lucene-dev mailing list archives

Site index · List index
Message view « Date » · « Thread »
Top « Date » · « Thread »
From Apache Jenkins Server <jenk...@builds.apache.org>
Subject [JENKINS] Lucene-Solr-Tests-5.x-Java7 - Build # 3977 - Failure
Date Wed, 17 Feb 2016 21:38:54 GMT
Build: https://builds.apache.org/job/Lucene-Solr-Tests-5.x-Java7/3977/

1 tests failed.
FAILED:  org.apache.solr.index.hdfs.CheckHdfsIndexTest.doTest

Error Message:
Could not find a healthy node to handle the request.

Stack Trace:
org.apache.solr.common.SolrException: Could not find a healthy node to handle the request.
	at __randomizedtesting.SeedInfo.seed([CAAC093D1DD1A44:ABEE7837BC6609FD]:0)
	at org.apache.solr.client.solrj.impl.CloudSolrClient.sendRequest(CloudSolrClient.java:1084)
	at org.apache.solr.client.solrj.impl.CloudSolrClient.requestWithRetryOnStaleState(CloudSolrClient.java:870)
	at org.apache.solr.client.solrj.impl.CloudSolrClient.request(CloudSolrClient.java:806)
	at org.apache.solr.client.solrj.SolrRequest.process(SolrRequest.java:149)
	at org.apache.solr.client.solrj.SolrClient.commit(SolrClient.java:482)
	at org.apache.solr.client.solrj.SolrClient.commit(SolrClient.java:463)
	at org.apache.solr.cloud.AbstractFullDistribZkTestBase.commit(AbstractFullDistribZkTestBase.java:1504)
	at org.apache.solr.index.hdfs.CheckHdfsIndexTest.doTest(CheckHdfsIndexTest.java:100)
	at sun.reflect.NativeMethodAccessorImpl.invoke0(Native Method)
	at sun.reflect.NativeMethodAccessorImpl.invoke(NativeMethodAccessorImpl.java:57)
	at sun.reflect.DelegatingMethodAccessorImpl.invoke(DelegatingMethodAccessorImpl.java:43)
	at java.lang.reflect.Method.invoke(Method.java:606)
	at com.carrotsearch.randomizedtesting.RandomizedRunner.invoke(RandomizedRunner.java:1764)
	at com.carrotsearch.randomizedtesting.RandomizedRunner$8.evaluate(RandomizedRunner.java:871)
	at com.carrotsearch.randomizedtesting.RandomizedRunner$9.evaluate(RandomizedRunner.java:907)
	at com.carrotsearch.randomizedtesting.RandomizedRunner$10.evaluate(RandomizedRunner.java:921)
	at org.apache.solr.BaseDistributedSearchTestCase$ShardsRepeatRule$ShardsFixedStatement.callStatement(BaseDistributedSearchTestCase.java:964)
	at org.apache.solr.BaseDistributedSearchTestCase$ShardsRepeatRule$ShardsStatement.evaluate(BaseDistributedSearchTestCase.java:939)
	at com.carrotsearch.randomizedtesting.rules.SystemPropertiesRestoreRule$1.evaluate(SystemPropertiesRestoreRule.java:57)
	at org.apache.lucene.util.TestRuleSetupTeardownChained$1.evaluate(TestRuleSetupTeardownChained.java:49)
	at org.apache.lucene.util.AbstractBeforeAfterRule$1.evaluate(AbstractBeforeAfterRule.java:45)
	at org.apache.lucene.util.TestRuleThreadAndTestName$1.evaluate(TestRuleThreadAndTestName.java:48)
	at org.apache.lucene.util.TestRuleIgnoreAfterMaxFailures$1.evaluate(TestRuleIgnoreAfterMaxFailures.java:64)
	at org.apache.lucene.util.TestRuleMarkFailure$1.evaluate(TestRuleMarkFailure.java:47)
	at com.carrotsearch.randomizedtesting.rules.StatementAdapter.evaluate(StatementAdapter.java:36)
	at com.carrotsearch.randomizedtesting.ThreadLeakControl$StatementRunner.run(ThreadLeakControl.java:367)
	at com.carrotsearch.randomizedtesting.ThreadLeakControl.forkTimeoutingTask(ThreadLeakControl.java:809)
	at com.carrotsearch.randomizedtesting.ThreadLeakControl$3.evaluate(ThreadLeakControl.java:460)
	at com.carrotsearch.randomizedtesting.RandomizedRunner.runSingleTest(RandomizedRunner.java:880)
	at com.carrotsearch.randomizedtesting.RandomizedRunner$5.evaluate(RandomizedRunner.java:781)
	at com.carrotsearch.randomizedtesting.RandomizedRunner$6.evaluate(RandomizedRunner.java:816)
	at com.carrotsearch.randomizedtesting.RandomizedRunner$7.evaluate(RandomizedRunner.java:827)
	at com.carrotsearch.randomizedtesting.rules.StatementAdapter.evaluate(StatementAdapter.java:36)
	at com.carrotsearch.randomizedtesting.rules.SystemPropertiesRestoreRule$1.evaluate(SystemPropertiesRestoreRule.java:57)
	at org.apache.lucene.util.AbstractBeforeAfterRule$1.evaluate(AbstractBeforeAfterRule.java:45)
	at com.carrotsearch.randomizedtesting.rules.StatementAdapter.evaluate(StatementAdapter.java:36)
	at org.apache.lucene.util.TestRuleStoreClassName$1.evaluate(TestRuleStoreClassName.java:41)
	at com.carrotsearch.randomizedtesting.rules.NoShadowingOrOverridesOnMethodsRule$1.evaluate(NoShadowingOrOverridesOnMethodsRule.java:40)
	at com.carrotsearch.randomizedtesting.rules.NoShadowingOrOverridesOnMethodsRule$1.evaluate(NoShadowingOrOverridesOnMethodsRule.java:40)
	at com.carrotsearch.randomizedtesting.rules.StatementAdapter.evaluate(StatementAdapter.java:36)
	at com.carrotsearch.randomizedtesting.rules.StatementAdapter.evaluate(StatementAdapter.java:36)
	at com.carrotsearch.randomizedtesting.rules.StatementAdapter.evaluate(StatementAdapter.java:36)
	at org.apache.lucene.util.TestRuleAssertionsRequired$1.evaluate(TestRuleAssertionsRequired.java:53)
	at org.apache.lucene.util.TestRuleMarkFailure$1.evaluate(TestRuleMarkFailure.java:47)
	at org.apache.lucene.util.TestRuleIgnoreAfterMaxFailures$1.evaluate(TestRuleIgnoreAfterMaxFailures.java:64)
	at org.apache.lucene.util.TestRuleIgnoreTestSuites$1.evaluate(TestRuleIgnoreTestSuites.java:54)
	at com.carrotsearch.randomizedtesting.rules.StatementAdapter.evaluate(StatementAdapter.java:36)
	at com.carrotsearch.randomizedtesting.ThreadLeakControl$StatementRunner.run(ThreadLeakControl.java:367)
	at java.lang.Thread.run(Thread.java:745)




Build Log:
[...truncated 11091 lines...]
   [junit4] Suite: org.apache.solr.index.hdfs.CheckHdfsIndexTest
   [junit4]   2> Creating dataDir: /x1/jenkins/jenkins-slave/workspace/Lucene-Solr-Tests-5.x-Java7/solr/build/solr-core/test/J1/temp/solr.index.hdfs.CheckHdfsIndexTest_CAAC093D1DD1A44-001/init-core-data-001
   [junit4]   2> 669092 INFO  (SUITE-CheckHdfsIndexTest-seed#[CAAC093D1DD1A44]-worker) [    ] o.a.s.SolrTestCaseJ4 Randomized ssl (false) and clientAuth (false)
   [junit4]   2> 669092 INFO  (SUITE-CheckHdfsIndexTest-seed#[CAAC093D1DD1A44]-worker) [    ] o.a.s.BaseDistributedSearchTestCase Setting hostContext system property: /
   [junit4]   1> Formatting using clusterid: testClusterID
   [junit4]   2> 669133 WARN  (SUITE-CheckHdfsIndexTest-seed#[CAAC093D1DD1A44]-worker) [    ] o.a.h.m.i.MetricsConfig Cannot locate configuration: tried hadoop-metrics2-namenode.properties,hadoop-metrics2.properties
   [junit4]   2> 669143 WARN  (SUITE-CheckHdfsIndexTest-seed#[CAAC093D1DD1A44]-worker) [    ] o.a.h.h.HttpRequestLog Jetty request log can only be enabled using Log4j
   [junit4]   2> 669147 INFO  (SUITE-CheckHdfsIndexTest-seed#[CAAC093D1DD1A44]-worker) [    ] o.m.log jetty-6.1.26
   [junit4]   2> 669160 INFO  (SUITE-CheckHdfsIndexTest-seed#[CAAC093D1DD1A44]-worker) [    ] o.m.log Extract jar:file:/x1/jenkins/.ivy2/cache/org.apache.hadoop/hadoop-hdfs/tests/hadoop-hdfs-2.6.0-tests.jar!/webapps/hdfs to ./temp/Jetty_localhost_48361_hdfs____.5vsiek/webapp
   [junit4]   2> 669283 INFO  (SUITE-CheckHdfsIndexTest-seed#[CAAC093D1DD1A44]-worker) [    ] o.m.log NO JSP Support for /, did not find org.apache.jasper.servlet.JspServlet
   [junit4]   2> 669613 INFO  (SUITE-CheckHdfsIndexTest-seed#[CAAC093D1DD1A44]-worker) [    ] o.m.log Started HttpServer2$SelectChannelConnectorWithSafeStartup@localhost:48361
   [junit4]   2> 669698 WARN  (SUITE-CheckHdfsIndexTest-seed#[CAAC093D1DD1A44]-worker) [    ] o.a.h.h.HttpRequestLog Jetty request log can only be enabled using Log4j
   [junit4]   2> 669700 INFO  (SUITE-CheckHdfsIndexTest-seed#[CAAC093D1DD1A44]-worker) [    ] o.m.log jetty-6.1.26
   [junit4]   2> 669713 INFO  (SUITE-CheckHdfsIndexTest-seed#[CAAC093D1DD1A44]-worker) [    ] o.m.log Extract jar:file:/x1/jenkins/.ivy2/cache/org.apache.hadoop/hadoop-hdfs/tests/hadoop-hdfs-2.6.0-tests.jar!/webapps/datanode to ./temp/Jetty_localhost_58033_datanode____.muky4/webapp
   [junit4]   2> 669839 INFO  (SUITE-CheckHdfsIndexTest-seed#[CAAC093D1DD1A44]-worker) [    ] o.m.log NO JSP Support for /, did not find org.apache.jasper.servlet.JspServlet
   [junit4]   2> 670110 INFO  (SUITE-CheckHdfsIndexTest-seed#[CAAC093D1DD1A44]-worker) [    ] o.m.log Started HttpServer2$SelectChannelConnectorWithSafeStartup@localhost:58033
   [junit4]   2> 670164 WARN  (SUITE-CheckHdfsIndexTest-seed#[CAAC093D1DD1A44]-worker) [    ] o.a.h.h.HttpRequestLog Jetty request log can only be enabled using Log4j
   [junit4]   2> 670166 INFO  (SUITE-CheckHdfsIndexTest-seed#[CAAC093D1DD1A44]-worker) [    ] o.m.log jetty-6.1.26
   [junit4]   2> 670179 INFO  (SUITE-CheckHdfsIndexTest-seed#[CAAC093D1DD1A44]-worker) [    ] o.m.log Extract jar:file:/x1/jenkins/.ivy2/cache/org.apache.hadoop/hadoop-hdfs/tests/hadoop-hdfs-2.6.0-tests.jar!/webapps/datanode to ./temp/Jetty_localhost_57145_datanode____eoau7r/webapp
   [junit4]   2> 670270 INFO  (IPC Server handler 5 on 45183) [    ] BlockStateChange BLOCK* processReport: from storage DS-6cf9cff8-6129-4339-a7e0-dbdd9541ab36 node DatanodeRegistration(127.0.0.1, datanodeUuid=e9118963-4db6-4467-902c-89a019e60c43, infoPort=58033, ipcPort=47180, storageInfo=lv=-56;cid=testClusterID;nsid=1548465652;c=0), blocks: 0, hasStaleStorages: true, processing time: 0 msecs
   [junit4]   2> 670271 INFO  (IPC Server handler 5 on 45183) [    ] BlockStateChange BLOCK* processReport: from storage DS-ec54d38c-fc99-49ad-a33a-f8988c16c3ef node DatanodeRegistration(127.0.0.1, datanodeUuid=e9118963-4db6-4467-902c-89a019e60c43, infoPort=58033, ipcPort=47180, storageInfo=lv=-56;cid=testClusterID;nsid=1548465652;c=0), blocks: 0, hasStaleStorages: false, processing time: 0 msecs
   [junit4]   2> 670338 INFO  (SUITE-CheckHdfsIndexTest-seed#[CAAC093D1DD1A44]-worker) [    ] o.m.log NO JSP Support for /, did not find org.apache.jasper.servlet.JspServlet
   [junit4]   2> 670690 INFO  (SUITE-CheckHdfsIndexTest-seed#[CAAC093D1DD1A44]-worker) [    ] o.m.log Started HttpServer2$SelectChannelConnectorWithSafeStartup@localhost:57145
   [junit4]   2> 670797 INFO  (IPC Server handler 4 on 45183) [    ] BlockStateChange BLOCK* processReport: from storage DS-9e16b5f3-9c18-4136-86c5-39c903dfbb11 node DatanodeRegistration(127.0.0.1, datanodeUuid=3185f2da-a5aa-4356-8ace-26bcfdb23df4, infoPort=57145, ipcPort=48707, storageInfo=lv=-56;cid=testClusterID;nsid=1548465652;c=0), blocks: 0, hasStaleStorages: true, processing time: 0 msecs
   [junit4]   2> 670797 INFO  (IPC Server handler 4 on 45183) [    ] BlockStateChange BLOCK* processReport: from storage DS-cf02f5cc-2d59-4562-9a94-60c25424b64a node DatanodeRegistration(127.0.0.1, datanodeUuid=3185f2da-a5aa-4356-8ace-26bcfdb23df4, infoPort=57145, ipcPort=48707, storageInfo=lv=-56;cid=testClusterID;nsid=1548465652;c=0), blocks: 0, hasStaleStorages: false, processing time: 0 msecs
   [junit4]   2> 670881 INFO  (TEST-CheckHdfsIndexTest.testChecksumsOnlyVerbose-seed#[CAAC093D1DD1A44]) [    ] o.a.s.c.ZkTestServer STARTING ZK TEST SERVER
   [junit4]   2> 670882 INFO  (Thread-2099) [    ] o.a.s.c.ZkTestServer client port:0.0.0.0/0.0.0.0:0
   [junit4]   2> 670882 INFO  (Thread-2099) [    ] o.a.s.c.ZkTestServer Starting server
   [junit4]   2> 670982 INFO  (TEST-CheckHdfsIndexTest.testChecksumsOnlyVerbose-seed#[CAAC093D1DD1A44]) [    ] o.a.s.c.ZkTestServer start zk server on port:38357
   [junit4]   2> 670982 INFO  (TEST-CheckHdfsIndexTest.testChecksumsOnlyVerbose-seed#[CAAC093D1DD1A44]) [    ] o.a.s.c.c.SolrZkClient Using default ZkCredentialsProvider
   [junit4]   2> 670983 INFO  (TEST-CheckHdfsIndexTest.testChecksumsOnlyVerbose-seed#[CAAC093D1DD1A44]) [    ] o.a.s.c.c.ConnectionManager Waiting for client to connect to ZooKeeper
   [junit4]   2> 670985 INFO  (zkCallback-649-thread-1) [    ] o.a.s.c.c.ConnectionManager Watcher org.apache.solr.common.cloud.ConnectionManager@6cfe1b75 name:ZooKeeperConnection Watcher:127.0.0.1:38357 got event WatchedEvent state:SyncConnected type:None path:null path:null type:None
   [junit4]   2> 670985 INFO  (TEST-CheckHdfsIndexTest.testChecksumsOnlyVerbose-seed#[CAAC093D1DD1A44]) [    ] o.a.s.c.c.ConnectionManager Client is connected to ZooKeeper
   [junit4]   2> 670985 INFO  (TEST-CheckHdfsIndexTest.testChecksumsOnlyVerbose-seed#[CAAC093D1DD1A44]) [    ] o.a.s.c.c.SolrZkClient Using default ZkACLProvider
   [junit4]   2> 670986 INFO  (TEST-CheckHdfsIndexTest.testChecksumsOnlyVerbose-seed#[CAAC093D1DD1A44]) [    ] o.a.s.c.c.SolrZkClient makePath: /solr
   [junit4]   2> 670990 INFO  (TEST-CheckHdfsIndexTest.testChecksumsOnlyVerbose-seed#[CAAC093D1DD1A44]) [    ] o.a.s.c.c.SolrZkClient Using default ZkCredentialsProvider
   [junit4]   2> 670991 INFO  (TEST-CheckHdfsIndexTest.testChecksumsOnlyVerbose-seed#[CAAC093D1DD1A44]) [    ] o.a.s.c.c.ConnectionManager Waiting for client to connect to ZooKeeper
   [junit4]   2> 670992 INFO  (zkCallback-650-thread-1) [    ] o.a.s.c.c.ConnectionManager Watcher org.apache.solr.common.cloud.ConnectionManager@27cc80dc name:ZooKeeperConnection Watcher:127.0.0.1:38357/solr got event WatchedEvent state:SyncConnected type:None path:null path:null type:None
   [junit4]   2> 670992 INFO  (TEST-CheckHdfsIndexTest.testChecksumsOnlyVerbose-seed#[CAAC093D1DD1A44]) [    ] o.a.s.c.c.ConnectionManager Client is connected to ZooKeeper
   [junit4]   2> 670992 INFO  (TEST-CheckHdfsIndexTest.testChecksumsOnlyVerbose-seed#[CAAC093D1DD1A44]) [    ] o.a.s.c.c.SolrZkClient Using default ZkACLProvider
   [junit4]   2> 670993 INFO  (TEST-CheckHdfsIndexTest.testChecksumsOnlyVerbose-seed#[CAAC093D1DD1A44]) [    ] o.a.s.c.c.SolrZkClient makePath: /collections/collection1
   [junit4]   2> 670994 INFO  (TEST-CheckHdfsIndexTest.testChecksumsOnlyVerbose-seed#[CAAC093D1DD1A44]) [    ] o.a.s.c.c.SolrZkClient makePath: /collections/collection1/shards
   [junit4]   2> 670996 INFO  (TEST-CheckHdfsIndexTest.testChecksumsOnlyVerbose-seed#[CAAC093D1DD1A44]) [    ] o.a.s.c.c.SolrZkClient makePath: /collections/control_collection
   [junit4]   2> 670997 INFO  (TEST-CheckHdfsIndexTest.testChecksumsOnlyVerbose-seed#[CAAC093D1DD1A44]) [    ] o.a.s.c.c.SolrZkClient makePath: /collections/control_collection/shards
   [junit4]   2> 670999 INFO  (TEST-CheckHdfsIndexTest.testChecksumsOnlyVerbose-seed#[CAAC093D1DD1A44]) [    ] o.a.s.c.AbstractZkTestCase put /x1/jenkins/jenkins-slave/workspace/Lucene-Solr-Tests-5.x-Java7/solr/core/src/test-files/solr/collection1/conf/solrconfig-tlog.xml to /configs/conf1/solrconfig.xml
   [junit4]   2> 670999 INFO  (TEST-CheckHdfsIndexTest.testChecksumsOnlyVerbose-seed#[CAAC093D1DD1A44]) [    ] o.a.s.c.c.SolrZkClient makePath: /configs/conf1/solrconfig.xml
   [junit4]   2> 671002 INFO  (TEST-CheckHdfsIndexTest.testChecksumsOnlyVerbose-seed#[CAAC093D1DD1A44]) [    ] o.a.s.c.AbstractZkTestCase put /x1/jenkins/jenkins-slave/workspace/Lucene-Solr-Tests-5.x-Java7/solr/core/src/test-files/solr/collection1/conf/schema.xml to /configs/conf1/schema.xml
   [junit4]   2> 671002 INFO  (TEST-CheckHdfsIndexTest.testChecksumsOnlyVerbose-seed#[CAAC093D1DD1A44]) [    ] o.a.s.c.c.SolrZkClient makePath: /configs/conf1/schema.xml
   [junit4]   2> 671004 INFO  (TEST-CheckHdfsIndexTest.testChecksumsOnlyVerbose-seed#[CAAC093D1DD1A44]) [    ] o.a.s.c.AbstractZkTestCase put /x1/jenkins/jenkins-slave/workspace/Lucene-Solr-Tests-5.x-Java7/solr/core/src/test-files/solr/collection1/conf/solrconfig.snippet.randomindexconfig.xml to /configs/conf1/solrconfig.snippet.randomindexconfig.xml
   [junit4]   2> 671004 INFO  (TEST-CheckHdfsIndexTest.testChecksumsOnlyVerbose-seed#[CAAC093D1DD1A44]) [    ] o.a.s.c.c.SolrZkClient makePath: /configs/conf1/solrconfig.snippet.randomindexconfig.xml
   [junit4]   2> 671005 INFO  (TEST-CheckHdfsIndexTest.testChecksumsOnlyVerbose-seed#[CAAC093D1DD1A44]) [    ] o.a.s.c.AbstractZkTestCase put /x1/jenkins/jenkins-slave/workspace/Lucene-Solr-Tests-5.x-Java7/solr/core/src/test-files/solr/collection1/conf/stopwords.txt to /configs/conf1/stopwords.txt
   [junit4]   2> 671006 INFO  (TEST-CheckHdfsIndexTest.testChecksumsOnlyVerbose-seed#[CAAC093D1DD1A44]) [    ] o.a.s.c.c.SolrZkClient makePath: /configs/conf1/stopwords.txt
   [junit4]   2> 671008 INFO  (TEST-CheckHdfsIndexTest.testChecksumsOnlyVerbose-seed#[CAAC093D1DD1A44]) [    ] o.a.s.c.AbstractZkTestCase put /x1/jenkins/jenkins-slave/workspace/Lucene-Solr-Tests-5.x-Java7/solr/core/src/test-files/solr/collection1/conf/protwords.txt to /configs/conf1/protwords.txt
   [junit4]   2> 671008 INFO  (TEST-CheckHdfsIndexTest.testChecksumsOnlyVerbose-seed#[CAAC093D1DD1A44]) [    ] o.a.s.c.c.SolrZkClient makePath: /configs/conf1/protwords.txt
   [junit4]   2> 671009 INFO  (TEST-CheckHdfsIndexTest.testChecksumsOnlyVerbose-seed#[CAAC093D1DD1A44]) [    ] o.a.s.c.AbstractZkTestCase put /x1/jenkins/jenkins-slave/workspace/Lucene-Solr-Tests-5.x-Java7/solr/core/src/test-files/solr/collection1/conf/currency.xml to /configs/conf1/currency.xml
   [junit4]   2> 671009 INFO  (TEST-CheckHdfsIndexTest.testChecksumsOnlyVerbose-seed#[CAAC093D1DD1A44]) [    ] o.a.s.c.c.SolrZkClient makePath: /configs/conf1/currency.xml
   [junit4]   2> 671011 INFO  (TEST-CheckHdfsIndexTest.testChecksumsOnlyVerbose-seed#[CAAC093D1DD1A44]) [    ] o.a.s.c.AbstractZkTestCase put /x1/jenkins/jenkins-slave/workspace/Lucene-Solr-Tests-5.x-Java7/solr/core/src/test-files/solr/collection1/conf/enumsConfig.xml to /configs/conf1/enumsConfig.xml
   [junit4]   2> 671011 INFO  (TEST-CheckHdfsIndexTest.testChecksumsOnlyVerbose-seed#[CAAC093D1DD1A44]) [    ] o.a.s.c.c.SolrZkClient makePath: /configs/conf1/enumsConfig.xml
   [junit4]   2> 671013 INFO  (TEST-CheckHdfsIndexTest.testChecksumsOnlyVerbose-seed#[CAAC093D1DD1A44]) [    ] o.a.s.c.AbstractZkTestCase put /x1/jenkins/jenkins-slave/workspace/Lucene-Solr-Tests-5.x-Java7/solr/core/src/test-files/solr/collection1/conf/open-exchange-rates.json to /configs/conf1/open-exchange-rates.json
   [junit4]   2> 671013 INFO  (TEST-CheckHdfsIndexTest.testChecksumsOnlyVerbose-seed#[CAAC093D1DD1A44]) [    ] o.a.s.c.c.SolrZkClient makePath: /configs/conf1/open-exchange-rates.json
   [junit4]   2> 671014 INFO  (TEST-CheckHdfsIndexTest.testChecksumsOnlyVerbose-seed#[CAAC093D1DD1A44]) [    ] o.a.s.c.AbstractZkTestCase put /x1/jenkins/jenkins-slave/workspace/Lucene-Solr-Tests-5.x-Java7/solr/core/src/test-files/solr/collection1/conf/mapping-ISOLatin1Accent.txt to /configs/conf1/mapping-ISOLatin1Accent.txt
   [junit4]   2> 671015 INFO  (TEST-CheckHdfsIndexTest.testChecksumsOnlyVerbose-seed#[CAAC093D1DD1A44]) [    ] o.a.s.c.c.SolrZkClient makePath: /configs/conf1/mapping-ISOLatin1Accent.txt
   [junit4]   2> 671017 INFO  (TEST-CheckHdfsIndexTest.testChecksumsOnlyVerbose-seed#[CAAC093D1DD1A44]) [    ] o.a.s.c.AbstractZkTestCase put /x1/jenkins/jenkins-slave/workspace/Lucene-Solr-Tests-5.x-Java7/solr/core/src/test-files/solr/collection1/conf/old_synonyms.txt to /configs/conf1/old_synonyms.txt
   [junit4]   2> 671017 INFO  (TEST-CheckHdfsIndexTest.testChecksumsOnlyVerbose-seed#[CAAC093D1DD1A44]) [    ] o.a.s.c.c.SolrZkClient makePath: /configs/conf1/old_synonyms.txt
   [junit4]   2> 671019 INFO  (TEST-CheckHdfsIndexTest.testChecksumsOnlyVerbose-seed#[CAAC093D1DD1A44]) [    ] o.a.s.c.AbstractZkTestCase put /x1/jenkins/jenkins-slave/workspace/Lucene-Solr-Tests-5.x-Java7/solr/core/src/test-files/solr/collection1/conf/synonyms.txt to /configs/conf1/synonyms.txt
   [junit4]   2> 671019 INFO  (TEST-CheckHdfsIndexTest.testChecksumsOnlyVerbose-seed#[CAAC093D1DD1A44]) [    ] o.a.s.c.c.SolrZkClient makePath: /configs/conf1/synonyms.txt
   [junit4]   2> 671109 INFO  (TEST-CheckHdfsIndexTest.testChecksumsOnlyVerbose-seed#[CAAC093D1DD1A44]) [    ] o.a.s.SolrTestCaseJ4 Writing core.properties file to /x1/jenkins/jenkins-slave/workspace/Lucene-Solr-Tests-5.x-Java7/solr/build/solr-core/test/J1/temp/solr.index.hdfs.CheckHdfsIndexTest_CAAC093D1DD1A44-001/control-001/cores/collection1
   [junit4]   2> 671112 INFO  (TEST-CheckHdfsIndexTest.testChecksumsOnlyVerbose-seed#[CAAC093D1DD1A44]) [    ] o.e.j.s.Server jetty-9.2.13.v20150730
   [junit4]   2> 671114 INFO  (TEST-CheckHdfsIndexTest.testChecksumsOnlyVerbose-seed#[CAAC093D1DD1A44]) [    ] o.e.j.s.h.ContextHandler Started o.e.j.s.ServletContextHandler@505db402{/,null,AVAILABLE}
   [junit4]   2> 671114 INFO  (TEST-CheckHdfsIndexTest.testChecksumsOnlyVerbose-seed#[CAAC093D1DD1A44]) [    ] o.e.j.s.ServerConnector Started ServerConnector@73d220d{HTTP/1.1}{127.0.0.1:41219}
   [junit4]   2> 671114 INFO  (TEST-CheckHdfsIndexTest.testChecksumsOnlyVerbose-seed#[CAAC093D1DD1A44]) [    ] o.e.j.s.Server Started @673962ms
   [junit4]   2> 671114 INFO  (TEST-CheckHdfsIndexTest.testChecksumsOnlyVerbose-seed#[CAAC093D1DD1A44]) [    ] o.a.s.c.s.e.JettySolrRunner Jetty properties: {hostPort=41219, coreRootDirectory=/x1/jenkins/jenkins-slave/workspace/Lucene-Solr-Tests-5.x-Java7/solr/build/solr-core/test/J1/temp/solr.index.hdfs.CheckHdfsIndexTest_CAAC093D1DD1A44-001/control-001/cores, hostContext=/, solr.data.dir=hdfs://localhost:45183/hdfs__localhost_45183__x1_jenkins_jenkins-slave_workspace_Lucene-Solr-Tests-5.x-Java7_solr_build_solr-core_test_J1_temp_solr.index.hdfs.CheckHdfsIndexTest_CAAC093D1DD1A44-001_tempDir-002_control_data}
   [junit4]   2> 671115 INFO  (TEST-CheckHdfsIndexTest.testChecksumsOnlyVerbose-seed#[CAAC093D1DD1A44]) [    ] o.a.s.s.SolrDispatchFilter SolrDispatchFilter.init(): sun.misc.Launcher$AppClassLoader@7b3cb2c6
   [junit4]   2> 671115 INFO  (TEST-CheckHdfsIndexTest.testChecksumsOnlyVerbose-seed#[CAAC093D1DD1A44]) [    ] o.a.s.c.SolrResourceLoader new SolrResourceLoader for directory: '/x1/jenkins/jenkins-slave/workspace/Lucene-Solr-Tests-5.x-Java7/solr/build/solr-core/test/J1/temp/solr.index.hdfs.CheckHdfsIndexTest_CAAC093D1DD1A44-001/control-001'
   [junit4]   2> 671115 INFO  (TEST-CheckHdfsIndexTest.testChecksumsOnlyVerbose-seed#[CAAC093D1DD1A44]) [    ] o.a.s.c.SolrResourceLoader JNDI not configured for solr (NoInitialContextEx)
   [junit4]   2> 671115 INFO  (TEST-CheckHdfsIndexTest.testChecksumsOnlyVerbose-seed#[CAAC093D1DD1A44]) [    ] o.a.s.c.SolrResourceLoader solr home defaulted to 'solr/' (could not find system property or JNDI)
   [junit4]   2> 671115 INFO  (TEST-CheckHdfsIndexTest.testChecksumsOnlyVerbose-seed#[CAAC093D1DD1A44]) [    ] o.a.s.c.c.SolrZkClient Using default ZkCredentialsProvider
   [junit4]   2> 671116 INFO  (TEST-CheckHdfsIndexTest.testChecksumsOnlyVerbose-seed#[CAAC093D1DD1A44]) [    ] o.a.s.c.c.ConnectionManager Waiting for client to connect to ZooKeeper
   [junit4]   2> 671117 INFO  (zkCallback-651-thread-1) [    ] o.a.s.c.c.ConnectionManager Watcher org.apache.solr.common.cloud.ConnectionManager@41d53f8e name:ZooKeeperConnection Watcher:127.0.0.1:38357/solr got event WatchedEvent state:SyncConnected type:None path:null path:null type:None
   [junit4]   2> 671117 INFO  (TEST-CheckHdfsIndexTest.testChecksumsOnlyVerbose-seed#[CAAC093D1DD1A44]) [    ] o.a.s.c.c.ConnectionManager Client is connected to ZooKeeper
   [junit4]   2> 671117 INFO  (TEST-CheckHdfsIndexTest.testChecksumsOnlyVerbose-seed#[CAAC093D1DD1A44]) [    ] o.a.s.c.c.SolrZkClient Using default ZkACLProvider
   [junit4]   2> 671118 INFO  (TEST-CheckHdfsIndexTest.testChecksumsOnlyVerbose-seed#[CAAC093D1DD1A44]) [    ] o.a.s.s.SolrDispatchFilter Loading solr.xml from SolrHome (not found in ZooKeeper)
   [junit4]   2> 671118 INFO  (TEST-CheckHdfsIndexTest.testChecksumsOnlyVerbose-seed#[CAAC093D1DD1A44]) [    ] o.a.s.c.SolrXmlConfig Loading container configuration from /x1/jenkins/jenkins-slave/workspace/Lucene-Solr-Tests-5.x-Java7/solr/build/solr-core/test/J1/temp/solr.index.hdfs.CheckHdfsIndexTest_CAAC093D1DD1A44-001/control-001/solr.xml
   [junit4]   2> 671134 INFO  (TEST-CheckHdfsIndexTest.testChecksumsOnlyVerbose-seed#[CAAC093D1DD1A44]) [    ] o.a.s.c.CorePropertiesLocator Config-defined core root directory: /x1/jenkins/jenkins-slave/workspace/Lucene-Solr-Tests-5.x-Java7/solr/build/solr-core/test/J1/temp/solr.index.hdfs.CheckHdfsIndexTest_CAAC093D1DD1A44-001/control-001/cores
   [junit4]   2> 671134 INFO  (TEST-CheckHdfsIndexTest.testChecksumsOnlyVerbose-seed#[CAAC093D1DD1A44]) [    ] o.a.s.c.CoreContainer New CoreContainer 1571634312
   [junit4]   2> 671134 INFO  (TEST-CheckHdfsIndexTest.testChecksumsOnlyVerbose-seed#[CAAC093D1DD1A44]) [    ] o.a.s.c.CoreContainer Loading cores into CoreContainer [instanceDir=/x1/jenkins/jenkins-slave/workspace/Lucene-Solr-Tests-5.x-Java7/solr/build/solr-core/test/J1/temp/solr.index.hdfs.CheckHdfsIndexTest_CAAC093D1DD1A44-001/control-001]
   [junit4]   2> 671134 WARN  (TEST-CheckHdfsIndexTest.testChecksumsOnlyVerbose-seed#[CAAC093D1DD1A44]) [    ] o.a.s.c.CoreContainer Couldn't add files from /x1/jenkins/jenkins-slave/workspace/Lucene-Solr-Tests-5.x-Java7/solr/build/solr-core/test/J1/temp/solr.index.hdfs.CheckHdfsIndexTest_CAAC093D1DD1A44-001/control-001/lib to classpath: /x1/jenkins/jenkins-slave/workspace/Lucene-Solr-Tests-5.x-Java7/solr/build/solr-core/test/J1/temp/solr.index.hdfs.CheckHdfsIndexTest_CAAC093D1DD1A44-001/control-001/lib
   [junit4]   2> 671134 INFO  (TEST-CheckHdfsIndexTest.testChecksumsOnlyVerbose-seed#[CAAC093D1DD1A44]) [    ] o.a.s.h.c.HttpShardHandlerFactory created with socketTimeout : 90000,urlScheme : ,connTimeout : 15000,maxConnectionsPerHost : 20,maxConnections : 10000,corePoolSize : 0,maximumPoolSize : 2147483647,maxThreadIdleTime : 5,sizeOfQueue : -1,fairnessPolicy : false,useRetries : false,
   [junit4]   2> 671136 INFO  (TEST-CheckHdfsIndexTest.testChecksumsOnlyVerbose-seed#[CAAC093D1DD1A44]) [    ] o.a.s.u.UpdateShardHandler Creating UpdateShardHandler HTTP client with params: socketTimeout=340000&connTimeout=45000&retry=true
   [junit4]   2> 671136 INFO  (TEST-CheckHdfsIndexTest.testChecksumsOnlyVerbose-seed#[CAAC093D1DD1A44]) [    ] o.a.s.l.LogWatcher SLF4J impl is org.slf4j.impl.Log4jLoggerFactory
   [junit4]   2> 671136 INFO  (TEST-CheckHdfsIndexTest.testChecksumsOnlyVerbose-seed#[CAAC093D1DD1A44]) [    ] o.a.s.l.LogWatcher Registering Log Listener [Log4j (org.slf4j.impl.Log4jLoggerFactory)]
   [junit4]   2> 671136 INFO  (TEST-CheckHdfsIndexTest.testChecksumsOnlyVerbose-seed#[CAAC093D1DD1A44]) [    ] o.a.s.c.ZkContainer Zookeeper client=127.0.0.1:38357/solr
   [junit4]   2> 671136 INFO  (TEST-CheckHdfsIndexTest.testChecksumsOnlyVerbose-seed#[CAAC093D1DD1A44]) [    ] o.a.s.c.ZkController zkHost includes chroot
   [junit4]   2> 671136 INFO  (TEST-CheckHdfsIndexTest.testChecksumsOnlyVerbose-seed#[CAAC093D1DD1A44]) [    ] o.a.s.c.c.SolrZkClient Using default ZkCredentialsProvider
   [junit4]   2> 671137 INFO  (TEST-CheckHdfsIndexTest.testChecksumsOnlyVerbose-seed#[CAAC093D1DD1A44]) [    ] o.a.s.c.c.ConnectionManager Waiting for client to connect to ZooKeeper
   [junit4]   2> 671138 INFO  (zkCallback-654-thread-1) [    ] o.a.s.c.c.ConnectionManager Watcher org.apache.solr.common.cloud.ConnectionManager@7593df4e name:ZooKeeperConnection Watcher:127.0.0.1:38357 got event WatchedEvent state:SyncConnected type:None path:null path:null type:None
   [junit4]   2> 671139 INFO  (TEST-CheckHdfsIndexTest.testChecksumsOnlyVerbose-seed#[CAAC093D1DD1A44]) [    ] o.a.s.c.c.ConnectionManager Client is connected to ZooKeeper
   [junit4]   2> 671139 INFO  (TEST-CheckHdfsIndexTest.testChecksumsOnlyVerbose-seed#[CAAC093D1DD1A44]) [    ] o.a.s.c.c.SolrZkClient Using default ZkACLProvider
   [junit4]   2> 671141 INFO  (TEST-CheckHdfsIndexTest.testChecksumsOnlyVerbose-seed#[CAAC093D1DD1A44]) [n:127.0.0.1:41219_    ] o.a.s.c.c.ConnectionManager Waiting for client to connect to ZooKeeper
   [junit4]   2> 671142 INFO  (zkCallback-655-thread-1-processing-n:127.0.0.1:41219_) [n:127.0.0.1:41219_    ] o.a.s.c.c.ConnectionManager Watcher org.apache.solr.common.cloud.ConnectionManager@3d8b7a95 name:ZooKeeperConnection Watcher:127.0.0.1:38357/solr got event WatchedEvent state:SyncConnected type:None path:null path:null type:None
   [junit4]   2> 671142 INFO  (TEST-CheckHdfsIndexTest.testChecksumsOnlyVerbose-seed#[CAAC093D1DD1A44]) [n:127.0.0.1:41219_    ] o.a.s.c.c.ConnectionManager Client is connected to ZooKeeper
   [junit4]   2> 671144 INFO  (TEST-CheckHdfsIndexTest.testChecksumsOnlyVerbose-seed#[CAAC093D1DD1A44]) [n:127.0.0.1:41219_    ] o.a.s.c.c.SolrZkClient makePath: /overseer/queue
   [junit4]   2> 671147 INFO  (TEST-CheckHdfsIndexTest.testChecksumsOnlyVerbose-seed#[CAAC093D1DD1A44]) [n:127.0.0.1:41219_    ] o.a.s.c.c.SolrZkClient makePath: /overseer/collection-queue-work
   [junit4]   2> 671151 INFO  (TEST-CheckHdfsIndexTest.testChecksumsOnlyVerbose-seed#[CAAC093D1DD1A44]) [n:127.0.0.1:41219_    ] o.a.s.c.c.SolrZkClient makePath: /overseer/collection-map-running
   [junit4]   2> 671154 INFO  (TEST-CheckHdfsIndexTest.testChecksumsOnlyVerbose-seed#[CAAC093D1DD1A44]) [n:127.0.0.1:41219_    ] o.a.s.c.c.SolrZkClient makePath: /overseer/collection-map-completed
   [junit4]   2> 671157 INFO  (TEST-CheckHdfsIndexTest.testChecksumsOnlyVerbose-seed#[CAAC093D1DD1A44]) [n:127.0.0.1:41219_    ] o.a.s.c.c.SolrZkClient makePath: /overseer/collection-map-failure
   [junit4]   2> 671159 INFO  (TEST-CheckHdfsIndexTest.testChecksumsOnlyVerbose-seed#[CAAC093D1DD1A44]) [n:127.0.0.1:41219_    ] o.a.s.c.c.SolrZkClient makePath: /live_nodes
   [junit4]   2> 671161 INFO  (TEST-CheckHdfsIndexTest.testChecksumsOnlyVerbose-seed#[CAAC093D1DD1A44]) [n:127.0.0.1:41219_    ] o.a.s.c.c.SolrZkClient makePath: /aliases.json
   [junit4]   2> 671163 INFO  (TEST-CheckHdfsIndexTest.testChecksumsOnlyVerbose-seed#[CAAC093D1DD1A44]) [n:127.0.0.1:41219_    ] o.a.s.c.c.SolrZkClient makePath: /clusterstate.json
   [junit4]   2> 671164 INFO  (TEST-CheckHdfsIndexTest.testChecksumsOnlyVerbose-seed#[CAAC093D1DD1A44]) [n:127.0.0.1:41219_    ] o.a.s.c.c.SolrZkClient makePath: /security.json
   [junit4]   2> 671165 INFO  (TEST-CheckHdfsIndexTest.testChecksumsOnlyVerbose-seed#[CAAC093D1DD1A44]) [n:127.0.0.1:41219_    ] o.a.s.c.ZkController Register node as live in ZooKeeper:/live_nodes/127.0.0.1:41219_
   [junit4]   2> 671166 INFO  (TEST-CheckHdfsIndexTest.testChecksumsOnlyVerbose-seed#[CAAC093D1DD1A44]) [n:127.0.0.1:41219_    ] o.a.s.c.c.SolrZkClient makePath: /live_nodes/127.0.0.1:41219_
   [junit4]   2> 671167 INFO  (TEST-CheckHdfsIndexTest.testChecksumsOnlyVerbose-seed#[CAAC093D1DD1A44]) [n:127.0.0.1:41219_    ] o.a.s.c.c.SolrZkClient makePath: /overseer_elect
   [junit4]   2> 671168 INFO  (TEST-CheckHdfsIndexTest.testChecksumsOnlyVerbose-seed#[CAAC093D1DD1A44]) [n:127.0.0.1:41219_    ] o.a.s.c.c.SolrZkClient makePath: /overseer_elect/election
   [junit4]   2> 671169 INFO  (TEST-CheckHdfsIndexTest.testChecksumsOnlyVerbose-seed#[CAAC093D1DD1A44]) [n:127.0.0.1:41219_    ] o.a.s.c.Overseer Overseer (id=null) closing
   [junit4]   2> 671170 INFO  (TEST-CheckHdfsIndexTest.testChecksumsOnlyVerbose-seed#[CAAC093D1DD1A44]) [n:127.0.0.1:41219_    ] o.a.s.c.LeaderElector Joined leadership election with path: /overseer_elect/election/95403607886856196-127.0.0.1:41219_-n_0000000000
   [junit4]   2> 671170 INFO  (TEST-CheckHdfsIndexTest.testChecksumsOnlyVerbose-seed#[CAAC093D1DD1A44]) [n:127.0.0.1:41219_    ] o.a.s.c.OverseerElectionContext I am going to be the leader 127.0.0.1:41219_
   [junit4]   2> 671170 INFO  (TEST-CheckHdfsIndexTest.testChecksumsOnlyVerbose-seed#[CAAC093D1DD1A44]) [n:127.0.0.1:41219_    ] o.a.s.c.c.SolrZkClient makePath: /overseer_elect/leader
   [junit4]   2> 671172 INFO  (TEST-CheckHdfsIndexTest.testChecksumsOnlyVerbose-seed#[CAAC093D1DD1A44]) [n:127.0.0.1:41219_    ] o.a.s.c.Overseer Overseer (id=95403607886856196-127.0.0.1:41219_-n_0000000000) starting
   [junit4]   2> 671173 INFO  (TEST-CheckHdfsIndexTest.testChecksumsOnlyVerbose-seed#[CAAC093D1DD1A44]) [n:127.0.0.1:41219_    ] o.a.s.c.c.SolrZkClient makePath: /overseer/queue-work
   [junit4]   2> 671179 INFO  (TEST-CheckHdfsIndexTest.testChecksumsOnlyVerbose-seed#[CAAC093D1DD1A44]) [n:127.0.0.1:41219_    ] o.a.s.c.OverseerAutoReplicaFailoverThread Starting OverseerAutoReplicaFailoverThread autoReplicaFailoverWorkLoopDelay=10000 autoReplicaFailoverWaitAfterExpiration=30000 autoReplicaFailoverBadNodeExpiration=60000
   [junit4]   2> 671179 INFO  (OverseerCollectionConfigSetProcessor-95403607886856196-127.0.0.1:41219_-n_0000000000) [n:127.0.0.1:41219_    ] o.a.s.c.OverseerTaskProcessor Process current queue of overseer operations
   [junit4]   2> 671180 INFO  (OverseerStateUpdate-95403607886856196-127.0.0.1:41219_-n_0000000000) [n:127.0.0.1:41219_    ] o.a.s.c.Overseer Starting to work on the main queue
   [junit4]   2> 671180 INFO  (TEST-CheckHdfsIndexTest.testChecksumsOnlyVerbose-seed#[CAAC093D1DD1A44]) [n:127.0.0.1:41219_    ] o.a.s.c.c.ZkStateReader Updating cluster state from ZooKeeper... 
   [junit4]   2> 671192 INFO  (TEST-CheckHdfsIndexTest.testChecksumsOnlyVerbose-seed#[CAAC093D1DD1A44]) [n:127.0.0.1:41219_    ] o.a.s.c.CoreContainer Security conf doesn't exist. Skipping setup for authorization module.
   [junit4]   2> 671192 INFO  (TEST-CheckHdfsIndexTest.testChecksumsOnlyVerbose-seed#[CAAC093D1DD1A44]) [n:127.0.0.1:41219_    ] o.a.s.c.CoreContainer No authentication plugin used.
   [junit4]   2> 671193 INFO  (TEST-CheckHdfsIndexTest.testChecksumsOnlyVerbose-seed#[CAAC093D1DD1A44]) [n:127.0.0.1:41219_    ] o.a.s.c.CorePropertiesLocator Looking for core definitions underneath /x1/jenkins/jenkins-slave/workspace/Lucene-Solr-Tests-5.x-Java7/solr/build/solr-core/test/J1/temp/solr.index.hdfs.CheckHdfsIndexTest_CAAC093D1DD1A44-001/control-001/cores
   [junit4]   2> 671194 INFO  (TEST-CheckHdfsIndexTest.testChecksumsOnlyVerbose-seed#[CAAC093D1DD1A44]) [n:127.0.0.1:41219_    ] o.a.s.c.CoreDescriptor Created CoreDescriptor: {configSetProperties=configsetprops.json, collection=control_collection, coreNodeName=, dataDir=data/, config=solrconfig.xml, transient=false, shard=, loadOnStartup=true, schema=schema.xml, name=collection1}
   [junit4]   2> 671194 INFO  (TEST-CheckHdfsIndexTest.testChecksumsOnlyVerbose-seed#[CAAC093D1DD1A44]) [n:127.0.0.1:41219_    ] o.a.s.c.CorePropertiesLocator Found core collection1 in /x1/jenkins/jenkins-slave/workspace/Lucene-Solr-Tests-5.x-Java7/solr/build/solr-core/test/J1/temp/solr.index.hdfs.CheckHdfsIndexTest_CAAC093D1DD1A44-001/control-001/cores/collection1
   [junit4]   2> 671194 INFO  (TEST-CheckHdfsIndexTest.testChecksumsOnlyVerbose-seed#[CAAC093D1DD1A44]) [n:127.0.0.1:41219_    ] o.a.s.c.CorePropertiesLocator Found 1 core definitions
   [junit4]   2> 671195 INFO  (TEST-CheckHdfsIndexTest.testChecksumsOnlyVerbose-seed#[CAAC093D1DD1A44]) [n:127.0.0.1:41219_    ] o.a.s.s.SolrDispatchFilter user.dir=/x1/jenkins/jenkins-slave/workspace/Lucene-Solr-Tests-5.x-Java7/solr/build/solr-core/test/J1
   [junit4]   2> 671195 INFO  (TEST-CheckHdfsIndexTest.testChecksumsOnlyVerbose-seed#[CAAC093D1DD1A44]) [n:127.0.0.1:41219_    ] o.a.s.s.SolrDispatchFilter SolrDispatchFilter.init() done
   [junit4]   2> 671195 INFO  (coreLoadExecutor-1708-thread-1-processing-n:127.0.0.1:41219_) [n:127.0.0.1:41219_ c:control_collection   x:collection1] o.a.s.c.ZkController publishing state=down
   [junit4]   2> 671195 INFO  (coreLoadExecutor-1708-thread-1-processing-n:127.0.0.1:41219_) [n:127.0.0.1:41219_ c:control_collection   x:collection1] o.a.s.c.ZkController numShards not found on descriptor - reading it from system property
   [junit4]   2> 671197 INFO  (OverseerStateUpdate-95403607886856196-127.0.0.1:41219_-n_0000000000) [n:127.0.0.1:41219_    ] o.a.s.c.Overseer processMessage: queueSize: 1, message = {
   [junit4]   2>   "collection":"control_collection",
   [junit4]   2>   "numShards":"1",
   [junit4]   2>   "roles":null,
   [junit4]   2>   "operation":"state",
   [junit4]   2>   "core":"collection1",
   [junit4]   2>   "state":"down",
   [junit4]   2>   "node_name":"127.0.0.1:41219_",
   [junit4]   2>   "shard":null,
   [junit4]   2>   "base_url":"http://127.0.0.1:41219"} current state version: 0
   [junit4]   2> 671197 INFO  (coreLoadExecutor-1708-thread-1-processing-n:127.0.0.1:41219_) [n:127.0.0.1:41219_ c:control_collection   x:collection1] o.a.s.c.ZkController look for our core node name
   [junit4]   2> 671198 INFO  (OverseerStateUpdate-95403607886856196-127.0.0.1:41219_-n_0000000000) [n:127.0.0.1:41219_    ] o.a.s.c.o.ReplicaMutator Update state numShards=1 message={
   [junit4]   2>   "collection":"control_collection",
   [junit4]   2>   "numShards":"1",
   [junit4]   2>   "roles":null,
   [junit4]   2>   "operation":"state",
   [junit4]   2>   "core":"collection1",
   [junit4]   2>   "state":"down",
   [junit4]   2>   "node_name":"127.0.0.1:41219_",
   [junit4]   2>   "shard":null,
   [junit4]   2>   "base_url":"http://127.0.0.1:41219"}
   [junit4]   2> 671198 INFO  (OverseerStateUpdate-95403607886856196-127.0.0.1:41219_-n_0000000000) [n:127.0.0.1:41219_    ] o.a.s.c.o.ClusterStateMutator building a new cName: control_collection
   [junit4]   2> 671199 INFO  (OverseerStateUpdate-95403607886856196-127.0.0.1:41219_-n_0000000000) [n:127.0.0.1:41219_    ] o.a.s.c.o.ReplicaMutator Assigning new node to shard shard=shard1
   [junit4]   2> 671200 INFO  (zkCallback-655-thread-1-processing-n:127.0.0.1:41219_) [n:127.0.0.1:41219_    ] o.a.s.c.c.ZkStateReader A cluster state change: [WatchedEvent state:SyncConnected type:NodeDataChanged path:/clusterstate.json], has occurred - updating... (live nodes size: [1])
   [junit4]   2> 672198 INFO  (coreLoadExecutor-1708-thread-1-processing-n:127.0.0.1:41219_) [n:127.0.0.1:41219_ c:control_collection   x:collection1] o.a.s.c.ZkController waiting to find shard id in clusterstate for collection1
   [junit4]   2> 672198 INFO  (coreLoadExecutor-1708-thread-1-processing-n:127.0.0.1:41219_) [n:127.0.0.1:41219_ c:control_collection   x:collection1] o.a.s.c.ZkController Check for collection zkNode:control_collection
   [junit4]   2> 672198 INFO  (coreLoadExecutor-1708-thread-1-processing-n:127.0.0.1:41219_) [n:127.0.0.1:41219_ c:control_collection   x:collection1] o.a.s.c.ZkController Collection zkNode exists
   [junit4]   2> 672198 INFO  (coreLoadExecutor-1708-thread-1-processing-n:127.0.0.1:41219_) [n:127.0.0.1:41219_ c:control_collection   x:collection1] o.a.s.c.c.ZkStateReader Load collection config from: [/collections/control_collection]
   [junit4]   2> 672199 INFO  (coreLoadExecutor-1708-thread-1-processing-n:127.0.0.1:41219_) [n:127.0.0.1:41219_ c:control_collection   x:collection1] o.a.s.c.c.ZkStateReader path=[/collections/control_collection] [configName]=[conf1] specified config exists in ZooKeeper
   [junit4]   2> 672199 INFO  (coreLoadExecutor-1708-thread-1-processing-n:127.0.0.1:41219_) [n:127.0.0.1:41219_ c:control_collection   x:collection1] o.a.s.c.SolrResourceLoader new SolrResourceLoader for directory: '/x1/jenkins/jenkins-slave/workspace/Lucene-Solr-Tests-5.x-Java7/solr/build/solr-core/test/J1/temp/solr.index.hdfs.CheckHdfsIndexTest_CAAC093D1DD1A44-001/control-001/cores/collection1'
   [junit4]   2> 672199 INFO  (coreLoadExecutor-1708-thread-1-processing-n:127.0.0.1:41219_) [n:127.0.0.1:41219_ c:control_collection   x:collection1] o.a.s.c.SolrResourceLoader JNDI not configured for solr (NoInitialContextEx)
   [junit4]   2> 672199 INFO  (coreLoadExecutor-1708-thread-1-processing-n:127.0.0.1:41219_) [n:127.0.0.1:41219_ c:control_collection   x:collection1] o.a.s.c.SolrResourceLoader solr home defaulted to 'solr/' (could not find system property or JNDI)
   [junit4]   2> 672201 INFO  (coreLoadExecutor-1708-thread-1-processing-n:127.0.0.1:41219_) [n:127.0.0.1:41219_ c:control_collection   x:collection1] o.a.s.c.Config loaded config solrconfig.xml with version 0 
   [junit4]   2> 672209 INFO  (coreLoadExecutor-1708-thread-1-processing-n:127.0.0.1:41219_) [n:127.0.0.1:41219_ c:control_collection   x:collection1] o.a.s.c.SolrConfig current version of requestparams : -1
   [junit4]   2> 672224 INFO  (coreLoadExecutor-1708-thread-1-processing-n:127.0.0.1:41219_) [n:127.0.0.1:41219_ c:control_collection   x:collection1] o.a.s.c.SolrConfig Using Lucene MatchVersion: 5.6.0
   [junit4]   2> 672254 INFO  (coreLoadExecutor-1708-thread-1-processing-n:127.0.0.1:41219_) [n:127.0.0.1:41219_ c:control_collection   x:collection1] o.a.s.c.SolrConfig Loaded SolrConfig: solrconfig.xml
   [junit4]   2> 672261 INFO  (coreLoadExecutor-1708-thread-1-processing-n:127.0.0.1:41219_) [n:127.0.0.1:41219_ c:control_collection   x:collection1] o.a.s.s.IndexSchema [collection1] Schema name=test
   [junit4]   2> 672522 INFO  (coreLoadExecutor-1708-thread-1-processing-n:127.0.0.1:41219_) [n:127.0.0.1:41219_ c:control_collection   x:collection1] o.a.s.s.OpenExchangeRatesOrgProvider Initialized with rates=open-exchange-rates.json, refreshInterval=1440.
   [junit4]   2> 672530 INFO  (coreLoadExecutor-1708-thread-1-processing-n:127.0.0.1:41219_) [n:127.0.0.1:41219_ c:control_collection   x:collection1] o.a.s.s.IndexSchema default search field in schema is text
   [junit4]   2> 672531 INFO  (coreLoadExecutor-1708-thread-1-processing-n:127.0.0.1:41219_) [n:127.0.0.1:41219_ c:control_collection   x:collection1] o.a.s.s.IndexSchema unique key field: id
   [junit4]   2> 672541 INFO  (coreLoadExecutor-1708-thread-1-processing-n:127.0.0.1:41219_) [n:127.0.0.1:41219_ c:control_collection   x:collection1] o.a.s.s.FileExchangeRateProvider Reloading exchange rates from file currency.xml
   [junit4]   2> 672545 INFO  (coreLoadExecutor-1708-thread-1-processing-n:127.0.0.1:41219_) [n:127.0.0.1:41219_ c:control_collection   x:collection1] o.a.s.s.FileExchangeRateProvider Reloading exchange rates from file currency.xml
   [junit4]   2> 672547 INFO  (coreLoadExecutor-1708-thread-1-processing-n:127.0.0.1:41219_) [n:127.0.0.1:41219_ c:control_collection   x:collection1] o.a.s.s.OpenExchangeRatesOrgProvider Reloading exchange rates from open-exchange-rates.json
   [junit4]   2> 672548 INFO  (coreLoadExecutor-1708-thread-1-processing-n:127.0.0.1:41219_) [n:127.0.0.1:41219_ c:control_collection   x:collection1] o.a.s.s.OpenExchangeRatesOrgProvider Reloading exchange rates from open-exchange-rates.json
   [junit4]   2> 672550 INFO  (coreLoadExecutor-1708-thread-1-processing-n:127.0.0.1:41219_) [n:127.0.0.1:41219_ c:control_collection   x:collection1] o.a.s.c.ConfigSetProperties Did not find ConfigSet properties, assuming default properties: Can't find resource 'configsetprops.json' in classpath or '/configs/conf1', cwd=/x1/jenkins/jenkins-slave/workspace/Lucene-Solr-Tests-5.x-Java7/solr/build/solr-core/test/J1
   [junit4]   2> 672550 INFO  (coreLoadExecutor-1708-thread-1-processing-n:127.0.0.1:41219_) [n:127.0.0.1:41219_ c:control_collection   x:collection1] o.a.s.c.CoreContainer Creating SolrCore 'collection1' using configuration from collection control_collection
   [junit4]   2> 672550 INFO  (coreLoadExecutor-1708-thread-1-processing-n:127.0.0.1:41219_) [n:127.0.0.1:41219_ c:control_collection s:shard1 r:core_node1 x:collection1] o.a.s.c.SolrCore org.apache.solr.core.HdfsDirectoryFactory
   [junit4]   2> 672558 INFO  (coreLoadExecutor-1708-thread-1-processing-n:127.0.0.1:41219_) [n:127.0.0.1:41219_ c:control_collection s:shard1 r:core_node1 x:collection1] o.a.s.c.HdfsDirectoryFactory solr.hdfs.home=hdfs://localhost:45183/solr_hdfs_home
   [junit4]   2> 672559 INFO  (coreLoadExecutor-1708-thread-1-processing-n:127.0.0.1:41219_) [n:127.0.0.1:41219_ c:control_collection s:shard1 r:core_node1 x:collection1] o.a.s.c.HdfsDirectoryFactory Solr Kerberos Authentication disabled
   [junit4]   2> 672559 INFO  (coreLoadExecutor-1708-thread-1-processing-n:127.0.0.1:41219_) [n:127.0.0.1:41219_ c:control_collection s:shard1 r:core_node1 x:collection1] o.a.s.c.SolrCore [[collection1] ] Opening new SolrCore at [/x1/jenkins/jenkins-slave/workspace/Lucene-Solr-Tests-5.x-Java7/solr/build/solr-core/test/J1/temp/solr.index.hdfs.CheckHdfsIndexTest_CAAC093D1DD1A44-001/control-001/cores/collection1], dataDir=[hdfs://localhost:45183/solr_hdfs_home/control_collection/core_node1/data/]
   [junit4]   2> 672559 INFO  (coreLoadExecutor-1708-thread-1-processing-n:127.0.0.1:41219_) [n:127.0.0.1:41219_ c:control_collection s:shard1 r:core_node1 x:collection1] o.a.s.c.JmxMonitoredMap JMX monitoring is enabled. Adding Solr mbeans to JMX Server: com.sun.jmx.mbeanserver.JmxMBeanServer@722e89f2
   [junit4]   2> 672559 INFO  (coreLoadExecutor-1708-thread-1-processing-n:127.0.0.1:41219_) [n:127.0.0.1:41219_ c:control_collection s:shard1 r:core_node1 x:collection1] o.a.s.c.HdfsDirectoryFactory creating directory factory for path hdfs://localhost:45183/solr_hdfs_home/control_collection/core_node1/data
   [junit4]   2> 672586 INFO  (coreLoadExecutor-1708-thread-1-processing-n:127.0.0.1:41219_) [n:127.0.0.1:41219_ c:control_collection s:shard1 r:core_node1 x:collection1] o.a.s.c.CachingDirectoryFactory return new directory for hdfs://localhost:45183/solr_hdfs_home/control_collection/core_node1/data
   [junit4]   2> 672588 INFO  (coreLoadExecutor-1708-thread-1-processing-n:127.0.0.1:41219_) [n:127.0.0.1:41219_ c:control_collection s:shard1 r:core_node1 x:collection1] o.a.s.c.SolrCore New index directory detected: old=null new=hdfs://localhost:45183/solr_hdfs_home/control_collection/core_node1/data/index/
   [junit4]   2> 672625 WARN  (coreLoadExecutor-1708-thread-1-processing-n:127.0.0.1:41219_) [n:127.0.0.1:41219_ c:control_collection s:shard1 r:core_node1 x:collection1] o.a.s.c.SolrCore [collection1] Solr index directory 'hdfs:/localhost:45183/solr_hdfs_home/control_collection/core_node1/data/index' doesn't exist. Creating new index...
   [junit4]   2> 672626 INFO  (coreLoadExecutor-1708-thread-1-processing-n:127.0.0.1:41219_) [n:127.0.0.1:41219_ c:control_collection s:shard1 r:core_node1 x:collection1] o.a.s.c.HdfsDirectoryFactory creating directory factory for path hdfs://localhost:45183/solr_hdfs_home/control_collection/core_node1/data/index
   [junit4]   2> 672639 INFO  (coreLoadExecutor-1708-thread-1-processing-n:127.0.0.1:41219_) [n:127.0.0.1:41219_ c:control_collection s:shard1 r:core_node1 x:collection1] o.a.s.c.HdfsDirectoryFactory Number of slabs of block cache [1] with direct memory allocation set to [true]
   [junit4]   2> 672640 INFO  (coreLoadExecutor-1708-thread-1-processing-n:127.0.0.1:41219_) [n:127.0.0.1:41219_ c:control_collection s:shard1 r:core_node1 x:collection1] o.a.s.c.HdfsDirectoryFactory Block cache target memory usage, slab size of [8388608] will allocate [1] slabs and use ~[8388608] bytes
   [junit4]   2> 672640 INFO  (coreLoadExecutor-1708-thread-1-processing-n:127.0.0.1:41219_) [n:127.0.0.1:41219_ c:control_collection s:shard1 r:core_node1 x:collection1] o.a.s.c.HdfsDirectoryFactory Creating new global HDFS BlockCache
   [junit4]   2> 672664 INFO  (coreLoadExecutor-1708-thread-1-processing-n:127.0.0.1:41219_) [n:127.0.0.1:41219_ c:control_collection s:shard1 r:core_node1 x:collection1] o.a.s.s.b.BlockDirectory Block cache on write is disabled
   [junit4]   2> 672664 INFO  (coreLoadExecutor-1708-thread-1-processing-n:127.0.0.1:41219_) [n:127.0.0.1:41219_ c:control_collection s:shard1 r:core_node1 x:collection1] o.a.s.c.CachingDirectoryFactory return new directory for hdfs://localhost:45183/solr_hdfs_home/control_collection/core_node1/data/index
   [junit4]   2> 672664 INFO  (coreLoadExecutor-1708-thread-1-processing-n:127.0.0.1:41219_) [n:127.0.0.1:41219_ c:control_collection s:shard1 r:core_node1 x:collection1] o.a.s.u.RandomMergePolicy RandomMergePolicy wrapping class org.apache.lucene.index.AlcoholicMergePolicy: [AlcoholicMergePolicy: minMergeSize=0, mergeFactor=10, maxMergeSize=1762217254, maxMergeSizeForForcedMerge=9223372036854775807, calibrateSizeByDeletes=true, maxMergeDocs=2147483647, maxCFSSegmentSizeMB=8.796093022207999E12, noCFSRatio=0.1]
   [junit4]   2> 672694 INFO  (IPC Server handler 5 on 45183) [    ] BlockStateChange BLOCK* addStoredBlock: blockMap updated: 127.0.0.1:38754 is added to blk_1073741825_1001{blockUCState=UNDER_CONSTRUCTION, primaryNodeIndex=-1, replicas=[ReplicaUnderConstruction[[DISK]DS-cf02f5cc-2d59-4562-9a94-60c25424b64a:NORMAL:127.0.0.1:49855|RBW], ReplicaUnderConstruction[[DISK]DS-ec54d38c-fc99-49ad-a33a-f8988c16c3ef:NORMAL:127.0.0.1:38754|FINALIZED]]} size 0
   [junit4]   2> 672701 INFO  (IPC Server handler 4 on 45183) [    ] BlockStateChange BLOCK* addStoredBlock: blockMap updated: 127.0.0.1:49855 is added to blk_1073741825_1001{blockUCState=UNDER_CONSTRUCTION, primaryNodeIndex=-1, replicas=[ReplicaUnderConstruction[[DISK]DS-ec54d38c-fc99-49ad-a33a-f8988c16c3ef:NORMAL:127.0.0.1:38754|FINALIZED], ReplicaUnderConstruction[[DISK]DS-9e16b5f3-9c18-4136-86c5-39c903dfbb11:NORMAL:127.0.0.1:49855|FINALIZED]]} size 0
   [junit4]   2> 672705 INFO  (coreLoadExecutor-1708-thread-1-processing-n:127.0.0.1:41219_) [n:127.0.0.1:41219_ c:control_collection s:shard1 r:core_node1 x:collection1] o.a.s.c.SolrDeletionPolicy SolrDeletionPolicy.onCommit: commits: num=1
   [junit4]   2> 	commit{dir=NRTCachingDirectory(BlockDirectory(HdfsDirectory@hdfs://localhost:45183/solr_hdfs_home/control_collection/core_node1/data/index lockFactory=org.apache.lucene.store.SingleInstanceLockFactory@36424a11); maxCacheMB=192.0 maxMergeSizeMB=16.0),segFN=segments_1,generation=1}
   [junit4]   2> 672706 INFO  (coreLoadExecutor-1708-thread-1-processing-n:127.0.0.1:41219_) [n:127.0.0.1:41219_ c:control_collection s:shard1 r:core_node1 x:collection1] o.a.s.c.SolrDeletionPolicy newest commit generation = 1
   [junit4]   2> 672712 INFO  (OldIndexDirectoryCleanupThreadForCore-collection1) [n:127.0.0.1:41219_ c:control_collection s:shard1 r:core_node1 x:collection1] o.a.s.c.SolrCore Looking for old index directories to cleanup for core collection1 in hdfs://localhost:45183/solr_hdfs_home/control_collection/core_node1/data/
   [junit4]   2> 672717 INFO  (coreLoadExecutor-1708-thread-1-processing-n:127.0.0.1:41219_) [n:127.0.0.1:41219_ c:control_collection s:shard1 r:core_node1 x:collection1] o.a.s.u.p.UpdateRequestProcessorChain creating updateRequestProcessorChain "nodistrib"
   [junit4]   2> 672717 INFO  (coreLoadExecutor-1708-thread-1-processing-n:127.0.0.1:41219_) [n:127.0.0.1:41219_ c:control_collection s:shard1 r:core_node1 x:collection1] o.a.s.u.p.UpdateRequestProcessorChain creating updateRequestProcessorChain "dedupe"
   [junit4]   2> 672717 INFO  (coreLoadExecutor-1708-thread-1-processing-n:127.0.0.1:41219_) [n:127.0.0.1:41219_ c:control_collection s:shard1 r:core_node1 x:collection1] o.a.s.u.p.UpdateRequestProcessorChain inserting DistributedUpdateProcessorFactory into updateRequestProcessorChain "dedupe"
   [junit4]   2> 672718 INFO  (coreLoadExecutor-1708-thread-1-processing-n:127.0.0.1:41219_) [n:127.0.0.1:41219_ c:control_collection s:shard1 r:core_node1 x:collection1] o.a.s.u.p.UpdateRequestProcessorChain creating updateRequestProcessorChain "stored_sig"
   [junit4]   2> 672718 INFO  (coreLoadExecutor-1708-thread-1-processing-n:127.0.0.1:41219_) [n:127.0.0.1:41219_ c:control_collection s:shard1 r:core_node1 x:collection1] o.a.s.u.p.UpdateRequestProcessorChain inserting DistributedUpdateProcessorFactory into updateRequestProcessorChain "stored_sig"
   [junit4]   2> 672718 INFO  (coreLoadExecutor-1708-thread-1-processing-n:127.0.0.1:41219_) [n:127.0.0.1:41219_ c:control_collection s:shard1 r:core_node1 x:collection1] o.a.s.u.p.UpdateRequestProcessorChain creating updateRequestProcessorChain "distrib-dup-test-chain-explicit"
   [junit4]   2> 672718 INFO  (coreLoadExecutor-1708-thread-1-processing-n:127.0.0.1:41219_) [n:127.0.0.1:41219_ c:control_collection s:shard1 r:core_node1 x:collection1] o.a.s.u.p.UpdateRequestProcessorChain creating updateRequestProcessorChain "distrib-dup-test-chain-implicit"
   [junit4]   2> 672718 INFO  (coreLoadExecutor-1708-thread-1-processing-n:127.0.0.1:41219_) [n:127.0.0.1:41219_ c:control_collection s:shard1 r:core_node1 x:collection1] o.a.s.u.p.UpdateRequestProcessorChain inserting DistributedUpdateProcessorFactory into updateRequestProcessorChain "distrib-dup-test-chain-implicit"
   [junit4]   2> 672718 INFO  (coreLoadExecutor-1708-thread-1-processing-n:127.0.0.1:41219_) [n:127.0.0.1:41219_ c:control_collection s:shard1 r:core_node1 x:collection1] o.a.s.c.SolrCore no updateRequestProcessorChain defined as default, creating implicit default
   [junit4]   2> 672718 WARN  (coreLoadExecutor-1708-thread-1-processing-n:127.0.0.1:41219_) [n:127.0.0.1:41219_ c:control_collection s:shard1 r:core_node1 x:collection1] o.a.s.c.RequestHandlers INVALID paramSet a in requestHandler {type = requestHandler,name = /dump,class = DumpRequestHandler,args = {defaults={a=A,b=B}}}
   [junit4]   2> 672722 INFO  (coreLoadExecutor-1708-thread-1-processing-n:127.0.0.1:41219_) [n:127.0.0.1:41219_ c:control_collection s:shard1 r:core_node1 x:collection1] o.a.s.h.l.XMLLoader xsltCacheLifetimeSeconds=60
   [junit4]   2> 672724 INFO  (coreLoadExecutor-1708-thread-1-processing-n:127.0.0.1:41219_) [n:127.0.0.1:41219_ c:control_collection s:shard1 r:core_node1 x:collection1] o.a.s.h.l.XMLLoader xsltCacheLifetimeSeconds=60
   [junit4]   2> 672725 INFO  (coreLoadExecutor-1708-thread-1-processing-n:127.0.0.1:41219_) [n:127.0.0.1:41219_ c:control_collection s:shard1 r:core_node1 x:collection1] o.a.s.h.l.XMLLoader xsltCacheLifetimeSeconds=60
   [junit4]   2> 672738 INFO  (coreLoadExecutor-1708-thread-1-processing-n:127.0.0.1:41219_) [n:127.0.0.1:41219_ c:control_collection s:shard1 r:core_node1 x:collection1] o.a.s.h.l.XMLLoader xsltCacheLifetimeSeconds=60
   [junit4]   2> 672744 INFO  (coreLoadExecutor-1708-thread-1-processing-n:127.0.0.1:41219_) [n:127.0.0.1:41219_ c:control_collection s:shard1 r:core_node1 x:collection1] o.a.s.c.RequestHandlers Registered paths: /admin/segments,/admin/system,/get,/config,/admin/threads,/admin/logging,standard,/admin/plugins,/update/json/docs,/dump,/schema,/update/json,/admin/ping,/admin/mbeans,/replication,/admin/properties,/admin/file,/update,/admin/luke,/update/csv
   [junit4]   2> 672746 INFO  (coreLoadExecutor-1708-thread-1-processing-n:127.0.0.1:41219_) [n:127.0.0.1:41219_ c:control_collection s:shard1 r:core_node1 x:collection1] o.a.s.c.SolrCore Using default statsCache cache: org.apache.solr.search.stats.LocalStatsCache
   [junit4]   2> 672750 INFO  (coreLoadExecutor-1708-thread-1-processing-n:127.0.0.1:41219_) [n:127.0.0.1:41219_ c:control_collection s:shard1 r:core_node1 x:collection1] o.a.s.u.UpdateHandler Using UpdateLog implementation: org.apache.solr.update.HdfsUpdateLog
   [junit4]   2> 672750 INFO  (coreLoadExecutor-1708-thread-1-processing-n:127.0.0.1:41219_) [n:127.0.0.1:41219_ c:control_collection s:shard1 r:core_node1 x:collection1] o.a.s.u.HdfsUpdateLog Initializing HdfsUpdateLog: dataDir= defaultSyncLevel=FLUSH numRecordsToKeep=100 maxNumLogsToKeep=10 tlogDfsReplication=2
   [junit4]   2> 672774 INFO  (coreLoadExecutor-1708-thread-1-processing-n:127.0.0.1:41219_) [n:127.0.0.1:41219_ c:control_collection s:shard1 r:core_node1 x:collection1] o.a.s.u.CommitTracker Hard AutoCommit: disabled
   [junit4]   2> 672774 INFO  (coreLoadExecutor-1708-thread-1-processing-n:127.0.0.1:41219_) [n:127.0.0.1:41219_ c:control_collection s:shard1 r:core_node1 x:collection1] o.a.s.u.CommitTracker Soft AutoCommit: disabled
   [junit4]   2> 672777 INFO  (coreLoadExecutor-1708-thread-1-processing-n:127.0.0.1:41219_) [n:127.0.0.1:41219_ c:control_collection s:shard1 r:core_node1 x:collection1] o.a.s.u.RandomMergePolicy RandomMergePolicy wrapping class org.apache.lucene.index.LogDocMergePolicy: [LogDocMergePolicy: minMergeSize=1000, mergeFactor=24, maxMergeSize=9223372036854775807, maxMergeSizeForForcedMerge=9223372036854775807, calibrateSizeByDeletes=false, maxMergeDocs=2147483647, maxCFSSegmentSizeMB=8.796093022207999E12, noCFSRatio=0.8592696410905457]
   [junit4]   2> 672791 INFO  (coreLoadExecutor-1708-thread-1-processing-n:127.0.0.1:41219_) [n:127.0.0.1:41219_ c:control_collection s:shard1 r:core_node1 x:collection1] o.a.s.c.SolrDeletionPolicy SolrDeletionPolicy.onInit: commits: num=1
   [junit4]   2> 	commit{dir=NRTCachingDirectory(BlockDirectory(HdfsDirectory@hdfs://localhost:45183/solr_hdfs_home/control_collection/core_node1/data/index lockFactory=org.apache.lucene.store.SingleInstanceLockFactory@36424a11); maxCacheMB=192.0 maxMergeSizeMB=16.0),segFN=segments_1,generation=1}
   [junit4]   2> 672791 INFO  (coreLoadExecutor-1708-thread-1-processing-n:127.0.0.1:41219_) [n:127.0.0.1:41219_ c:control_collection s:shard1 r:core_node1 x:collection1] o.a.s.c.SolrDeletionPolicy newest commit generation = 1
   [junit4]   2> 672791 INFO  (coreLoadExecutor-1708-thread-1-processing-n:127.0.0.1:41219_) [n:127.0.0.1:41219_ c:control_collection s:shard1 r:core_node1 x:collection1] o.a.s.s.SolrIndexSearcher Opening Searcher@3096c7b6[collection1] main
   [junit4]   2> 672791 INFO  (coreLoadExecutor-1708-thread-1-processing-n:127.0.0.1:41219_) [n:127.0.0.1:41219_ c:control_collection s:shard1 r:core_node1 x:collection1] o.a.s.c.c.ZkStateReader Load collection config from: [/collections/control_collection]
   [junit4]   2> 672792 INFO  (coreLoadExecutor-1708-thread-1-processing-n:127.0.0.1:41219_) [n:127.0.0.1:41219_ c:control_collection s:shard1 r:core_node1 x:collection1] o.a.s.c.c.ZkStateReader path=[/collections/control_collection] [configName]=[conf1] specified config exists in ZooKeeper
   [junit4]   2> 672792 INFO  (coreLoadExecutor-1708-thread-1-processing-n:127.0.0.1:41219_) [n:127.0.0.1:41219_ c:control_collection s:shard1 r:core_node1 x:collection1] o.a.s.r.ManagedResourceStorage Setting up ZooKeeper-based storage for the RestManager with znodeBase: /configs/conf1
   [junit4]   2> 672793 INFO  (coreLoadExecutor-1708-thread-1-processing-n:127.0.0.1:41219_) [n:127.0.0.1:41219_ c:control_collection s:shard1 r:core_node1 x:collection1] o.a.s.r.ManagedResourceStorage Configured ZooKeeperStorageIO with znodeBase: /configs/conf1
   [junit4]   2> 672793 INFO  (coreLoadExecutor-1708-thread-1-processing-n:127.0.0.1:41219_) [n:127.0.0.1:41219_ c:control_collection s:shard1 r:core_node1 x:collection1] o.a.s.r.RestManager Initializing RestManager with initArgs: {}
   [junit4]   2> 672793 INFO  (coreLoadExecutor-1708-thread-1-processing-n:127.0.0.1:41219_) [n:127.0.0.1:41219_ c:control_collection s:shard1 r:core_node1 x:collection1] o.a.s.r.ManagedResourceStorage Reading _rest_managed.json using ZooKeeperStorageIO:path=/configs/conf1
   [junit4]   2> 672794 INFO  (coreLoadExecutor-1708-thread-1-processing-n:127.0.0.1:41219_) [n:127.0.0.1:41219_ c:control_collection s:shard1 r:core_node1 x:collection1] o.a.s.r.ManagedResourceStorage No data found for znode /configs/conf1/_rest_managed.json
   [junit4]   2> 672794 INFO  (coreLoadExecutor-1708-thread-1-processing-n:127.0.0.1:41219_) [n:127.0.0.1:41219_ c:control_collection s:shard1 r:core_node1 x:collection1] o.a.s.r.ManagedResourceStorage Loaded null at path _rest_managed.json using ZooKeeperStorageIO:path=/configs/conf1
   [junit4]   2> 672795 INFO  (coreLoadExecutor-1708-thread-1-processing-n:127.0.0.1:41219_) [n:127.0.0.1:41219_ c:control_collection s:shard1 r:core_node1 x:collection1] o.a.s.r.RestManager Initializing 0 registered ManagedResources
   [junit4]   2> 672798 INFO  (coreLoadExecutor-1708-thread-1-processing-n:127.0.0.1:41219_) [n:127.0.0.1:41219_ c:control_collection s:shard1 r:core_node1 x:collection1] o.a.s.h.ReplicationHandler Commits will be reserved for  10000
   [junit4]   2> 672800 INFO  (searcherExecutor-1709-thread-1-processing-c:control_collection x:collection1 r:core_node1 n:127.0.0.1:41219_ s:shard1) [n:127.0.0.1:41219_ c:control_collection s:shard1 r:core_node1 x:collection1] o.a.s.c.SolrCore [collection1] Registered new searcher Searcher@3096c7b6[collection1] main{ExitableDirectoryReader(UninvertingDirectoryReader())}
   [junit4]   2> 672800 INFO  (coreLoadExecutor-1708-thread-1-processing-n:127.0.0.1:41219_) [n:127.0.0.1:41219_ c:control_collection s:shard1 r:core_node1 x:collection1] o.a.s.u.UpdateLog Looking up max value of version field to seed version buckets
   [junit4]   2> 672800 INFO  (coreLoadExecutor-1708-thread-1-processing-n:127.0.0.1:41219_) [n:127.0.0.1:41219_ c:control_collection s:shard1 r:core_node1 x:collection1] o.a.s.u.VersionInfo Refreshing highest value of _version_ for 256 version buckets from index
   [junit4]   2> 672800 INFO  (coreLoadExecutor-1708-thread-1-processing-n:127.0.0.1:41219_) [n:127.0.0.1:41219_ c:control_collection s:shard1 r:core_node1 x:collection1] o.a.s.u.VersionInfo No terms found for _version_, cannot seed version bucket highest value from index
   [junit4]   2> 672800 INFO  (coreLoadExecutor-1708-thread-1-processing-n:127.0.0.1:41219_) [n:127.0.0.1:41219_ c:control_collection s:shard1 r:core_node1 x:collection1] o.a.s.u.UpdateLog Could not find max version in index or recent updates, using new clock 1526457728198770688
   [junit4]   2> 672800 INFO  (coreLoadExecutor-1708-thread-1-processing-n:127.0.0.1:41219_) [n:127.0.0.1:41219_ c:control_collection s:shard1 r:core_node1 x:collection1] o.a.s.u.UpdateLog Took 0.0ms to seed version buckets with highest version 1526457728198770688
   [junit4]   2> 672800 INFO  (coreLoadExecutor-1708-thread-1-processing-n:127.0.0.1:41219_) [n:127.0.0.1:41219_ c:control_collection s:shard1 r:core_node1 x:collection1] o.a.s.c.ZkController watch zkdir /configs/conf1
   [junit4]   2> 672802 INFO  (coreLoadExecutor-1708-thread-1-processing-n:127.0.0.1:41219_) [n:127.0.0.1:41219_ c:control_collection s:shard1 r:core_node1 x:collection1] o.a.s.c.CoreContainer registering core: collection1
   [junit4]   2> 672802 INFO  (coreZkRegister-1702-thread-1-processing-c:control_collection x:collection1 r:core_node1 n:127.0.0.1:41219_ s:shard1) [n:127.0.0.1:41219_ c:control_collection s:shard1 r:core_node1 x:collection1] o.a.s.c.ZkController Register replica - core:collection1 address:http://127.0.0.1:41219 collection:control_collection shard:shard1
   [junit4]   2> 672803 INFO  (coreZkRegister-1702-thread-1-processing-c:control_collection x:collection1 r:core_node1 n:127.0.0.1:41219_ s:shard1) [n:127.0.0.1:41219_ c:control_collection s:shard1 r:core_node1 x:collection1] o.a.s.c.c.SolrZkClient makePath: /collections/control_collection/leader_elect/shard1/election
   [junit4]   2> 672808 INFO  (coreZkRegister-1702-thread-1-processing-c:control_collection x:collection1 r:core_node1 n:127.0.0.1:41219_ s:shard1) [n:127.0.0.1:41219_ c:control_collection s:shard1 r:core_node1 x:collection1] o.a.s.c.LeaderElector Joined leadership election with path: /collections/control_collection/leader_elect/shard1/election/95403607886856196-core_node1-n_0000000000
   [junit4]   2> 672808 INFO  (coreZkRegister-1702-thread-1-processing-c:control_collection x:collection1 r:core_node1 n:127.0.0.1:41219_ s:shard1) [n:127.0.0.1:41219_ c:control_collection s:shard1 r:core_node1 x:collection1] o.a.s.c.ShardLeaderElectionContext Running the leader process for shard=shard1 and weAreReplacement=false and leaderVoteWait=10000
   [junit4]   2> 672810 INFO  (coreZkRegister-1702-thread-1-processing-c:control_collection x:collection1 r:core_node1 n:127.0.0.1:41219_ s:shard1) [n:127.0.0.1:41219_ c:control_collection s:shard1 r:core_node1 x:collection1] o.a.s.c.ShardLeaderElectionContext Enough replicas found to continue.
   [junit4]   2> 672810 INFO  (coreZkRegister-1702-thread-1-processing-c:control_collection x:collection1 r:core_node1 n:127.0.0.1:41219_ s:shard1) [n:127.0.0.1:41219_ c:control_collection s:shard1 r:core_node1 x:collection1] o.a.s.c.ShardLeaderElectionContext I may be the new leader - try and sync
   [junit4]   2> 672810 INFO  (OverseerStateUpdate-95403607886856196-127.0.0.1:41219_-n_0000000000) [n:127.0.0.1:41219_    ] o.a.s.c.Overseer processMessage: queueSize: 1, message = {
   [junit4]   2>   "operation":"leader",
   [junit4]   2>   "shard":"shard1",
   [junit4]   2>   "collection":"control_collection"} current state version: 1
   [junit4]   2> 672810 INFO  (coreZkRegister-1702-thread-1-processing-c:control_collection x:collection1 r:core_node1 n:127.0.0.1:41219_ s:shard1) [n:127.0.0.1:41219_ c:control_collection s:shard1 r:core_node1 x:collection1] o.a.s.c.SyncStrategy Sync replicas to http://127.0.0.1:41219/collection1/
   [junit4]   2> 672810 INFO  (coreZkRegister-1702-thread-1-processing-c:control_collection x:collection1 r:core_node1 n:127.0.0.1:41219_ s:shard1) [n:127.0.0.1:41219_ c:control_collection s:shard1 r:core_node1 x:collection1] o.a.s.c.SyncStrategy Sync Success - now sync replicas to me
   [junit4]   2> 672811 INFO  (coreZkRegister-1702-thread-1-processing-c:control_collection x:collection1 r:core_node1 n:127.0.0.1:41219_ s:shard1) [n:127.0.0.1:41219_ c:control_collection s:shard1 r:core_node1 x:collection1] o.a.s.c.SyncStrategy http://127.0.0.1:41219/collection1/ has no replicas
   [junit4]   2> 672812 INFO  (zkCallback-655-thread-1-processing-n:127.0.0.1:41219_) [n:127.0.0.1:41219_    ] o.a.s.c.c.ZkStateReader A cluster state change: [WatchedEvent state:SyncConnected type:NodeDataChanged path:/clusterstate.json], has occurred - updating... (live nodes size: [1])
   [junit4]   2> 672812 INFO  (coreZkRegister-1702-thread-1-processing-c:control_collection x:collection1 r:core_node1 n:127.0.0.1:41219_ s:shard1) [n:127.0.0.1:41219_ c:control_collection s:shard1 r:core_node1 x:collection1] o.a.s.c.c.SolrZkClient makePath: /collections/control_collection/leaders/shard1
   [junit4]   2> 672816 INFO  (coreZkRegister-1702-thread-1-processing-c:control_collection x:collection1 r:core_node1 n:127.0.0.1:41219_ s:shard1) [n:127.0.0.1:41219_ c:control_collection s:shard1 r:core_node1 x:collection1] o.a.s.c.ShardLeaderElectionContextBase Creating leader registration node
   [junit4]   2> 672818 INFO  (coreZkRegister-1702-thread-1-processing-c:control_collection x:collection1 r:core_node1 n:127.0.0.1:41219_ s:shard1) [n:127.0.0.1:41219_ c:control_collection s:shard1 r:core_node1 x:collection1] o.a.s.c.ShardLeaderElectionContext I am the new leader: http://127.0.0.1:41219/collection1/ shard1
   [junit4]   2> 672820 INFO  (OverseerStateUpdate-95403607886856196-127.0.0.1:41219_-n_0000000000) [n:127.0.0.1:41219_    ] o.a.s.c.Overseer processMessage: queueSize: 1, message = {
   [junit4]   2>   "operation":"leader",
   [junit4]   2>   "shard":"shard1",
   [junit4]   2>   "collection":"control_collection",
   [junit4]   2>   "base_url":"http://127.0.0.1:41219",
   [junit4]   2>   "core":"collection1",
   [junit4]   2>   "state":"active"} current state version: 2
   [junit4]   2> 672922 INFO  (zkCallback-655-thread-1-processing-n:127.0.0.1:41219_) [n:127.0.0.1:41219_    ] o.a.s.c.c.ZkStateReader A cluster state change: [WatchedEvent state:SyncConnected type:NodeDataChanged path:/clusterstate.json], has occurred - updating... (live nodes size: [1])
   [junit4]   2> 672971 INFO  (coreZkRegister-1702-thread-1-processing-c:control_collection x:collection1 r:core_node1 n:127.0.0.1:41219_ s:shard1) [n:127.0.0.1:41219_ c:control_collection s:shard1 r:core_node1 x:collection1] o.a.s.c.ZkController We are http://127.0.0.1:41219/collection1/ and leader is http://127.0.0.1:41219/collection1/
   [junit4]   2> 672971 INFO  (coreZkRegister-1702-thread-1-processing-c:control_collection x:collection1 r:core_node1 n:127.0.0.1:41219_ s:shard1) [n:127.0.0.1:41219_ c:control_collection s:shard1 r:core_node1 x:collection1] o.a.s.c.ZkController No LogReplay needed for core=collection1 baseURL=http://127.0.0.1:41219
   [junit4]   2> 672971 INFO  (coreZkRegister-1702-thread-1-processing-c:control_collection x:collection1 r:core_node1 n:127.0.0.1:41219_ s:shard1) [n:127.0.0.1:41219_ c:control_collection s:shard1 r:core_node1 x:collection1] o.a.s.c.ZkController I am the leader, no recovery necessary
   [junit4]   2> 672971 INFO  (coreZkRegister-1702-thread-1-processing-c:control_collection x:collection1 r:core_node1 n:127.0.0.1:41219_ s:shard1) [n:127.0.0.1:41219_ c:control_collection s:shard1 r:core_node1 x:collection1] o.a.s.c.ZkController publishing state=active
   [junit4]   2> 672971 INFO  (coreZkRegister-1702-thread-1-processing-c:control_collection x:collection1 r:core_node1 n:127.0.0.1:41219_ s:shard1) [n:127.0.0.1:41219_ c:control_collection s:shard1 r:core_node1 x:collection1] o.a.s.c.ZkController numShards not found on descriptor - reading it from system property
   [junit4]   2> 672973 INFO  (OverseerStateUpdate-95403607886856196-127.0.0.1:41219_-n_0000000000) [n:127.0.0.1:41219_    ] o.a.s.c.Overseer processMessage: queueSize: 1, message = {
   [junit4]   2>   "collection":"control_collection",
   [junit4]   2>   "numShards":"1",
   [junit4]   2>   "roles":null,
   [junit4]   2>   "operation":"state",
   [junit4]   2>   "core":"collection1",
   [junit4]   2>   "state":"active",
   [junit4]   2>   "node_name":"127.0.0.1:41219_",
   [junit4]   2>   "core_node_name":"core_node1",
   [junit4]   2>   "shard":"shard1",
   [junit4]   2>   "base_url":"http://127.0.0.1:41219"} current state version: 3
   [junit4]   2> 672974 INFO  (OverseerStateUpdate-95403607886856196-127.0.0.1:41219_-n_0000000000) [n:127.0.0.1:41219_    ] o.a.s.c.o.ReplicaMutator Update state numShards=1 message={
   [junit4]   2>   "collection":"control_collection",
   [junit4]   2>   "numShards":"1",
   [junit4]   2>   "roles":null,
   [junit4]   2>   "operation":"state",
   [junit4]   2>   "core":"collection1",
   [junit4]   2>   "state":"active",
   [junit4]   2>   "node_name":"127.0.0.1:41219_",
   [junit4]   2>   "core_node_name":"core_node1",
   [junit4]   2>   "shard":"shard1",
   [junit4]   2>   "base_url":"http://127.0.0.1:41219"}
   [junit4]   2> 673076 INFO  (zkCallback-655-thread-1-processing-n:127.0.0.1:41219_) [n:127.0.0.1:41219_    ] o.a.s.c.c.ZkStateReader A cluster state change: [WatchedEvent state:SyncConnected type:NodeDataChanged path:/clusterstate.json], has occurred - updating... (live nodes size: [1])
   [junit4]   2> 673198 INFO  (TEST-CheckHdfsIndexTest.testChecksumsOnlyVerbose-seed#[CAAC093D1DD1A44]) [    ] o.a.s.c.c.SolrZkClient Using default ZkCredentialsProvider
   [junit4]   2> 673199 INFO  (TEST-CheckHdfsIndexTest.testChecksumsOnlyVerbose-seed#[CAAC093D1DD1A44]) [    ] o.a.s.c.c.ConnectionManager Waiting for client to connect to ZooKeeper
   [junit4]   2> 673202 INFO  (zkCallback-657-thread-1) [    ] o.a.s.c.c.ConnectionManager Watcher org.apache.solr.common.cloud.ConnectionManager@3f361465 name:ZooKeeperConnection Watcher:127.0.0.1:38357/solr got event WatchedEvent state:SyncConnected type:None path:null path:null type:None
   [junit4]   2> 673202 INFO  (TEST-CheckHdfsIndexTest.testChecksumsOnlyVerbose-seed#[CAAC093D1DD1A44]) [    ] o.a.s.c.c.ConnectionManager Client is connected to ZooKeeper
   [junit4]   2> 673202 INFO  (TEST-CheckHdfsIndexTest.testChecksumsOnlyVerbose-seed#[CAAC093D1DD1A44]) [    ] o.a.s.c.c.SolrZkClient Using default ZkACLProvider
   [junit4]   2> 673202 INFO  (TEST-CheckHdfsIndexTest.testChecksumsOnlyVerbose-seed#[CAAC093D1DD1A44]) [    ] o.a.s.c.c.ZkStateReader Updating cluster state from ZooKeeper... 
   [junit4]   2> 673205 INFO  (TEST-CheckHdfsIndexTest.testChecksumsOnlyVerbose-seed#[CAAC093D1DD1A44]) [    ] o.a.s.c.ChaosMonkey monkey: init - expire sessions:false cause connection loss:false
   [junit4]   2> 673205 INFO  (TEST-CheckHdfsIndexTest.testChecksumsOnlyVerbose-seed#[CAAC093D1DD1A44]) [    ] o.a.s.c.AbstractFullDistribZkTestBase Creating collection1 with stateFormat=2
   [junit4]   2> 673205 INFO  (TEST-CheckHdfsIndexTest.testChecksumsOnlyVerbose-seed#[CAAC093D1DD1A44]) [    ] o.a.s.c.c.SolrZkClient Using default ZkCredentialsProvider
   [junit4]   2> 673205 INFO  (TEST-CheckHdfsIndexTest.testChecksumsOnlyVerbose-seed#[CAAC093D1DD1A44]) [    ] o.a.s.c.c.ConnectionManager Waiting for client to connect to ZooKeeper
   [junit4]   2> 673209 INFO  (zkCallback-658-thread-1) [    ] o.a.s.c.c.ConnectionManager Watcher org.apache.solr.common.cloud.ConnectionManager@675ae9d4 name:ZooKeeperConnection Watcher:127.0.0.1:38357/solr got event WatchedEvent state:SyncConnected type:None path:null path:null type:None
   [junit4]   2> 673209 INFO  (TEST-CheckHdfsIndexTest.testChecksumsOnlyVerbose-seed#[CAAC093D1DD1A44]) [    ] o.a.s.c.c.ConnectionManager Client is connected to ZooKeeper
   [junit4]   2> 673209 INFO  (TEST-CheckHdfsIndexTest.testChecksumsOnlyVerbose-seed#[CAAC093D1DD1A44]) [    ] o.a.s.c.c.SolrZkClient Using default ZkACLProvider
   [junit4]   2> 673211 INFO  (OverseerStateUpdate-95403607886856196-127.0.0.1:41219_-n_0000000000) [n:127.0.0.1:41219_    ] o.a.s.c.Overseer processMessage: queueSize: 1, message = {
   [junit4]   2>   "operation":"create",
   [junit4]   2>   "name":"collection1",
   [junit4]   2>   "numShards":"1",
   [junit4]   2>   "stateFormat":"2"} current state version: 4
   [junit4]   2> 673211 INFO  (OverseerStateUpdate-95403607886856196-127.0.0.1:41219_-n_0000000000) [n:127.0.0.1:41219_    ] o.a.s.c.o.ClusterStateMutator building a new cName: collection1
   [junit4]   2> 673310 INFO  (TEST-CheckHdfsIndexTest.testChecksumsOnlyVerbose-seed#[CAAC093D1DD1A44]) [    ] o.a.s.SolrTestCaseJ4 Writing core.properties file to /x1/jenkins/jenkins-slave/workspace/Lucene-Solr-Tests-5.x-Java7/solr/build/solr-core/test/J1/temp/solr.index.hdfs.CheckHdfsIndexTest_CAAC093D1DD1A44-001/shard-1-001/cores/collection1
   [junit4]   2> 673310 INFO  (TEST-CheckHdfsIndexTest.testChecksumsOnlyVerbose-seed#[CAAC093D1DD1A44]) [    ] o.a.s.c.AbstractFullDistribZkTestBase create jetty 1 in directory /x1/jenkins/jenkins-slave/workspace/Lucene-Solr-Tests-5.x-Java7/solr/build/solr-core/test/J1/temp/solr.index.hdfs.CheckHdfsIndexTest_CAAC093D1DD1A44-001/shard-1-001
   [junit4]   2> 673311 INFO  (TEST-CheckHdfsIndexTest.testChecksumsOnlyVerbose-seed#[CAAC093D1DD1A44]) [    ] o.e.j.s.Server jetty-9.2.13.v20150730
   [junit4]   2> 673313 INFO  (TEST-CheckHdfsIndexTest.testChecksumsOnlyVerbose-seed#[CAAC093D1DD1A44]) [    ] o.e.j.s.h.ContextHandler Started o.e.j.s.ServletContextHandler@2a456835{/,null,AVAILABLE}
   [junit4]   2> 673314 INFO  (TEST-CheckHdfsIndexTest.testChecksumsOnlyVerbose-seed#[CAAC093D1DD1A44]) [    ] o.e.j.s.ServerConnector Started ServerConnector@76d0886c{HTTP/1.1}{127.0.0.1:51222}
   [junit4]   2> 673314 INFO  (TEST-CheckHdfsIndexTest.testChecksumsOnlyVerbose-seed#[CAAC093D1DD1A44]) [    ] o.e.j.s.Server Started @676162ms
   [junit4]   2> 673314 INFO  (TEST-CheckHdfsIndexTest.testChecksumsOnlyVerbose-seed#[CAAC093D1DD1A44]) [    ] o.a.s.c.s.e.JettySolrRunner Jetty properties: {coreRootDirectory=/x1/jenkins/jenkins-slave/workspace/Lucene-Solr-Tests-5.x-Java7/solr/build/solr-core/test/J1/../../../../../../../../../../x1/jenkins/jenkins-slave/workspace/Lucene-Solr-Tests-5.x-Java7/solr/build/solr-core/test/J1/temp/solr.index.hdfs.CheckHdfsIndexTest_CAAC093D1DD1A44-001/shard-1-001/cores, solr.data.dir=hdfs://localhost:45183/hdfs__localhost_45183__x1_jenkins_jenkins-slave_workspace_Lucene-Solr-Tests-5.x-Java7_solr_build_solr-core_test_J1_temp_solr.index.hdfs.CheckHdfsIndexTest_CAAC093D1DD1A44-001_tempDir-002_jetty1, hostContext=/, hostPort=51222, solrconfig=solrconfig.xml}
   [junit4]   2> 673314 INFO  (TEST-CheckHdfsIndexTest.testChecksumsOnlyVerbose-seed#[CAAC093D1DD1A44]) [    ] o.a.s.s.SolrDispatchFilter SolrDispatchFilter.init(): sun.misc.Launcher$AppClassLoader@7b3cb2c6
   [junit4]   2> 673314 INFO  (TEST-CheckHdfsIndexTest.testChecksumsOnlyVerbose-seed#[CAAC093D1DD1A44]) [    ] o.a.s.c.SolrResourceLoader new SolrResourceLoader for directory: '/x1/jenkins/jenkins-slave/workspace/Lucene-Solr-Tests-5.x-Java7/solr/build/solr-core/test/J1/temp/solr.index.hdfs.CheckHdfsIndexTest_CAAC093D1DD1A44-001/shard-1-001'
   [junit4]   2> 673314 INFO  (TEST-CheckHdfsIndexTest.testChecksumsOnlyVerbose-seed#[CAAC093D1DD1A44]) [    ] o.a.s.c.SolrResourceLoader JNDI not configured for solr (NoInitialContextEx)
   [junit4]   2> 673315 INFO  (TEST-CheckHdfsIndexTest.testChecksumsOnlyVerbose-seed#[CAAC093D1DD1A44]) [    ] o.a.s.c.SolrResourceLoader solr home defaulted to 'solr/' (could not find system property or JNDI)
   [junit4]   2> 673315 INFO  (TEST-CheckHdfsIndexTest.testChecksumsOnlyVerbose-seed#[CAAC093D1DD1A44]) [    ] o.a.s.c.c.SolrZkClient Using default ZkCredentialsProvider
   [junit4]   2> 673315 INFO  (TEST-CheckHdfsIndexTest.testChecksumsOnlyVerbose-seed#[CAAC093D1DD1A44]) [    ] o.a.s.c.c.ConnectionManager Waiting for client to connect to ZooKeeper
   [junit4]   2> 673317 INFO  (zkCallback-659-thread-1) [    ] o.a.s.c.c.ConnectionManager Watcher org.apache.solr.common.cloud.ConnectionManager@a7863a9 name:ZooKeeperConnection Watcher:127.0.0.1:38357/solr got event WatchedEvent state:SyncConnected type:None path:null path:null type:None
   [junit4]   2> 673318 INFO  (TEST-CheckHdfsIndexTest.testChecksumsOnlyVerbose-seed#[CAAC093D1DD1A44]) [    ] o.a.s.c.c.ConnectionManager Client is connected to ZooKeeper
   [junit4]   2> 673318 INFO  (TEST-CheckHdfsIndexTest.testChecksumsOnlyVerbose-seed#[CAAC093D1DD1A44]) [    ] o.a.s.c.c.SolrZkClient Using default ZkACLProvider
   [junit4]   2> 673318 INFO  (OverseerStateUpdate-95403607886856196-127.0.0.1:41219_-n_0000000000) [n:127.0.0.1:41219_    ] o.a.s.c.o.ZkStateWriter going to create_collection /collections/collection1/state.json
   [junit4]   2> 673321 INFO  (TEST-CheckHdfsIndexTest.testChecksumsOnlyVerbose-seed#[CAAC093D1DD1A44]) [    ] o.a.s.s.SolrDispatchFilter Loading solr.xml from SolrHome (not found in ZooKeeper)
   [junit4]   2> 673321 INFO  (TEST-CheckHdfsIndexTest.testChecksumsOnlyVerbose-seed#[CAAC093D1DD1A44]) [    ] o.a.s.c.SolrXmlConfig Loading container configuration from /x1/jenkins/jenkins-slave/workspace/Lucene-Solr-Tests-5.x-Java7/solr/build/solr-core/test/J1/temp/solr.index.hdfs.CheckHdfsIndexTest_CAAC093D1DD1A44-001/shard-1-001/solr.xml
   [junit4]   2> 673341 INFO  (TEST-CheckHdfsIndexTest.testChecksumsOnlyVerbose-seed#[CAAC093D1DD1A44]) [    ] o.a.s.c.CorePropertiesLocator Config-defined core root directory: /x1/jenkins/jenkins-slave/workspace/Lucene-Solr-Tests-5.x-Java7/solr/build/solr-core/test/J1/../../../../../../../../../../x1/jenkins/jenkins-slave/workspace/Lucene-Solr-Tests-5.x-Java7/solr/build/solr-core/test/J1/temp/solr.index.hdfs.CheckHdfsIndexTest_CAAC093D1DD1A44-001/shard-1-001/cores
   [junit4]   2> 673341 INFO  (TEST-CheckHdfsIndexTest.testChecksumsOnlyVerbose-seed#[CAAC093D1DD1A44]) [    ] o.a.s.c.CoreContainer New CoreContainer 1743827440
   [junit4]   2> 673341 INFO  (TEST-CheckHdfsIndexTest.testChecksumsOnlyVerbose-seed#[CAAC093D1DD1A44]) [    ] o.a.s.c.CoreContainer Loading cores into CoreContainer [instanceDir=/x1/jenkins/jenkins-slave/workspace/Lucene-Solr-Tests-5.x-Java7/solr/build/solr-core/test/J1/temp/solr.index.hdfs.CheckHdfsIndexTest_CAAC093D1DD1A44-001/shard-1-001]
   [junit4]   2> 673341 WARN  (TEST-CheckHdfsIndexTest.testChecksumsOnlyVerbose-seed#[CAAC093D1DD1A44]) [    ] o.a.s.c.CoreContainer Couldn't add files from /x1/jenkins/jenkins-slave/workspace/Lucene-Solr-Tests-5.x-Java7/solr/build/solr-core/test/J1/temp/solr.index.hdfs.CheckHdfsIndexTest_CAAC093D1DD1A44-001/shard-1-001/lib to classpath: /x1/jenkins/jenkins-slave/workspace/Lucene-Solr-Tests-5.x-Java7/solr/build/solr-core/test/J1/temp/solr.index.hdfs.CheckHdfsIndexTest_CAAC093D1DD1A44-001/shard-1-001/lib
   [junit4]   2> 673342 INFO  (TEST-CheckHdfsIndexTest.testChecksumsOnlyVerbose-seed#[CAAC093D1DD1A44]) [    ] o.a.s.h.c.HttpShardHandlerFactory created with socketTimeout : 90000,urlScheme : ,connTimeout : 15000,maxConnectionsPerHost : 20,maxConnections : 10000,corePoolSize : 0,maximumPoolSize : 2147483647,maxThreadIdleTime : 5,sizeOfQueue : -1,fairnessPolicy : false,useRetries : false,
   [junit4]   2> 673343 INFO  (TEST-CheckHdfsIndexTest.testChecksumsOnlyVerbose-seed#[CAAC093D1DD1A44]) [    ] o.a.s.u.UpdateShardHandler Creating UpdateShardHandler HTTP client with params: socketTimeout=340000&connTimeout=45000&retry=true
   [junit4]   2> 673344 INFO  (TEST-CheckHdfsIndexTest.testChecksumsOnlyVerbose-seed#[CAAC093D1DD1A44]) [    ] o.a.s.l.LogWatcher SLF4J impl is org.slf4j.impl.Log4jLoggerFactory
   [junit4]   2> 673344 INFO  (TEST-CheckHdfsIndexTest.testChecksumsOnlyVerbose-seed#[CAAC093D1DD1A44]) [    ] o.a.s.l.LogWatcher Registering Log Listener [Log4j (org.slf4j.impl.Log4jLoggerFactory)]
   [junit4]   2> 673344 INFO  (TEST-CheckHdfsIndexTest.testChecksumsOnlyVerbose-seed#[CAAC093D1DD1A44]) [    ] o.a.s.c.ZkContainer Zookeeper client=127.0.0.1:38357/solr
   [junit4]   2> 673344 INFO  (TEST-CheckHdfsIndexTest.testChecksumsOnlyVerbose-seed#[CAAC093D1DD1A44]) [    ] o.a.s.c.ZkController zkHost includes chroot
   [junit4]   2> 673344 INFO  (TEST-CheckHdfsIndexTest.testChecksumsOnlyVerbose-seed#[CAAC093D1DD1A44]) [    ] o.a.s.c.c.SolrZkClient Using default ZkCredentialsProvider
   [junit4]   2> 673345 INFO  (TEST-CheckHdfsIndexTest.testChecksumsOnlyVerbose-seed#[CAAC093D1DD1A44]) [    ] o.a.s.c.c.ConnectionManager Waiting for client to connect to ZooKeeper
   [junit4]   2> 673348 INFO  (zkCallback-662-thread-1) [    ] o.a.s.c.c.ConnectionManager Watcher org.apache.solr.common.cloud.ConnectionManager@2580d558 name:ZooKeeperConnection Watcher:127.0.0.1:38357 got event WatchedEvent state:SyncConnected type:None path:null path:null type:None
   [junit4]   2> 673349 INFO  (TEST-CheckHdfsIndexTest.testChecksumsOnlyVerbose-seed#[CAAC093D1DD1A44]) [    ] o.a.s.c.c.ConnectionManager Client is connected to ZooKeeper
   [junit4]   2> 673349 INFO  (TEST-CheckHdfsIndexTest.testChecksumsOnlyVerbose-seed#[CAAC093D1DD1A44]) [    ] o.a.s.c.c.SolrZkClient Using default ZkACLProvider
   [junit4]   2> 673351 INFO  (TEST-CheckHdfsIndexTest.testChecksumsOnlyVerbose-seed#[CAAC093D1DD1A44]) [n:127.0.0.1:51222_    ] o.a.s.c.c.ConnectionManager Waiting for client to connect to ZooKeeper
   [junit4]   2> 673354 INFO  (zkCallback-663-thread-1-processing-n:127.0.0.1:51222_) [n:127.0.0.1:51222_    ] o.a.s.c.c.ConnectionManager Watcher org.apache.solr.common.cloud.ConnectionManager@34aa8b7b name:ZooKeeperConnection Watcher:127.0.0.1:38357/solr got event WatchedEvent state:SyncConnected type:None path:null path:null type:None
   [junit4]   2> 673354 INFO  (TEST-CheckHdfsIndexTest.testChecksumsOnlyVerbose-seed#[CAAC093D1DD1A44]) [n:127.0.0.1:51222_    ] o.a.s.c.c.ConnectionManager Client is connected to ZooKeeper
   [junit4]   2> 673361 INFO  (TEST-CheckHdfsIndexTest.testChecksumsOnlyVerbose-seed#[CAAC093D1DD1A44]) [n:127.0.0.1:51222_    ] o.a.s.c.c.ZkStateReader Updating cluster state from ZooKeeper... 
   [junit4]   2> 674373 INFO  (TEST-CheckHdfsIndexTest.testChecksumsOnlyVerbose-seed#[CAAC093D1DD1A44]) [n:127.0.0.1:51222_    ] o.a.s.c.ZkController Register node as live in ZooKeeper:/live_nodes/127.0.0.1:51222_
   [junit4]   2> 674374 INFO  (TEST-CheckHdfsIndexTest.testChecksumsOnlyVerbose-seed#[CAAC093D1DD1A44]) [n:127.0.0.1:51222_    ] o.a.s.c.c.SolrZkClient makePath: /live_nodes/127.0.0.1:51222_
   [junit4]   2> 674375 INFO  (zkCallback-657-thread-1) [    ] o.a.s.c.c.ZkStateReader A live node change: [WatchedEvent state:SyncConnected type:NodeChildrenChanged path:/live_nodes], has occurred - updating... (live nodes size: [1])
   [junit4]   2> 674375 INFO  (zkCallback-655-thread-1-processing-n:127.0.0.1:41219_) [n:127.0.0.1:41219_    ] o.a.s.c.c.ZkStateReader A live node change: [WatchedEvent state:SyncConnected type:NodeChildrenChanged path:/live_nodes], has occurred - updating... (live nodes size: [1])
   [junit4]   2> 674375 INFO  (zkCallback-663-thread-1-processing-n:127.0.0.1:51222_) [n:127.0.0.1:51222_    ] o.a.s.c.c.ZkStateReader A live node change: [WatchedEvent state:SyncConnected type:NodeChildrenChanged path:/live_nodes], has occurred - updating... (live nodes size: [1])
   [junit4]   2> 674378 INFO  (TEST-CheckHdfsIndexTest.testChecksumsOnlyVerbose-seed#[CAAC093D1DD1A44]) [n:127.0.0.1:51222_    ] o.a.s.c.Overseer Overseer (id=null) closing
   [junit4]   2> 674379 INFO  (TEST-CheckHdfsIndexTest.testChecksumsOnlyVerbose-seed#[CAAC093D1DD1A44]) [n:127.0.0.1:51222_    ] o.a.s.c.LeaderElector Joined leadership election with path: /overseer_elect/election/95403607886856201-127.0.0.1:51222_-n_0000000001
   [junit4]   2> 674381 INFO  (TEST-CheckHdfsIndexTest.testChecksumsOnlyVerbose-seed#[CAAC093D1DD1A44]) [n:127.0.0.1:51222_    ] o.a.s.c.LeaderElector Watching path /overseer_elect/election/95403607886856196-127.0.0.1:41219_-n_0000000000 to know if I could be the leader
   [junit4]   2> 674398 INFO  (TEST-CheckHdfsIndexTest.testChecksumsOnlyVerbose-seed#[CAAC093D1DD1A44]) [n:127.0.0.1:51222_    ] o.a.s.c.CoreContainer Security conf doesn't exist. Skipping setup for authorization module.
   [junit4]   2> 674398 INFO  (TEST-CheckHdfsIndexTest.testChecksumsOnlyVerbose-seed#[CAAC093D1DD1A44]) [n:127.0.0.1:51222_    ] o.a.s.c.CoreContainer No authentication plugin used.
   [junit4]   2> 674399 INFO  (TEST-CheckHdfsIndexTest.testChecksumsOnlyVerbose-seed#[CAAC093D1DD1A44]) [n:127.0.0.1:51222_    ] o.a.s.c.CorePropertiesLocator Looking for core definitions underneath /x1/jenkins/jenkins-slave/workspace/Lucene-Solr-Tests-5.x-Java7/solr/build/solr-core/test/J1/../../../../../../../../../../x1/jenkins/jenkins-slave/workspace/Lucene-Solr-Tests-5.x-Java7/solr/build/solr-core/test/J1/temp/solr.index.hdfs.CheckHdfsIndexTest_CAAC093D1DD1A44-001/shard-1-001/cores
   [junit4]   2> 674401 INFO  (TEST-CheckHdfsIndexTest.testChecksumsOnlyVerbose-seed#[CAAC093D1DD1A44]) [n:127.0.0.1:51222_    ] o.a.s.c.CoreDescriptor Created CoreDescriptor: {shard=, coreNodeName=, collection=collection1, schema=schema.xml, dataDir=data/, transient=false, name=collection1, config=solrconfig.xml, configSetProperties=configsetprops.json, loadOnStartup=true}
   [junit4]   2> 674401 INFO  (TEST-CheckHdfsIndexTest.testChecksumsOnlyVerbose-seed#[CAAC093D1DD1A44]) [n:127.0.0.1:51222_    ] o.a.s.c.CorePropertiesLocator Found core collection1 in /x1/jenkins/jenkins-slave/workspace/Lucene-Solr-Tests-5.x-Java7/solr/build/solr-core/test/J1/../../../../../../../../../../x1/jenkins/jenkins-slave/workspace/Lucene-Solr-Tests-5.x-Java7/solr/build/solr-core/test/J1/temp/solr.index.hdfs.CheckHdfsIndexTest_CAAC093D1DD1A44-001/shard-1-001/cores/collection1
   [junit4]   2> 674401 INFO  (TEST-CheckHdfsIndexTest.testChecksumsOnlyVerbose-seed#[CAAC093D1DD1A44]) [n:127.0.0.1:51222_    ] o.a.s.c.CorePropertiesLocator Found 1 core definitions
   [junit4]   2> 674402 INFO  (TEST-CheckHdfsIndexTest.testChecksumsOnlyVerbose-seed#[CAAC093D1DD1A44]) [n:127.0.0.1:51222_    ] o.a.s.s.SolrDispatchFilter user.dir=/x1/jenkins/jenkins-slave/workspace/Lucene-Solr-Tests-5.x-Java7/solr/build/solr-core/test/J1
   [junit4]   2> 674402 INFO  (TEST-CheckHdfsIndexTest.testChecksumsOnlyVerbose-seed#[CAAC093D1DD1A44]) [n:127.0.0.1:51222_    ] o.a.s.s.SolrDispatchFilter SolrDispatchFilter.init() done
   [junit4]   2> 674403 INFO  (coreLoadExecutor-1719-thread-1-processing-n:127.0.0.1:51222_) [n:127.0.0.1:51222_ c:collection1   x:collection1] o.a.s.c.ZkController publishing state=down
   [junit4]   2> 674403 INFO  (coreLoadExecutor-1719-thread-1-processing-n:127.0.0.1:51222_) [n:127.0.0.1:51222_ c:collection1   x:collection1] o.a.s.c.ZkController numShards not found on descriptor - reading it from system property
   [junit4]   2> 674405 INFO  (coreLoadExecutor-1719-thread-1-processing-n:127.0.0.1:51222_) [n:127.0.0.1:51222_ c:collection1   x:collection1] o.a.s.c.ZkController Registering watch for collection collection1
   [junit4]   2> 674405 INFO  (coreLoadExecutor-1719-thread-1-processing-n:127.0.0.1:51222_) [n:127.0.0.1:51222_ c:collection1   x:collection1] o.a.s.c.c.ZkStateReader addZkWatch [collection1]
   [junit4]   2> 674405 INFO  (OverseerStateUpdate-95403607886856196-127.0.0.1:41219_-n_0000000000) [n:127.0.0.1:41219_    ] o.a.s.c.Overseer processMessage: queueSize: 1, message = {
   [junit4]   2>   "collection":"collection1",
   [junit4]   2>   "numShards":"1",
   [junit4]   2>   "roles":null,
   [junit4]   2>   "operation":"state",
   [junit4]   2>   "core":"collection1",
   [junit4]   2>   "state":"down",
   [junit4]   2>   "node_name":"127.0.0.1:51222_",
   [junit4]   2>   "shard":null,
   [junit4]   2>   "base_url":"http://127.0.0.1:51222"} current state version: 4
   [junit4]   2> 674406 INFO  (coreLoadExecutor-1719-thread-1-processing-n:127.0.0.1:51222_) [n:127.0.0.1:51222_ c:collection1   x:collection1] o.a.s.c.c.ZkStateReader Add data for [collection1] ver [0]
   [junit4]   2> 674408 INFO  (coreLoadExecutor-1719-thread-1-processing-n:127.0.0.1:51222_) [n:127.0.0.1:51222_ c:collection1   x:collection1] o.a.s.c.ZkController look for our core node name
   [junit4]   2> 674408 INFO  (OverseerStateUpdate-95403607886856196-127.0.0.1:41219_-n_0000000000) [n:127.0.0.1:41219_    ] o.a.s.c.o.ReplicaMutator Update state numShards=1 message={
   [junit4]   2>   "collection":"collection1",
   [junit4]   2>   "numShards":"1",
   [junit4]   2>   "roles":null,
   [junit4]   2>   "operation":"state",
   [junit4]   2>   "core":"collection1",
   [junit4]   2>   "state":"down",
   [junit4]   2>   "node_name":"127.0.0.1:51222_",
   [junit4]   2>   "shard":null,
   [junit4]   2>   "base_url":"http://127.0.0.1:51222"}
   [junit4]   2> 674408 INFO  (OverseerStateUpdate-95403607886856196-127.0.0.1:41219_-n_0000000000) [n:127.0.0.1:41219_    ] o.a.s.c.o.ReplicaMutator Collection already exists with numShards=1
   [junit4]   2> 674408 INFO  (OverseerStateUpdate-95403607886856196-127.0.0.1:41219_-n_0000000000) [n:127.0.0.1:41219_    ] o.a.s.c.o.ReplicaMutator Assigning new node to shard shard=shard1
   [junit4]   2> 674511 INFO  (OverseerStateUpdate-95403607886856196-127.0.0.1:41219_-n_0000000000) [n:127.0.0.1:41219_    ] o.a.s.c.o.ZkStateWriter going to update_collection /collections/collection1/state.json version: 0
   [junit4]   2> 674511 INFO  (zkCallback-663-thread-1-processing-n:127.0.0.1:51222_) [n:127.0.0.1:51222_    ] o.a.s.c.c.ZkStateReader A cluster state change: [WatchedEvent state:SyncConnected type:NodeDataChanged path:/collections/collection1/state.json] for collection [collection1] has occurred - updating... (live nodes size: [2])
   [junit4]   2> 674512 INFO  (zkCallback-663-thread-1-processing-n:127.0.0.1:51222_) [n:127.0.0.1:51222_    ] o.a.s.c.c.ZkStateReader Updating data for [collection1] from [0] to [1]
   [junit4]   2> 675408 INFO  (coreLoadExecutor-1719-thread-1-processing-n:127.0.0.1:51222_) [n:127.0.0.1:51222_ c:collection1   x:collection1] o.a.s.c.ZkController waiting to find shard id in clusterstate for collection1
   [junit4]   2> 675408 INFO  (coreLoadExecutor-1719-thread-1-processing-n:127.0.0.1:51222_) [n:127.0.0.1:51222_ c:collection1   x:collection1] o.a.s.c.ZkController Check for collection zkNode:collec

[...truncated too long message...]

it4]   2> 712690 WARN  (org.apache.hadoop.hdfs.server.blockmanagement.DecommissionManager$Monitor@744b5108) [    ] o.a.h.h.s.b.DecommissionManager Monitor interrupted: java.lang.InterruptedException: sleep interrupted
   [junit4]   2> 712712 INFO  (SUITE-CheckHdfsIndexTest-seed#[CAAC093D1DD1A44]-worker) [    ] o.m.log Stopped HttpServer2$SelectChannelConnectorWithSafeStartup@localhost:0
   [junit4]   2> 712816 ERROR (SUITE-CheckHdfsIndexTest-seed#[CAAC093D1DD1A44]-worker) [    ] o.a.h.m.l.MethodMetric Error invoking method getBlocksTotal
   [junit4]   2> java.lang.reflect.InvocationTargetException
   [junit4]   2> 	at sun.reflect.NativeMethodAccessorImpl.invoke0(Native Method)
   [junit4]   2> 	at sun.reflect.NativeMethodAccessorImpl.invoke(NativeMethodAccessorImpl.java:57)
   [junit4]   2> 	at sun.reflect.DelegatingMethodAccessorImpl.invoke(DelegatingMethodAccessorImpl.java:43)
   [junit4]   2> 	at java.lang.reflect.Method.invoke(Method.java:606)
   [junit4]   2> 	at org.apache.hadoop.metrics2.lib.MethodMetric$2.snapshot(MethodMetric.java:111)
   [junit4]   2> 	at org.apache.hadoop.metrics2.lib.MethodMetric.snapshot(MethodMetric.java:144)
   [junit4]   2> 	at org.apache.hadoop.metrics2.lib.MetricsRegistry.snapshot(MetricsRegistry.java:387)
   [junit4]   2> 	at org.apache.hadoop.metrics2.lib.MetricsSourceBuilder$1.getMetrics(MetricsSourceBuilder.java:79)
   [junit4]   2> 	at org.apache.hadoop.metrics2.impl.MetricsSourceAdapter.getMetrics(MetricsSourceAdapter.java:195)
   [junit4]   2> 	at org.apache.hadoop.metrics2.impl.MetricsSourceAdapter.updateJmxCache(MetricsSourceAdapter.java:172)
   [junit4]   2> 	at org.apache.hadoop.metrics2.impl.MetricsSourceAdapter.getMBeanInfo(MetricsSourceAdapter.java:151)
   [junit4]   2> 	at com.sun.jmx.interceptor.DefaultMBeanServerInterceptor.getClassName(DefaultMBeanServerInterceptor.java:1804)
   [junit4]   2> 	at com.sun.jmx.interceptor.DefaultMBeanServerInterceptor.safeGetClassName(DefaultMBeanServerInterceptor.java:1595)
   [junit4]   2> 	at com.sun.jmx.interceptor.DefaultMBeanServerInterceptor.checkMBeanPermission(DefaultMBeanServerInterceptor.java:1813)
   [junit4]   2> 	at com.sun.jmx.interceptor.DefaultMBeanServerInterceptor.exclusiveUnregisterMBean(DefaultMBeanServerInterceptor.java:430)
   [junit4]   2> 	at com.sun.jmx.interceptor.DefaultMBeanServerInterceptor.unregisterMBean(DefaultMBeanServerInterceptor.java:415)
   [junit4]   2> 	at com.sun.jmx.mbeanserver.JmxMBeanServer.unregisterMBean(JmxMBeanServer.java:546)
   [junit4]   2> 	at org.apache.hadoop.metrics2.util.MBeans.unregister(MBeans.java:81)
   [junit4]   2> 	at org.apache.hadoop.metrics2.impl.MetricsSourceAdapter.stopMBeans(MetricsSourceAdapter.java:227)
   [junit4]   2> 	at org.apache.hadoop.metrics2.impl.MetricsSourceAdapter.stop(MetricsSourceAdapter.java:212)
   [junit4]   2> 	at org.apache.hadoop.metrics2.impl.MetricsSystemImpl.stopSources(MetricsSystemImpl.java:461)
   [junit4]   2> 	at org.apache.hadoop.metrics2.impl.MetricsSystemImpl.stop(MetricsSystemImpl.java:212)
   [junit4]   2> 	at org.apache.hadoop.metrics2.impl.MetricsSystemImpl.shutdown(MetricsSystemImpl.java:592)
   [junit4]   2> 	at org.apache.hadoop.metrics2.lib.DefaultMetricsSystem.shutdownInstance(DefaultMetricsSystem.java:72)
   [junit4]   2> 	at org.apache.hadoop.metrics2.lib.DefaultMetricsSystem.shutdown(DefaultMetricsSystem.java:68)
   [junit4]   2> 	at org.apache.hadoop.hdfs.server.namenode.metrics.NameNodeMetrics.shutdown(NameNodeMetrics.java:145)
   [junit4]   2> 	at org.apache.hadoop.hdfs.server.namenode.NameNode.stop(NameNode.java:822)
   [junit4]   2> 	at org.apache.hadoop.hdfs.MiniDFSCluster.shutdown(MiniDFSCluster.java:1720)
   [junit4]   2> 	at org.apache.hadoop.hdfs.MiniDFSCluster.shutdown(MiniDFSCluster.java:1699)
   [junit4]   2> 	at org.apache.solr.cloud.hdfs.HdfsTestUtil.teardownClass(HdfsTestUtil.java:198)
   [junit4]   2> 	at org.apache.solr.index.hdfs.CheckHdfsIndexTest.teardownClass(CheckHdfsIndexTest.java:69)
   [junit4]   2> 	at sun.reflect.NativeMethodAccessorImpl.invoke0(Native Method)
   [junit4]   2> 	at sun.reflect.NativeMethodAccessorImpl.invoke(NativeMethodAccessorImpl.java:57)
   [junit4]   2> 	at sun.reflect.DelegatingMethodAccessorImpl.invoke(DelegatingMethodAccessorImpl.java:43)
   [junit4]   2> 	at java.lang.reflect.Method.invoke(Method.java:606)
   [junit4]   2> 	at com.carrotsearch.randomizedtesting.RandomizedRunner.invoke(RandomizedRunner.java:1764)
   [junit4]   2> 	at com.carrotsearch.randomizedtesting.RandomizedRunner$7.evaluate(RandomizedRunner.java:834)
   [junit4]   2> 	at com.carrotsearch.randomizedtesting.rules.StatementAdapter.evaluate(StatementAdapter.java:36)
   [junit4]   2> 	at com.carrotsearch.randomizedtesting.rules.SystemPropertiesRestoreRule$1.evaluate(SystemPropertiesRestoreRule.java:57)
   [junit4]   2> 	at org.apache.lucene.util.AbstractBeforeAfterRule$1.evaluate(AbstractBeforeAfterRule.java:45)
   [junit4]   2> 	at com.carrotsearch.randomizedtesting.rules.StatementAdapter.evaluate(StatementAdapter.java:36)
   [junit4]   2> 	at org.apache.lucene.util.TestRuleStoreClassName$1.evaluate(TestRuleStoreClassName.java:41)
   [junit4]   2> 	at com.carrotsearch.randomizedtesting.rules.NoShadowingOrOverridesOnMethodsRule$1.evaluate(NoShadowingOrOverridesOnMethodsRule.java:40)
   [junit4]   2> 	at com.carrotsearch.randomizedtesting.rules.NoShadowingOrOverridesOnMethodsRule$1.evaluate(NoShadowingOrOverridesOnMethodsRule.java:40)
   [junit4]   2> 	at com.carrotsearch.randomizedtesting.rules.StatementAdapter.evaluate(StatementAdapter.java:36)
   [junit4]   2> 	at com.carrotsearch.randomizedtesting.rules.StatementAdapter.evaluate(StatementAdapter.java:36)
   [junit4]   2> 	at com.carrotsearch.randomizedtesting.rules.StatementAdapter.evaluate(StatementAdapter.java:36)
   [junit4]   2> 	at org.apache.lucene.util.TestRuleAssertionsRequired$1.evaluate(TestRuleAssertionsRequired.java:53)
   [junit4]   2> 	at org.apache.lucene.util.TestRuleMarkFailure$1.evaluate(TestRuleMarkFailure.java:47)
   [junit4]   2> 	at org.apache.lucene.util.TestRuleIgnoreAfterMaxFailures$1.evaluate(TestRuleIgnoreAfterMaxFailures.java:64)
   [junit4]   2> 	at org.apache.lucene.util.TestRuleIgnoreTestSuites$1.evaluate(TestRuleIgnoreTestSuites.java:54)
   [junit4]   2> 	at com.carrotsearch.randomizedtesting.rules.StatementAdapter.evaluate(StatementAdapter.java:36)
   [junit4]   2> 	at com.carrotsearch.randomizedtesting.ThreadLeakControl$StatementRunner.run(ThreadLeakControl.java:367)
   [junit4]   2> 	at java.lang.Thread.run(Thread.java:745)
   [junit4]   2> Caused by: java.lang.NullPointerException
   [junit4]   2> 	at org.apache.hadoop.hdfs.server.blockmanagement.BlocksMap.size(BlocksMap.java:198)
   [junit4]   2> 	at org.apache.hadoop.hdfs.server.blockmanagement.BlockManager.getTotalBlocks(BlockManager.java:3291)
   [junit4]   2> 	at org.apache.hadoop.hdfs.server.namenode.FSNamesystem.getBlocksTotal(FSNamesystem.java:6223)
   [junit4]   2> 	... 54 more
   [junit4]   2> 712820 INFO  (SUITE-CheckHdfsIndexTest-seed#[CAAC093D1DD1A44]-worker) [    ] o.a.s.SolrTestCaseJ4 ###deleteCore
   [junit4]   2> NOTE: leaving temporary files on disk at: /x1/jenkins/jenkins-slave/workspace/Lucene-Solr-Tests-5.x-Java7/solr/build/solr-core/test/J1/temp/solr.index.hdfs.CheckHdfsIndexTest_CAAC093D1DD1A44-001
   [junit4]   2> Feb 17, 2016 9:12:50 PM com.carrotsearch.randomizedtesting.ThreadLeakControl checkThreadLeaks
   [junit4]   2> WARNING: Will linger awaiting termination of 2 leaked thread(s).
   [junit4]   2> NOTE: test params are: codec=Lucene54, sim=DefaultSimilarity, locale=uk-UA, timezone=Etc/Universal
   [junit4]   2> NOTE: Linux 3.13.0-52-generic amd64/Oracle Corporation 1.7.0_80 (64-bit)/cpus=4,threads=2,free=137096400,total=452460544
   [junit4]   2> NOTE: All tests run in this JVM: [UpdateRequestProcessorFactoryTest, ShardSplitTest, TermsComponentTest, ConfigSetsAPITest, HdfsDirectoryTest, ChaosMonkeyNothingIsSafeTest, NumericFieldsTest, DistributedIntervalFacetingTest, TestExceedMaxTermLength, TestDocumentBuilder, NotRequiredUniqueKeyTest, TestSortByMinMaxFunction, TestExactStatsCache, ZkSolrClientTest, TestFieldResource, MultiTermTest, TestCodecSupport, TestSchemaSimilarityResource, TestSolrCoreProperties, BlockCacheTest, TestAuthenticationFramework, TestRuleBasedAuthorizationPlugin, TestRestoreCore, AliasIntegrationTest, BasicFunctionalityTest, ConjunctionSolrSpellCheckerTest, DistributedTermsComponentTest, DistributedVersionInfoTest, TestUpdate, DistributedFacetPivotWhiteBoxTest, ZkStateWriterTest, TestNonDefinedSimilarityFactory, CheckHdfsIndexTest]
   [junit4] Completed [174/566 (1!)] on J1 in 53.56s, 6 tests, 1 error, 1 skipped <<< FAILURES!

[...truncated 1263 lines...]
BUILD FAILED
/x1/jenkins/jenkins-slave/workspace/Lucene-Solr-Tests-5.x-Java7/build.xml:750: The following error occurred while executing this line:
/x1/jenkins/jenkins-slave/workspace/Lucene-Solr-Tests-5.x-Java7/build.xml:694: The following error occurred while executing this line:
/x1/jenkins/jenkins-slave/workspace/Lucene-Solr-Tests-5.x-Java7/build.xml:59: The following error occurred while executing this line:
/x1/jenkins/jenkins-slave/workspace/Lucene-Solr-Tests-5.x-Java7/solr/build.xml:233: The following error occurred while executing this line:
/x1/jenkins/jenkins-slave/workspace/Lucene-Solr-Tests-5.x-Java7/solr/common-build.xml:534: The following error occurred while executing this line:
/x1/jenkins/jenkins-slave/workspace/Lucene-Solr-Tests-5.x-Java7/lucene/common-build.xml:1477: The following error occurred while executing this line:
/x1/jenkins/jenkins-slave/workspace/Lucene-Solr-Tests-5.x-Java7/lucene/common-build.xml:1033: There were test failures: 566 suites (7 ignored), 2279 tests, 1 error, 55 ignored (39 assumptions) [seed: CAAC093D1DD1A44]

Total time: 61 minutes 33 seconds
Build step 'Invoke Ant' marked build as failure
Archiving artifacts
Recording test results
Email was triggered for: Failure - Any
Sending email for trigger: Failure - Any



Mime
View raw message