lucene-dev mailing list archives

Site index · List index
Message view « Date » · « Thread »
Top « Date » · « Thread »
From Policeman Jenkins Server <jenk...@thetaphi.de>
Subject [JENKINS] Lucene-Solr-5.x-MacOSX (64bit/jdk1.7.0) - Build # 3038 - Failure!
Date Wed, 17 Feb 2016 23:10:09 GMT
Build: http://jenkins.thetaphi.de/job/Lucene-Solr-5.x-MacOSX/3038/
Java: 64bit/jdk1.7.0 -XX:+UseCompressedOops -XX:+UseSerialGC

1 tests failed.
FAILED:  org.apache.solr.cloud.CollectionsAPIDistributedZkTest.test

Error Message:
Error from server at http://127.0.0.1:54794/o_/b/awholynewcollection_0: non ok status: 500, message:Server Error

Stack Trace:
org.apache.solr.client.solrj.impl.HttpSolrClient$RemoteSolrException: Error from server at http://127.0.0.1:54794/o_/b/awholynewcollection_0: non ok status: 500, message:Server Error
	at __randomizedtesting.SeedInfo.seed([3ECF26845C57B0C7:B69B195EF2ABDD3F]:0)
	at org.apache.solr.client.solrj.impl.HttpSolrClient.executeMethod(HttpSolrClient.java:510)
	at org.apache.solr.client.solrj.impl.HttpSolrClient.request(HttpSolrClient.java:240)
	at org.apache.solr.client.solrj.impl.HttpSolrClient.request(HttpSolrClient.java:229)
	at org.apache.solr.client.solrj.SolrRequest.process(SolrRequest.java:149)
	at org.apache.solr.client.solrj.SolrClient.query(SolrClient.java:942)
	at org.apache.solr.client.solrj.SolrClient.query(SolrClient.java:957)
	at org.apache.solr.cloud.AbstractFullDistribZkTestBase.waitForNon403or404or503(AbstractFullDistribZkTestBase.java:1753)
	at org.apache.solr.cloud.CollectionsAPIDistributedZkTest.testCollectionsAPI(CollectionsAPIDistributedZkTest.java:737)
	at org.apache.solr.cloud.CollectionsAPIDistributedZkTest.test(CollectionsAPIDistributedZkTest.java:160)
	at sun.reflect.NativeMethodAccessorImpl.invoke0(Native Method)
	at sun.reflect.NativeMethodAccessorImpl.invoke(NativeMethodAccessorImpl.java:57)
	at sun.reflect.DelegatingMethodAccessorImpl.invoke(DelegatingMethodAccessorImpl.java:43)
	at java.lang.reflect.Method.invoke(Method.java:606)
	at com.carrotsearch.randomizedtesting.RandomizedRunner.invoke(RandomizedRunner.java:1764)
	at com.carrotsearch.randomizedtesting.RandomizedRunner$8.evaluate(RandomizedRunner.java:871)
	at com.carrotsearch.randomizedtesting.RandomizedRunner$9.evaluate(RandomizedRunner.java:907)
	at com.carrotsearch.randomizedtesting.RandomizedRunner$10.evaluate(RandomizedRunner.java:921)
	at org.apache.solr.BaseDistributedSearchTestCase$ShardsRepeatRule$ShardsFixedStatement.callStatement(BaseDistributedSearchTestCase.java:964)
	at org.apache.solr.BaseDistributedSearchTestCase$ShardsRepeatRule$ShardsStatement.evaluate(BaseDistributedSearchTestCase.java:939)
	at com.carrotsearch.randomizedtesting.rules.SystemPropertiesRestoreRule$1.evaluate(SystemPropertiesRestoreRule.java:57)
	at org.apache.lucene.util.TestRuleSetupTeardownChained$1.evaluate(TestRuleSetupTeardownChained.java:49)
	at org.apache.lucene.util.AbstractBeforeAfterRule$1.evaluate(AbstractBeforeAfterRule.java:45)
	at org.apache.lucene.util.TestRuleThreadAndTestName$1.evaluate(TestRuleThreadAndTestName.java:48)
	at org.apache.lucene.util.TestRuleIgnoreAfterMaxFailures$1.evaluate(TestRuleIgnoreAfterMaxFailures.java:64)
	at org.apache.lucene.util.TestRuleMarkFailure$1.evaluate(TestRuleMarkFailure.java:47)
	at com.carrotsearch.randomizedtesting.rules.StatementAdapter.evaluate(StatementAdapter.java:36)
	at com.carrotsearch.randomizedtesting.ThreadLeakControl$StatementRunner.run(ThreadLeakControl.java:367)
	at com.carrotsearch.randomizedtesting.ThreadLeakControl.forkTimeoutingTask(ThreadLeakControl.java:809)
	at com.carrotsearch.randomizedtesting.ThreadLeakControl$3.evaluate(ThreadLeakControl.java:460)
	at com.carrotsearch.randomizedtesting.RandomizedRunner.runSingleTest(RandomizedRunner.java:880)
	at com.carrotsearch.randomizedtesting.RandomizedRunner$5.evaluate(RandomizedRunner.java:781)
	at com.carrotsearch.randomizedtesting.RandomizedRunner$6.evaluate(RandomizedRunner.java:816)
	at com.carrotsearch.randomizedtesting.RandomizedRunner$7.evaluate(RandomizedRunner.java:827)
	at com.carrotsearch.randomizedtesting.rules.StatementAdapter.evaluate(StatementAdapter.java:36)
	at com.carrotsearch.randomizedtesting.rules.SystemPropertiesRestoreRule$1.evaluate(SystemPropertiesRestoreRule.java:57)
	at org.apache.lucene.util.AbstractBeforeAfterRule$1.evaluate(AbstractBeforeAfterRule.java:45)
	at com.carrotsearch.randomizedtesting.rules.StatementAdapter.evaluate(StatementAdapter.java:36)
	at org.apache.lucene.util.TestRuleStoreClassName$1.evaluate(TestRuleStoreClassName.java:41)
	at com.carrotsearch.randomizedtesting.rules.NoShadowingOrOverridesOnMethodsRule$1.evaluate(NoShadowingOrOverridesOnMethodsRule.java:40)
	at com.carrotsearch.randomizedtesting.rules.NoShadowingOrOverridesOnMethodsRule$1.evaluate(NoShadowingOrOverridesOnMethodsRule.java:40)
	at com.carrotsearch.randomizedtesting.rules.StatementAdapter.evaluate(StatementAdapter.java:36)
	at com.carrotsearch.randomizedtesting.rules.StatementAdapter.evaluate(StatementAdapter.java:36)
	at com.carrotsearch.randomizedtesting.rules.StatementAdapter.evaluate(StatementAdapter.java:36)
	at org.apache.lucene.util.TestRuleAssertionsRequired$1.evaluate(TestRuleAssertionsRequired.java:53)
	at org.apache.lucene.util.TestRuleMarkFailure$1.evaluate(TestRuleMarkFailure.java:47)
	at org.apache.lucene.util.TestRuleIgnoreAfterMaxFailures$1.evaluate(TestRuleIgnoreAfterMaxFailures.java:64)
	at org.apache.lucene.util.TestRuleIgnoreTestSuites$1.evaluate(TestRuleIgnoreTestSuites.java:54)
	at com.carrotsearch.randomizedtesting.rules.StatementAdapter.evaluate(StatementAdapter.java:36)
	at com.carrotsearch.randomizedtesting.ThreadLeakControl$StatementRunner.run(ThreadLeakControl.java:367)
	at java.lang.Thread.run(Thread.java:745)




Build Log:
[...truncated 10644 lines...]
   [junit4] Suite: org.apache.solr.cloud.CollectionsAPIDistributedZkTest
   [junit4]   2> Creating dataDir: /Users/jenkins/workspace/Lucene-Solr-5.x-MacOSX/solr/build/solr-core/test/J1/temp/solr.cloud.CollectionsAPIDistributedZkTest_3ECF26845C57B0C7-001/init-core-data-001
   [junit4]   2> 222191 WARN  (SUITE-CollectionsAPIDistributedZkTest-seed#[3ECF26845C57B0C7]-worker) [    ] o.a.s.SolrTestCaseJ4 startTrackingSearchers: numOpens=80 numCloses=80
   [junit4]   2> 222192 INFO  (SUITE-CollectionsAPIDistributedZkTest-seed#[3ECF26845C57B0C7]-worker) [    ] o.a.s.SolrTestCaseJ4 Randomized ssl (false) and clientAuth (false)
   [junit4]   2> 222192 INFO  (SUITE-CollectionsAPIDistributedZkTest-seed#[3ECF26845C57B0C7]-worker) [    ] o.a.s.BaseDistributedSearchTestCase Setting hostContext system property: /o_/b
   [junit4]   2> 222198 INFO  (TEST-CollectionsAPIDistributedZkTest.test-seed#[3ECF26845C57B0C7]) [    ] o.a.s.c.ZkTestServer STARTING ZK TEST SERVER
   [junit4]   2> 222199 INFO  (Thread-550) [    ] o.a.s.c.ZkTestServer client port:0.0.0.0/0.0.0.0:0
   [junit4]   2> 222199 INFO  (Thread-550) [    ] o.a.s.c.ZkTestServer Starting server
   [junit4]   2> 222300 INFO  (TEST-CollectionsAPIDistributedZkTest.test-seed#[3ECF26845C57B0C7]) [    ] o.a.s.c.ZkTestServer start zk server on port:54751
   [junit4]   2> 222302 INFO  (TEST-CollectionsAPIDistributedZkTest.test-seed#[3ECF26845C57B0C7]) [    ] o.a.s.c.c.SolrZkClient Using default ZkCredentialsProvider
   [junit4]   2> 222302 INFO  (TEST-CollectionsAPIDistributedZkTest.test-seed#[3ECF26845C57B0C7]) [    ] o.a.s.c.c.ConnectionManager Waiting for client to connect to ZooKeeper
   [junit4]   2> 222306 INFO  (zkCallback-260-thread-1) [    ] o.a.s.c.c.ConnectionManager Watcher org.apache.solr.common.cloud.ConnectionManager@734d8895 name:ZooKeeperConnection Watcher:127.0.0.1:54751 got event WatchedEvent state:SyncConnected type:None path:null path:null type:None
   [junit4]   2> 222306 INFO  (TEST-CollectionsAPIDistributedZkTest.test-seed#[3ECF26845C57B0C7]) [    ] o.a.s.c.c.ConnectionManager Client is connected to ZooKeeper
   [junit4]   2> 222306 INFO  (TEST-CollectionsAPIDistributedZkTest.test-seed#[3ECF26845C57B0C7]) [    ] o.a.s.c.c.SolrZkClient Using default ZkACLProvider
   [junit4]   2> 222306 INFO  (TEST-CollectionsAPIDistributedZkTest.test-seed#[3ECF26845C57B0C7]) [    ] o.a.s.c.c.SolrZkClient makePath: /solr
   [junit4]   2> 222311 INFO  (TEST-CollectionsAPIDistributedZkTest.test-seed#[3ECF26845C57B0C7]) [    ] o.a.s.c.c.SolrZkClient Using default ZkCredentialsProvider
   [junit4]   2> 222311 INFO  (TEST-CollectionsAPIDistributedZkTest.test-seed#[3ECF26845C57B0C7]) [    ] o.a.s.c.c.ConnectionManager Waiting for client to connect to ZooKeeper
   [junit4]   2> 222313 INFO  (zkCallback-261-thread-1) [    ] o.a.s.c.c.ConnectionManager Watcher org.apache.solr.common.cloud.ConnectionManager@2ccb1f0b name:ZooKeeperConnection Watcher:127.0.0.1:54751/solr got event WatchedEvent state:SyncConnected type:None path:null path:null type:None
   [junit4]   2> 222313 INFO  (TEST-CollectionsAPIDistributedZkTest.test-seed#[3ECF26845C57B0C7]) [    ] o.a.s.c.c.ConnectionManager Client is connected to ZooKeeper
   [junit4]   2> 222313 INFO  (TEST-CollectionsAPIDistributedZkTest.test-seed#[3ECF26845C57B0C7]) [    ] o.a.s.c.c.SolrZkClient Using default ZkACLProvider
   [junit4]   2> 222313 INFO  (TEST-CollectionsAPIDistributedZkTest.test-seed#[3ECF26845C57B0C7]) [    ] o.a.s.c.c.SolrZkClient makePath: /collections/collection1
   [junit4]   2> 222317 INFO  (TEST-CollectionsAPIDistributedZkTest.test-seed#[3ECF26845C57B0C7]) [    ] o.a.s.c.c.SolrZkClient makePath: /collections/collection1/shards
   [junit4]   2> 222320 INFO  (TEST-CollectionsAPIDistributedZkTest.test-seed#[3ECF26845C57B0C7]) [    ] o.a.s.c.c.SolrZkClient makePath: /collections/control_collection
   [junit4]   2> 222322 INFO  (TEST-CollectionsAPIDistributedZkTest.test-seed#[3ECF26845C57B0C7]) [    ] o.a.s.c.c.SolrZkClient makePath: /collections/control_collection/shards
   [junit4]   2> 222326 INFO  (TEST-CollectionsAPIDistributedZkTest.test-seed#[3ECF26845C57B0C7]) [    ] o.a.s.c.AbstractZkTestCase put /Users/jenkins/workspace/Lucene-Solr-5.x-MacOSX/solr/core/src/test-files/solr/collection1/conf/solrconfig-tlog.xml to /configs/conf1/solrconfig.xml
   [junit4]   2> 222326 INFO  (TEST-CollectionsAPIDistributedZkTest.test-seed#[3ECF26845C57B0C7]) [    ] o.a.s.c.c.SolrZkClient makePath: /configs/conf1/solrconfig.xml
   [junit4]   2> 222331 INFO  (TEST-CollectionsAPIDistributedZkTest.test-seed#[3ECF26845C57B0C7]) [    ] o.a.s.c.AbstractZkTestCase put /Users/jenkins/workspace/Lucene-Solr-5.x-MacOSX/solr/core/src/test-files/solr/collection1/conf/schema.xml to /configs/conf1/schema.xml
   [junit4]   2> 222331 INFO  (TEST-CollectionsAPIDistributedZkTest.test-seed#[3ECF26845C57B0C7]) [    ] o.a.s.c.c.SolrZkClient makePath: /configs/conf1/schema.xml
   [junit4]   2> 222335 INFO  (TEST-CollectionsAPIDistributedZkTest.test-seed#[3ECF26845C57B0C7]) [    ] o.a.s.c.AbstractZkTestCase put /Users/jenkins/workspace/Lucene-Solr-5.x-MacOSX/solr/core/src/test-files/solr/collection1/conf/solrconfig.snippet.randomindexconfig.xml to /configs/conf1/solrconfig.snippet.randomindexconfig.xml
   [junit4]   2> 222335 INFO  (TEST-CollectionsAPIDistributedZkTest.test-seed#[3ECF26845C57B0C7]) [    ] o.a.s.c.c.SolrZkClient makePath: /configs/conf1/solrconfig.snippet.randomindexconfig.xml
   [junit4]   2> 222338 INFO  (TEST-CollectionsAPIDistributedZkTest.test-seed#[3ECF26845C57B0C7]) [    ] o.a.s.c.AbstractZkTestCase put /Users/jenkins/workspace/Lucene-Solr-5.x-MacOSX/solr/core/src/test-files/solr/collection1/conf/stopwords.txt to /configs/conf1/stopwords.txt
   [junit4]   2> 222338 INFO  (TEST-CollectionsAPIDistributedZkTest.test-seed#[3ECF26845C57B0C7]) [    ] o.a.s.c.c.SolrZkClient makePath: /configs/conf1/stopwords.txt
   [junit4]   2> 222341 INFO  (TEST-CollectionsAPIDistributedZkTest.test-seed#[3ECF26845C57B0C7]) [    ] o.a.s.c.AbstractZkTestCase put /Users/jenkins/workspace/Lucene-Solr-5.x-MacOSX/solr/core/src/test-files/solr/collection1/conf/protwords.txt to /configs/conf1/protwords.txt
   [junit4]   2> 222341 INFO  (TEST-CollectionsAPIDistributedZkTest.test-seed#[3ECF26845C57B0C7]) [    ] o.a.s.c.c.SolrZkClient makePath: /configs/conf1/protwords.txt
   [junit4]   2> 222345 INFO  (TEST-CollectionsAPIDistributedZkTest.test-seed#[3ECF26845C57B0C7]) [    ] o.a.s.c.AbstractZkTestCase put /Users/jenkins/workspace/Lucene-Solr-5.x-MacOSX/solr/core/src/test-files/solr/collection1/conf/currency.xml to /configs/conf1/currency.xml
   [junit4]   2> 222345 INFO  (TEST-CollectionsAPIDistributedZkTest.test-seed#[3ECF26845C57B0C7]) [    ] o.a.s.c.c.SolrZkClient makePath: /configs/conf1/currency.xml
   [junit4]   2> 222348 INFO  (TEST-CollectionsAPIDistributedZkTest.test-seed#[3ECF26845C57B0C7]) [    ] o.a.s.c.AbstractZkTestCase put /Users/jenkins/workspace/Lucene-Solr-5.x-MacOSX/solr/core/src/test-files/solr/collection1/conf/enumsConfig.xml to /configs/conf1/enumsConfig.xml
   [junit4]   2> 222349 INFO  (TEST-CollectionsAPIDistributedZkTest.test-seed#[3ECF26845C57B0C7]) [    ] o.a.s.c.c.SolrZkClient makePath: /configs/conf1/enumsConfig.xml
   [junit4]   2> 222352 INFO  (TEST-CollectionsAPIDistributedZkTest.test-seed#[3ECF26845C57B0C7]) [    ] o.a.s.c.AbstractZkTestCase put /Users/jenkins/workspace/Lucene-Solr-5.x-MacOSX/solr/core/src/test-files/solr/collection1/conf/open-exchange-rates.json to /configs/conf1/open-exchange-rates.json
   [junit4]   2> 222352 INFO  (TEST-CollectionsAPIDistributedZkTest.test-seed#[3ECF26845C57B0C7]) [    ] o.a.s.c.c.SolrZkClient makePath: /configs/conf1/open-exchange-rates.json
   [junit4]   2> 222356 INFO  (TEST-CollectionsAPIDistributedZkTest.test-seed#[3ECF26845C57B0C7]) [    ] o.a.s.c.AbstractZkTestCase put /Users/jenkins/workspace/Lucene-Solr-5.x-MacOSX/solr/core/src/test-files/solr/collection1/conf/mapping-ISOLatin1Accent.txt to /configs/conf1/mapping-ISOLatin1Accent.txt
   [junit4]   2> 222356 INFO  (TEST-CollectionsAPIDistributedZkTest.test-seed#[3ECF26845C57B0C7]) [    ] o.a.s.c.c.SolrZkClient makePath: /configs/conf1/mapping-ISOLatin1Accent.txt
   [junit4]   2> 222360 INFO  (TEST-CollectionsAPIDistributedZkTest.test-seed#[3ECF26845C57B0C7]) [    ] o.a.s.c.AbstractZkTestCase put /Users/jenkins/workspace/Lucene-Solr-5.x-MacOSX/solr/core/src/test-files/solr/collection1/conf/old_synonyms.txt to /configs/conf1/old_synonyms.txt
   [junit4]   2> 222360 INFO  (TEST-CollectionsAPIDistributedZkTest.test-seed#[3ECF26845C57B0C7]) [    ] o.a.s.c.c.SolrZkClient makePath: /configs/conf1/old_synonyms.txt
   [junit4]   2> 222363 INFO  (TEST-CollectionsAPIDistributedZkTest.test-seed#[3ECF26845C57B0C7]) [    ] o.a.s.c.AbstractZkTestCase put /Users/jenkins/workspace/Lucene-Solr-5.x-MacOSX/solr/core/src/test-files/solr/collection1/conf/synonyms.txt to /configs/conf1/synonyms.txt
   [junit4]   2> 222364 INFO  (TEST-CollectionsAPIDistributedZkTest.test-seed#[3ECF26845C57B0C7]) [    ] o.a.s.c.c.SolrZkClient makePath: /configs/conf1/synonyms.txt
   [junit4]   2> 222774 INFO  (TEST-CollectionsAPIDistributedZkTest.test-seed#[3ECF26845C57B0C7]) [    ] o.a.s.SolrTestCaseJ4 Writing core.properties file to /Users/jenkins/workspace/Lucene-Solr-5.x-MacOSX/solr/build/solr-core/test/J1/temp/solr.cloud.CollectionsAPIDistributedZkTest_3ECF26845C57B0C7-001/control-001/cores/collection1
   [junit4]   2> 222776 INFO  (TEST-CollectionsAPIDistributedZkTest.test-seed#[3ECF26845C57B0C7]) [    ] o.e.j.s.Server jetty-9.2.13.v20150730
   [junit4]   2> 222780 INFO  (TEST-CollectionsAPIDistributedZkTest.test-seed#[3ECF26845C57B0C7]) [    ] o.e.j.s.h.ContextHandler Started o.e.j.s.ServletContextHandler@7420172b{/o_/b,null,AVAILABLE}
   [junit4]   2> 222787 INFO  (TEST-CollectionsAPIDistributedZkTest.test-seed#[3ECF26845C57B0C7]) [    ] o.e.j.s.ServerConnector Started ServerConnector@66d1439c{HTTP/1.1}{127.0.0.1:54754}
   [junit4]   2> 222787 INFO  (TEST-CollectionsAPIDistributedZkTest.test-seed#[3ECF26845C57B0C7]) [    ] o.e.j.s.Server Started @227442ms
   [junit4]   2> 222787 INFO  (TEST-CollectionsAPIDistributedZkTest.test-seed#[3ECF26845C57B0C7]) [    ] o.a.s.c.s.e.JettySolrRunner Jetty properties: {hostContext=/o_/b, coreRootDirectory=/Users/jenkins/workspace/Lucene-Solr-5.x-MacOSX/solr/build/solr-core/test/J1/../../../../../../../../../Users/jenkins/workspace/Lucene-Solr-5.x-MacOSX/solr/build/solr-core/test/J1/temp/solr.cloud.CollectionsAPIDistributedZkTest_3ECF26845C57B0C7-001/control-001/cores, hostPort=54754, solr.data.dir=/Users/jenkins/workspace/Lucene-Solr-5.x-MacOSX/solr/build/solr-core/test/J1/temp/solr.cloud.CollectionsAPIDistributedZkTest_3ECF26845C57B0C7-001/tempDir-001/control/data}
   [junit4]   2> 222787 INFO  (TEST-CollectionsAPIDistributedZkTest.test-seed#[3ECF26845C57B0C7]) [    ] o.a.s.s.SolrDispatchFilter SolrDispatchFilter.init(): sun.misc.Launcher$AppClassLoader@3b756db3
   [junit4]   2> 222788 INFO  (TEST-CollectionsAPIDistributedZkTest.test-seed#[3ECF26845C57B0C7]) [    ] o.a.s.c.SolrResourceLoader new SolrResourceLoader for directory: '/Users/jenkins/workspace/Lucene-Solr-5.x-MacOSX/solr/build/solr-core/test/J1/temp/solr.cloud.CollectionsAPIDistributedZkTest_3ECF26845C57B0C7-001/control-001'
   [junit4]   2> 222788 INFO  (TEST-CollectionsAPIDistributedZkTest.test-seed#[3ECF26845C57B0C7]) [    ] o.a.s.c.SolrResourceLoader JNDI not configured for solr (NoInitialContextEx)
   [junit4]   2> 222788 INFO  (TEST-CollectionsAPIDistributedZkTest.test-seed#[3ECF26845C57B0C7]) [    ] o.a.s.c.SolrResourceLoader solr home defaulted to 'solr/' (could not find system property or JNDI)
   [junit4]   2> 222788 INFO  (TEST-CollectionsAPIDistributedZkTest.test-seed#[3ECF26845C57B0C7]) [    ] o.a.s.c.c.SolrZkClient Using default ZkCredentialsProvider
   [junit4]   2> 222789 INFO  (TEST-CollectionsAPIDistributedZkTest.test-seed#[3ECF26845C57B0C7]) [    ] o.a.s.c.c.ConnectionManager Waiting for client to connect to ZooKeeper
   [junit4]   2> 222792 INFO  (zkCallback-262-thread-1) [    ] o.a.s.c.c.ConnectionManager Watcher org.apache.solr.common.cloud.ConnectionManager@3b9ec5c1 name:ZooKeeperConnection Watcher:127.0.0.1:54751/solr got event WatchedEvent state:SyncConnected type:None path:null path:null type:None
   [junit4]   2> 222793 INFO  (TEST-CollectionsAPIDistributedZkTest.test-seed#[3ECF26845C57B0C7]) [    ] o.a.s.c.c.ConnectionManager Client is connected to ZooKeeper
   [junit4]   2> 222793 INFO  (TEST-CollectionsAPIDistributedZkTest.test-seed#[3ECF26845C57B0C7]) [    ] o.a.s.c.c.SolrZkClient Using default ZkACLProvider
   [junit4]   2> 222795 INFO  (TEST-CollectionsAPIDistributedZkTest.test-seed#[3ECF26845C57B0C7]) [    ] o.a.s.s.SolrDispatchFilter Loading solr.xml from SolrHome (not found in ZooKeeper)
   [junit4]   2> 222795 INFO  (TEST-CollectionsAPIDistributedZkTest.test-seed#[3ECF26845C57B0C7]) [    ] o.a.s.c.SolrXmlConfig Loading container configuration from /Users/jenkins/workspace/Lucene-Solr-5.x-MacOSX/solr/build/solr-core/test/J1/temp/solr.cloud.CollectionsAPIDistributedZkTest_3ECF26845C57B0C7-001/control-001/solr.xml
   [junit4]   2> 222817 INFO  (TEST-CollectionsAPIDistributedZkTest.test-seed#[3ECF26845C57B0C7]) [    ] o.a.s.c.CorePropertiesLocator Config-defined core root directory: /Users/jenkins/workspace/Lucene-Solr-5.x-MacOSX/solr/build/solr-core/test/J1/../../../../../../../../../Users/jenkins/workspace/Lucene-Solr-5.x-MacOSX/solr/build/solr-core/test/J1/temp/solr.cloud.CollectionsAPIDistributedZkTest_3ECF26845C57B0C7-001/control-001/cores
   [junit4]   2> 222817 INFO  (TEST-CollectionsAPIDistributedZkTest.test-seed#[3ECF26845C57B0C7]) [    ] o.a.s.c.CoreContainer New CoreContainer 746889462
   [junit4]   2> 222817 INFO  (TEST-CollectionsAPIDistributedZkTest.test-seed#[3ECF26845C57B0C7]) [    ] o.a.s.c.CoreContainer Loading cores into CoreContainer [instanceDir=/Users/jenkins/workspace/Lucene-Solr-5.x-MacOSX/solr/build/solr-core/test/J1/temp/solr.cloud.CollectionsAPIDistributedZkTest_3ECF26845C57B0C7-001/control-001]
   [junit4]   2> 222817 WARN  (TEST-CollectionsAPIDistributedZkTest.test-seed#[3ECF26845C57B0C7]) [    ] o.a.s.c.CoreContainer Couldn't add files from /Users/jenkins/workspace/Lucene-Solr-5.x-MacOSX/solr/build/solr-core/test/J1/temp/solr.cloud.CollectionsAPIDistributedZkTest_3ECF26845C57B0C7-001/control-001/lib to classpath: /Users/jenkins/workspace/Lucene-Solr-5.x-MacOSX/solr/build/solr-core/test/J1/temp/solr.cloud.CollectionsAPIDistributedZkTest_3ECF26845C57B0C7-001/control-001/lib
   [junit4]   2> 222817 INFO  (TEST-CollectionsAPIDistributedZkTest.test-seed#[3ECF26845C57B0C7]) [    ] o.a.s.h.c.HttpShardHandlerFactory created with socketTimeout : 90000,urlScheme : ,connTimeout : 15000,maxConnectionsPerHost : 20,maxConnections : 10000,corePoolSize : 0,maximumPoolSize : 2147483647,maxThreadIdleTime : 5,sizeOfQueue : -1,fairnessPolicy : false,useRetries : false,
   [junit4]   2> 222820 INFO  (TEST-CollectionsAPIDistributedZkTest.test-seed#[3ECF26845C57B0C7]) [    ] o.a.s.u.UpdateShardHandler Creating UpdateShardHandler HTTP client with params: socketTimeout=340000&connTimeout=45000&retry=true
   [junit4]   2> 222820 INFO  (TEST-CollectionsAPIDistributedZkTest.test-seed#[3ECF26845C57B0C7]) [    ] o.a.s.l.LogWatcher SLF4J impl is org.slf4j.impl.Log4jLoggerFactory
   [junit4]   2> 222820 INFO  (TEST-CollectionsAPIDistributedZkTest.test-seed#[3ECF26845C57B0C7]) [    ] o.a.s.l.LogWatcher Registering Log Listener [Log4j (org.slf4j.impl.Log4jLoggerFactory)]
   [junit4]   2> 222820 INFO  (TEST-CollectionsAPIDistributedZkTest.test-seed#[3ECF26845C57B0C7]) [    ] o.a.s.c.ZkContainer Zookeeper client=127.0.0.1:54751/solr
   [junit4]   2> 222820 INFO  (TEST-CollectionsAPIDistributedZkTest.test-seed#[3ECF26845C57B0C7]) [    ] o.a.s.c.ZkController zkHost includes chroot
   [junit4]   2> 222820 INFO  (TEST-CollectionsAPIDistributedZkTest.test-seed#[3ECF26845C57B0C7]) [    ] o.a.s.c.c.SolrZkClient Using default ZkCredentialsProvider
   [junit4]   2> 222821 INFO  (TEST-CollectionsAPIDistributedZkTest.test-seed#[3ECF26845C57B0C7]) [    ] o.a.s.c.c.ConnectionManager Waiting for client to connect to ZooKeeper
   [junit4]   2> 222824 INFO  (zkCallback-265-thread-1) [    ] o.a.s.c.c.ConnectionManager Watcher org.apache.solr.common.cloud.ConnectionManager@35f04a1e name:ZooKeeperConnection Watcher:127.0.0.1:54751 got event WatchedEvent state:SyncConnected type:None path:null path:null type:None
   [junit4]   2> 222824 INFO  (TEST-CollectionsAPIDistributedZkTest.test-seed#[3ECF26845C57B0C7]) [    ] o.a.s.c.c.ConnectionManager Client is connected to ZooKeeper
   [junit4]   2> 222825 INFO  (TEST-CollectionsAPIDistributedZkTest.test-seed#[3ECF26845C57B0C7]) [    ] o.a.s.c.c.SolrZkClient Using default ZkACLProvider
   [junit4]   2> 222827 INFO  (TEST-CollectionsAPIDistributedZkTest.test-seed#[3ECF26845C57B0C7]) [n:127.0.0.1:54754_o_%2Fb    ] o.a.s.c.c.ConnectionManager Waiting for client to connect to ZooKeeper
   [junit4]   2> 222829 INFO  (zkCallback-266-thread-1-processing-n:127.0.0.1:54754_o_%2Fb) [n:127.0.0.1:54754_o_%2Fb    ] o.a.s.c.c.ConnectionManager Watcher org.apache.solr.common.cloud.ConnectionManager@6c0e7a33 name:ZooKeeperConnection Watcher:127.0.0.1:54751/solr got event WatchedEvent state:SyncConnected type:None path:null path:null type:None
   [junit4]   2> 222829 INFO  (TEST-CollectionsAPIDistributedZkTest.test-seed#[3ECF26845C57B0C7]) [n:127.0.0.1:54754_o_%2Fb    ] o.a.s.c.c.ConnectionManager Client is connected to ZooKeeper
   [junit4]   2> 222831 INFO  (TEST-CollectionsAPIDistributedZkTest.test-seed#[3ECF26845C57B0C7]) [n:127.0.0.1:54754_o_%2Fb    ] o.a.s.c.c.SolrZkClient makePath: /overseer/queue
   [junit4]   2> 222835 INFO  (TEST-CollectionsAPIDistributedZkTest.test-seed#[3ECF26845C57B0C7]) [n:127.0.0.1:54754_o_%2Fb    ] o.a.s.c.c.SolrZkClient makePath: /overseer/collection-queue-work
   [junit4]   2> 222841 INFO  (TEST-CollectionsAPIDistributedZkTest.test-seed#[3ECF26845C57B0C7]) [n:127.0.0.1:54754_o_%2Fb    ] o.a.s.c.c.SolrZkClient makePath: /overseer/collection-map-running
   [junit4]   2> 222845 INFO  (TEST-CollectionsAPIDistributedZkTest.test-seed#[3ECF26845C57B0C7]) [n:127.0.0.1:54754_o_%2Fb    ] o.a.s.c.c.SolrZkClient makePath: /overseer/collection-map-completed
   [junit4]   2> 222849 INFO  (TEST-CollectionsAPIDistributedZkTest.test-seed#[3ECF26845C57B0C7]) [n:127.0.0.1:54754_o_%2Fb    ] o.a.s.c.c.SolrZkClient makePath: /overseer/collection-map-failure
   [junit4]   2> 222853 INFO  (TEST-CollectionsAPIDistributedZkTest.test-seed#[3ECF26845C57B0C7]) [n:127.0.0.1:54754_o_%2Fb    ] o.a.s.c.c.SolrZkClient makePath: /live_nodes
   [junit4]   2> 222857 INFO  (TEST-CollectionsAPIDistributedZkTest.test-seed#[3ECF26845C57B0C7]) [n:127.0.0.1:54754_o_%2Fb    ] o.a.s.c.c.SolrZkClient makePath: /aliases.json
   [junit4]   2> 222860 INFO  (TEST-CollectionsAPIDistributedZkTest.test-seed#[3ECF26845C57B0C7]) [n:127.0.0.1:54754_o_%2Fb    ] o.a.s.c.c.SolrZkClient makePath: /clusterstate.json
   [junit4]   2> 222863 INFO  (TEST-CollectionsAPIDistributedZkTest.test-seed#[3ECF26845C57B0C7]) [n:127.0.0.1:54754_o_%2Fb    ] o.a.s.c.c.SolrZkClient makePath: /security.json
   [junit4]   2> 222865 INFO  (TEST-CollectionsAPIDistributedZkTest.test-seed#[3ECF26845C57B0C7]) [n:127.0.0.1:54754_o_%2Fb    ] o.a.s.c.ZkController Register node as live in ZooKeeper:/live_nodes/127.0.0.1:54754_o_%2Fb
   [junit4]   2> 222866 INFO  (TEST-CollectionsAPIDistributedZkTest.test-seed#[3ECF26845C57B0C7]) [n:127.0.0.1:54754_o_%2Fb    ] o.a.s.c.c.SolrZkClient makePath: /live_nodes/127.0.0.1:54754_o_%2Fb
   [junit4]   2> 222869 INFO  (TEST-CollectionsAPIDistributedZkTest.test-seed#[3ECF26845C57B0C7]) [n:127.0.0.1:54754_o_%2Fb    ] o.a.s.c.c.SolrZkClient makePath: /overseer_elect
   [junit4]   2> 222872 INFO  (TEST-CollectionsAPIDistributedZkTest.test-seed#[3ECF26845C57B0C7]) [n:127.0.0.1:54754_o_%2Fb    ] o.a.s.c.c.SolrZkClient makePath: /overseer_elect/election
   [junit4]   2> 222874 INFO  (TEST-CollectionsAPIDistributedZkTest.test-seed#[3ECF26845C57B0C7]) [n:127.0.0.1:54754_o_%2Fb    ] o.a.s.c.Overseer Overseer (id=null) closing
   [junit4]   2> 222875 INFO  (TEST-CollectionsAPIDistributedZkTest.test-seed#[3ECF26845C57B0C7]) [n:127.0.0.1:54754_o_%2Fb    ] o.a.s.c.LeaderElector Joined leadership election with path: /overseer_elect/election/95403864864129028-127.0.0.1:54754_o_%2Fb-n_0000000000
   [junit4]   2> 222876 INFO  (TEST-CollectionsAPIDistributedZkTest.test-seed#[3ECF26845C57B0C7]) [n:127.0.0.1:54754_o_%2Fb    ] o.a.s.c.OverseerElectionContext I am going to be the leader 127.0.0.1:54754_o_%2Fb
   [junit4]   2> 222876 INFO  (TEST-CollectionsAPIDistributedZkTest.test-seed#[3ECF26845C57B0C7]) [n:127.0.0.1:54754_o_%2Fb    ] o.a.s.c.c.SolrZkClient makePath: /overseer_elect/leader
   [junit4]   2> 222878 INFO  (TEST-CollectionsAPIDistributedZkTest.test-seed#[3ECF26845C57B0C7]) [n:127.0.0.1:54754_o_%2Fb    ] o.a.s.c.Overseer Overseer (id=95403864864129028-127.0.0.1:54754_o_%2Fb-n_0000000000) starting
   [junit4]   2> 222882 INFO  (TEST-CollectionsAPIDistributedZkTest.test-seed#[3ECF26845C57B0C7]) [n:127.0.0.1:54754_o_%2Fb    ] o.a.s.c.c.SolrZkClient makePath: /overseer/queue-work
   [junit4]   2> 222894 INFO  (TEST-CollectionsAPIDistributedZkTest.test-seed#[3ECF26845C57B0C7]) [n:127.0.0.1:54754_o_%2Fb    ] o.a.s.c.OverseerAutoReplicaFailoverThread Starting OverseerAutoReplicaFailoverThread autoReplicaFailoverWorkLoopDelay=10000 autoReplicaFailoverWaitAfterExpiration=10000 autoReplicaFailoverBadNodeExpiration=60000
   [junit4]   2> 222895 INFO  (OverseerCollectionConfigSetProcessor-95403864864129028-127.0.0.1:54754_o_%2Fb-n_0000000000) [n:127.0.0.1:54754_o_%2Fb    ] o.a.s.c.OverseerTaskProcessor Process current queue of overseer operations
   [junit4]   2> 222895 INFO  (TEST-CollectionsAPIDistributedZkTest.test-seed#[3ECF26845C57B0C7]) [n:127.0.0.1:54754_o_%2Fb    ] o.a.s.c.c.ZkStateReader Updating cluster state from ZooKeeper... 
   [junit4]   2> 222895 INFO  (OverseerStateUpdate-95403864864129028-127.0.0.1:54754_o_%2Fb-n_0000000000) [n:127.0.0.1:54754_o_%2Fb    ] o.a.s.c.Overseer Starting to work on the main queue
   [junit4]   2> 222918 INFO  (TEST-CollectionsAPIDistributedZkTest.test-seed#[3ECF26845C57B0C7]) [n:127.0.0.1:54754_o_%2Fb    ] o.a.s.c.CoreContainer Security conf doesn't exist. Skipping setup for authorization module.
   [junit4]   2> 222918 INFO  (TEST-CollectionsAPIDistributedZkTest.test-seed#[3ECF26845C57B0C7]) [n:127.0.0.1:54754_o_%2Fb    ] o.a.s.c.CoreContainer No authentication plugin used.
   [junit4]   2> 222921 INFO  (TEST-CollectionsAPIDistributedZkTest.test-seed#[3ECF26845C57B0C7]) [n:127.0.0.1:54754_o_%2Fb    ] o.a.s.c.CorePropertiesLocator Looking for core definitions underneath /Users/jenkins/workspace/Lucene-Solr-5.x-MacOSX/solr/build/solr-core/test/J1/../../../../../../../../../Users/jenkins/workspace/Lucene-Solr-5.x-MacOSX/solr/build/solr-core/test/J1/temp/solr.cloud.CollectionsAPIDistributedZkTest_3ECF26845C57B0C7-001/control-001/cores
   [junit4]   2> 222923 INFO  (TEST-CollectionsAPIDistributedZkTest.test-seed#[3ECF26845C57B0C7]) [n:127.0.0.1:54754_o_%2Fb    ] o.a.s.c.CoreDescriptor Created CoreDescriptor: {name=collection1, transient=false, configSetProperties=configsetprops.json, loadOnStartup=true, schema=schema.xml, shard=, collection=control_collection, config=solrconfig.xml, coreNodeName=, dataDir=data/}
   [junit4]   2> 222923 INFO  (TEST-CollectionsAPIDistributedZkTest.test-seed#[3ECF26845C57B0C7]) [n:127.0.0.1:54754_o_%2Fb    ] o.a.s.c.CorePropertiesLocator Found core collection1 in /Users/jenkins/workspace/Lucene-Solr-5.x-MacOSX/solr/build/solr-core/test/J1/../../../../../../../../../Users/jenkins/workspace/Lucene-Solr-5.x-MacOSX/solr/build/solr-core/test/J1/temp/solr.cloud.CollectionsAPIDistributedZkTest_3ECF26845C57B0C7-001/control-001/cores/collection1
   [junit4]   2> 222923 INFO  (TEST-CollectionsAPIDistributedZkTest.test-seed#[3ECF26845C57B0C7]) [n:127.0.0.1:54754_o_%2Fb    ] o.a.s.c.CorePropertiesLocator Found 1 core definitions
   [junit4]   2> 222925 INFO  (coreLoadExecutor-485-thread-1-processing-n:127.0.0.1:54754_o_%2Fb) [n:127.0.0.1:54754_o_%2Fb c:control_collection   x:collection1] o.a.s.c.ZkController publishing state=down
   [junit4]   2> 222925 INFO  (TEST-CollectionsAPIDistributedZkTest.test-seed#[3ECF26845C57B0C7]) [n:127.0.0.1:54754_o_%2Fb    ] o.a.s.s.SolrDispatchFilter user.dir=/Users/jenkins/workspace/Lucene-Solr-5.x-MacOSX/solr/build/solr-core/test/J1
   [junit4]   2> 222925 INFO  (TEST-CollectionsAPIDistributedZkTest.test-seed#[3ECF26845C57B0C7]) [n:127.0.0.1:54754_o_%2Fb    ] o.a.s.s.SolrDispatchFilter SolrDispatchFilter.init() done
   [junit4]   2> 222925 INFO  (coreLoadExecutor-485-thread-1-processing-n:127.0.0.1:54754_o_%2Fb) [n:127.0.0.1:54754_o_%2Fb c:control_collection   x:collection1] o.a.s.c.ZkController numShards not found on descriptor - reading it from system property
   [junit4]   2> 222929 INFO  (OverseerStateUpdate-95403864864129028-127.0.0.1:54754_o_%2Fb-n_0000000000) [n:127.0.0.1:54754_o_%2Fb    ] o.a.s.c.Overseer processMessage: queueSize: 1, message = {
   [junit4]   2>   "numShards":"1",
   [junit4]   2>   "state":"down",
   [junit4]   2>   "collection":"control_collection",
   [junit4]   2>   "core":"collection1",
   [junit4]   2>   "operation":"state",
   [junit4]   2>   "shard":null,
   [junit4]   2>   "roles":null,
   [junit4]   2>   "node_name":"127.0.0.1:54754_o_%2Fb",
   [junit4]   2>   "base_url":"http://127.0.0.1:54754/o_/b"} current state version: 0
   [junit4]   2> 222929 INFO  (coreLoadExecutor-485-thread-1-processing-n:127.0.0.1:54754_o_%2Fb) [n:127.0.0.1:54754_o_%2Fb c:control_collection   x:collection1] o.a.s.c.ZkController look for our core node name
   [junit4]   2> 222930 INFO  (OverseerStateUpdate-95403864864129028-127.0.0.1:54754_o_%2Fb-n_0000000000) [n:127.0.0.1:54754_o_%2Fb    ] o.a.s.c.o.ReplicaMutator Update state numShards=1 message={
   [junit4]   2>   "numShards":"1",
   [junit4]   2>   "state":"down",
   [junit4]   2>   "collection":"control_collection",
   [junit4]   2>   "core":"collection1",
   [junit4]   2>   "operation":"state",
   [junit4]   2>   "shard":null,
   [junit4]   2>   "roles":null,
   [junit4]   2>   "node_name":"127.0.0.1:54754_o_%2Fb",
   [junit4]   2>   "base_url":"http://127.0.0.1:54754/o_/b"}
   [junit4]   2> 222931 INFO  (OverseerStateUpdate-95403864864129028-127.0.0.1:54754_o_%2Fb-n_0000000000) [n:127.0.0.1:54754_o_%2Fb    ] o.a.s.c.o.ClusterStateMutator building a new cName: control_collection
   [junit4]   2> 222933 INFO  (OverseerStateUpdate-95403864864129028-127.0.0.1:54754_o_%2Fb-n_0000000000) [n:127.0.0.1:54754_o_%2Fb    ] o.a.s.c.o.ReplicaMutator Assigning new node to shard shard=shard1
   [junit4]   2> 222936 INFO  (zkCallback-266-thread-1-processing-n:127.0.0.1:54754_o_%2Fb) [n:127.0.0.1:54754_o_%2Fb    ] o.a.s.c.c.ZkStateReader A cluster state change: [WatchedEvent state:SyncConnected type:NodeDataChanged path:/clusterstate.json], has occurred - updating... (live nodes size: [1])
   [junit4]   2> 223931 INFO  (coreLoadExecutor-485-thread-1-processing-n:127.0.0.1:54754_o_%2Fb) [n:127.0.0.1:54754_o_%2Fb c:control_collection   x:collection1] o.a.s.c.ZkController waiting to find shard id in clusterstate for collection1
   [junit4]   2> 223931 INFO  (coreLoadExecutor-485-thread-1-processing-n:127.0.0.1:54754_o_%2Fb) [n:127.0.0.1:54754_o_%2Fb c:control_collection   x:collection1] o.a.s.c.ZkController Check for collection zkNode:control_collection
   [junit4]   2> 223932 INFO  (coreLoadExecutor-485-thread-1-processing-n:127.0.0.1:54754_o_%2Fb) [n:127.0.0.1:54754_o_%2Fb c:control_collection   x:collection1] o.a.s.c.ZkController Collection zkNode exists
   [junit4]   2> 223932 INFO  (coreLoadExecutor-485-thread-1-processing-n:127.0.0.1:54754_o_%2Fb) [n:127.0.0.1:54754_o_%2Fb c:control_collection   x:collection1] o.a.s.c.c.ZkStateReader Load collection config from: [/collections/control_collection]
   [junit4]   2> 223935 INFO  (coreLoadExecutor-485-thread-1-processing-n:127.0.0.1:54754_o_%2Fb) [n:127.0.0.1:54754_o_%2Fb c:control_collection   x:collection1] o.a.s.c.c.ZkStateReader path=[/collections/control_collection] [configName]=[conf1] specified config exists in ZooKeeper
   [junit4]   2> 223935 INFO  (coreLoadExecutor-485-thread-1-processing-n:127.0.0.1:54754_o_%2Fb) [n:127.0.0.1:54754_o_%2Fb c:control_collection   x:collection1] o.a.s.c.SolrResourceLoader new SolrResourceLoader for directory: '/Users/jenkins/workspace/Lucene-Solr-5.x-MacOSX/solr/build/solr-core/test/J1/temp/solr.cloud.CollectionsAPIDistributedZkTest_3ECF26845C57B0C7-001/control-001/cores/collection1'
   [junit4]   2> 223935 INFO  (coreLoadExecutor-485-thread-1-processing-n:127.0.0.1:54754_o_%2Fb) [n:127.0.0.1:54754_o_%2Fb c:control_collection   x:collection1] o.a.s.c.SolrResourceLoader JNDI not configured for solr (NoInitialContextEx)
   [junit4]   2> 223935 INFO  (coreLoadExecutor-485-thread-1-processing-n:127.0.0.1:54754_o_%2Fb) [n:127.0.0.1:54754_o_%2Fb c:control_collection   x:collection1] o.a.s.c.SolrResourceLoader solr home defaulted to 'solr/' (could not find system property or JNDI)
   [junit4]   2> 223937 INFO  (coreLoadExecutor-485-thread-1-processing-n:127.0.0.1:54754_o_%2Fb) [n:127.0.0.1:54754_o_%2Fb c:control_collection   x:collection1] o.a.s.c.Config loaded config solrconfig.xml with version 0 
   [junit4]   2> 223946 INFO  (coreLoadExecutor-485-thread-1-processing-n:127.0.0.1:54754_o_%2Fb) [n:127.0.0.1:54754_o_%2Fb c:control_collection   x:collection1] o.a.s.c.SolrConfig current version of requestparams : -1
   [junit4]   2> 223959 INFO  (coreLoadExecutor-485-thread-1-processing-n:127.0.0.1:54754_o_%2Fb) [n:127.0.0.1:54754_o_%2Fb c:control_collection   x:collection1] o.a.s.c.SolrConfig Using Lucene MatchVersion: 5.6.0
   [junit4]   2> 223991 INFO  (coreLoadExecutor-485-thread-1-processing-n:127.0.0.1:54754_o_%2Fb) [n:127.0.0.1:54754_o_%2Fb c:control_collection   x:collection1] o.a.s.c.SolrConfig Loaded SolrConfig: solrconfig.xml
   [junit4]   2> 223999 INFO  (coreLoadExecutor-485-thread-1-processing-n:127.0.0.1:54754_o_%2Fb) [n:127.0.0.1:54754_o_%2Fb c:control_collection   x:collection1] o.a.s.s.IndexSchema [collection1] Schema name=test
   [junit4]   2> 224230 INFO  (coreLoadExecutor-485-thread-1-processing-n:127.0.0.1:54754_o_%2Fb) [n:127.0.0.1:54754_o_%2Fb c:control_collection   x:collection1] o.a.s.s.OpenExchangeRatesOrgProvider Initialized with rates=open-exchange-rates.json, refreshInterval=1440.
   [junit4]   2> 224240 INFO  (coreLoadExecutor-485-thread-1-processing-n:127.0.0.1:54754_o_%2Fb) [n:127.0.0.1:54754_o_%2Fb c:control_collection   x:collection1] o.a.s.s.IndexSchema default search field in schema is text
   [junit4]   2> 224241 INFO  (coreLoadExecutor-485-thread-1-processing-n:127.0.0.1:54754_o_%2Fb) [n:127.0.0.1:54754_o_%2Fb c:control_collection   x:collection1] o.a.s.s.IndexSchema unique key field: id
   [junit4]   2> 224258 INFO  (coreLoadExecutor-485-thread-1-processing-n:127.0.0.1:54754_o_%2Fb) [n:127.0.0.1:54754_o_%2Fb c:control_collection   x:collection1] o.a.s.s.FileExchangeRateProvider Reloading exchange rates from file currency.xml
   [junit4]   2> 224261 INFO  (coreLoadExecutor-485-thread-1-processing-n:127.0.0.1:54754_o_%2Fb) [n:127.0.0.1:54754_o_%2Fb c:control_collection   x:collection1] o.a.s.s.FileExchangeRateProvider Reloading exchange rates from file currency.xml
   [junit4]   2> 224265 INFO  (coreLoadExecutor-485-thread-1-processing-n:127.0.0.1:54754_o_%2Fb) [n:127.0.0.1:54754_o_%2Fb c:control_collection   x:collection1] o.a.s.s.OpenExchangeRatesOrgProvider Reloading exchange rates from open-exchange-rates.json
   [junit4]   2> 224267 INFO  (coreLoadExecutor-485-thread-1-processing-n:127.0.0.1:54754_o_%2Fb) [n:127.0.0.1:54754_o_%2Fb c:control_collection   x:collection1] o.a.s.s.OpenExchangeRatesOrgProvider Reloading exchange rates from open-exchange-rates.json
   [junit4]   2> 224270 INFO  (coreLoadExecutor-485-thread-1-processing-n:127.0.0.1:54754_o_%2Fb) [n:127.0.0.1:54754_o_%2Fb c:control_collection   x:collection1] o.a.s.c.ConfigSetProperties Did not find ConfigSet properties, assuming default properties: Can't find resource 'configsetprops.json' in classpath or '/configs/conf1', cwd=/Users/jenkins/workspace/Lucene-Solr-5.x-MacOSX/solr/build/solr-core/test/J1
   [junit4]   2> 224270 INFO  (coreLoadExecutor-485-thread-1-processing-n:127.0.0.1:54754_o_%2Fb) [n:127.0.0.1:54754_o_%2Fb c:control_collection   x:collection1] o.a.s.c.CoreContainer Creating SolrCore 'collection1' using configuration from collection control_collection
   [junit4]   2> 224270 INFO  (coreLoadExecutor-485-thread-1-processing-n:127.0.0.1:54754_o_%2Fb) [n:127.0.0.1:54754_o_%2Fb c:control_collection s:shard1 r:core_node1 x:collection1] o.a.s.c.SolrCore org.apache.solr.core.MockDirectoryFactory
   [junit4]   2> 224270 INFO  (coreLoadExecutor-485-thread-1-processing-n:127.0.0.1:54754_o_%2Fb) [n:127.0.0.1:54754_o_%2Fb c:control_collection s:shard1 r:core_node1 x:collection1] o.a.s.c.SolrCore [[collection1] ] Opening new SolrCore at [/Users/jenkins/workspace/Lucene-Solr-5.x-MacOSX/solr/build/solr-core/test/J1/temp/solr.cloud.CollectionsAPIDistributedZkTest_3ECF26845C57B0C7-001/control-001/cores/collection1], dataDir=[/Users/jenkins/workspace/Lucene-Solr-5.x-MacOSX/solr/build/solr-core/test/J1/../../../../../../../../../Users/jenkins/workspace/Lucene-Solr-5.x-MacOSX/solr/build/solr-core/test/J1/temp/solr.cloud.CollectionsAPIDistributedZkTest_3ECF26845C57B0C7-001/control-001/cores/collection1/data/]
   [junit4]   2> 224271 INFO  (coreLoadExecutor-485-thread-1-processing-n:127.0.0.1:54754_o_%2Fb) [n:127.0.0.1:54754_o_%2Fb c:control_collection s:shard1 r:core_node1 x:collection1] o.a.s.c.JmxMonitoredMap JMX monitoring is enabled. Adding Solr mbeans to JMX Server: com.sun.jmx.mbeanserver.JmxMBeanServer@7784fdfc
   [junit4]   2> 224271 INFO  (coreLoadExecutor-485-thread-1-processing-n:127.0.0.1:54754_o_%2Fb) [n:127.0.0.1:54754_o_%2Fb c:control_collection s:shard1 r:core_node1 x:collection1] o.a.s.c.CachingDirectoryFactory return new directory for /Users/jenkins/workspace/Lucene-Solr-5.x-MacOSX/solr/build/solr-core/test/J1/../../../../../../../../../Users/jenkins/workspace/Lucene-Solr-5.x-MacOSX/solr/build/solr-core/test/J1/temp/solr.cloud.CollectionsAPIDistributedZkTest_3ECF26845C57B0C7-001/control-001/cores/collection1/data
   [junit4]   2> 224271 INFO  (coreLoadExecutor-485-thread-1-processing-n:127.0.0.1:54754_o_%2Fb) [n:127.0.0.1:54754_o_%2Fb c:control_collection s:shard1 r:core_node1 x:collection1] o.a.s.c.SolrCore New index directory detected: old=null new=/Users/jenkins/workspace/Lucene-Solr-5.x-MacOSX/solr/build/solr-core/test/J1/../../../../../../../../../Users/jenkins/workspace/Lucene-Solr-5.x-MacOSX/solr/build/solr-core/test/J1/temp/solr.cloud.CollectionsAPIDistributedZkTest_3ECF26845C57B0C7-001/control-001/cores/collection1/data/index/
   [junit4]   2> 224271 WARN  (coreLoadExecutor-485-thread-1-processing-n:127.0.0.1:54754_o_%2Fb) [n:127.0.0.1:54754_o_%2Fb c:control_collection s:shard1 r:core_node1 x:collection1] o.a.s.c.SolrCore [collection1] Solr index directory '/Users/jenkins/workspace/Lucene-Solr-5.x-MacOSX/solr/build/solr-core/test/J1/../../../../../../../../../Users/jenkins/workspace/Lucene-Solr-5.x-MacOSX/solr/build/solr-core/test/J1/temp/solr.cloud.CollectionsAPIDistributedZkTest_3ECF26845C57B0C7-001/control-001/cores/collection1/data/index' doesn't exist. Creating new index...
   [junit4]   2> 224272 INFO  (coreLoadExecutor-485-thread-1-processing-n:127.0.0.1:54754_o_%2Fb) [n:127.0.0.1:54754_o_%2Fb c:control_collection s:shard1 r:core_node1 x:collection1] o.a.s.c.CachingDirectoryFactory return new directory for /Users/jenkins/workspace/Lucene-Solr-5.x-MacOSX/solr/build/solr-core/test/J1/../../../../../../../../../Users/jenkins/workspace/Lucene-Solr-5.x-MacOSX/solr/build/solr-core/test/J1/temp/solr.cloud.CollectionsAPIDistributedZkTest_3ECF26845C57B0C7-001/control-001/cores/collection1/data/index
   [junit4]   2> 224272 INFO  (coreLoadExecutor-485-thread-1-processing-n:127.0.0.1:54754_o_%2Fb) [n:127.0.0.1:54754_o_%2Fb c:control_collection s:shard1 r:core_node1 x:collection1] o.a.s.u.RandomMergePolicy RandomMergePolicy wrapping class org.apache.lucene.index.TieredMergePolicy: [TieredMergePolicy: maxMergeAtOnce=36, maxMergeAtOnceExplicit=39, maxMergedSegmentMB=30.845703125, floorSegmentMB=0.37109375, forceMergeDeletesPctAllowed=4.873748385433831, segmentsPerTier=16.0, maxCFSSegmentSizeMB=8.796093022207999E12, noCFSRatio=0.12171336963386264
   [junit4]   2> 224272 INFO  (coreLoadExecutor-485-thread-1-processing-n:127.0.0.1:54754_o_%2Fb) [n:127.0.0.1:54754_o_%2Fb c:control_collection s:shard1 r:core_node1 x:collection1] o.a.s.c.SolrDeletionPolicy SolrDeletionPolicy.onCommit: commits: num=1
   [junit4]   2> 	commit{dir=MockDirectoryWrapper(RAMDirectory@53372ccf lockFactory=org.apache.lucene.store.SingleInstanceLockFactory@4b5ef4b7),segFN=segments_1,generation=1}
   [junit4]   2> 224272 INFO  (coreLoadExecutor-485-thread-1-processing-n:127.0.0.1:54754_o_%2Fb) [n:127.0.0.1:54754_o_%2Fb c:control_collection s:shard1 r:core_node1 x:collection1] o.a.s.c.SolrDeletionPolicy newest commit generation = 1
   [junit4]   2> 224273 INFO  (OldIndexDirectoryCleanupThreadForCore-collection1) [n:127.0.0.1:54754_o_%2Fb c:control_collection s:shard1 r:core_node1 x:collection1] o.a.s.c.SolrCore Looking for old index directories to cleanup for core collection1 in /Users/jenkins/workspace/Lucene-Solr-5.x-MacOSX/solr/build/solr-core/test/J1/../../../../../../../../../Users/jenkins/workspace/Lucene-Solr-5.x-MacOSX/solr/build/solr-core/test/J1/temp/solr.cloud.CollectionsAPIDistributedZkTest_3ECF26845C57B0C7-001/control-001/cores/collection1/data/
   [junit4]   2> 224273 WARN  (OldIndexDirectoryCleanupThreadForCore-collection1) [n:127.0.0.1:54754_o_%2Fb c:control_collection s:shard1 r:core_node1 x:collection1] o.a.s.c.DirectoryFactory /Users/jenkins/workspace/Lucene-Solr-5.x-MacOSX/solr/build/solr-core/test/J1/../../../../../../../../../Users/jenkins/workspace/Lucene-Solr-5.x-MacOSX/solr/build/solr-core/test/J1/temp/solr.cloud.CollectionsAPIDistributedZkTest_3ECF26845C57B0C7-001/control-001/cores/collection1/data/ does not point to a valid data directory; skipping clean-up of old index directories.
   [junit4]   2> 224277 INFO  (coreLoadExecutor-485-thread-1-processing-n:127.0.0.1:54754_o_%2Fb) [n:127.0.0.1:54754_o_%2Fb c:control_collection s:shard1 r:core_node1 x:collection1] o.a.s.u.p.UpdateRequestProcessorChain creating updateRequestProcessorChain "nodistrib"
   [junit4]   2> 224278 INFO  (coreLoadExecutor-485-thread-1-processing-n:127.0.0.1:54754_o_%2Fb) [n:127.0.0.1:54754_o_%2Fb c:control_collection s:shard1 r:core_node1 x:collection1] o.a.s.u.p.UpdateRequestProcessorChain creating updateRequestProcessorChain "dedupe"
   [junit4]   2> 224278 INFO  (coreLoadExecutor-485-thread-1-processing-n:127.0.0.1:54754_o_%2Fb) [n:127.0.0.1:54754_o_%2Fb c:control_collection s:shard1 r:core_node1 x:collection1] o.a.s.u.p.UpdateRequestProcessorChain inserting DistributedUpdateProcessorFactory into updateRequestProcessorChain "dedupe"
   [junit4]   2> 224278 INFO  (coreLoadExecutor-485-thread-1-processing-n:127.0.0.1:54754_o_%2Fb) [n:127.0.0.1:54754_o_%2Fb c:control_collection s:shard1 r:core_node1 x:collection1] o.a.s.u.p.UpdateRequestProcessorChain creating updateRequestProcessorChain "stored_sig"
   [junit4]   2> 224278 INFO  (coreLoadExecutor-485-thread-1-processing-n:127.0.0.1:54754_o_%2Fb) [n:127.0.0.1:54754_o_%2Fb c:control_collection s:shard1 r:core_node1 x:collection1] o.a.s.u.p.UpdateRequestProcessorChain inserting DistributedUpdateProcessorFactory into updateRequestProcessorChain "stored_sig"
   [junit4]   2> 224278 INFO  (coreLoadExecutor-485-thread-1-processing-n:127.0.0.1:54754_o_%2Fb) [n:127.0.0.1:54754_o_%2Fb c:control_collection s:shard1 r:core_node1 x:collection1] o.a.s.u.p.UpdateRequestProcessorChain creating updateRequestProcessorChain "distrib-dup-test-chain-explicit"
   [junit4]   2> 224278 INFO  (coreLoadExecutor-485-thread-1-processing-n:127.0.0.1:54754_o_%2Fb) [n:127.0.0.1:54754_o_%2Fb c:control_collection s:shard1 r:core_node1 x:collection1] o.a.s.u.p.UpdateRequestProcessorChain creating updateRequestProcessorChain "distrib-dup-test-chain-implicit"
   [junit4]   2> 224278 INFO  (coreLoadExecutor-485-thread-1-processing-n:127.0.0.1:54754_o_%2Fb) [n:127.0.0.1:54754_o_%2Fb c:control_collection s:shard1 r:core_node1 x:collection1] o.a.s.u.p.UpdateRequestProcessorChain inserting DistributedUpdateProcessorFactory into updateRequestProcessorChain "distrib-dup-test-chain-implicit"
   [junit4]   2> 224278 INFO  (coreLoadExecutor-485-thread-1-processing-n:127.0.0.1:54754_o_%2Fb) [n:127.0.0.1:54754_o_%2Fb c:control_collection s:shard1 r:core_node1 x:collection1] o.a.s.c.SolrCore no updateRequestProcessorChain defined as default, creating implicit default
   [junit4]   2> 224279 WARN  (coreLoadExecutor-485-thread-1-processing-n:127.0.0.1:54754_o_%2Fb) [n:127.0.0.1:54754_o_%2Fb c:control_collection s:shard1 r:core_node1 x:collection1] o.a.s.c.RequestHandlers INVALID paramSet a in requestHandler {type = requestHandler,name = /dump,class = DumpRequestHandler,args = {defaults={a=A,b=B}}}
   [junit4]   2> 224284 INFO  (coreLoadExecutor-485-thread-1-processing-n:127.0.0.1:54754_o_%2Fb) [n:127.0.0.1:54754_o_%2Fb c:control_collection s:shard1 r:core_node1 x:collection1] o.a.s.h.l.XMLLoader xsltCacheLifetimeSeconds=60
   [junit4]   2> 224285 INFO  (coreLoadExecutor-485-thread-1-processing-n:127.0.0.1:54754_o_%2Fb) [n:127.0.0.1:54754_o_%2Fb c:control_collection s:shard1 r:core_node1 x:collection1] o.a.s.h.l.XMLLoader xsltCacheLifetimeSeconds=60
   [junit4]   2> 224287 INFO  (coreLoadExecutor-485-thread-1-processing-n:127.0.0.1:54754_o_%2Fb) [n:127.0.0.1:54754_o_%2Fb c:control_collection s:shard1 r:core_node1 x:collection1] o.a.s.h.l.XMLLoader xsltCacheLifetimeSeconds=60
   [junit4]   2> 224288 INFO  (coreLoadExecutor-485-thread-1-processing-n:127.0.0.1:54754_o_%2Fb) [n:127.0.0.1:54754_o_%2Fb c:control_collection s:shard1 r:core_node1 x:collection1] o.a.s.h.l.XMLLoader xsltCacheLifetimeSeconds=60
   [junit4]   2> 224292 INFO  (coreLoadExecutor-485-thread-1-processing-n:127.0.0.1:54754_o_%2Fb) [n:127.0.0.1:54754_o_%2Fb c:control_collection s:shard1 r:core_node1 x:collection1] o.a.s.c.RequestHandlers Registered paths: /admin/luke,/replication,/update,/update/csv,/admin/file,/config,/dump,/admin/ping,/admin/logging,/admin/threads,/get,/update/json/docs,/admin/system,/admin/plugins,/schema,/admin/properties,/admin/mbeans,/update/json,standard,/admin/segments
   [junit4]   2> 224293 INFO  (coreLoadExecutor-485-thread-1-processing-n:127.0.0.1:54754_o_%2Fb) [n:127.0.0.1:54754_o_%2Fb c:control_collection s:shard1 r:core_node1 x:collection1] o.a.s.c.SolrCore Using default statsCache cache: org.apache.solr.search.stats.LocalStatsCache
   [junit4]   2> 224294 INFO  (coreLoadExecutor-485-thread-1-processing-n:127.0.0.1:54754_o_%2Fb) [n:127.0.0.1:54754_o_%2Fb c:control_collection s:shard1 r:core_node1 x:collection1] o.a.s.u.UpdateHandler Using UpdateLog implementation: org.apache.solr.update.UpdateLog
   [junit4]   2> 224294 INFO  (coreLoadExecutor-485-thread-1-processing-n:127.0.0.1:54754_o_%2Fb) [n:127.0.0.1:54754_o_%2Fb c:control_collection s:shard1 r:core_node1 x:collection1] o.a.s.u.UpdateLog Initializing UpdateLog: dataDir= defaultSyncLevel=FLUSH numRecordsToKeep=100 maxNumLogsToKeep=10 numVersionBuckets=65536
   [junit4]   2> 224295 INFO  (coreLoadExecutor-485-thread-1-processing-n:127.0.0.1:54754_o_%2Fb) [n:127.0.0.1:54754_o_%2Fb c:control_collection s:shard1 r:core_node1 x:collection1] o.a.s.u.CommitTracker Hard AutoCommit: disabled
   [junit4]   2> 224295 INFO  (coreLoadExecutor-485-thread-1-processing-n:127.0.0.1:54754_o_%2Fb) [n:127.0.0.1:54754_o_%2Fb c:control_collection s:shard1 r:core_node1 x:collection1] o.a.s.u.CommitTracker Soft AutoCommit: disabled
   [junit4]   2> 224295 INFO  (coreLoadExecutor-485-thread-1-processing-n:127.0.0.1:54754_o_%2Fb) [n:127.0.0.1:54754_o_%2Fb c:control_collection s:shard1 r:core_node1 x:collection1] o.a.s.u.RandomMergePolicy RandomMergePolicy wrapping class org.apache.lucene.index.LogDocMergePolicy: [LogDocMergePolicy: minMergeSize=1000, mergeFactor=19, maxMergeSize=9223372036854775807, maxMergeSizeForForcedMerge=9223372036854775807, calibrateSizeByDeletes=false, maxMergeDocs=2147483647, maxCFSSegmentSizeMB=8.796093022207999E12, noCFSRatio=0.614932829884158]
   [junit4]   2> 224296 INFO  (coreLoadExecutor-485-thread-1-processing-n:127.0.0.1:54754_o_%2Fb) [n:127.0.0.1:54754_o_%2Fb c:control_collection s:shard1 r:core_node1 x:collection1] o.a.s.c.SolrDeletionPolicy SolrDeletionPolicy.onInit: commits: num=1
   [junit4]   2> 	commit{dir=MockDirectoryWrapper(RAMDirectory@53372ccf lockFactory=org.apache.lucene.store.SingleInstanceLockFactory@4b5ef4b7),segFN=segments_1,generation=1}
   [junit4]   2> 224296 INFO  (coreLoadExecutor-485-thread-1-processing-n:127.0.0.1:54754_o_%2Fb) [n:127.0.0.1:54754_o_%2Fb c:control_collection s:shard1 r:core_node1 x:collection1] o.a.s.c.SolrDeletionPolicy newest commit generation = 1
   [junit4]   2> 224296 INFO  (coreLoadExecutor-485-thread-1-processing-n:127.0.0.1:54754_o_%2Fb) [n:127.0.0.1:54754_o_%2Fb c:control_collection s:shard1 r:core_node1 x:collection1] o.a.s.s.SolrIndexSearcher Opening Searcher@1f043cf3[collection1] main
   [junit4]   2> 224296 INFO  (coreLoadExecutor-485-thread-1-processing-n:127.0.0.1:54754_o_%2Fb) [n:127.0.0.1:54754_o_%2Fb c:control_collection s:shard1 r:core_node1 x:collection1] o.a.s.c.c.ZkStateReader Load collection config from: [/collections/control_collection]
   [junit4]   2> 224298 INFO  (coreLoadExecutor-485-thread-1-processing-n:127.0.0.1:54754_o_%2Fb) [n:127.0.0.1:54754_o_%2Fb c:control_collection s:shard1 r:core_node1 x:collection1] o.a.s.c.c.ZkStateReader path=[/collections/control_collection] [configName]=[conf1] specified config exists in ZooKeeper
   [junit4]   2> 224298 INFO  (coreLoadExecutor-485-thread-1-processing-n:127.0.0.1:54754_o_%2Fb) [n:127.0.0.1:54754_o_%2Fb c:control_collection s:shard1 r:core_node1 x:collection1] o.a.s.r.ManagedResourceStorage Setting up ZooKeeper-based storage for the RestManager with znodeBase: /configs/conf1
   [junit4]   2> 224299 INFO  (coreLoadExecutor-485-thread-1-processing-n:127.0.0.1:54754_o_%2Fb) [n:127.0.0.1:54754_o_%2Fb c:control_collection s:shard1 r:core_node1 x:collection1] o.a.s.r.ManagedResourceStorage Configured ZooKeeperStorageIO with znodeBase: /configs/conf1
   [junit4]   2> 224299 INFO  (coreLoadExecutor-485-thread-1-processing-n:127.0.0.1:54754_o_%2Fb) [n:127.0.0.1:54754_o_%2Fb c:control_collection s:shard1 r:core_node1 x:collection1] o.a.s.r.RestManager Initializing RestManager with initArgs: {}
   [junit4]   2> 224299 INFO  (coreLoadExecutor-485-thread-1-processing-n:127.0.0.1:54754_o_%2Fb) [n:127.0.0.1:54754_o_%2Fb c:control_collection s:shard1 r:core_node1 x:collection1] o.a.s.r.ManagedResourceStorage Reading _rest_managed.json using ZooKeeperStorageIO:path=/configs/conf1
   [junit4]   2> 224300 INFO  (coreLoadExecutor-485-thread-1-processing-n:127.0.0.1:54754_o_%2Fb) [n:127.0.0.1:54754_o_%2Fb c:control_collection s:shard1 r:core_node1 x:collection1] o.a.s.r.ManagedResourceStorage No data found for znode /configs/conf1/_rest_managed.json
   [junit4]   2> 224300 INFO  (coreLoadExecutor-485-thread-1-processing-n:127.0.0.1:54754_o_%2Fb) [n:127.0.0.1:54754_o_%2Fb c:control_collection s:shard1 r:core_node1 x:collection1] o.a.s.r.ManagedResourceStorage Loaded null at path _rest_managed.json using ZooKeeperStorageIO:path=/configs/conf1
   [junit4]   2> 224300 INFO  (coreLoadExecutor-485-thread-1-processing-n:127.0.0.1:54754_o_%2Fb) [n:127.0.0.1:54754_o_%2Fb c:control_collection s:shard1 r:core_node1 x:collection1] o.a.s.r.RestManager Initializing 0 registered ManagedResources
   [junit4]   2> 224300 INFO  (coreLoadExecutor-485-thread-1-processing-n:127.0.0.1:54754_o_%2Fb) [n:127.0.0.1:54754_o_%2Fb c:control_collection s:shard1 r:core_node1 x:collection1] o.a.s.h.ReplicationHandler Commits will be reserved for  10000
   [junit4]   2> 224301 INFO  (searcherExecutor-486-thread-1-processing-c:control_collection x:collection1 s:shard1 r:core_node1 n:127.0.0.1:54754_o_%2Fb) [n:127.0.0.1:54754_o_%2Fb c:control_collection s:shard1 r:core_node1 x:collection1] o.a.s.c.SolrCore [collection1] Registered new searcher Searcher@1f043cf3[collection1] main{ExitableDirectoryReader(UninvertingDirectoryReader())}
   [junit4]   2> 224301 INFO  (coreLoadExecutor-485-thread-1-processing-n:127.0.0.1:54754_o_%2Fb) [n:127.0.0.1:54754_o_%2Fb c:control_collection s:shard1 r:core_node1 x:collection1] o.a.s.u.UpdateLog Looking up max value of version field to seed version buckets
   [junit4]   2> 224302 INFO  (coreLoadExecutor-485-thread-1-processing-n:127.0.0.1:54754_o_%2Fb) [n:127.0.0.1:54754_o_%2Fb c:control_collection s:shard1 r:core_node1 x:collection1] o.a.s.u.VersionInfo Refreshing highest value of _version_ for 65536 version buckets from index
   [junit4]   2> 224302 INFO  (coreLoadExecutor-485-thread-1-processing-n:127.0.0.1:54754_o_%2Fb) [n:127.0.0.1:54754_o_%2Fb c:control_collection s:shard1 r:core_node1 x:collection1] o.a.s.u.VersionInfo No terms found for _version_, cannot seed version bucket highest value from index
   [junit4]   2> 224302 INFO  (coreLoadExecutor-485-thread-1-processing-n:127.0.0.1:54754_o_%2Fb) [n:127.0.0.1:54754_o_%2Fb c:control_collection s:shard1 r:core_node1 x:collection1] o.a.s.u.UpdateLog Could not find max version in index or recent updates, using new clock 1526461840029122560
   [junit4]   2> 224304 INFO  (coreLoadExecutor-485-thread-1-processing-n:127.0.0.1:54754_o_%2Fb) [n:127.0.0.1:54754_o_%2Fb c:control_collection s:shard1 r:core_node1 x:collection1] o.a.s.u.UpdateLog Took 2.0ms to seed version buckets with highest version 1526461840029122560
   [junit4]   2> 224304 INFO  (coreLoadExecutor-485-thread-1-processing-n:127.0.0.1:54754_o_%2Fb) [n:127.0.0.1:54754_o_%2Fb c:control_collection s:shard1 r:core_node1 x:collection1] o.a.s.c.ZkController watch zkdir /configs/conf1
   [junit4]   2> 224305 INFO  (coreLoadExecutor-485-thread-1-processing-n:127.0.0.1:54754_o_%2Fb) [n:127.0.0.1:54754_o_%2Fb c:control_collection s:shard1 r:core_node1 x:collection1] o.a.s.c.CoreContainer registering core: collection1
   [junit4]   2> 224305 INFO  (coreZkRegister-479-thread-1-processing-c:control_collection x:collection1 s:shard1 r:core_node1 n:127.0.0.1:54754_o_%2Fb) [n:127.0.0.1:54754_o_%2Fb c:control_collection s:shard1 r:core_node1 x:collection1] o.a.s.c.ZkController Register replica - core:collection1 address:http://127.0.0.1:54754/o_/b collection:control_collection shard:shard1
   [junit4]   2> 224307 INFO  (coreZkRegister-479-thread-1-processing-c:control_collection x:collection1 s:shard1 r:core_node1 n:127.0.0.1:54754_o_%2Fb) [n:127.0.0.1:54754_o_%2Fb c:control_collection s:shard1 r:core_node1 x:collection1] o.a.s.c.c.SolrZkClient makePath: /collections/control_collection/leader_elect/shard1/election
   [junit4]   2> 224313 INFO  (coreZkRegister-479-thread-1-processing-c:control_collection x:collection1 s:shard1 r:core_node1 n:127.0.0.1:54754_o_%2Fb) [n:127.0.0.1:54754_o_%2Fb c:control_collection s:shard1 r:core_node1 x:collection1] o.a.s.c.LeaderElector Joined leadership election with path: /collections/control_collection/leader_elect/shard1/election/95403864864129028-core_node1-n_0000000000
   [junit4]   2> 224314 INFO  (coreZkRegister-479-thread-1-processing-c:control_collection x:collection1 s:shard1 r:core_node1 n:127.0.0.1:54754_o_%2Fb) [n:127.0.0.1:54754_o_%2Fb c:control_collection s:shard1 r:core_node1 x:collection1] o.a.s.c.ShardLeaderElectionContext Running the leader process for shard=shard1 and weAreReplacement=false and leaderVoteWait=180000
   [junit4]   2> 224317 INFO  (coreZkRegister-479-thread-1-processing-c:control_collection x:collection1 s:shard1 r:core_node1 n:127.0.0.1:54754_o_%2Fb) [n:127.0.0.1:54754_o_%2Fb c:control_collection s:shard1 r:core_node1 x:collection1] o.a.s.c.ShardLeaderElectionContext Enough replicas found to continue.
   [junit4]   2> 224317 INFO  (coreZkRegister-479-thread-1-processing-c:control_collection x:collection1 s:shard1 r:core_node1 n:127.0.0.1:54754_o_%2Fb) [n:127.0.0.1:54754_o_%2Fb c:control_collection s:shard1 r:core_node1 x:collection1] o.a.s.c.ShardLeaderElectionContext I may be the new leader - try and sync
   [junit4]   2> 224318 INFO  (coreZkRegister-479-thread-1-processing-c:control_collection x:collection1 s:shard1 r:core_node1 n:127.0.0.1:54754_o_%2Fb) [n:127.0.0.1:54754_o_%2Fb c:control_collection s:shard1 r:core_node1 x:collection1] o.a.s.c.SyncStrategy Sync replicas to http://127.0.0.1:54754/o_/b/collection1/
   [junit4]   2> 224318 INFO  (coreZkRegister-479-thread-1-processing-c:control_collection x:collection1 s:shard1 r:core_node1 n:127.0.0.1:54754_o_%2Fb) [n:127.0.0.1:54754_o_%2Fb c:control_collection s:shard1 r:core_node1 x:collection1] o.a.s.c.SyncStrategy Sync Success - now sync replicas to me
   [junit4]   2> 224318 INFO  (coreZkRegister-479-thread-1-processing-c:control_collection x:collection1 s:shard1 r:core_node1 n:127.0.0.1:54754_o_%2Fb) [n:127.0.0.1:54754_o_%2Fb c:control_collection s:shard1 r:core_node1 x:collection1] o.a.s.c.SyncStrategy http://127.0.0.1:54754/o_/b/collection1/ has no replicas
   [junit4]   2> 224318 INFO  (OverseerStateUpdate-95403864864129028-127.0.0.1:54754_o_%2Fb-n_0000000000) [n:127.0.0.1:54754_o_%2Fb    ] o.a.s.c.Overseer processMessage: queueSize: 1, message = {
   [junit4]   2>   "operation":"leader",
   [junit4]   2>   "shard":"shard1",
   [junit4]   2>   "collection":"control_collection"} current state version: 1
   [junit4]   2> 224319 INFO  (coreZkRegister-479-thread-1-processing-c:control_collection x:collection1 s:shard1 r:core_node1 n:127.0.0.1:54754_o_%2Fb) [n:127.0.0.1:54754_o_%2Fb c:control_collection s:shard1 r:core_node1 x:collection1] o.a.s.c.c.SolrZkClient makePath: /collections/control_collection/leaders/shard1
   [junit4]   2> 224324 INFO  (coreZkRegister-479-thread-1-processing-c:control_collection x:collection1 s:shard1 r:core_node1 n:127.0.0.1:54754_o_%2Fb) [n:127.0.0.1:54754_o_%2Fb c:control_collection s:shard1 r:core_node1 x:collection1] o.a.s.c.ShardLeaderElectionContextBase Creating leader registration node
   [junit4]   2> 224327 INFO  (coreZkRegister-479-thread-1-processing-c:control_collection x:collection1 s:shard1 r:core_node1 n:127.0.0.1:54754_o_%2Fb) [n:127.0.0.1:54754_o_%2Fb c:control_collection s:shard1 r:core_node1 x:collection1] o.a.s.c.ShardLeaderElectionContext I am the new leader: http://127.0.0.1:54754/o_/b/collection1/ shard1
   [junit4]   2> 224328 INFO  (OverseerStateUpdate-95403864864129028-127.0.0.1:54754_o_%2Fb-n_0000000000) [n:127.0.0.1:54754_o_%2Fb    ] o.a.s.c.Overseer processMessage: queueSize: 1, message = {
   [junit4]   2>   "operation":"leader",
   [junit4]   2>   "shard":"shard1",
   [junit4]   2>   "collection":"control_collection",
   [junit4]   2>   "base_url":"http://127.0.0.1:54754/o_/b",
   [junit4]   2>   "core":"collection1",
   [junit4]   2>   "state":"active"} current state version: 1
   [junit4]   2> 224431 INFO  (TEST-CollectionsAPIDistributedZkTest.test-seed#[3ECF26845C57B0C7]) [    ] o.a.s.c.c.SolrZkClient Using default ZkCredentialsProvider
   [junit4]   2> 224432 INFO  (TEST-CollectionsAPIDistributedZkTest.test-seed#[3ECF26845C57B0C7]) [    ] o.a.s.c.c.ConnectionManager Waiting for client to connect to ZooKeeper
   [junit4]   2> 224434 INFO  (zkCallback-266-thread-1-processing-n:127.0.0.1:54754_o_%2Fb) [n:127.0.0.1:54754_o_%2Fb    ] o.a.s.c.c.ZkStateReader A cluster state change: [WatchedEvent state:SyncConnected type:NodeDataChanged path:/clusterstate.json], has occurred - updating... (live nodes size: [1])
   [junit4]   2> 224434 INFO  (zkCallback-268-thread-1) [    ] o.a.s.c.c.ConnectionManager Watcher org.apache.solr.common.cloud.ConnectionManager@6a982dc5 name:ZooKeeperConnection Watcher:127.0.0.1:54751/solr got event WatchedEvent state:SyncConnected type:None path:null path:null type:None
   [junit4]   2> 224434 INFO  (TEST-CollectionsAPIDistributedZkTest.test-seed#[3ECF26845C57B0C7]) [    ] o.a.s.c.c.ConnectionManager Client is connected to ZooKeeper
   [junit4]   2> 224435 INFO  (TEST-CollectionsAPIDistributedZkTest.test-seed#[3ECF26845C57B0C7]) [    ] o.a.s.c.c.SolrZkClient Using default ZkACLProvider
   [junit4]   2> 224435 INFO  (TEST-CollectionsAPIDistributedZkTest.test-seed#[3ECF26845C57B0C7]) [    ] o.a.s.c.c.ZkStateReader Updating cluster state from ZooKeeper... 
   [junit4]   2> 224442 INFO  (TEST-CollectionsAPIDistributedZkTest.test-seed#[3ECF26845C57B0C7]) [    ] o.a.s.c.ChaosMonkey monkey: init - expire sessions:false cause connection loss:false
   [junit4]   2> 224482 INFO  (coreZkRegister-479-thread-1-processing-c:control_collection x:collection1 s:shard1 r:core_node1 n:127.0.0.1:54754_o_%2Fb) [n:127.0.0.1:54754_o_%2Fb c:control_collection s:shard1 r:core_node1 x:collection1] o.a.s.c.ZkController We are http://127.0.0.1:54754/o_/b/collection1/ and leader is http://127.0.0.1:54754/o_/b/collection1/
   [junit4]   2> 224482 INFO  (coreZkRegister-479-thread-1-processing-c:control_collection x:collection1 s:shard1 r:core_node1 n:127.0.0.1:54754_o_%2Fb) [n:127.0.0.1:54754_o_%2Fb c:control_collection s:shard1 r:core_node1 x:collection1] o.a.s.c.ZkController No LogReplay needed for core=collection1 baseURL=http://127.0.0.1:54754/o_/b
   [junit4]   2> 224482 INFO  (coreZkRegister-479-thread-1-processing-c:control_collection x:collection1 s:shard1 r:core_node1 n:127.0.0.1:54754_o_%2Fb) [n:127.0.0.1:54754_o_%2Fb c:control_collection s:shard1 r:core_node1 x:collection1] o.a.s.c.ZkController I am the leader, no recovery necessary
   [junit4]   2> 224482 INFO  (coreZkRegister-479-thread-1-processing-c:control_collection x:collection1 s:shard1 r:core_node1 n:127.0.0.1:54754_o_%2Fb) [n:127.0.0.1:54754_o_%2Fb c:control_collection s:shard1 r:core_node1 x:collection1] o.a.s.c.ZkController publishing state=active
   [junit4]   2> 224482 INFO  (coreZkRegister-479-thread-1-processing-c:control_collection x:collection1 s:shard1 r:core_node1 n:127.0.0.1:54754_o_%2Fb) [n:127.0.0.1:54754_o_%2Fb c:control_collection s:shard1 r:core_node1 x:collection1] o.a.s.c.ZkController numShards not found on descriptor - reading it from system property
   [junit4]   2> 224486 INFO  (OverseerStateUpdate-95403864864129028-127.0.0.1:54754_o_%2Fb-n_0000000000) [n:127.0.0.1:54754_o_%2Fb    ] o.a.s.c.Overseer processMessage: queueSize: 1, message = {
   [junit4]   2>   "numShards":"2",
   [junit4]   2>   "state":"active",
   [junit4]   2>   "collection":"control_collection",
   [junit4]   2>   "core":"collection1",
   [junit4]   2>   "operation":"state",
   [junit4]   2>   "shard":"shard1",
   [junit4]   2>   "roles":null,
   [junit4]   2>   "core_node_name":"core_node1",
   [junit4]   2>   "node_name":"127.0.0.1:54754_o_%2Fb",
   [junit4]   2>   "base_url":"http://127.0.0.1:54754/o_/b"} current state version: 2
   [junit4]   2> 224487 INFO  (OverseerStateUpdate-95403864864129028-127.0.0.1:54754_o_%2Fb-n_0000000000) [n:127.0.0.1:54754_o_%2Fb    ] o.a.s.c.o.ReplicaMutator Update state numShards=2 message={
   [junit4]   2>   "numShards":"2",
   [junit4]   2>   "state":"active",
   [junit4]   2>   "collection":"control_collection",
   [junit4]   2>   "core":"collection1",
   [junit4]   2>   "operation":"state",
   [junit4]   2>   "shard":"shard1",
   [junit4]   2>   "roles":null,
   [junit4]   2>   "core_node_name":"core_node1",
   [junit4]   2>   "node_name":"127.0.0.1:54754_o_%2Fb",
   [junit4]   2>   "base_url":"http://127.0.0.1:54754/o_/b"}
   [junit4]   2> 224592 INFO  (zkCallback-268-thread-1) [    ] o.a.s.c.c.ZkStateReader A cluster state change: [WatchedEvent state:SyncConnected type:NodeDataChanged path:/clusterstate.json], has occurred - updating... (live nodes size: [1])
   [junit4]   2> 224592 INFO  (zkCallback-266-thread-1-processing-n:127.0.0.1:54754_o_%2Fb) [n:127.0.0.1:54754_o_%2Fb    ] o.a.s.c.c.ZkStateReader A cluster state change: [WatchedEvent state:SyncConnected type:NodeDataChanged path:/clusterstate.json], has occurred - updating... (live nodes size: [1])
   [junit4]   2> 224788 INFO  (TEST-CollectionsAPIDistributedZkTest.test-seed#[3ECF26845C57B0C7]) [    ] o.a.s.SolrTestCaseJ4 Writing core.properties file to /Users/jenkins/workspace/Lucene-Solr-5.x-MacOSX/solr/build/solr-core/test/J1/temp/solr.cloud.CollectionsAPIDistributedZkTest_3ECF26845C57B0C7-001/shard-1-001/cores/collection1
   [junit4]   2> 224790 INFO  (TEST-CollectionsAPIDistributedZkTest.test-seed#[3ECF26845C57B0C7]) [    ] o.a.s.c.AbstractFullDistribZkTestBase create jetty 1 in directory /Users/jenkins/workspace/Lucene-Solr-5.x-MacOSX/solr/build/solr-core/test/J1/temp/solr.cloud.CollectionsAPIDistributedZkTest_3ECF26845C57B0C7-001/shard-1-001
   [junit4]   2> 224791 INFO  (TEST-CollectionsAPIDistributedZkTest.test-seed#[3ECF26845C57B0C7]) [    ] o.e.j.s.Server jetty-9.2.13.v20150730
   [junit4]   2> 224794 INFO  (TEST-CollectionsAPIDistributedZkTest.test-seed#[3ECF26845C57B0C7]) [    ] o.e.j.s.h.ContextHandler Started o.e.j.s.ServletContextHandler@1f5a9d91{/o_/b,null,AVAILABLE}
   [junit4]   2> 224794 INFO  (TEST-CollectionsAPIDistributedZkTest.test-seed#[3ECF26845C57B0C7]) [    ] o.e.j.s.ServerConnector Started ServerConnector@761eaaab{HTTP/1.1}{127.0.0.1:54771}
   [junit4]   2> 224794 INFO  (TEST-CollectionsAPIDistributedZkTest.test-seed#[3ECF26845C57B0C7]) [    ] o.e.j.s.Server Started @229449ms
   [junit4]   2> 224794 INFO  (TEST-CollectionsAPIDistributedZkTest.test-seed#[3ECF26845C57B0C7]) [    ] o.a.s.c.s.e.JettySolrRunner Jetty properties: {solr.data.dir=/Users/jenkins/workspace/Lucene-Solr-5.x-MacOSX/solr/build/solr-core/test/J1/temp/solr.cloud.CollectionsAPIDistributedZkTest_3ECF26845C57B0C7-001/tempDir-001/jetty1, hostPort=54771, coreRootDirectory=/Users/jenkins/workspace/Lucene-Solr-5.x-MacOSX/solr/build/solr-core/test/J1/temp/solr.cloud.CollectionsAPIDistributedZkTest_3ECF26845C57B0C7-001/shard-1-001/cores, solrconfig=solrconfig.xml, hostContext=/o_/b}
   [junit4]   2> 224795 INFO  (TEST-CollectionsAPIDistributedZkTest.test-seed#[3ECF26845C57B0C7]) [    ] o.a.s.s.SolrDispatchFilter SolrDispatchFilter.init(): sun.misc.Launcher$AppClassLoader@3b756db3
   [junit4]   2> 224795 INFO  (TEST-CollectionsAPIDistributedZkTest.test-seed#[3ECF26845C57B0C7]) [    ] o.a.s.c.SolrResourceLoader new SolrResourceLoader for directory: '/Users/jenkins/workspace/Lucene-Solr-5.x-MacOSX/solr/build/solr-core/test/J1/temp/solr.cloud.CollectionsAPIDistributedZkTest_3ECF26845C57B0C7-001/shard-1-001'
   [junit4]   2> 224795 INFO  (TEST-CollectionsAPIDistributedZkTest.test-seed#[3ECF26845C57B0C7]) [    ] o.a.s.c.SolrResourceLoader JNDI not configured for solr (NoInitialContextEx)
   [junit4]   2> 224795 INFO  (TEST-CollectionsAPIDistributedZkTest.test-seed#[3ECF26845C57B0C7]) [    ] o.a.s.c.SolrResourceLoader solr home defaulted to 'solr/' (could not find system property or JNDI)
   [junit4]   2> 224795 INFO  (TEST-CollectionsAPIDistributedZkTest.test-seed#[3ECF26845C57B0C7]) [    ] o.a.s.c.c.SolrZkClient Using default ZkCredentialsProvider
   [junit4]   2> 224796 INFO  (TEST-CollectionsAPIDistributedZkTest.test-seed#[3ECF26845C57B0C7]) [    ] o.a.s.c.c.ConnectionManager Waiting for client to connect to ZooKeeper
   [junit4]   2> 224798 INFO  (zkCallback-269-thread-1) [    ] o.a.s.c.c.ConnectionManager Watcher org.apache.solr.common.cloud.ConnectionManager@5ab48d5b name:ZooKeeperConnection Watcher:127.0.0.1:54751/solr got event WatchedEvent state:SyncConnected type:None path:null path:null type:None
   [junit4]   2> 224798 INFO  (TEST-CollectionsAPIDistributedZkTest.test-seed#[3ECF26845C57B0C7]) [    ] o.a.s.c.c.ConnectionManager Client is connected to ZooKeeper
   [junit4]   2> 224798 INFO  (TEST-CollectionsAPIDistributedZkTest.test-seed#[3ECF26845C57B0C7]) [    ] o.a.s.c.c.SolrZkClient Using default ZkACLProvider
   [junit4]   2> 224800 INFO  (TEST-CollectionsAPIDistributedZkTest.test-seed#[3ECF26845C57B0C7]) [    ] o.a.s.s.SolrDispatchFilter Loading solr.xml from SolrHome (not found in ZooKeeper)
   [junit4]   2> 224800 INFO  (TEST-CollectionsAPIDistributedZkTest.test-seed#[3ECF26845C57B0C7]) [    ] o.a.s.c.SolrXmlConfig Loading container configuration from /Users/jenkins/workspace/Lucene-Solr-5.x-MacOSX/solr/build/solr-core/test/J1/temp/solr.cloud.CollectionsAPIDistributedZkTest_3ECF26845C57B0C7-001/shard-1-001/solr.xml
   [junit4]   2> 224867 INFO  (TEST-CollectionsAPIDistributedZkTest.test-seed#[3ECF26845C57B0C7]) [    ] o.a.s.c.CorePropertiesLocator Config-defined core root directory: /Users/jenkins/workspace/Lucene-Solr-5.x-MacOSX/solr/build/solr-core/test/J1/temp/solr.cloud.CollectionsAPIDistributedZkTest_3ECF26845C57B0C7-001/shard-1-001/cores
   [junit4]   2> 224867 INFO  (TEST-CollectionsAPIDistributedZkTest.test-seed#[3ECF26845C57B0C7]) [    ] o.a.s.c.CoreContainer New CoreContainer 538717479
   [junit4]   2> 224867 INFO  (TEST-CollectionsAPIDistributedZkTest.test-seed#[3ECF26845C57B0C7]) [    ] o.a.s.c.CoreContainer Loading cores into CoreContainer [instanceDir=/Users/jenkins/workspace/Lucene-Solr-5.x-MacOSX/solr/build/solr-core/test/J1/temp/solr.cloud.CollectionsAPIDistributedZkTest_3ECF26845C57B0C7-001/shard-1-001]
   [junit4]   2> 224868 WARN  (TEST-CollectionsAPIDistributedZkTest.test-seed#[3ECF26845C57B0C7]) [    ] o.a.s.c.CoreContainer Couldn't add files from /Users/jenkins/workspace/Lucene-Solr-5.x-MacOSX/solr/build/solr-core/test/J1/temp/solr.cloud.CollectionsAPIDistributedZkTest_3ECF26845C57B0C7-001/shard-1-001/lib to classpath: /Users/jenkins/workspace/Lucene-Solr-5.x-MacOSX/solr/build/solr-core/test/J1/temp/solr.cloud.CollectionsAPIDistributedZkTest_3ECF26845C57B0C7-001/shard-1-001/lib
   [junit4]   2> 224868 INFO  (TEST-CollectionsAPIDistributedZkTest.test-seed#[3ECF26845C57B0C7]) [    ] o.a.s.h.c.HttpShardHandlerFactory created with socketTimeout : 90000,urlScheme : ,connTimeout : 15000,maxConnectionsPerHost : 20,maxConnections : 10000,corePoolSize : 0,maximumPoolSize : 2147483647,maxThreadIdleTime : 5,sizeOfQueue : -1,fairnessPolicy : false,useRetries : false,
   [junit4]   2> 224870 INFO  (TEST-CollectionsAPIDistributedZkTest.test-seed#[3ECF26845C57B0C7]) [    ] o.a.s.u.UpdateShardHandler Creating UpdateShardHandler HTTP client with params: socketTimeout=340000&connTimeout=45000&retry=true
   [junit4]   2> 224871 INFO  (TEST-CollectionsAPIDistributedZkTest.test-seed#[3ECF26845C57B0C7]) [    ] o.a.s.l.LogWatcher SLF4J impl is org.slf4j.impl.Log4jLoggerFactory
   [junit4]   2> 224871 INFO  (TEST-CollectionsAPIDistributedZkTest.test-seed#[3ECF26845C57B0C7]) [    ] o.a.s.l.LogWatcher Registering Log Listener [Log4j (org.slf4j.impl.Log4jLoggerFactory)]
   [junit4]   2> 224871 INFO  (TEST-CollectionsAPIDistributedZkTest.test-seed#[3ECF26845C57B0C7]) [    ] o.a.s.c.ZkContainer Zookeeper client=127.0.0.1:54751/solr
   [junit4]   2> 224871 INFO  (TEST-CollectionsAPIDistributedZkTest.test-seed#[3ECF26845C57B0C7]) [    ] o.a.s.c.ZkController zkHost includes chroot
   [junit4]   2> 224871 INFO  (TEST-CollectionsAPIDistributedZkTest.test-seed#[3ECF26845C57B0C7]) [    ] o.a.s.c.c.SolrZkClient Using default ZkCredentialsProvider
   [junit4]   2> 224872 INFO  (TEST-CollectionsAPIDistributedZkTest.test-seed#[3ECF26845C57B0C7]) [    ] o.a.s.c.c.ConnectionManager Waiting for client to connect to ZooKeeper
   [junit4]   2> 224874 INFO  (zkCallback-272-thread-1) [    ] o.a.s.c.c.ConnectionManager Watcher org.apache.solr.common.cloud.ConnectionManager@63c12171 name:ZooKeeperConnection Watcher:127.0.0.1:54751 got event WatchedEvent state:SyncConnected type:None path:null path:null type:None
   [junit4]   2> 224875 INFO  (TEST-CollectionsAPIDistributedZkTest.test-seed#[3ECF26845C57B0C7]) [    ] o.a.s.c.c.ConnectionManager Client is connected to ZooKeeper
   [junit4]   2> 224875 INFO  (TEST-CollectionsAPIDistributedZkTest.test-seed#[3ECF26845C57B0C7]) [    ] o.a.s.c.c.SolrZkClient Using default ZkACLProvider
   [junit4]   2> 224878 INFO  (TEST-CollectionsAPIDistributedZkTest.test-seed#[3ECF26845C57B0C7]) [n:127.0.0.1:54771_o_%2Fb    ] o.a.s.c.c.ConnectionManager Waiting for client to connect to ZooKeeper
   [junit4]   2> 224879 INFO  (zkCallback-273-thread-1-processing-n:127.0.0.1:54771_o_%2Fb) [n:127.0.0.1:54771_o_%2Fb    ] o.a.s.c.c.ConnectionManager Watcher org.apache.solr.common.cloud.ConnectionManager@70f837bd name:ZooKeeperConnection Watcher:127.0.0.1:54751/solr got event WatchedEvent state:SyncConnected type:None path:null path:null type:None
   [junit4]   2> 224880 INFO  (TEST-CollectionsAPIDistributedZkTest.test-seed#[3ECF26845C57B0C7]) [n:127.0.0.1:54771_o_%2Fb    ] o.a.s.c.c.ConnectionManager Client is connected to ZooKeeper
   [junit4]   2> 224891 INFO  (TEST-CollectionsAPIDistributedZkTest.test-seed#[3ECF26845C57B0C7]) [n:127.0.0.1:54771_o_%2Fb    ] o.a.s.c.c.ZkStateReader Updating cluster state from ZooKeeper... 
   [junit4]   2> 225903 INFO  (TEST-CollectionsAPIDistributedZkTest.test-seed#[3ECF26845C57B0C7]) [n:127.0.0.1:54771_o_%2Fb    ] o.a.s.c.ZkController Register node as live in ZooKeeper:/live_nodes/127.0.0.1:54771_o_%2Fb
   [junit4]   2> 225903 INFO  (TEST-CollectionsAPIDistributedZkTest.test-seed#[3ECF26845C57B0C7]) [n:127.0.0.1:54771_o_%2Fb    ] o.a.s.c.c.SolrZkClient makePath: /live_nodes/127.0.0.1:54771_o_%2Fb
   [junit4]   2> 225906 INFO  (zkCallback-273-thread-1-processing-n:127.0.0.1:54771_o_%2Fb) [n:127.0.0.1:54771_o_%2Fb    ] o.a.s.c.c.ZkStateReader A live node change: [WatchedEvent state:SyncConnected type:NodeChildrenChanged path:/live_nodes], has occurred - updating... (live nodes size: [1])
   [junit4]   2> 225906 INFO  (zkCallback-268-thread-1) [    ] o.a.s.c.c.ZkStateReader A live node change: [WatchedEvent state:SyncConnected type:NodeChildrenChanged path:/live_nodes], has occurred - updating... (live nodes size: [1])
   [junit4]   2> 225906 INFO  (zkCallback-266-thread-1-processing-n:127.0.0.1:54754_o_%2Fb) [n:127.0.0.1:54754_o_%2Fb    ] o.a.s.c.c.ZkStateReader A live node change: [WatchedEvent state:SyncConnected type:NodeChildrenChanged path:/live_nodes], has occurred - updating... (live nodes size: [1])
   [junit4]   2> 225909 INFO  (TEST-CollectionsAPIDistributedZkTest.test-seed#[3ECF26845C57B0C7]) [n:127.0.0.1:54771_o_%2Fb    ] o.a.s.c.Overseer Overseer (id=null) closing
   [junit4]   2> 225909 INFO  (TEST-CollectionsAPIDistributedZkTest.test-seed#[3ECF26845C57B0C7]) [n:127.0.0.1:54771_o_%2Fb    ] o.a.s.c.LeaderElector Joined leadership election with path: /overseer_elect/election/95403864864129032-127.0.0.1:54771_o_%2Fb-n_0000000001
   [junit4]   2> 225911 INFO  (TEST-CollectionsAPIDistributedZkTest.test-seed#[3ECF26845C57B0C7]) [n:127.0.0.1:54771_o_%2Fb    ] o.a.s.c.LeaderElector Watching path /overseer_elect/election/95403864864129028-127.0.0.1:54754_o_%2Fb-n_0000000000 to know if I could be the leader
   [junit4]   2> 225920 INFO  (TEST-CollectionsAPIDistributedZkTest.test-seed#[3ECF26845C57B0C7]) [n:127.0.0.1:54771_o_%2Fb    ] o.a.s.c.CoreContainer Security conf doesn't exist. Skipping setup for authorization module.
   [junit4]   2> 225920 INFO  (TEST-CollectionsAPIDistributedZkTest.test-seed#[3ECF26845C57B0C7]) [n:127.0.0.1:54771_o_%2Fb    ] o.a.s.c.CoreContainer No authentication plugin used.
   [junit4]   2> 225921 INFO  (TEST-CollectionsAPIDistributedZkTest.test-seed#[3ECF26845C57B0C7]) [n:127.0.0.1:54771_o_%2Fb    ] o.a.s.c.CorePropertiesLocator Looking for core definitions underneath /Users/jenkins/workspace/Lucene-Solr-5.x-MacOSX/solr/build/solr-core/test/J1/temp/solr.cloud.CollectionsAPIDistributedZkTest_3ECF26845C57B0C7-001/shard-1-001/cores
   [junit4]   2> 225922 INFO  (TEST-CollectionsAPIDistributedZkTest.test-seed#[3ECF26845C57B0C7]) [n:127.0.0.1:54771_o_%2Fb    ] o.a.s.c.CoreDescriptor Created CoreDescriptor: {shard=, schema=schema.xml, transient=false, name=collection1, collection=collection1, configSetProperties=configsetprops.json, coreNodeName=, loadOnStartup=true, config=solrconfig.xml, dataDir=data/}
   [junit4]   2> 225922 INFO  (TEST-CollectionsAPIDistributedZkTest.test-seed#[3ECF26845C57B0C7]) [n:127.0.0.1:54771_o_%2Fb    ] o.a.s.c.CorePropertiesLocator Found core collection1 in /Users/jenkins/workspace/Lucene-Solr-5.x-MacOSX/solr/build/solr-core/test/J1/temp/solr.cloud.CollectionsAPIDistributedZkTest_3ECF26845C57B0C7-001/shard-1-001/cores/collection1
   [junit4]   2> 225922 INFO  (TEST-CollectionsAPIDistributedZkTest.test-seed#[3ECF26845C57B0C7]) [n:127.0.0.1:54771_o_%2Fb    ] o.a.s.c.CorePropertiesLocator Found 1 core definitions
   [junit4]   2> 225924 INFO  (TEST-CollectionsAPIDistributedZkTest.test-seed#[3ECF26845C57B0C7]) [n:127.0.0.1:54771_o_%2Fb    ] o.a.s.s.SolrDispatchFilter user.dir=/Users/jenkins/workspace/Lucene-Solr-5.x-MacOSX/solr/build/solr-core/test/J1
   [junit4]   2> 225924 INFO  (TEST-CollectionsAPIDistributedZkTest.test-seed#[3ECF26845C57B0C7]) [n:127.0.0.1:54771_o_%2Fb    ] o.a.s.s.SolrDispatchFilter SolrDispatchFilter.init() done
   [junit4]   2> 225924 INFO  (coreLoadExecutor-496-thread-1-processing-n:127.0.0.1:54771_o_%2Fb) [n:127.0.0.1:54771_o_%2Fb c:collection1   x:collection1] o.a.s.c.ZkController publishing state=down
   [junit4]   2> 225925 INFO  (coreLoadExecutor-496-thread-1-processing-n:127.0.0.1:54771_o_%2Fb) [n:127.0.0.1:54771_o_%2Fb c:collection1   x:collection1] o.a.s.c.ZkController numShards not found on descriptor - reading it from system property
   [junit4]   2> 225928 INFO  (coreLoadExecutor-496-thread-1-processing-n:127.0.0.1:54771_o_%2Fb) [n:127.0.0.1:54771_o_%2Fb c:collection1   x:collection1] o.a.s.c.ZkController look for our core node name
   [junit4]   2> 225928 INFO  (OverseerStateUpdate-95403864864129028-127.0.0.1:54754_o_%2Fb-n_0000000000) [n:127.0.0.1:54754_o_%2Fb    ] o.a.s.c.Overseer processMessage: queueSize: 1, message = {
   [junit4]   2>   "numShards":"2",
   [junit4]   2>   "state":"down",
   [junit4]   2>   "collection":"collection1",
   [junit4]   2>   "core":"collection1",
   [junit4]   2>   "operation":"state",
   [junit4]   2>   "shard":null,
   [junit4]   2>   "roles":null,
   [junit4]   2>   "node_name":"127.0.0.1:54771_o_%2Fb",
   [junit4]   2>   "base_url":"http://127.0.0.1:54771/o_/b"} current state version: 3
   [junit4]   2> 225929 INFO  (OverseerStateUpdate-95403864864129028-127.0.0.1:54754_o_%2Fb-n_0000000000) [n:127.0.0.1:54754_o_%2Fb    ] o.a.s.c.o.ReplicaMutator Update state numShards=2 message={
   [junit4]   2>   "numShards":"2",
   [junit4]   2>   "state":"down",
   [junit4]   2>   "collection":"collection1",
   [junit4]   2>   "core":"collection1",
   [junit4]   2>   "operation":"state",
   [junit4]   2>   "shard":null,
   [junit4]   2>   "roles":null,
   [junit4]   2>   "node_name":"127.0.0.1:54771_o_%2Fb",
   [junit4]   2>   "base_url":"http://127.0.0.1:54771/o_/b"}
   [junit4]   2> 225929 INFO  (OverseerStateUpdate-95403864864129028-127.0.0.1:54754_o_%2Fb-n_0000000000) [n:127.0.0.1:54754_o_%2Fb    ] o.a.s.c.o.ClusterStateMutator building a new cName: collection1
   [junit4]   2> 225929 INFO  (OverseerStateUpdate-95403864864129028-127.0.0.1:54754_o_%2Fb-n_0000000000) [n:127.0.0.1:54754_o_%2Fb    ] o.a.s.c.o.ReplicaMutator Assigning new node to shard shard=shard1
   [junit4]   2> 226035 INFO  (zkCallback-273-thread-1-processing-n:127.0.0.1:54771_o_%2Fb) [n:127.0.0.1:54771_o_%2Fb    ] o.a.s.c.c.ZkStateReader A cluster state change: [WatchedEvent state:SyncConnected type:NodeDataChanged path:/clusterstate.json], has occurred - updating... (live nodes size: [2])
   [junit4]   2> 226035 INFO  (zkCallback-266-thread-1-processing-n:127.0.0.1:54754_o_%2Fb) [n:127.0.0.1:54754_o_%2Fb    ] o.a.s.c.c.ZkStateReader A cluster state change: [WatchedEvent state:SyncConnected type:NodeDataChanged path:/clusterstate.json], has occurred - updating... (live nodes size: [2])
   [junit4]   2> 226035 INFO  (zkCallback-268-thread-1) [    ] o.a.s.c.c.ZkStateReader A cluster state change: [WatchedEvent state:SyncConnected type:NodeDataChanged path:/clusterstate.json], has occurred - updating... (live nodes size: [2])
   [junit4]   2> 226930 INFO  (coreLoadExecutor-496-thread-1-processing-n:127.0.0.1:54771_o_%2Fb) [n:127.0.0.1:54771_o_%2Fb c:collection1   x:collection1] o.a.s.c.ZkController waiting to find shard id in clusterstate for collection1
   [junit4]   2> 226930 INFO  (coreLoadExecutor-496-thread-1-processing-n:127.0.0.1:54771_o_%2Fb) [n:127.0.0.1:54771_o_%2Fb c:collection1   x:collection1] o.a.s.c.ZkController Check for collection zkNode:collection1
   [junit4]   2> 226931 INFO  (coreLoadExecutor-496-thread-1-processing-n:127.0.0.1:54771_o_%2Fb) [n:127.0.0.1:54771_o_%2Fb c:collection1   x:collection1] o.a.s.c.ZkController Collection zkNode exists
   [junit4]   2> 226931 INFO  (coreLoadExecutor-496-thread-1-processing-n:127.0.0.1:54771_o_%2Fb) [n:127.0.0.1:54771_o_%2Fb c:collection1   x:collection1] o.a.s.c.c.ZkStateReader Load collection config from: [/collections/collection1]
   [junit4]   2> 226932 INFO  (coreLoadExecutor-496-thread-1-processing-n:127.0.0.1:54771_o_%2Fb) [n:127.0.0.1:54771_o_%2Fb c:collection1   x:collection1] o.a.s.c.c.ZkStateReader path=[/collections/collection1] [configName]=[conf1] specified config exists in ZooKeeper
   [junit4]   2> 226932 INFO  (coreLoadExecutor-496-thread-1-processing-n:127.0.0.1:54771_o_%2Fb) [n:127.0.0.1:54771_o_%2Fb c:collection1   x:collection1] o.a.s.c.SolrResourceLoader new SolrResourceLoader for directory: '/Users/jenkins/workspace/Lucene-Solr-5.x-MacOSX/solr/build/solr-core/test/J1/temp/solr.cloud.CollectionsAPIDistributedZkTest_3ECF26845C57B0C7-001/shard-1-001/cores/collection1'
   [junit4]   2> 226932 INFO  (coreLoadExecutor-496-thread-1-processing-n:127.0.0.1:54771_o_%2Fb) [n:127.0.0.1:54771_o_%2Fb c:collection1   x:collection1] o.a.s.c.SolrResourceLoader JNDI not configured for solr (NoInitialContextEx)
   [junit4]   2> 226932 INFO  (coreLoadExecutor-496-thread-1-processing-n:127.0.0.1:54771_o_%2Fb) [n:127.0.0.1:54771_o_%2Fb c:collection1   x:collection1] o.a.s.c.SolrResourceLoader solr home defaulted to 'solr/' (could not find system property or JNDI)
   [junit4]   2> 226935 INFO  (coreLoadExecutor-496-thread-1-processing-n:127.0.0.1:54771_o_%2Fb) [n:127.0.0.1:54771_o_%2Fb c:collection1   x:collection1] o.a.s.c.Config loaded config solrconfig.xml with version 0 
   [junit4]   2> 226943 INFO  (coreLoadExecutor-496-thread-1-processing-n:127.0.0.1:54771_o_%2Fb) [n:127.0.0.1:54771_o_%2Fb c:collection1   x:collection1] o.a.s.c.SolrConfig current version of requestparams : -1
   [junit4]   2> 226956 INFO  (coreLoadExecutor-496-thread-1-processing-n:127.0.0.1:54771_o_%2Fb) [n:127.0.0.1:54771_o_%2Fb c:collection1   x:collection1] o.a.s.c.SolrConfig Using Lucene MatchVersion: 5.6.0
   [junit4]   2> 227194 INFO  (coreLoadExecutor-496-thread-1-processing-n:127.0.0.1:54771_o_%2Fb) [n:127.0.0.1:54771_o_%2Fb c:collection1   x:collection1] o.a.s.c.SolrConfig Loaded SolrConfig: solrconfig.xml
   [junit4]   2> 227202 INFO  (coreLoadExecutor-496-thread-1-processing-n:127.0.0.1:54771_o_%2Fb) [n:127.0.0.1:54771_o_%2Fb c:collection1   x:collection1] o.a.s.s.IndexSchema [collection1] Schema name=test
   [junit4]   2> 227431 INFO  (coreLoadExecutor-496-thread-1-processing-n:127.0.0.1:54771_o_%2Fb) [n:127.0.0.1:54771_o_%2Fb c:collection1   x:collection1] o.a.s.s.OpenExchangeRatesOrgProvider Initialized with rates=open-exchange-rates.json, refreshInterval=1440.
   [junit4]   2> 227441 INFO  (coreLoadExecutor-496-thread-1-processing-n:127.0.0.1:54771_o_%2Fb) [n:127.0.0.1:54771_o_%2Fb c:collection1   x:collection1] o.a.s.s.IndexSchema default search field in schema is text
   [junit4]   2> 227443 INFO  (coreLoadExecutor-496-thread-1-processing-n:127.0.0.1:54771_o_%2Fb) [n:127.0.0.1:54771_o_%2Fb c:collection1   x:collection1] o.a.s.s.IndexSchema unique key field: id
   [junit4]   2> 227459 INFO  (coreLoadExecutor-496-thread-1-processing-n:127.0.0.1:54771_o_%2Fb) [n:127.0.0.1:54771_o_%2Fb c:collection1   x:collection1] o.a.s.s.FileExchangeRateProvider Reloading exchange rates from file currency.xml
   [junit4]   2> 227465 INFO  (coreLoadExecutor-496-thread-1-processing-n:127.0.0.1:54771_o_%2Fb) [n:127.0.0.1:54771_o_%2Fb c:collection1   x:collection1] o.a.s.s.FileExchangeRateProvider Reloading exchange rates from file currency.xml
   [junit4]   2> 227472 INFO  (coreLoadExecutor-496-thread-1-processing-n:127.0.0.1:54771_o_%2Fb) [n:127.0.0.1:54771_o_%2Fb c:collection1   x:collection1] o.a.s.s.OpenExchangeRatesOrgProvider Reloading exchange rates from open-exchange-rates.json
   [junit4]   2> 227473 INFO  (coreLoadExecutor-496-thread-1-processing-n:127.0.0.1:54771_o_%2Fb) [n:127.0.0.1:54771_o_%2Fb c:collection1   x:collection1] o.a.s.s.OpenExchangeRatesOrgProvider Reloading exchange rates from open-exchange-rates.json
   [junit4]   2> 227477 INFO  (coreLoadExecutor-496-thread-1-processing-n:127.0.0.1:54771_o_%2Fb) [n:127.0.0.1:54771_o_%2Fb c:collection1   x:collection1] o.a.s.c.ConfigSetProperties Did not find ConfigSet properties, assuming default properties: Can't find resource 'configsetprops.json' in classpath or '/configs/conf1', cwd=/Users/jenkins/workspace/Lucene-Solr-5.x-MacOSX/solr/build/solr-core/test/J1
   [junit4]   2> 227477 INFO  (coreLoadExecutor-496-thread-1-processing-n:127.0.0.1:54771_o_%2Fb) [n:127.0.0.1:54771_o_%2Fb c:collection1   x:collection1] o.a.s.c.CoreContainer Creating SolrCore 'collection1' using configuration from collection collection1
   [junit4]   2> 227477 INFO  (coreLoadExecutor-496-thread-1-processing-n:127.0.0.1:54771_o_%2Fb) [n:127.0.0.1:54771_o_%2Fb c:collection1 s:shard1 r:core_node1 x:collection1] o.a.s.c.SolrCore org.apache.solr.core.MockDirectoryFactory
   [junit4]   2> 227477 INFO  (coreLoadExecutor-496-thread-1-processing-n:127.0.0.1:54771_o_%2Fb) [n:127.0.0.1:54771_o_%2Fb c:collection1 s:shard1 r:core_node1 x:collection1] o.a.s.c.SolrCore [[collection1] ] Opening new SolrCore at [/Users/jenkins/workspace/Lucene-Solr-5.x-MacOSX/solr/build/solr-core/test/J1/temp/solr.cloud.CollectionsAPIDistributedZkTest_3ECF26845C57B0C7-001/shard-1-001/cores/collection1], dataDir=[/Users/jenkins/workspace/Lucene-Solr-5.x-MacOSX/solr/build/solr-core/test/J1/temp/solr.cloud.CollectionsAPIDistributedZkTest_3ECF26845C57B0C7-001/shard-1-001/cores/collection1/data/]
   [junit4]   2> 227478 INFO  (coreLoadExecutor-496-thread-1-processing-n:127.0.0.1:54771_o_%2Fb) [n:127.0.0.1:54771_o_%2Fb c:collection1 s:shard1 r:core_node1 x:collection1] o.a.s.c.JmxMonitoredMap JMX monitoring is enabled. Adding Solr mbeans to JMX Server: com.sun.jmx.mbeanserver.JmxMBeanServer@7784fdfc
   [junit4]   2> 227479 INFO  (coreLoadExecutor-496-thread-1-processing-n:127.0.0.1:54771_o_%2Fb) [n:127.0.0.1:54771_o_%2Fb c:collection1 s:shard1 r:core_node1 x:collection1] o.a.s.c.CachingDirectoryFactory return new directory for /Users/jenkins/workspace/Lucene-Solr-5.x-MacOSX/solr/build/solr-core/test/J1/temp/solr.cloud.CollectionsAPIDistributedZkTest_3ECF26845C57B0C7-001/shard-1-001/cores/collection1/data
   [junit4]   2> 227479 INFO  (coreLoadExecutor-496-thread-1-processing-n:127.0.0.1:54771_o_%2Fb) [n:127.0.0.1:54771_o_%2Fb c:collection1 s:shard1 r:core_node1 x:collection1] o.a.s.c.SolrCore New index directory detected: old=null new=/Users/jenkins/workspace/Lucene-Solr-5.x-MacOSX/solr/build/solr-core/test/J1/temp/solr.cloud.CollectionsAPIDistributedZkTest_3ECF26845C57B0C7-001/shard-1-001/cores/collection1/data/index/
   [junit4]   2> 227479 WARN  (coreLoadExecutor-496-thread-1-processing-n:127.0.0.1:54771_o_%2Fb) [n:127.0.0.1:54771_o_%2Fb c:collection1 s:shard1 r:core_node1 x:collection1] o.a.s.c.SolrCore [collection1] Solr index directory '/Users/jenkins/workspace/Lucene-Solr-5.x-MacOSX/solr/build/solr-core/test/J1/temp/solr.cloud.CollectionsAPIDistributedZkTest_3ECF26845C57B0C7-001/shard-1-001/cores/collection1/data/index' doesn't exist. Creating new index...
   [junit4]   2> 227479 INFO  (coreLoadExecutor-496-thread-1-processing-n:127.0.0.1:54771_o_%2Fb) [n:127.0.0.1:54771_o_%2Fb c:collection1 s:shard1 r:core_node1 x:collection1] o.a.s.c.CachingDirectoryFactory return new directory for /Users/jenkins/workspace/Lucene-Solr-5.x-MacOSX/solr/build/solr-core/tes

[...truncated too long message...]

solr.cloud.CollectionsAPIDistributedZkTest_3ECF26845C57B0C7-001/shard-4-001/cores/collection1/data/index
   [junit4]   2> 275720 WARN  (zkCallback-289-thread-2-processing-n:127.0.0.1:54803_o_%2Fb) [n:127.0.0.1:54803_o_%2Fb c:collection1 s:shard2 r:core_node4 x:collection1] o.a.s.c.LeaderElector 
   [junit4]   2> java.lang.RuntimeException: org.apache.zookeeper.KeeperException$SessionExpiredException: KeeperErrorCode = Session expired for /overseer
   [junit4]   2> 	at org.apache.solr.cloud.Overseer.createOverseerNode(Overseer.java:963)
   [junit4]   2> 	at org.apache.solr.cloud.Overseer.getInQueue(Overseer.java:902)
   [junit4]   2> 	at org.apache.solr.cloud.Overseer.getInQueue(Overseer.java:898)
   [junit4]   2> 	at org.apache.solr.cloud.ShardLeaderElectionContext.runLeaderProcess(ElectionContext.java:303)
   [junit4]   2> 	at org.apache.solr.cloud.LeaderElector.runIamLeaderProcess(LeaderElector.java:197)
   [junit4]   2> 	at org.apache.solr.cloud.LeaderElector.checkIfIamLeader(LeaderElector.java:157)
   [junit4]   2> 	at org.apache.solr.cloud.LeaderElector.joinElection(LeaderElector.java:346)
   [junit4]   2> 	at org.apache.solr.cloud.LeaderElector.joinElection(LeaderElector.java:255)
   [junit4]   2> 	at org.apache.solr.cloud.ShardLeaderElectionContext.rejoinLeaderElection(ElectionContext.java:659)
   [junit4]   2> 	at org.apache.solr.cloud.ShardLeaderElectionContext.runLeaderProcess(ElectionContext.java:329)
   [junit4]   2> 	at org.apache.solr.cloud.LeaderElector.runIamLeaderProcess(LeaderElector.java:197)
   [junit4]   2> 	at org.apache.solr.cloud.LeaderElector.checkIfIamLeader(LeaderElector.java:157)
   [junit4]   2> 	at org.apache.solr.cloud.LeaderElector.joinElection(LeaderElector.java:346)
   [junit4]   2> 	at org.apache.solr.cloud.LeaderElector.joinElection(LeaderElector.java:255)
   [junit4]   2> 	at org.apache.solr.cloud.ShardLeaderElectionContext.rejoinLeaderElection(ElectionContext.java:659)
   [junit4]   2> 	at org.apache.solr.cloud.ShardLeaderElectionContext.runLeaderProcess(ElectionContext.java:329)
   [junit4]   2> 	at org.apache.solr.cloud.LeaderElector.runIamLeaderProcess(LeaderElector.java:197)
   [junit4]   2> 	at org.apache.solr.cloud.LeaderElector.checkIfIamLeader(LeaderElector.java:157)
   [junit4]   2> 	at org.apache.solr.cloud.LeaderElector.access$200(LeaderElector.java:58)
   [junit4]   2> 	at org.apache.solr.cloud.LeaderElector$ElectionWatcher.process(LeaderElector.java:388)
   [junit4]   2> 	at org.apache.solr.common.cloud.SolrZkClient$3$1.run(SolrZkClient.java:264)
   [junit4]   2> 	at java.util.concurrent.Executors$RunnableAdapter.call(Executors.java:471)
   [junit4]   2> 	at java.util.concurrent.FutureTask.run(FutureTask.java:262)
   [junit4]   2> 	at org.apache.solr.common.util.ExecutorUtil$MDCAwareThreadPoolExecutor$1.run(ExecutorUtil.java:231)
   [junit4]   2> 	at java.util.concurrent.ThreadPoolExecutor.runWorker(ThreadPoolExecutor.java:1145)
   [junit4]   2> 	at java.util.concurrent.ThreadPoolExecutor$Worker.run(ThreadPoolExecutor.java:615)
   [junit4]   2> 	at java.lang.Thread.run(Thread.java:745)
   [junit4]   2> Caused by: org.apache.zookeeper.KeeperException$SessionExpiredException: KeeperErrorCode = Session expired for /overseer
   [junit4]   2> 	at org.apache.zookeeper.KeeperException.create(KeeperException.java:127)
   [junit4]   2> 	at org.apache.zookeeper.KeeperException.create(KeeperException.java:51)
   [junit4]   2> 	at org.apache.zookeeper.ZooKeeper.create(ZooKeeper.java:783)
   [junit4]   2> 	at org.apache.solr.common.cloud.SolrZkClient$9.execute(SolrZkClient.java:380)
   [junit4]   2> 	at org.apache.solr.common.cloud.SolrZkClient$9.execute(SolrZkClient.java:377)
   [junit4]   2> 	at org.apache.solr.common.cloud.ZkCmdExecutor.retryOperation(ZkCmdExecutor.java:60)
   [junit4]   2> 	at org.apache.solr.common.cloud.SolrZkClient.create(SolrZkClient.java:377)
   [junit4]   2> 	at org.apache.solr.cloud.Overseer.createOverseerNode(Overseer.java:954)
   [junit4]   2> 	... 26 more
   [junit4]   2> 275723 INFO  (TEST-CollectionsAPIDistributedZkTest.test-seed#[3ECF26845C57B0C7]) [    ] o.e.j.s.ServerConnector Stopped ServerConnector@5720f63b{HTTP/1.1}{127.0.0.1:0}
   [junit4]   2> 275723 INFO  (TEST-CollectionsAPIDistributedZkTest.test-seed#[3ECF26845C57B0C7]) [    ] o.e.j.s.h.ContextHandler Stopped o.e.j.s.ServletContextHandler@38457189{/o_/b,null,UNAVAILABLE}
   [junit4]   2> 275725 INFO  (TEST-CollectionsAPIDistributedZkTest.test-seed#[3ECF26845C57B0C7]) [    ] o.a.s.c.ZkTestServer connecting to 127.0.0.1:54751 54751
   [junit4]   2> 275745 INFO  (Thread-550) [    ] o.a.s.c.ZkTestServer connecting to 127.0.0.1:54751 54751
   [junit4]   2> 277155 WARN  (Thread-550) [    ] o.a.s.c.ZkTestServer Watch limit violations: 
   [junit4]   2> Maximum concurrent create/delete watches above limit:
   [junit4]   2> 
   [junit4]   2> 	9	/solr/aliases.json
   [junit4]   2> 	6	/solr/security.json
   [junit4]   2> 	6	/solr/configs/conf1
   [junit4]   2> 
   [junit4]   2> Maximum concurrent data watches above limit:
   [junit4]   2> 
   [junit4]   2> 	9	/solr/clusterstate.json
   [junit4]   2> 	5	/solr/collections/nodes_used_collection/state.json
   [junit4]   2> 	2	/solr/collections/awholynewcollection_0/leader_elect/shard1/election/95403864864129038-core_node3-n_0000000008
   [junit4]   2> 	2	/solr/overseer_elect/election/95403864864129032-127.0.0.1:54771_o_%2Fb-n_0000000001
   [junit4]   2> 
   [junit4]   2> Maximum concurrent children watches above limit:
   [junit4]   2> 
   [junit4]   2> 	9	/solr/collections
   [junit4]   2> 	8	/solr/live_nodes
   [junit4]   2> 	4	/solr/overseer/collection-queue-work
   [junit4]   2> 	3	/solr/overseer/queue
   [junit4]   2> 	3	/solr/overseer/queue-work
   [junit4]   2> 
   [junit4]   2> NOTE: reproduce with: ant test  -Dtestcase=CollectionsAPIDistributedZkTest -Dtests.method=test -Dtests.seed=3ECF26845C57B0C7 -Dtests.slow=true -Dtests.locale=zh-TW -Dtests.timezone=Asia/Vladivostok -Dtests.asserts=true -Dtests.file.encoding=UTF-8
   [junit4] ERROR   55.0s J1 | CollectionsAPIDistributedZkTest.test <<<
   [junit4]    > Throwable #1: org.apache.solr.client.solrj.impl.HttpSolrClient$RemoteSolrException: Error from server at http://127.0.0.1:54794/o_/b/awholynewcollection_0: non ok status: 500, message:Server Error
   [junit4]    > 	at __randomizedtesting.SeedInfo.seed([3ECF26845C57B0C7:B69B195EF2ABDD3F]:0)
   [junit4]    > 	at org.apache.solr.client.solrj.impl.HttpSolrClient.executeMethod(HttpSolrClient.java:510)
   [junit4]    > 	at org.apache.solr.client.solrj.impl.HttpSolrClient.request(HttpSolrClient.java:240)
   [junit4]    > 	at org.apache.solr.client.solrj.impl.HttpSolrClient.request(HttpSolrClient.java:229)
   [junit4]    > 	at org.apache.solr.client.solrj.SolrRequest.process(SolrRequest.java:149)
   [junit4]    > 	at org.apache.solr.client.solrj.SolrClient.query(SolrClient.java:942)
   [junit4]    > 	at org.apache.solr.client.solrj.SolrClient.query(SolrClient.java:957)
   [junit4]    > 	at org.apache.solr.cloud.AbstractFullDistribZkTestBase.waitForNon403or404or503(AbstractFullDistribZkTestBase.java:1753)
   [junit4]    > 	at org.apache.solr.cloud.CollectionsAPIDistributedZkTest.testCollectionsAPI(CollectionsAPIDistributedZkTest.java:737)
   [junit4]    > 	at org.apache.solr.cloud.CollectionsAPIDistributedZkTest.test(CollectionsAPIDistributedZkTest.java:160)
   [junit4]    > 	at org.apache.solr.BaseDistributedSearchTestCase$ShardsRepeatRule$ShardsFixedStatement.callStatement(BaseDistributedSearchTestCase.java:964)
   [junit4]    > 	at org.apache.solr.BaseDistributedSearchTestCase$ShardsRepeatRule$ShardsStatement.evaluate(BaseDistributedSearchTestCase.java:939)
   [junit4]    > 	at java.lang.Thread.run(Thread.java:745)
   [junit4]   2> 277160 INFO  (SUITE-CollectionsAPIDistributedZkTest-seed#[3ECF26845C57B0C7]-worker) [    ] o.a.s.SolrTestCaseJ4 ###deleteCore
   [junit4]   2> NOTE: leaving temporary files on disk at: /Users/jenkins/workspace/Lucene-Solr-5.x-MacOSX/solr/build/solr-core/test/J1/temp/solr.cloud.CollectionsAPIDistributedZkTest_3ECF26845C57B0C7-001
   [junit4]   2> NOTE: test params are: codec=CheapBastard, sim=DefaultSimilarity, locale=zh-TW, timezone=Asia/Vladivostok
   [junit4]   2> NOTE: Mac OS X 10.8.5 x86_64/Oracle Corporation 1.7.0_80 (64-bit)/cpus=3,threads=1,free=87778008,total=284626944
   [junit4]   2> NOTE: All tests run in this JVM: [TestBM25SimilarityFactory, TestDynamicFieldCollectionResource, InfoHandlerTest, HdfsChaosMonkeySafeLeaderTest, BinaryUpdateRequestHandlerTest, OpenCloseCoreStressTest, TestZkChroot, AutoCommitTest, BadCopyFieldTest, TestMiniSolrCloudCluster, CollectionsAPIDistributedZkTest]
   [junit4] Completed [43/566 (1!)] on J1 in 55.00s, 1 test, 1 error <<< FAILURES!

[...truncated 1644 lines...]
BUILD FAILED
/Users/jenkins/workspace/Lucene-Solr-5.x-MacOSX/build.xml:750: The following error occurred while executing this line:
/Users/jenkins/workspace/Lucene-Solr-5.x-MacOSX/build.xml:694: The following error occurred while executing this line:
/Users/jenkins/workspace/Lucene-Solr-5.x-MacOSX/build.xml:59: The following error occurred while executing this line:
/Users/jenkins/workspace/Lucene-Solr-5.x-MacOSX/solr/build.xml:233: The following error occurred while executing this line:
/Users/jenkins/workspace/Lucene-Solr-5.x-MacOSX/solr/common-build.xml:534: The following error occurred while executing this line:
/Users/jenkins/workspace/Lucene-Solr-5.x-MacOSX/lucene/common-build.xml:1477: The following error occurred while executing this line:
/Users/jenkins/workspace/Lucene-Solr-5.x-MacOSX/lucene/common-build.xml:1033: There were test failures: 566 suites (7 ignored), 2279 tests, 1 error, 89 ignored (38 assumptions) [seed: 3ECF26845C57B0C7]

Total time: 82 minutes 38 seconds
Build step 'Invoke Ant' marked build as failure
Archiving artifacts
[WARNINGS] Skipping publisher since build result is FAILURE
Recording test results
Email was triggered for: Failure - Any
Sending email for trigger: Failure - Any



Mime
View raw message