lucene-dev mailing list archives

Site index · List index
Message view « Date » · « Thread »
Top « Date » · « Thread »
From Apache Jenkins Server <jenk...@builds.apache.org>
Subject [JENKINS] Lucene-Solr-NightlyTests-5.x - Build # 1100 - Still Failing
Date Wed, 17 Feb 2016 15:31:14 GMT
Build: https://builds.apache.org/job/Lucene-Solr-NightlyTests-5.x/1100/

4 tests failed.
FAILED:  junit.framework.TestSuite.org.apache.solr.handler.TestReplicationHandler

Error Message:
ObjectTracker found 7 object(s) that were not released!!! [NRTCachingDirectory, NRTCachingDirectory, NRTCachingDirectory, NRTCachingDirectory, NRTCachingDirectory, NRTCachingDirectory, NRTCachingDirectory]

Stack Trace:
java.lang.AssertionError: ObjectTracker found 7 object(s) that were not released!!! [NRTCachingDirectory, NRTCachingDirectory, NRTCachingDirectory, NRTCachingDirectory, NRTCachingDirectory, NRTCachingDirectory, NRTCachingDirectory]
	at __randomizedtesting.SeedInfo.seed([3D49B6BCFBA4BC04]:0)
	at org.junit.Assert.fail(Assert.java:93)
	at org.junit.Assert.assertTrue(Assert.java:43)
	at org.junit.Assert.assertNull(Assert.java:551)
	at org.apache.solr.SolrTestCaseJ4.afterClass(SolrTestCaseJ4.java:228)
	at sun.reflect.GeneratedMethodAccessor18.invoke(Unknown Source)
	at sun.reflect.DelegatingMethodAccessorImpl.invoke(DelegatingMethodAccessorImpl.java:43)
	at java.lang.reflect.Method.invoke(Method.java:606)
	at com.carrotsearch.randomizedtesting.RandomizedRunner.invoke(RandomizedRunner.java:1764)
	at com.carrotsearch.randomizedtesting.RandomizedRunner$7.evaluate(RandomizedRunner.java:834)
	at com.carrotsearch.randomizedtesting.rules.StatementAdapter.evaluate(StatementAdapter.java:36)
	at com.carrotsearch.randomizedtesting.rules.SystemPropertiesRestoreRule$1.evaluate(SystemPropertiesRestoreRule.java:57)
	at org.apache.lucene.util.AbstractBeforeAfterRule$1.evaluate(AbstractBeforeAfterRule.java:45)
	at com.carrotsearch.randomizedtesting.rules.StatementAdapter.evaluate(StatementAdapter.java:36)
	at org.apache.lucene.util.TestRuleStoreClassName$1.evaluate(TestRuleStoreClassName.java:41)
	at com.carrotsearch.randomizedtesting.rules.NoShadowingOrOverridesOnMethodsRule$1.evaluate(NoShadowingOrOverridesOnMethodsRule.java:40)
	at com.carrotsearch.randomizedtesting.rules.NoShadowingOrOverridesOnMethodsRule$1.evaluate(NoShadowingOrOverridesOnMethodsRule.java:40)
	at com.carrotsearch.randomizedtesting.rules.StatementAdapter.evaluate(StatementAdapter.java:36)
	at com.carrotsearch.randomizedtesting.rules.StatementAdapter.evaluate(StatementAdapter.java:36)
	at com.carrotsearch.randomizedtesting.rules.StatementAdapter.evaluate(StatementAdapter.java:36)
	at org.apache.lucene.util.TestRuleAssertionsRequired$1.evaluate(TestRuleAssertionsRequired.java:53)
	at org.apache.lucene.util.TestRuleMarkFailure$1.evaluate(TestRuleMarkFailure.java:47)
	at org.apache.lucene.util.TestRuleIgnoreAfterMaxFailures$1.evaluate(TestRuleIgnoreAfterMaxFailures.java:64)
	at org.apache.lucene.util.TestRuleIgnoreTestSuites$1.evaluate(TestRuleIgnoreTestSuites.java:54)
	at com.carrotsearch.randomizedtesting.rules.StatementAdapter.evaluate(StatementAdapter.java:36)
	at com.carrotsearch.randomizedtesting.ThreadLeakControl$StatementRunner.run(ThreadLeakControl.java:367)
	at java.lang.Thread.run(Thread.java:745)


FAILED:  org.apache.solr.security.BasicAuthIntegrationTest.testBasics

Error Message:
Test abandoned because suite timeout was reached.

Stack Trace:
java.lang.Exception: Test abandoned because suite timeout was reached.
	at __randomizedtesting.SeedInfo.seed([3D49B6BCFBA4BC04]:0)


FAILED:  junit.framework.TestSuite.org.apache.solr.security.BasicAuthIntegrationTest

Error Message:
Suite timeout exceeded (>= 7200000 msec).

Stack Trace:
java.lang.Exception: Suite timeout exceeded (>= 7200000 msec).
	at __randomizedtesting.SeedInfo.seed([3D49B6BCFBA4BC04]:0)


FAILED:  org.apache.solr.cloud.CollectionsAPIDistributedZkTest.test

Error Message:
Timeout occured while waiting response from server at: http://127.0.0.1:56311/cu_i/fg

Stack Trace:
org.apache.solr.client.solrj.SolrServerException: Timeout occured while waiting response from server at: http://127.0.0.1:56311/cu_i/fg
	at org.apache.solr.client.solrj.impl.HttpSolrClient.executeMethod(HttpSolrClient.java:585)
	at org.apache.solr.client.solrj.impl.HttpSolrClient.request(HttpSolrClient.java:240)
	at org.apache.solr.client.solrj.impl.HttpSolrClient.request(HttpSolrClient.java:229)
	at org.apache.solr.client.solrj.SolrClient.request(SolrClient.java:1219)
	at org.apache.solr.cloud.CollectionsAPIDistributedZkTest.makeRequest(CollectionsAPIDistributedZkTest.java:375)
	at org.apache.solr.cloud.CollectionsAPIDistributedZkTest.testErrorHandling(CollectionsAPIDistributedZkTest.java:502)
	at org.apache.solr.cloud.CollectionsAPIDistributedZkTest.test(CollectionsAPIDistributedZkTest.java:162)
	at sun.reflect.NativeMethodAccessorImpl.invoke0(Native Method)
	at sun.reflect.NativeMethodAccessorImpl.invoke(NativeMethodAccessorImpl.java:57)
	at sun.reflect.DelegatingMethodAccessorImpl.invoke(DelegatingMethodAccessorImpl.java:43)
	at java.lang.reflect.Method.invoke(Method.java:606)
	at com.carrotsearch.randomizedtesting.RandomizedRunner.invoke(RandomizedRunner.java:1764)
	at com.carrotsearch.randomizedtesting.RandomizedRunner$8.evaluate(RandomizedRunner.java:871)
	at com.carrotsearch.randomizedtesting.RandomizedRunner$9.evaluate(RandomizedRunner.java:907)
	at com.carrotsearch.randomizedtesting.RandomizedRunner$10.evaluate(RandomizedRunner.java:921)
	at org.apache.solr.BaseDistributedSearchTestCase$ShardsRepeatRule$ShardsFixedStatement.callStatement(BaseDistributedSearchTestCase.java:964)
	at org.apache.solr.BaseDistributedSearchTestCase$ShardsRepeatRule$ShardsStatement.evaluate(BaseDistributedSearchTestCase.java:939)
	at com.carrotsearch.randomizedtesting.rules.SystemPropertiesRestoreRule$1.evaluate(SystemPropertiesRestoreRule.java:57)
	at org.apache.lucene.util.TestRuleSetupTeardownChained$1.evaluate(TestRuleSetupTeardownChained.java:49)
	at org.apache.lucene.util.AbstractBeforeAfterRule$1.evaluate(AbstractBeforeAfterRule.java:45)
	at org.apache.lucene.util.TestRuleThreadAndTestName$1.evaluate(TestRuleThreadAndTestName.java:48)
	at org.apache.lucene.util.TestRuleIgnoreAfterMaxFailures$1.evaluate(TestRuleIgnoreAfterMaxFailures.java:64)
	at org.apache.lucene.util.TestRuleMarkFailure$1.evaluate(TestRuleMarkFailure.java:47)
	at com.carrotsearch.randomizedtesting.rules.StatementAdapter.evaluate(StatementAdapter.java:36)
	at com.carrotsearch.randomizedtesting.ThreadLeakControl$StatementRunner.run(ThreadLeakControl.java:367)
	at com.carrotsearch.randomizedtesting.ThreadLeakControl.forkTimeoutingTask(ThreadLeakControl.java:809)
	at com.carrotsearch.randomizedtesting.ThreadLeakControl$3.evaluate(ThreadLeakControl.java:460)
	at com.carrotsearch.randomizedtesting.RandomizedRunner.runSingleTest(RandomizedRunner.java:880)
	at com.carrotsearch.randomizedtesting.RandomizedRunner$5.evaluate(RandomizedRunner.java:781)
	at com.carrotsearch.randomizedtesting.RandomizedRunner$6.evaluate(RandomizedRunner.java:816)
	at com.carrotsearch.randomizedtesting.RandomizedRunner$7.evaluate(RandomizedRunner.java:827)
	at com.carrotsearch.randomizedtesting.rules.StatementAdapter.evaluate(StatementAdapter.java:36)
	at com.carrotsearch.randomizedtesting.rules.SystemPropertiesRestoreRule$1.evaluate(SystemPropertiesRestoreRule.java:57)
	at org.apache.lucene.util.AbstractBeforeAfterRule$1.evaluate(AbstractBeforeAfterRule.java:45)
	at com.carrotsearch.randomizedtesting.rules.StatementAdapter.evaluate(StatementAdapter.java:36)
	at org.apache.lucene.util.TestRuleStoreClassName$1.evaluate(TestRuleStoreClassName.java:41)
	at com.carrotsearch.randomizedtesting.rules.NoShadowingOrOverridesOnMethodsRule$1.evaluate(NoShadowingOrOverridesOnMethodsRule.java:40)
	at com.carrotsearch.randomizedtesting.rules.NoShadowingOrOverridesOnMethodsRule$1.evaluate(NoShadowingOrOverridesOnMethodsRule.java:40)
	at com.carrotsearch.randomizedtesting.rules.StatementAdapter.evaluate(StatementAdapter.java:36)
	at com.carrotsearch.randomizedtesting.rules.StatementAdapter.evaluate(StatementAdapter.java:36)
	at com.carrotsearch.randomizedtesting.rules.StatementAdapter.evaluate(StatementAdapter.java:36)
	at org.apache.lucene.util.TestRuleAssertionsRequired$1.evaluate(TestRuleAssertionsRequired.java:53)
	at org.apache.lucene.util.TestRuleMarkFailure$1.evaluate(TestRuleMarkFailure.java:47)
	at org.apache.lucene.util.TestRuleIgnoreAfterMaxFailures$1.evaluate(TestRuleIgnoreAfterMaxFailures.java:64)
	at org.apache.lucene.util.TestRuleIgnoreTestSuites$1.evaluate(TestRuleIgnoreTestSuites.java:54)
	at com.carrotsearch.randomizedtesting.rules.StatementAdapter.evaluate(StatementAdapter.java:36)
	at com.carrotsearch.randomizedtesting.ThreadLeakControl$StatementRunner.run(ThreadLeakControl.java:367)
	at java.lang.Thread.run(Thread.java:745)
Caused by: java.net.SocketTimeoutException: Read timed out
	at java.net.SocketInputStream.socketRead0(Native Method)
	at java.net.SocketInputStream.read(SocketInputStream.java:152)
	at java.net.SocketInputStream.read(SocketInputStream.java:122)
	at org.apache.http.impl.io.AbstractSessionInputBuffer.fillBuffer(AbstractSessionInputBuffer.java:160)
	at org.apache.http.impl.io.SocketInputBuffer.fillBuffer(SocketInputBuffer.java:84)
	at org.apache.http.impl.io.AbstractSessionInputBuffer.readLine(AbstractSessionInputBuffer.java:273)
	at org.apache.http.impl.conn.DefaultHttpResponseParser.parseHead(DefaultHttpResponseParser.java:140)
	at org.apache.http.impl.conn.DefaultHttpResponseParser.parseHead(DefaultHttpResponseParser.java:57)
	at org.apache.http.impl.io.AbstractMessageParser.parse(AbstractMessageParser.java:261)
	at org.apache.http.impl.AbstractHttpClientConnection.receiveResponseHeader(AbstractHttpClientConnection.java:283)
	at org.apache.http.impl.conn.DefaultClientConnection.receiveResponseHeader(DefaultClientConnection.java:251)
	at org.apache.http.impl.conn.ManagedClientConnectionImpl.receiveResponseHeader(ManagedClientConnectionImpl.java:197)
	at org.apache.http.protocol.HttpRequestExecutor.doReceiveResponse(HttpRequestExecutor.java:272)
	at org.apache.http.protocol.HttpRequestExecutor.execute(HttpRequestExecutor.java:124)
	at org.apache.http.impl.client.DefaultRequestDirector.tryExecute(DefaultRequestDirector.java:685)
	at org.apache.http.impl.client.DefaultRequestDirector.execute(DefaultRequestDirector.java:487)
	at org.apache.http.impl.client.AbstractHttpClient.doExecute(AbstractHttpClient.java:882)
	at org.apache.http.impl.client.CloseableHttpClient.execute(CloseableHttpClient.java:82)
	at org.apache.http.impl.client.CloseableHttpClient.execute(CloseableHttpClient.java:107)
	at org.apache.http.impl.client.CloseableHttpClient.execute(CloseableHttpClient.java:55)
	at org.apache.solr.client.solrj.impl.HttpSolrClient.executeMethod(HttpSolrClient.java:481)
	... 47 more




Build Log:
[...truncated 11345 lines...]
   [junit4] Suite: org.apache.solr.cloud.CollectionsAPIDistributedZkTest
   [junit4]   2> 181034 ERROR (Finalizer) [    ] o.a.s.c.CoreContainer CoreContainer was not close prior to finalize(), indicates a bug -- POSSIBLE RESOURCE LEAK!!!  instance=2019256400
   [junit4]   2> 181034 ERROR (Finalizer) [    ] o.a.s.c.CoreContainer CoreContainer was not close prior to finalize(), indicates a bug -- POSSIBLE RESOURCE LEAK!!!  instance=1843133625
   [junit4]   2> 181034 ERROR (Finalizer) [    ] o.a.s.c.CoreContainer CoreContainer was not close prior to finalize(), indicates a bug -- POSSIBLE RESOURCE LEAK!!!  instance=710656256
   [junit4]   2> 181034 ERROR (Finalizer) [    ] o.a.s.c.CoreContainer CoreContainer was not close prior to finalize(), indicates a bug -- POSSIBLE RESOURCE LEAK!!!  instance=142892686
   [junit4]   2> Creating dataDir: /x1/jenkins/jenkins-slave/workspace/Lucene-Solr-NightlyTests-5.x/solr/build/solr-core/test/J1/temp/solr.cloud.CollectionsAPIDistributedZkTest_3D49B6BCFBA4BC04-001/init-core-data-001
   [junit4]   2> 181044 INFO  (SUITE-CollectionsAPIDistributedZkTest-seed#[3D49B6BCFBA4BC04]-worker) [    ] o.a.s.SolrTestCaseJ4 Randomized ssl (false) and clientAuth (true)
   [junit4]   2> 181044 INFO  (SUITE-CollectionsAPIDistributedZkTest-seed#[3D49B6BCFBA4BC04]-worker) [    ] o.a.s.BaseDistributedSearchTestCase Setting hostContext system property: /cu_i/fg
   [junit4]   2> 181050 INFO  (TEST-CollectionsAPIDistributedZkTest.test-seed#[3D49B6BCFBA4BC04]) [    ] o.a.s.c.ZkTestServer STARTING ZK TEST SERVER
   [junit4]   2> 181050 INFO  (Thread-1267) [    ] o.a.s.c.ZkTestServer client port:0.0.0.0/0.0.0.0:0
   [junit4]   2> 181050 INFO  (Thread-1267) [    ] o.a.s.c.ZkTestServer Starting server
   [junit4]   2> 181150 INFO  (TEST-CollectionsAPIDistributedZkTest.test-seed#[3D49B6BCFBA4BC04]) [    ] o.a.s.c.ZkTestServer start zk server on port:52759
   [junit4]   2> 181151 INFO  (TEST-CollectionsAPIDistributedZkTest.test-seed#[3D49B6BCFBA4BC04]) [    ] o.a.s.c.c.SolrZkClient Using default ZkCredentialsProvider
   [junit4]   2> 181217 INFO  (TEST-CollectionsAPIDistributedZkTest.test-seed#[3D49B6BCFBA4BC04]) [    ] o.a.s.c.c.ConnectionManager Waiting for client to connect to ZooKeeper
   [junit4]   2> 181228 INFO  (zkCallback-133-thread-1) [    ] o.a.s.c.c.ConnectionManager Watcher org.apache.solr.common.cloud.ConnectionManager@1278256c name:ZooKeeperConnection Watcher:127.0.0.1:52759 got event WatchedEvent state:SyncConnected type:None path:null path:null type:None
   [junit4]   2> 181228 INFO  (TEST-CollectionsAPIDistributedZkTest.test-seed#[3D49B6BCFBA4BC04]) [    ] o.a.s.c.c.ConnectionManager Client is connected to ZooKeeper
   [junit4]   2> 181228 INFO  (TEST-CollectionsAPIDistributedZkTest.test-seed#[3D49B6BCFBA4BC04]) [    ] o.a.s.c.c.SolrZkClient Using default ZkACLProvider
   [junit4]   2> 181228 INFO  (TEST-CollectionsAPIDistributedZkTest.test-seed#[3D49B6BCFBA4BC04]) [    ] o.a.s.c.c.SolrZkClient makePath: /solr
   [junit4]   2> 181242 INFO  (TEST-CollectionsAPIDistributedZkTest.test-seed#[3D49B6BCFBA4BC04]) [    ] o.a.s.c.c.SolrZkClient Using default ZkCredentialsProvider
   [junit4]   2> 181252 INFO  (TEST-CollectionsAPIDistributedZkTest.test-seed#[3D49B6BCFBA4BC04]) [    ] o.a.s.c.c.ConnectionManager Waiting for client to connect to ZooKeeper
   [junit4]   2> 181253 INFO  (zkCallback-134-thread-1) [    ] o.a.s.c.c.ConnectionManager Watcher org.apache.solr.common.cloud.ConnectionManager@75f05481 name:ZooKeeperConnection Watcher:127.0.0.1:52759/solr got event WatchedEvent state:SyncConnected type:None path:null path:null type:None
   [junit4]   2> 181253 INFO  (TEST-CollectionsAPIDistributedZkTest.test-seed#[3D49B6BCFBA4BC04]) [    ] o.a.s.c.c.ConnectionManager Client is connected to ZooKeeper
   [junit4]   2> 181253 INFO  (TEST-CollectionsAPIDistributedZkTest.test-seed#[3D49B6BCFBA4BC04]) [    ] o.a.s.c.c.SolrZkClient Using default ZkACLProvider
   [junit4]   2> 181253 INFO  (TEST-CollectionsAPIDistributedZkTest.test-seed#[3D49B6BCFBA4BC04]) [    ] o.a.s.c.c.SolrZkClient makePath: /collections/collection1
   [junit4]   2> 181256 INFO  (TEST-CollectionsAPIDistributedZkTest.test-seed#[3D49B6BCFBA4BC04]) [    ] o.a.s.c.c.SolrZkClient makePath: /collections/collection1/shards
   [junit4]   2> 181258 INFO  (TEST-CollectionsAPIDistributedZkTest.test-seed#[3D49B6BCFBA4BC04]) [    ] o.a.s.c.c.SolrZkClient makePath: /collections/control_collection
   [junit4]   2> 181259 INFO  (TEST-CollectionsAPIDistributedZkTest.test-seed#[3D49B6BCFBA4BC04]) [    ] o.a.s.c.c.SolrZkClient makePath: /collections/control_collection/shards
   [junit4]   2> 181261 INFO  (TEST-CollectionsAPIDistributedZkTest.test-seed#[3D49B6BCFBA4BC04]) [    ] o.a.s.c.AbstractZkTestCase put /x1/jenkins/jenkins-slave/workspace/Lucene-Solr-NightlyTests-5.x/solr/core/src/test-files/solr/collection1/conf/solrconfig-tlog.xml to /configs/conf1/solrconfig.xml
   [junit4]   2> 181261 INFO  (TEST-CollectionsAPIDistributedZkTest.test-seed#[3D49B6BCFBA4BC04]) [    ] o.a.s.c.c.SolrZkClient makePath: /configs/conf1/solrconfig.xml
   [junit4]   2> 181265 INFO  (TEST-CollectionsAPIDistributedZkTest.test-seed#[3D49B6BCFBA4BC04]) [    ] o.a.s.c.AbstractZkTestCase put /x1/jenkins/jenkins-slave/workspace/Lucene-Solr-NightlyTests-5.x/solr/core/src/test-files/solr/collection1/conf/schema.xml to /configs/conf1/schema.xml
   [junit4]   2> 181266 INFO  (TEST-CollectionsAPIDistributedZkTest.test-seed#[3D49B6BCFBA4BC04]) [    ] o.a.s.c.c.SolrZkClient makePath: /configs/conf1/schema.xml
   [junit4]   2> 181269 INFO  (TEST-CollectionsAPIDistributedZkTest.test-seed#[3D49B6BCFBA4BC04]) [    ] o.a.s.c.AbstractZkTestCase put /x1/jenkins/jenkins-slave/workspace/Lucene-Solr-NightlyTests-5.x/solr/core/src/test-files/solr/collection1/conf/solrconfig.snippet.randomindexconfig.xml to /configs/conf1/solrconfig.snippet.randomindexconfig.xml
   [junit4]   2> 181269 INFO  (TEST-CollectionsAPIDistributedZkTest.test-seed#[3D49B6BCFBA4BC04]) [    ] o.a.s.c.c.SolrZkClient makePath: /configs/conf1/solrconfig.snippet.randomindexconfig.xml
   [junit4]   2> 181271 INFO  (TEST-CollectionsAPIDistributedZkTest.test-seed#[3D49B6BCFBA4BC04]) [    ] o.a.s.c.AbstractZkTestCase put /x1/jenkins/jenkins-slave/workspace/Lucene-Solr-NightlyTests-5.x/solr/core/src/test-files/solr/collection1/conf/stopwords.txt to /configs/conf1/stopwords.txt
   [junit4]   2> 181271 INFO  (TEST-CollectionsAPIDistributedZkTest.test-seed#[3D49B6BCFBA4BC04]) [    ] o.a.s.c.c.SolrZkClient makePath: /configs/conf1/stopwords.txt
   [junit4]   2> 181273 INFO  (TEST-CollectionsAPIDistributedZkTest.test-seed#[3D49B6BCFBA4BC04]) [    ] o.a.s.c.AbstractZkTestCase put /x1/jenkins/jenkins-slave/workspace/Lucene-Solr-NightlyTests-5.x/solr/core/src/test-files/solr/collection1/conf/protwords.txt to /configs/conf1/protwords.txt
   [junit4]   2> 181273 INFO  (TEST-CollectionsAPIDistributedZkTest.test-seed#[3D49B6BCFBA4BC04]) [    ] o.a.s.c.c.SolrZkClient makePath: /configs/conf1/protwords.txt
   [junit4]   2> 181275 INFO  (TEST-CollectionsAPIDistributedZkTest.test-seed#[3D49B6BCFBA4BC04]) [    ] o.a.s.c.AbstractZkTestCase put /x1/jenkins/jenkins-slave/workspace/Lucene-Solr-NightlyTests-5.x/solr/core/src/test-files/solr/collection1/conf/currency.xml to /configs/conf1/currency.xml
   [junit4]   2> 181275 INFO  (TEST-CollectionsAPIDistributedZkTest.test-seed#[3D49B6BCFBA4BC04]) [    ] o.a.s.c.c.SolrZkClient makePath: /configs/conf1/currency.xml
   [junit4]   2> 181277 INFO  (TEST-CollectionsAPIDistributedZkTest.test-seed#[3D49B6BCFBA4BC04]) [    ] o.a.s.c.AbstractZkTestCase put /x1/jenkins/jenkins-slave/workspace/Lucene-Solr-NightlyTests-5.x/solr/core/src/test-files/solr/collection1/conf/enumsConfig.xml to /configs/conf1/enumsConfig.xml
   [junit4]   2> 181277 INFO  (TEST-CollectionsAPIDistributedZkTest.test-seed#[3D49B6BCFBA4BC04]) [    ] o.a.s.c.c.SolrZkClient makePath: /configs/conf1/enumsConfig.xml
   [junit4]   2> 181279 INFO  (TEST-CollectionsAPIDistributedZkTest.test-seed#[3D49B6BCFBA4BC04]) [    ] o.a.s.c.AbstractZkTestCase put /x1/jenkins/jenkins-slave/workspace/Lucene-Solr-NightlyTests-5.x/solr/core/src/test-files/solr/collection1/conf/open-exchange-rates.json to /configs/conf1/open-exchange-rates.json
   [junit4]   2> 181279 INFO  (TEST-CollectionsAPIDistributedZkTest.test-seed#[3D49B6BCFBA4BC04]) [    ] o.a.s.c.c.SolrZkClient makePath: /configs/conf1/open-exchange-rates.json
   [junit4]   2> 181289 INFO  (TEST-CollectionsAPIDistributedZkTest.test-seed#[3D49B6BCFBA4BC04]) [    ] o.a.s.c.AbstractZkTestCase put /x1/jenkins/jenkins-slave/workspace/Lucene-Solr-NightlyTests-5.x/solr/core/src/test-files/solr/collection1/conf/mapping-ISOLatin1Accent.txt to /configs/conf1/mapping-ISOLatin1Accent.txt
   [junit4]   2> 181289 INFO  (TEST-CollectionsAPIDistributedZkTest.test-seed#[3D49B6BCFBA4BC04]) [    ] o.a.s.c.c.SolrZkClient makePath: /configs/conf1/mapping-ISOLatin1Accent.txt
   [junit4]   2> 181291 INFO  (TEST-CollectionsAPIDistributedZkTest.test-seed#[3D49B6BCFBA4BC04]) [    ] o.a.s.c.AbstractZkTestCase put /x1/jenkins/jenkins-slave/workspace/Lucene-Solr-NightlyTests-5.x/solr/core/src/test-files/solr/collection1/conf/old_synonyms.txt to /configs/conf1/old_synonyms.txt
   [junit4]   2> 181291 INFO  (TEST-CollectionsAPIDistributedZkTest.test-seed#[3D49B6BCFBA4BC04]) [    ] o.a.s.c.c.SolrZkClient makePath: /configs/conf1/old_synonyms.txt
   [junit4]   2> 181293 INFO  (TEST-CollectionsAPIDistributedZkTest.test-seed#[3D49B6BCFBA4BC04]) [    ] o.a.s.c.AbstractZkTestCase put /x1/jenkins/jenkins-slave/workspace/Lucene-Solr-NightlyTests-5.x/solr/core/src/test-files/solr/collection1/conf/synonyms.txt to /configs/conf1/synonyms.txt
   [junit4]   2> 181293 INFO  (TEST-CollectionsAPIDistributedZkTest.test-seed#[3D49B6BCFBA4BC04]) [    ] o.a.s.c.c.SolrZkClient makePath: /configs/conf1/synonyms.txt
   [junit4]   2> 181302 INFO  (TEST-CollectionsAPIDistributedZkTest.test-seed#[3D49B6BCFBA4BC04]) [    ] o.a.s.c.c.SolrZkClient Using default ZkCredentialsProvider
   [junit4]   2> 181304 INFO  (TEST-CollectionsAPIDistributedZkTest.test-seed#[3D49B6BCFBA4BC04]) [    ] o.a.s.c.c.ConnectionManager Waiting for client to connect to ZooKeeper
   [junit4]   2> 181305 INFO  (zkCallback-135-thread-1) [    ] o.a.s.c.c.ConnectionManager Watcher org.apache.solr.common.cloud.ConnectionManager@5477e0e8 name:ZooKeeperConnection Watcher:127.0.0.1:52759 got event WatchedEvent state:SyncConnected type:None path:null path:null type:None
   [junit4]   2> 181305 INFO  (TEST-CollectionsAPIDistributedZkTest.test-seed#[3D49B6BCFBA4BC04]) [    ] o.a.s.c.c.ConnectionManager Client is connected to ZooKeeper
   [junit4]   2> 181305 INFO  (TEST-CollectionsAPIDistributedZkTest.test-seed#[3D49B6BCFBA4BC04]) [    ] o.a.s.c.c.SolrZkClient Using default ZkACLProvider
   [junit4]   2> 181305 INFO  (TEST-CollectionsAPIDistributedZkTest.test-seed#[3D49B6BCFBA4BC04]) [    ] o.a.s.c.c.SolrZkClient makePath: /solr
   [junit4]   2> 181308 INFO  (TEST-CollectionsAPIDistributedZkTest.test-seed#[3D49B6BCFBA4BC04]) [    ] o.a.s.c.c.SolrZkClient Using default ZkCredentialsProvider
   [junit4]   2> 181339 INFO  (TEST-CollectionsAPIDistributedZkTest.test-seed#[3D49B6BCFBA4BC04]) [    ] o.a.s.c.c.ConnectionManager Waiting for client to connect to ZooKeeper
   [junit4]   2> 181340 INFO  (zkCallback-136-thread-1) [    ] o.a.s.c.c.ConnectionManager Watcher org.apache.solr.common.cloud.ConnectionManager@2d6e6e7b name:ZooKeeperConnection Watcher:127.0.0.1:52759/solr got event WatchedEvent state:SyncConnected type:None path:null path:null type:None
   [junit4]   2> 181347 INFO  (TEST-CollectionsAPIDistributedZkTest.test-seed#[3D49B6BCFBA4BC04]) [    ] o.a.s.c.c.ConnectionManager Client is connected to ZooKeeper
   [junit4]   2> 181347 INFO  (TEST-CollectionsAPIDistributedZkTest.test-seed#[3D49B6BCFBA4BC04]) [    ] o.a.s.c.c.SolrZkClient Using default ZkACLProvider
   [junit4]   2> 181348 INFO  (TEST-CollectionsAPIDistributedZkTest.test-seed#[3D49B6BCFBA4BC04]) [    ] o.a.s.c.AbstractZkTestCase put /x1/jenkins/jenkins-slave/workspace/Lucene-Solr-NightlyTests-5.x/solr/core/src/test-files/solr/collection1/conf/solrconfig-tlog.xml to /configs/conf2/solrconfig.xml
   [junit4]   2> 181348 INFO  (TEST-CollectionsAPIDistributedZkTest.test-seed#[3D49B6BCFBA4BC04]) [    ] o.a.s.c.c.SolrZkClient makePath: /configs/conf2/solrconfig.xml
   [junit4]   2> 181356 INFO  (TEST-CollectionsAPIDistributedZkTest.test-seed#[3D49B6BCFBA4BC04]) [    ] o.a.s.c.AbstractZkTestCase put /x1/jenkins/jenkins-slave/workspace/Lucene-Solr-NightlyTests-5.x/solr/core/src/test-files/solr/collection1/conf/schema.xml to /configs/conf2/schema.xml
   [junit4]   2> 181356 INFO  (TEST-CollectionsAPIDistributedZkTest.test-seed#[3D49B6BCFBA4BC04]) [    ] o.a.s.c.c.SolrZkClient makePath: /configs/conf2/schema.xml
   [junit4]   2> 181359 INFO  (TEST-CollectionsAPIDistributedZkTest.test-seed#[3D49B6BCFBA4BC04]) [    ] o.a.s.c.AbstractZkTestCase put /x1/jenkins/jenkins-slave/workspace/Lucene-Solr-NightlyTests-5.x/solr/core/src/test-files/solr/collection1/conf/enumsConfig.xml to /configs/conf2/enumsConfig.xml
   [junit4]   2> 181359 INFO  (TEST-CollectionsAPIDistributedZkTest.test-seed#[3D49B6BCFBA4BC04]) [    ] o.a.s.c.c.SolrZkClient makePath: /configs/conf2/enumsConfig.xml
   [junit4]   2> 181361 INFO  (TEST-CollectionsAPIDistributedZkTest.test-seed#[3D49B6BCFBA4BC04]) [    ] o.a.s.c.AbstractZkTestCase put /x1/jenkins/jenkins-slave/workspace/Lucene-Solr-NightlyTests-5.x/solr/core/src/test-files/solr/collection1/conf/solrconfig.snippet.randomindexconfig.xml to /configs/conf2/solrconfig.snippet.randomindexconfig.xml
   [junit4]   2> 181361 INFO  (TEST-CollectionsAPIDistributedZkTest.test-seed#[3D49B6BCFBA4BC04]) [    ] o.a.s.c.c.SolrZkClient makePath: /configs/conf2/solrconfig.snippet.randomindexconfig.xml
   [junit4]   2> 181363 INFO  (TEST-CollectionsAPIDistributedZkTest.test-seed#[3D49B6BCFBA4BC04]) [    ] o.a.s.c.AbstractZkTestCase put /x1/jenkins/jenkins-slave/workspace/Lucene-Solr-NightlyTests-5.x/solr/core/src/test-files/solr/collection1/conf/stopwords.txt to /configs/conf2/stopwords.txt
   [junit4]   2> 181363 INFO  (TEST-CollectionsAPIDistributedZkTest.test-seed#[3D49B6BCFBA4BC04]) [    ] o.a.s.c.c.SolrZkClient makePath: /configs/conf2/stopwords.txt
   [junit4]   2> 181365 INFO  (TEST-CollectionsAPIDistributedZkTest.test-seed#[3D49B6BCFBA4BC04]) [    ] o.a.s.c.AbstractZkTestCase put /x1/jenkins/jenkins-slave/workspace/Lucene-Solr-NightlyTests-5.x/solr/core/src/test-files/solr/collection1/conf/protwords.txt to /configs/conf2/protwords.txt
   [junit4]   2> 181366 INFO  (TEST-CollectionsAPIDistributedZkTest.test-seed#[3D49B6BCFBA4BC04]) [    ] o.a.s.c.c.SolrZkClient makePath: /configs/conf2/protwords.txt
   [junit4]   2> 181367 INFO  (TEST-CollectionsAPIDistributedZkTest.test-seed#[3D49B6BCFBA4BC04]) [    ] o.a.s.c.AbstractZkTestCase put /x1/jenkins/jenkins-slave/workspace/Lucene-Solr-NightlyTests-5.x/solr/core/src/test-files/solr/collection1/conf/currency.xml to /configs/conf2/currency.xml
   [junit4]   2> 181368 INFO  (TEST-CollectionsAPIDistributedZkTest.test-seed#[3D49B6BCFBA4BC04]) [    ] o.a.s.c.c.SolrZkClient makePath: /configs/conf2/currency.xml
   [junit4]   2> 181369 INFO  (TEST-CollectionsAPIDistributedZkTest.test-seed#[3D49B6BCFBA4BC04]) [    ] o.a.s.c.AbstractZkTestCase put /x1/jenkins/jenkins-slave/workspace/Lucene-Solr-NightlyTests-5.x/solr/core/src/test-files/solr/collection1/conf/open-exchange-rates.json to /configs/conf2/open-exchange-rates.json
   [junit4]   2> 181370 INFO  (TEST-CollectionsAPIDistributedZkTest.test-seed#[3D49B6BCFBA4BC04]) [    ] o.a.s.c.c.SolrZkClient makePath: /configs/conf2/open-exchange-rates.json
   [junit4]   2> 181371 INFO  (TEST-CollectionsAPIDistributedZkTest.test-seed#[3D49B6BCFBA4BC04]) [    ] o.a.s.c.AbstractZkTestCase put /x1/jenkins/jenkins-slave/workspace/Lucene-Solr-NightlyTests-5.x/solr/core/src/test-files/solr/collection1/conf/mapping-ISOLatin1Accent.txt to /configs/conf2/mapping-ISOLatin1Accent.txt
   [junit4]   2> 181371 INFO  (TEST-CollectionsAPIDistributedZkTest.test-seed#[3D49B6BCFBA4BC04]) [    ] o.a.s.c.c.SolrZkClient makePath: /configs/conf2/mapping-ISOLatin1Accent.txt
   [junit4]   2> 181373 INFO  (TEST-CollectionsAPIDistributedZkTest.test-seed#[3D49B6BCFBA4BC04]) [    ] o.a.s.c.AbstractZkTestCase put /x1/jenkins/jenkins-slave/workspace/Lucene-Solr-NightlyTests-5.x/solr/core/src/test-files/solr/collection1/conf/old_synonyms.txt to /configs/conf2/old_synonyms.txt
   [junit4]   2> 181373 INFO  (TEST-CollectionsAPIDistributedZkTest.test-seed#[3D49B6BCFBA4BC04]) [    ] o.a.s.c.c.SolrZkClient makePath: /configs/conf2/old_synonyms.txt
   [junit4]   2> 181375 INFO  (TEST-CollectionsAPIDistributedZkTest.test-seed#[3D49B6BCFBA4BC04]) [    ] o.a.s.c.AbstractZkTestCase put /x1/jenkins/jenkins-slave/workspace/Lucene-Solr-NightlyTests-5.x/solr/core/src/test-files/solr/collection1/conf/synonyms.txt to /configs/conf2/synonyms.txt
   [junit4]   2> 181375 INFO  (TEST-CollectionsAPIDistributedZkTest.test-seed#[3D49B6BCFBA4BC04]) [    ] o.a.s.c.c.SolrZkClient makePath: /configs/conf2/synonyms.txt
   [junit4]   2> 181377 INFO  (TEST-CollectionsAPIDistributedZkTest.test-seed#[3D49B6BCFBA4BC04]) [    ] o.a.s.c.AbstractZkTestCase put /x1/jenkins/jenkins-slave/workspace/Lucene-Solr-NightlyTests-5.x/solr/core/src/test-files/solr/collection1/conf/elevate.xml to /configs/conf2/elevate.xml
   [junit4]   2> 181377 INFO  (TEST-CollectionsAPIDistributedZkTest.test-seed#[3D49B6BCFBA4BC04]) [    ] o.a.s.c.c.SolrZkClient makePath: /configs/conf2/elevate.xml
   [junit4]   2> 181533 INFO  (TEST-CollectionsAPIDistributedZkTest.test-seed#[3D49B6BCFBA4BC04]) [    ] o.a.s.SolrTestCaseJ4 Writing core.properties file to /x1/jenkins/jenkins-slave/workspace/Lucene-Solr-NightlyTests-5.x/solr/build/solr-core/test/J1/temp/solr.cloud.CollectionsAPIDistributedZkTest_3D49B6BCFBA4BC04-001/control-001/cores/collection1
   [junit4]   2> 181548 INFO  (TEST-CollectionsAPIDistributedZkTest.test-seed#[3D49B6BCFBA4BC04]) [    ] o.e.j.s.Server jetty-9.2.13.v20150730
   [junit4]   2> 181573 INFO  (TEST-CollectionsAPIDistributedZkTest.test-seed#[3D49B6BCFBA4BC04]) [    ] o.e.j.s.h.ContextHandler Started o.e.j.s.ServletContextHandler@153df5e5{/cu_i/fg,null,AVAILABLE}
   [junit4]   2> 181574 INFO  (TEST-CollectionsAPIDistributedZkTest.test-seed#[3D49B6BCFBA4BC04]) [    ] o.e.j.s.ServerConnector Started ServerConnector@16da9848{HTTP/1.1}{127.0.0.1:45254}
   [junit4]   2> 181574 INFO  (TEST-CollectionsAPIDistributedZkTest.test-seed#[3D49B6BCFBA4BC04]) [    ] o.e.j.s.Server Started @184649ms
   [junit4]   2> 181574 INFO  (TEST-CollectionsAPIDistributedZkTest.test-seed#[3D49B6BCFBA4BC04]) [    ] o.a.s.c.s.e.JettySolrRunner Jetty properties: {solr.data.dir=/x1/jenkins/jenkins-slave/workspace/Lucene-Solr-NightlyTests-5.x/solr/build/solr-core/test/J1/temp/solr.cloud.CollectionsAPIDistributedZkTest_3D49B6BCFBA4BC04-001/tempDir-001/control/data, hostPort=45254, coreRootDirectory=/x1/jenkins/jenkins-slave/workspace/Lucene-Solr-NightlyTests-5.x/solr/build/solr-core/test/J1/temp/solr.cloud.CollectionsAPIDistributedZkTest_3D49B6BCFBA4BC04-001/control-001/cores, hostContext=/cu_i/fg}
   [junit4]   2> 181575 INFO  (TEST-CollectionsAPIDistributedZkTest.test-seed#[3D49B6BCFBA4BC04]) [    ] o.a.s.s.SolrDispatchFilter SolrDispatchFilter.init(): sun.misc.Launcher$AppClassLoader@41692a49
   [junit4]   2> 181575 INFO  (TEST-CollectionsAPIDistributedZkTest.test-seed#[3D49B6BCFBA4BC04]) [    ] o.a.s.c.SolrResourceLoader new SolrResourceLoader for directory: '/x1/jenkins/jenkins-slave/workspace/Lucene-Solr-NightlyTests-5.x/solr/build/solr-core/test/J1/temp/solr.cloud.CollectionsAPIDistributedZkTest_3D49B6BCFBA4BC04-001/control-001'
   [junit4]   2> 181575 INFO  (TEST-CollectionsAPIDistributedZkTest.test-seed#[3D49B6BCFBA4BC04]) [    ] o.a.s.c.SolrResourceLoader JNDI not configured for solr (NoInitialContextEx)
   [junit4]   2> 181575 INFO  (TEST-CollectionsAPIDistributedZkTest.test-seed#[3D49B6BCFBA4BC04]) [    ] o.a.s.c.SolrResourceLoader solr home defaulted to 'solr/' (could not find system property or JNDI)
   [junit4]   2> 181576 INFO  (TEST-CollectionsAPIDistributedZkTest.test-seed#[3D49B6BCFBA4BC04]) [    ] o.a.s.c.c.SolrZkClient Using default ZkCredentialsProvider
   [junit4]   2> 181583 INFO  (TEST-CollectionsAPIDistributedZkTest.test-seed#[3D49B6BCFBA4BC04]) [    ] o.a.s.c.c.ConnectionManager Waiting for client to connect to ZooKeeper
   [junit4]   2> 181596 INFO  (zkCallback-137-thread-1) [    ] o.a.s.c.c.ConnectionManager Watcher org.apache.solr.common.cloud.ConnectionManager@22f4d1c4 name:ZooKeeperConnection Watcher:127.0.0.1:52759/solr got event WatchedEvent state:SyncConnected type:None path:null path:null type:None
   [junit4]   2> 181597 INFO  (TEST-CollectionsAPIDistributedZkTest.test-seed#[3D49B6BCFBA4BC04]) [    ] o.a.s.c.c.ConnectionManager Client is connected to ZooKeeper
   [junit4]   2> 181597 INFO  (TEST-CollectionsAPIDistributedZkTest.test-seed#[3D49B6BCFBA4BC04]) [    ] o.a.s.c.c.SolrZkClient Using default ZkACLProvider
   [junit4]   2> 181613 INFO  (TEST-CollectionsAPIDistributedZkTest.test-seed#[3D49B6BCFBA4BC04]) [    ] o.a.s.s.SolrDispatchFilter Loading solr.xml from SolrHome (not found in ZooKeeper)
   [junit4]   2> 181613 INFO  (TEST-CollectionsAPIDistributedZkTest.test-seed#[3D49B6BCFBA4BC04]) [    ] o.a.s.c.SolrXmlConfig Loading container configuration from /x1/jenkins/jenkins-slave/workspace/Lucene-Solr-NightlyTests-5.x/solr/build/solr-core/test/J1/temp/solr.cloud.CollectionsAPIDistributedZkTest_3D49B6BCFBA4BC04-001/control-001/solr.xml
   [junit4]   2> 181630 INFO  (TEST-CollectionsAPIDistributedZkTest.test-seed#[3D49B6BCFBA4BC04]) [    ] o.a.s.c.CorePropertiesLocator Config-defined core root directory: /x1/jenkins/jenkins-slave/workspace/Lucene-Solr-NightlyTests-5.x/solr/build/solr-core/test/J1/temp/solr.cloud.CollectionsAPIDistributedZkTest_3D49B6BCFBA4BC04-001/control-001/cores
   [junit4]   2> 181630 INFO  (TEST-CollectionsAPIDistributedZkTest.test-seed#[3D49B6BCFBA4BC04]) [    ] o.a.s.c.CoreContainer New CoreContainer 1534671923
   [junit4]   2> 181630 INFO  (TEST-CollectionsAPIDistributedZkTest.test-seed#[3D49B6BCFBA4BC04]) [    ] o.a.s.c.CoreContainer Loading cores into CoreContainer [instanceDir=/x1/jenkins/jenkins-slave/workspace/Lucene-Solr-NightlyTests-5.x/solr/build/solr-core/test/J1/temp/solr.cloud.CollectionsAPIDistributedZkTest_3D49B6BCFBA4BC04-001/control-001]
   [junit4]   2> 181630 WARN  (TEST-CollectionsAPIDistributedZkTest.test-seed#[3D49B6BCFBA4BC04]) [    ] o.a.s.c.CoreContainer Couldn't add files from /x1/jenkins/jenkins-slave/workspace/Lucene-Solr-NightlyTests-5.x/solr/build/solr-core/test/J1/temp/solr.cloud.CollectionsAPIDistributedZkTest_3D49B6BCFBA4BC04-001/control-001/lib to classpath: /x1/jenkins/jenkins-slave/workspace/Lucene-Solr-NightlyTests-5.x/solr/build/solr-core/test/J1/temp/solr.cloud.CollectionsAPIDistributedZkTest_3D49B6BCFBA4BC04-001/control-001/lib
   [junit4]   2> 181630 INFO  (TEST-CollectionsAPIDistributedZkTest.test-seed#[3D49B6BCFBA4BC04]) [    ] o.a.s.h.c.HttpShardHandlerFactory created with socketTimeout : 90000,urlScheme : ,connTimeout : 15000,maxConnectionsPerHost : 20,maxConnections : 10000,corePoolSize : 0,maximumPoolSize : 2147483647,maxThreadIdleTime : 5,sizeOfQueue : -1,fairnessPolicy : false,useRetries : false,
   [junit4]   2> 181653 INFO  (TEST-CollectionsAPIDistributedZkTest.test-seed#[3D49B6BCFBA4BC04]) [    ] o.a.s.u.UpdateShardHandler Creating UpdateShardHandler HTTP client with params: socketTimeout=340000&connTimeout=45000&retry=true
   [junit4]   2> 181654 INFO  (TEST-CollectionsAPIDistributedZkTest.test-seed#[3D49B6BCFBA4BC04]) [    ] o.a.s.l.LogWatcher SLF4J impl is org.slf4j.impl.Log4jLoggerFactory
   [junit4]   2> 181654 INFO  (TEST-CollectionsAPIDistributedZkTest.test-seed#[3D49B6BCFBA4BC04]) [    ] o.a.s.l.LogWatcher Registering Log Listener [Log4j (org.slf4j.impl.Log4jLoggerFactory)]
   [junit4]   2> 181654 INFO  (TEST-CollectionsAPIDistributedZkTest.test-seed#[3D49B6BCFBA4BC04]) [    ] o.a.s.c.ZkContainer Zookeeper client=127.0.0.1:52759/solr
   [junit4]   2> 181654 INFO  (TEST-CollectionsAPIDistributedZkTest.test-seed#[3D49B6BCFBA4BC04]) [    ] o.a.s.c.ZkController zkHost includes chroot
   [junit4]   2> 181654 INFO  (TEST-CollectionsAPIDistributedZkTest.test-seed#[3D49B6BCFBA4BC04]) [    ] o.a.s.c.c.SolrZkClient Using default ZkCredentialsProvider
   [junit4]   2> 181655 INFO  (TEST-CollectionsAPIDistributedZkTest.test-seed#[3D49B6BCFBA4BC04]) [    ] o.a.s.c.c.ConnectionManager Waiting for client to connect to ZooKeeper
   [junit4]   2> 181668 INFO  (zkCallback-140-thread-1) [    ] o.a.s.c.c.ConnectionManager Watcher org.apache.solr.common.cloud.ConnectionManager@28d9c453 name:ZooKeeperConnection Watcher:127.0.0.1:52759 got event WatchedEvent state:SyncConnected type:None path:null path:null type:None
   [junit4]   2> 181670 INFO  (TEST-CollectionsAPIDistributedZkTest.test-seed#[3D49B6BCFBA4BC04]) [    ] o.a.s.c.c.ConnectionManager Client is connected to ZooKeeper
   [junit4]   2> 181670 INFO  (TEST-CollectionsAPIDistributedZkTest.test-seed#[3D49B6BCFBA4BC04]) [    ] o.a.s.c.c.SolrZkClient Using default ZkACLProvider
   [junit4]   2> 181701 INFO  (TEST-CollectionsAPIDistributedZkTest.test-seed#[3D49B6BCFBA4BC04]) [n:127.0.0.1:45254_cu_i%2Ffg    ] o.a.s.c.c.ConnectionManager Waiting for client to connect to ZooKeeper
   [junit4]   2> 181719 INFO  (zkCallback-141-thread-1-processing-n:127.0.0.1:45254_cu_i%2Ffg) [n:127.0.0.1:45254_cu_i%2Ffg    ] o.a.s.c.c.ConnectionManager Watcher org.apache.solr.common.cloud.ConnectionManager@26aa762f name:ZooKeeperConnection Watcher:127.0.0.1:52759/solr got event WatchedEvent state:SyncConnected type:None path:null path:null type:None
   [junit4]   2> 181719 INFO  (TEST-CollectionsAPIDistributedZkTest.test-seed#[3D49B6BCFBA4BC04]) [n:127.0.0.1:45254_cu_i%2Ffg    ] o.a.s.c.c.ConnectionManager Client is connected to ZooKeeper
   [junit4]   2> 181721 INFO  (TEST-CollectionsAPIDistributedZkTest.test-seed#[3D49B6BCFBA4BC04]) [n:127.0.0.1:45254_cu_i%2Ffg    ] o.a.s.c.c.SolrZkClient makePath: /overseer/queue
   [junit4]   2> 181723 INFO  (TEST-CollectionsAPIDistributedZkTest.test-seed#[3D49B6BCFBA4BC04]) [n:127.0.0.1:45254_cu_i%2Ffg    ] o.a.s.c.c.SolrZkClient makePath: /overseer/collection-queue-work
   [junit4]   2> 181725 INFO  (TEST-CollectionsAPIDistributedZkTest.test-seed#[3D49B6BCFBA4BC04]) [n:127.0.0.1:45254_cu_i%2Ffg    ] o.a.s.c.c.SolrZkClient makePath: /overseer/collection-map-running
   [junit4]   2> 181727 INFO  (TEST-CollectionsAPIDistributedZkTest.test-seed#[3D49B6BCFBA4BC04]) [n:127.0.0.1:45254_cu_i%2Ffg    ] o.a.s.c.c.SolrZkClient makePath: /overseer/collection-map-completed
   [junit4]   2> 181729 INFO  (TEST-CollectionsAPIDistributedZkTest.test-seed#[3D49B6BCFBA4BC04]) [n:127.0.0.1:45254_cu_i%2Ffg    ] o.a.s.c.c.SolrZkClient makePath: /overseer/collection-map-failure
   [junit4]   2> 181731 INFO  (TEST-CollectionsAPIDistributedZkTest.test-seed#[3D49B6BCFBA4BC04]) [n:127.0.0.1:45254_cu_i%2Ffg    ] o.a.s.c.c.SolrZkClient makePath: /live_nodes
   [junit4]   2> 181732 INFO  (TEST-CollectionsAPIDistributedZkTest.test-seed#[3D49B6BCFBA4BC04]) [n:127.0.0.1:45254_cu_i%2Ffg    ] o.a.s.c.c.SolrZkClient makePath: /aliases.json
   [junit4]   2> 181734 INFO  (TEST-CollectionsAPIDistributedZkTest.test-seed#[3D49B6BCFBA4BC04]) [n:127.0.0.1:45254_cu_i%2Ffg    ] o.a.s.c.c.SolrZkClient makePath: /clusterstate.json
   [junit4]   2> 181735 INFO  (TEST-CollectionsAPIDistributedZkTest.test-seed#[3D49B6BCFBA4BC04]) [n:127.0.0.1:45254_cu_i%2Ffg    ] o.a.s.c.c.SolrZkClient makePath: /security.json
   [junit4]   2> 181736 INFO  (TEST-CollectionsAPIDistributedZkTest.test-seed#[3D49B6BCFBA4BC04]) [n:127.0.0.1:45254_cu_i%2Ffg    ] o.a.s.c.ZkController Register node as live in ZooKeeper:/live_nodes/127.0.0.1:45254_cu_i%2Ffg
   [junit4]   2> 181736 INFO  (TEST-CollectionsAPIDistributedZkTest.test-seed#[3D49B6BCFBA4BC04]) [n:127.0.0.1:45254_cu_i%2Ffg    ] o.a.s.c.c.SolrZkClient makePath: /live_nodes/127.0.0.1:45254_cu_i%2Ffg
   [junit4]   2> 181737 INFO  (TEST-CollectionsAPIDistributedZkTest.test-seed#[3D49B6BCFBA4BC04]) [n:127.0.0.1:45254_cu_i%2Ffg    ] o.a.s.c.c.SolrZkClient makePath: /overseer_elect
   [junit4]   2> 181739 INFO  (TEST-CollectionsAPIDistributedZkTest.test-seed#[3D49B6BCFBA4BC04]) [n:127.0.0.1:45254_cu_i%2Ffg    ] o.a.s.c.c.SolrZkClient makePath: /overseer_elect/election
   [junit4]   2> 181740 INFO  (TEST-CollectionsAPIDistributedZkTest.test-seed#[3D49B6BCFBA4BC04]) [n:127.0.0.1:45254_cu_i%2Ffg    ] o.a.s.c.Overseer Overseer (id=null) closing
   [junit4]   2> 181741 INFO  (TEST-CollectionsAPIDistributedZkTest.test-seed#[3D49B6BCFBA4BC04]) [n:127.0.0.1:45254_cu_i%2Ffg    ] o.a.s.c.LeaderElector Joined leadership election with path: /overseer_elect/election/95401488593059846-127.0.0.1:45254_cu_i%2Ffg-n_0000000000
   [junit4]   2> 181741 INFO  (TEST-CollectionsAPIDistributedZkTest.test-seed#[3D49B6BCFBA4BC04]) [n:127.0.0.1:45254_cu_i%2Ffg    ] o.a.s.c.OverseerElectionContext I am going to be the leader 127.0.0.1:45254_cu_i%2Ffg
   [junit4]   2> 181741 INFO  (TEST-CollectionsAPIDistributedZkTest.test-seed#[3D49B6BCFBA4BC04]) [n:127.0.0.1:45254_cu_i%2Ffg    ] o.a.s.c.c.SolrZkClient makePath: /overseer_elect/leader
   [junit4]   2> 181742 INFO  (TEST-CollectionsAPIDistributedZkTest.test-seed#[3D49B6BCFBA4BC04]) [n:127.0.0.1:45254_cu_i%2Ffg    ] o.a.s.c.Overseer Overseer (id=95401488593059846-127.0.0.1:45254_cu_i%2Ffg-n_0000000000) starting
   [junit4]   2> 181744 INFO  (TEST-CollectionsAPIDistributedZkTest.test-seed#[3D49B6BCFBA4BC04]) [n:127.0.0.1:45254_cu_i%2Ffg    ] o.a.s.c.c.SolrZkClient makePath: /overseer/queue-work
   [junit4]   2> 181752 INFO  (TEST-CollectionsAPIDistributedZkTest.test-seed#[3D49B6BCFBA4BC04]) [n:127.0.0.1:45254_cu_i%2Ffg    ] o.a.s.c.OverseerAutoReplicaFailoverThread Starting OverseerAutoReplicaFailoverThread autoReplicaFailoverWorkLoopDelay=10000 autoReplicaFailoverWaitAfterExpiration=10000 autoReplicaFailoverBadNodeExpiration=60000
   [junit4]   2> 181758 INFO  (OverseerCollectionConfigSetProcessor-95401488593059846-127.0.0.1:45254_cu_i%2Ffg-n_0000000000) [n:127.0.0.1:45254_cu_i%2Ffg    ] o.a.s.c.OverseerTaskProcessor Process current queue of overseer operations
   [junit4]   2> 181758 INFO  (OverseerStateUpdate-95401488593059846-127.0.0.1:45254_cu_i%2Ffg-n_0000000000) [n:127.0.0.1:45254_cu_i%2Ffg    ] o.a.s.c.Overseer Starting to work on the main queue
   [junit4]   2> 181759 INFO  (OverseerStateUpdate-95401488593059846-127.0.0.1:45254_cu_i%2Ffg-n_0000000000) [n:127.0.0.1:45254_cu_i%2Ffg    ] o.a.s.c.c.ZkStateReader Updating cluster state from ZooKeeper... 
   [junit4]   2> 181770 INFO  (TEST-CollectionsAPIDistributedZkTest.test-seed#[3D49B6BCFBA4BC04]) [n:127.0.0.1:45254_cu_i%2Ffg    ] o.a.s.c.c.ZkStateReader Updating cluster state from ZooKeeper... 
   [junit4]   2> 181815 INFO  (TEST-CollectionsAPIDistributedZkTest.test-seed#[3D49B6BCFBA4BC04]) [n:127.0.0.1:45254_cu_i%2Ffg    ] o.a.s.c.CoreContainer Security conf doesn't exist. Skipping setup for authorization module.
   [junit4]   2> 181815 INFO  (TEST-CollectionsAPIDistributedZkTest.test-seed#[3D49B6BCFBA4BC04]) [n:127.0.0.1:45254_cu_i%2Ffg    ] o.a.s.c.CoreContainer No authentication plugin used.
   [junit4]   2> 181817 INFO  (TEST-CollectionsAPIDistributedZkTest.test-seed#[3D49B6BCFBA4BC04]) [n:127.0.0.1:45254_cu_i%2Ffg    ] o.a.s.c.CorePropertiesLocator Looking for core definitions underneath /x1/jenkins/jenkins-slave/workspace/Lucene-Solr-NightlyTests-5.x/solr/build/solr-core/test/J1/temp/solr.cloud.CollectionsAPIDistributedZkTest_3D49B6BCFBA4BC04-001/control-001/cores
   [junit4]   2> 181819 INFO  (TEST-CollectionsAPIDistributedZkTest.test-seed#[3D49B6BCFBA4BC04]) [n:127.0.0.1:45254_cu_i%2Ffg    ] o.a.s.c.CoreDescriptor Created CoreDescriptor: {shard=, schema=schema.xml, name=collection1, dataDir=data/, loadOnStartup=true, transient=false, collection=control_collection, config=solrconfig.xml, configSetProperties=configsetprops.json, coreNodeName=}
   [junit4]   2> 181820 INFO  (TEST-CollectionsAPIDistributedZkTest.test-seed#[3D49B6BCFBA4BC04]) [n:127.0.0.1:45254_cu_i%2Ffg    ] o.a.s.c.CorePropertiesLocator Found core collection1 in /x1/jenkins/jenkins-slave/workspace/Lucene-Solr-NightlyTests-5.x/solr/build/solr-core/test/J1/temp/solr.cloud.CollectionsAPIDistributedZkTest_3D49B6BCFBA4BC04-001/control-001/cores/collection1
   [junit4]   2> 181820 INFO  (TEST-CollectionsAPIDistributedZkTest.test-seed#[3D49B6BCFBA4BC04]) [n:127.0.0.1:45254_cu_i%2Ffg    ] o.a.s.c.CorePropertiesLocator Found 1 core definitions
   [junit4]   2> 181821 INFO  (coreLoadExecutor-386-thread-1-processing-n:127.0.0.1:45254_cu_i%2Ffg) [n:127.0.0.1:45254_cu_i%2Ffg c:control_collection   x:collection1] o.a.s.c.ZkController publishing state=down
   [junit4]   2> 181821 INFO  (coreLoadExecutor-386-thread-1-processing-n:127.0.0.1:45254_cu_i%2Ffg) [n:127.0.0.1:45254_cu_i%2Ffg c:control_collection   x:collection1] o.a.s.c.ZkController numShards not found on descriptor - reading it from system property
   [junit4]   2> 181836 INFO  (TEST-CollectionsAPIDistributedZkTest.test-seed#[3D49B6BCFBA4BC04]) [n:127.0.0.1:45254_cu_i%2Ffg    ] o.a.s.s.SolrDispatchFilter user.dir=/x1/jenkins/jenkins-slave/workspace/Lucene-Solr-NightlyTests-5.x/solr/build/solr-core/test/J1
   [junit4]   2> 181837 INFO  (TEST-CollectionsAPIDistributedZkTest.test-seed#[3D49B6BCFBA4BC04]) [n:127.0.0.1:45254_cu_i%2Ffg    ] o.a.s.s.SolrDispatchFilter SolrDispatchFilter.init() done
   [junit4]   2> 181837 INFO  (OverseerStateUpdate-95401488593059846-127.0.0.1:45254_cu_i%2Ffg-n_0000000000) [n:127.0.0.1:45254_cu_i%2Ffg    ] o.a.s.c.Overseer processMessage: queueSize: 1, message = {
   [junit4]   2>   "shard":null,
   [junit4]   2>   "base_url":"http://127.0.0.1:45254/cu_i/fg",
   [junit4]   2>   "operation":"state",
   [junit4]   2>   "node_name":"127.0.0.1:45254_cu_i%2Ffg",
   [junit4]   2>   "numShards":"1",
   [junit4]   2>   "roles":null,
   [junit4]   2>   "state":"down",
   [junit4]   2>   "collection":"control_collection",
   [junit4]   2>   "core":"collection1"} current state version: 0
   [junit4]   2> 181837 INFO  (coreLoadExecutor-386-thread-1-processing-n:127.0.0.1:45254_cu_i%2Ffg) [n:127.0.0.1:45254_cu_i%2Ffg c:control_collection   x:collection1] o.a.s.c.ZkController look for our core node name
   [junit4]   2> 181838 INFO  (OverseerStateUpdate-95401488593059846-127.0.0.1:45254_cu_i%2Ffg-n_0000000000) [n:127.0.0.1:45254_cu_i%2Ffg    ] o.a.s.c.o.ReplicaMutator Update state numShards=1 message={
   [junit4]   2>   "shard":null,
   [junit4]   2>   "base_url":"http://127.0.0.1:45254/cu_i/fg",
   [junit4]   2>   "operation":"state",
   [junit4]   2>   "node_name":"127.0.0.1:45254_cu_i%2Ffg",
   [junit4]   2>   "numShards":"1",
   [junit4]   2>   "roles":null,
   [junit4]   2>   "state":"down",
   [junit4]   2>   "collection":"control_collection",
   [junit4]   2>   "core":"collection1"}
   [junit4]   2> 181838 INFO  (OverseerStateUpdate-95401488593059846-127.0.0.1:45254_cu_i%2Ffg-n_0000000000) [n:127.0.0.1:45254_cu_i%2Ffg    ] o.a.s.c.o.ClusterStateMutator building a new cName: control_collection
   [junit4]   2> 181839 INFO  (OverseerStateUpdate-95401488593059846-127.0.0.1:45254_cu_i%2Ffg-n_0000000000) [n:127.0.0.1:45254_cu_i%2Ffg    ] o.a.s.c.o.ReplicaMutator Assigning new node to shard shard=shard1
   [junit4]   2> 181842 INFO  (zkCallback-141-thread-1-processing-n:127.0.0.1:45254_cu_i%2Ffg) [n:127.0.0.1:45254_cu_i%2Ffg    ] o.a.s.c.c.ZkStateReader A cluster state change: [WatchedEvent state:SyncConnected type:NodeDataChanged path:/clusterstate.json], has occurred - updating... (live nodes size: [1])
   [junit4]   2> 181848 INFO  (zkCallback-141-thread-2-processing-n:127.0.0.1:45254_cu_i%2Ffg) [n:127.0.0.1:45254_cu_i%2Ffg    ] o.a.s.c.c.ZkStateReader A cluster state change: [WatchedEvent state:SyncConnected type:NodeDataChanged path:/clusterstate.json], has occurred - updating... (live nodes size: [1])
   [junit4]   2> 182838 INFO  (coreLoadExecutor-386-thread-1-processing-n:127.0.0.1:45254_cu_i%2Ffg) [n:127.0.0.1:45254_cu_i%2Ffg c:control_collection   x:collection1] o.a.s.c.ZkController waiting to find shard id in clusterstate for collection1
   [junit4]   2> 182838 INFO  (coreLoadExecutor-386-thread-1-processing-n:127.0.0.1:45254_cu_i%2Ffg) [n:127.0.0.1:45254_cu_i%2Ffg c:control_collection   x:collection1] o.a.s.c.ZkController Check for collection zkNode:control_collection
   [junit4]   2> 182839 INFO  (coreLoadExecutor-386-thread-1-processing-n:127.0.0.1:45254_cu_i%2Ffg) [n:127.0.0.1:45254_cu_i%2Ffg c:control_collection   x:collection1] o.a.s.c.ZkController Collection zkNode exists
   [junit4]   2> 182839 INFO  (coreLoadExecutor-386-thread-1-processing-n:127.0.0.1:45254_cu_i%2Ffg) [n:127.0.0.1:45254_cu_i%2Ffg c:control_collection   x:collection1] o.a.s.c.c.ZkStateReader Load collection config from: [/collections/control_collection]
   [junit4]   2> 182840 INFO  (coreLoadExecutor-386-thread-1-processing-n:127.0.0.1:45254_cu_i%2Ffg) [n:127.0.0.1:45254_cu_i%2Ffg c:control_collection   x:collection1] o.a.s.c.c.ZkStateReader path=[/collections/control_collection] [configName]=[conf1] specified config exists in ZooKeeper
   [junit4]   2> 182840 INFO  (coreLoadExecutor-386-thread-1-processing-n:127.0.0.1:45254_cu_i%2Ffg) [n:127.0.0.1:45254_cu_i%2Ffg c:control_collection   x:collection1] o.a.s.c.SolrResourceLoader new SolrResourceLoader for directory: '/x1/jenkins/jenkins-slave/workspace/Lucene-Solr-NightlyTests-5.x/solr/build/solr-core/test/J1/temp/solr.cloud.CollectionsAPIDistributedZkTest_3D49B6BCFBA4BC04-001/control-001/cores/collection1'
   [junit4]   2> 182840 INFO  (coreLoadExecutor-386-thread-1-processing-n:127.0.0.1:45254_cu_i%2Ffg) [n:127.0.0.1:45254_cu_i%2Ffg c:control_collection   x:collection1] o.a.s.c.SolrResourceLoader JNDI not configured for solr (NoInitialContextEx)
   [junit4]   2> 182840 INFO  (coreLoadExecutor-386-thread-1-processing-n:127.0.0.1:45254_cu_i%2Ffg) [n:127.0.0.1:45254_cu_i%2Ffg c:control_collection   x:collection1] o.a.s.c.SolrResourceLoader solr home defaulted to 'solr/' (could not find system property or JNDI)
   [junit4]   2> 182842 INFO  (coreLoadExecutor-386-thread-1-processing-n:127.0.0.1:45254_cu_i%2Ffg) [n:127.0.0.1:45254_cu_i%2Ffg c:control_collection   x:collection1] o.a.s.c.Config loaded config solrconfig.xml with version 0 
   [junit4]   2> 182852 INFO  (coreLoadExecutor-386-thread-1-processing-n:127.0.0.1:45254_cu_i%2Ffg) [n:127.0.0.1:45254_cu_i%2Ffg c:control_collection   x:collection1] o.a.s.c.SolrConfig current version of requestparams : -1
   [junit4]   2> 182866 INFO  (coreLoadExecutor-386-thread-1-processing-n:127.0.0.1:45254_cu_i%2Ffg) [n:127.0.0.1:45254_cu_i%2Ffg c:control_collection   x:collection1] o.a.s.c.SolrConfig Using Lucene MatchVersion: 5.6.0
   [junit4]   2> 182898 INFO  (coreLoadExecutor-386-thread-1-processing-n:127.0.0.1:45254_cu_i%2Ffg) [n:127.0.0.1:45254_cu_i%2Ffg c:control_collection   x:collection1] o.a.s.c.SolrConfig Loaded SolrConfig: solrconfig.xml
   [junit4]   2> 182922 INFO  (coreLoadExecutor-386-thread-1-processing-n:127.0.0.1:45254_cu_i%2Ffg) [n:127.0.0.1:45254_cu_i%2Ffg c:control_collection   x:collection1] o.a.s.s.IndexSchema [collection1] Schema name=test
   [junit4]   2> 183184 INFO  (coreLoadExecutor-386-thread-1-processing-n:127.0.0.1:45254_cu_i%2Ffg) [n:127.0.0.1:45254_cu_i%2Ffg c:control_collection   x:collection1] o.a.s.s.OpenExchangeRatesOrgProvider Initialized with rates=open-exchange-rates.json, refreshInterval=1440.
   [junit4]   2> 183198 INFO  (coreLoadExecutor-386-thread-1-processing-n:127.0.0.1:45254_cu_i%2Ffg) [n:127.0.0.1:45254_cu_i%2Ffg c:control_collection   x:collection1] o.a.s.s.IndexSchema default search field in schema is text
   [junit4]   2> 183200 INFO  (coreLoadExecutor-386-thread-1-processing-n:127.0.0.1:45254_cu_i%2Ffg) [n:127.0.0.1:45254_cu_i%2Ffg c:control_collection   x:collection1] o.a.s.s.IndexSchema unique key field: id
   [junit4]   2> 183215 INFO  (coreLoadExecutor-386-thread-1-processing-n:127.0.0.1:45254_cu_i%2Ffg) [n:127.0.0.1:45254_cu_i%2Ffg c:control_collection   x:collection1] o.a.s.s.FileExchangeRateProvider Reloading exchange rates from file currency.xml
   [junit4]   2> 183220 INFO  (coreLoadExecutor-386-thread-1-processing-n:127.0.0.1:45254_cu_i%2Ffg) [n:127.0.0.1:45254_cu_i%2Ffg c:control_collection   x:collection1] o.a.s.s.FileExchangeRateProvider Reloading exchange rates from file currency.xml
   [junit4]   2> 183226 INFO  (coreLoadExecutor-386-thread-1-processing-n:127.0.0.1:45254_cu_i%2Ffg) [n:127.0.0.1:45254_cu_i%2Ffg c:control_collection   x:collection1] o.a.s.s.OpenExchangeRatesOrgProvider Reloading exchange rates from open-exchange-rates.json
   [junit4]   2> 183227 INFO  (coreLoadExecutor-386-thread-1-processing-n:127.0.0.1:45254_cu_i%2Ffg) [n:127.0.0.1:45254_cu_i%2Ffg c:control_collection   x:collection1] o.a.s.s.OpenExchangeRatesOrgProvider Reloading exchange rates from open-exchange-rates.json
   [junit4]   2> 183232 INFO  (coreLoadExecutor-386-thread-1-processing-n:127.0.0.1:45254_cu_i%2Ffg) [n:127.0.0.1:45254_cu_i%2Ffg c:control_collection   x:collection1] o.a.s.c.ConfigSetProperties Did not find ConfigSet properties, assuming default properties: Can't find resource 'configsetprops.json' in classpath or '/configs/conf1', cwd=/x1/jenkins/jenkins-slave/workspace/Lucene-Solr-NightlyTests-5.x/solr/build/solr-core/test/J1
   [junit4]   2> 183232 INFO  (coreLoadExecutor-386-thread-1-processing-n:127.0.0.1:45254_cu_i%2Ffg) [n:127.0.0.1:45254_cu_i%2Ffg c:control_collection   x:collection1] o.a.s.c.CoreContainer Creating SolrCore 'collection1' using configuration from collection control_collection
   [junit4]   2> 183233 INFO  (coreLoadExecutor-386-thread-1-processing-n:127.0.0.1:45254_cu_i%2Ffg) [n:127.0.0.1:45254_cu_i%2Ffg c:control_collection s:shard1 r:core_node1 x:collection1] o.a.s.c.SolrCore org.apache.solr.core.MockDirectoryFactory
   [junit4]   2> 183233 INFO  (coreLoadExecutor-386-thread-1-processing-n:127.0.0.1:45254_cu_i%2Ffg) [n:127.0.0.1:45254_cu_i%2Ffg c:control_collection s:shard1 r:core_node1 x:collection1] o.a.s.c.SolrCore [[collection1] ] Opening new SolrCore at [/x1/jenkins/jenkins-slave/workspace/Lucene-Solr-NightlyTests-5.x/solr/build/solr-core/test/J1/temp/solr.cloud.CollectionsAPIDistributedZkTest_3D49B6BCFBA4BC04-001/control-001/cores/collection1], dataDir=[/x1/jenkins/jenkins-slave/workspace/Lucene-Solr-NightlyTests-5.x/solr/build/solr-core/test/J1/temp/solr.cloud.CollectionsAPIDistributedZkTest_3D49B6BCFBA4BC04-001/control-001/cores/collection1/data/]
   [junit4]   2> 183233 INFO  (coreLoadExecutor-386-thread-1-processing-n:127.0.0.1:45254_cu_i%2Ffg) [n:127.0.0.1:45254_cu_i%2Ffg c:control_collection s:shard1 r:core_node1 x:collection1] o.a.s.c.JmxMonitoredMap JMX monitoring is enabled. Adding Solr mbeans to JMX Server: com.sun.jmx.mbeanserver.JmxMBeanServer@1347c8ba
   [junit4]   2> 183236 INFO  (coreLoadExecutor-386-thread-1-processing-n:127.0.0.1:45254_cu_i%2Ffg) [n:127.0.0.1:45254_cu_i%2Ffg c:control_collection s:shard1 r:core_node1 x:collection1] o.a.s.c.CachingDirectoryFactory return new directory for /x1/jenkins/jenkins-slave/workspace/Lucene-Solr-NightlyTests-5.x/solr/build/solr-core/test/J1/temp/solr.cloud.CollectionsAPIDistributedZkTest_3D49B6BCFBA4BC04-001/control-001/cores/collection1/data
   [junit4]   2> 183237 INFO  (coreLoadExecutor-386-thread-1-processing-n:127.0.0.1:45254_cu_i%2Ffg) [n:127.0.0.1:45254_cu_i%2Ffg c:control_collection s:shard1 r:core_node1 x:collection1] o.a.s.c.SolrCore New index directory detected: old=null new=/x1/jenkins/jenkins-slave/workspace/Lucene-Solr-NightlyTests-5.x/solr/build/solr-core/test/J1/temp/solr.cloud.CollectionsAPIDistributedZkTest_3D49B6BCFBA4BC04-001/control-001/cores/collection1/data/index/
   [junit4]   2> 183237 WARN  (coreLoadExecutor-386-thread-1-processing-n:127.0.0.1:45254_cu_i%2Ffg) [n:127.0.0.1:45254_cu_i%2Ffg c:control_collection s:shard1 r:core_node1 x:collection1] o.a.s.c.SolrCore [collection1] Solr index directory '/x1/jenkins/jenkins-slave/workspace/Lucene-Solr-NightlyTests-5.x/solr/build/solr-core/test/J1/temp/solr.cloud.CollectionsAPIDistributedZkTest_3D49B6BCFBA4BC04-001/control-001/cores/collection1/data/index' doesn't exist. Creating new index...
   [junit4]   2> 183238 INFO  (coreLoadExecutor-386-thread-1-processing-n:127.0.0.1:45254_cu_i%2Ffg) [n:127.0.0.1:45254_cu_i%2Ffg c:control_collection s:shard1 r:core_node1 x:collection1] o.a.s.c.CachingDirectoryFactory return new directory for /x1/jenkins/jenkins-slave/workspace/Lucene-Solr-NightlyTests-5.x/solr/build/solr-core/test/J1/temp/solr.cloud.CollectionsAPIDistributedZkTest_3D49B6BCFBA4BC04-001/control-001/cores/collection1/data/index
   [junit4]   2> 183238 INFO  (coreLoadExecutor-386-thread-1-processing-n:127.0.0.1:45254_cu_i%2Ffg) [n:127.0.0.1:45254_cu_i%2Ffg c:control_collection s:shard1 r:core_node1 x:collection1] o.a.s.u.RandomMergePolicy RandomMergePolicy wrapping class org.apache.lucene.index.MockRandomMergePolicy: org.apache.lucene.index.MockRandomMergePolicy@76bad186
   [junit4]   2> 183238 INFO  (coreLoadExecutor-386-thread-1-processing-n:127.0.0.1:45254_cu_i%2Ffg) [n:127.0.0.1:45254_cu_i%2Ffg c:control_collection s:shard1 r:core_node1 x:collection1] o.a.s.c.SolrDeletionPolicy SolrDeletionPolicy.onCommit: commits: num=1
   [junit4]   2> 	commit{dir=MockDirectoryWrapper(RAMDirectory@6311f14f lockFactory=org.apache.lucene.store.SingleInstanceLockFactory@2ef9ac59),segFN=segments_1,generation=1}
   [junit4]   2> 183239 INFO  (coreLoadExecutor-386-thread-1-processing-n:127.0.0.1:45254_cu_i%2Ffg) [n:127.0.0.1:45254_cu_i%2Ffg c:control_collection s:shard1 r:core_node1 x:collection1] o.a.s.c.SolrDeletionPolicy newest commit generation = 1
   [junit4]   2> 183239 INFO  (OldIndexDirectoryCleanupThreadForCore-collection1) [n:127.0.0.1:45254_cu_i%2Ffg c:control_collection s:shard1 r:core_node1 x:collection1] o.a.s.c.SolrCore Looking for old index directories to cleanup for core collection1 in /x1/jenkins/jenkins-slave/workspace/Lucene-Solr-NightlyTests-5.x/solr/build/solr-core/test/J1/temp/solr.cloud.CollectionsAPIDistributedZkTest_3D49B6BCFBA4BC04-001/control-001/cores/collection1/data/
   [junit4]   2> 183239 WARN  (OldIndexDirectoryCleanupThreadForCore-collection1) [n:127.0.0.1:45254_cu_i%2Ffg c:control_collection s:shard1 r:core_node1 x:collection1] o.a.s.c.DirectoryFactory /x1/jenkins/jenkins-slave/workspace/Lucene-Solr-NightlyTests-5.x/solr/build/solr-core/test/J1/temp/solr.cloud.CollectionsAPIDistributedZkTest_3D49B6BCFBA4BC04-001/control-001/cores/collection1/data/ does not point to a valid data directory; skipping clean-up of old index directories.
   [junit4]   2> 183254 INFO  (coreLoadExecutor-386-thread-1-processing-n:127.0.0.1:45254_cu_i%2Ffg) [n:127.0.0.1:45254_cu_i%2Ffg c:control_collection s:shard1 r:core_node1 x:collection1] o.a.s.u.p.UpdateRequestProcessorChain creating updateRequestProcessorChain "nodistrib"
   [junit4]   2> 183254 INFO  (coreLoadExecutor-386-thread-1-processing-n:127.0.0.1:45254_cu_i%2Ffg) [n:127.0.0.1:45254_cu_i%2Ffg c:control_collection s:shard1 r:core_node1 x:collection1] o.a.s.u.p.UpdateRequestProcessorChain creating updateRequestProcessorChain "dedupe"
   [junit4]   2> 183254 INFO  (coreLoadExecutor-386-thread-1-processing-n:127.0.0.1:45254_cu_i%2Ffg) [n:127.0.0.1:45254_cu_i%2Ffg c:control_collection s:shard1 r:core_node1 x:collection1] o.a.s.u.p.UpdateRequestProcessorChain inserting DistributedUpdateProcessorFactory into updateRequestProcessorChain "dedupe"
   [junit4]   2> 183254 INFO  (coreLoadExecutor-386-thread-1-processing-n:127.0.0.1:45254_cu_i%2Ffg) [n:127.0.0.1:45254_cu_i%2Ffg c:control_collection s:shard1 r:core_node1 x:collection1] o.a.s.u.p.UpdateRequestProcessorChain creating updateRequestProcessorChain "stored_sig"
   [junit4]   2> 183254 INFO  (coreLoadExecutor-386-thread-1-processing-n:127.0.0.1:45254_cu_i%2Ffg) [n:127.0.0.1:45254_cu_i%2Ffg c:control_collection s:shard1 r:core_node1 x:collection1] o.a.s.u.p.UpdateRequestProcessorChain inserting DistributedUpdateProcessorFactory into updateRequestProcessorChain "stored_sig"
   [junit4]   2> 183254 INFO  (coreLoadExecutor-386-thread-1-processing-n:127.0.0.1:45254_cu_i%2Ffg) [n:127.0.0.1:45254_cu_i%2Ffg c:control_collection s:shard1 r:core_node1 x:collection1] o.a.s.u.p.UpdateRequestProcessorChain creating updateRequestProcessorChain "distrib-dup-test-chain-explicit"
   [junit4]   2> 183255 INFO  (coreLoadExecutor-386-thread-1-processing-n:127.0.0.1:45254_cu_i%2Ffg) [n:127.0.0.1:45254_cu_i%2Ffg c:control_collection s:shard1 r:core_node1 x:collection1] o.a.s.u.p.UpdateRequestProcessorChain creating updateRequestProcessorChain "distrib-dup-test-chain-implicit"
   [junit4]   2> 183255 INFO  (coreLoadExecutor-386-thread-1-processing-n:127.0.0.1:45254_cu_i%2Ffg) [n:127.0.0.1:45254_cu_i%2Ffg c:control_collection s:shard1 r:core_node1 x:collection1] o.a.s.u.p.UpdateRequestProcessorChain inserting DistributedUpdateProcessorFactory into updateRequestProcessorChain "distrib-dup-test-chain-implicit"
   [junit4]   2> 183255 INFO  (coreLoadExecutor-386-thread-1-processing-n:127.0.0.1:45254_cu_i%2Ffg) [n:127.0.0.1:45254_cu_i%2Ffg c:control_collection s:shard1 r:core_node1 x:collection1] o.a.s.c.SolrCore no updateRequestProcessorChain defined as default, creating implicit default
   [junit4]   2> 183255 WARN  (coreLoadExecutor-386-thread-1-processing-n:127.0.0.1:45254_cu_i%2Ffg) [n:127.0.0.1:45254_cu_i%2Ffg c:control_collection s:shard1 r:core_node1 x:collection1] o.a.s.c.RequestHandlers INVALID paramSet a in requestHandler {type = requestHandler,name = /dump,class = DumpRequestHandler,args = {defaults={a=A,b=B}}}
   [junit4]   2> 183258 INFO  (coreLoadExecutor-386-thread-1-processing-n:127.0.0.1:45254_cu_i%2Ffg) [n:127.0.0.1:45254_cu_i%2Ffg c:control_collection s:shard1 r:core_node1 x:collection1] o.a.s.h.l.XMLLoader xsltCacheLifetimeSeconds=60
   [junit4]   2> 183260 INFO  (coreLoadExecutor-386-thread-1-processing-n:127.0.0.1:45254_cu_i%2Ffg) [n:127.0.0.1:45254_cu_i%2Ffg c:control_collection s:shard1 r:core_node1 x:collection1] o.a.s.h.l.XMLLoader xsltCacheLifetimeSeconds=60
   [junit4]   2> 183261 INFO  (coreLoadExecutor-386-thread-1-processing-n:127.0.0.1:45254_cu_i%2Ffg) [n:127.0.0.1:45254_cu_i%2Ffg c:control_collection s:shard1 r:core_node1 x:collection1] o.a.s.h.l.XMLLoader xsltCacheLifetimeSeconds=60
   [junit4]   2> 183263 INFO  (coreLoadExecutor-386-thread-1-processing-n:127.0.0.1:45254_cu_i%2Ffg) [n:127.0.0.1:45254_cu_i%2Ffg c:control_collection s:shard1 r:core_node1 x:collection1] o.a.s.h.l.XMLLoader xsltCacheLifetimeSeconds=60
   [junit4]   2> 183268 INFO  (coreLoadExecutor-386-thread-1-processing-n:127.0.0.1:45254_cu_i%2Ffg) [n:127.0.0.1:45254_cu_i%2Ffg c:control_collection s:shard1 r:core_node1 x:collection1] o.a.s.c.RequestHandlers Registered paths: /admin/threads,/admin/luke,/get,/admin/ping,/replication,/admin/system,standard,/admin/properties,/schema,/admin/segments,/admin/plugins,/update,/admin/mbeans,/admin/logging,/update/json,/dump,/update/json/docs,/config,/admin/file,/update/csv
   [junit4]   2> 183269 INFO  (coreLoadExecutor-386-thread-1-processing-n:127.0.0.1:45254_cu_i%2Ffg) [n:127.0.0.1:45254_cu_i%2Ffg c:control_collection s:shard1 r:core_node1 x:collection1] o.a.s.c.SolrCore Using default statsCache cache: org.apache.solr.search.stats.LocalStatsCache
   [junit4]   2> 183270 INFO  (coreLoadExecutor-386-thread-1-processing-n:127.0.0.1:45254_cu_i%2Ffg) [n:127.0.0.1:45254_cu_i%2Ffg c:control_collection s:shard1 r:core_node1 x:collection1] o.a.s.u.UpdateHandler Using UpdateLog implementation: org.apache.solr.update.UpdateLog
   [junit4]   2> 183270 INFO  (coreLoadExecutor-386-thread-1-processing-n:127.0.0.1:45254_cu_i%2Ffg) [n:127.0.0.1:45254_cu_i%2Ffg c:control_collection s:shard1 r:core_node1 x:collection1] o.a.s.u.UpdateLog Initializing UpdateLog: dataDir= defaultSyncLevel=FLUSH numRecordsToKeep=100 maxNumLogsToKeep=10 numVersionBuckets=65536
   [junit4]   2> 183271 INFO  (coreLoadExecutor-386-thread-1-processing-n:127.0.0.1:45254_cu_i%2Ffg) [n:127.0.0.1:45254_cu_i%2Ffg c:control_collection s:shard1 r:core_node1 x:collection1] o.a.s.u.CommitTracker Hard AutoCommit: disabled
   [junit4]   2> 183271 INFO  (coreLoadExecutor-386-thread-1-processing-n:127.0.0.1:45254_cu_i%2Ffg) [n:127.0.0.1:45254_cu_i%2Ffg c:control_collection s:shard1 r:core_node1 x:collection1] o.a.s.u.CommitTracker Soft AutoCommit: disabled
   [junit4]   2> 183271 INFO  (coreLoadExecutor-386-thread-1-processing-n:127.0.0.1:45254_cu_i%2Ffg) [n:127.0.0.1:45254_cu_i%2Ffg c:control_collection s:shard1 r:core_node1 x:collection1] o.a.s.u.RandomMergePolicy RandomMergePolicy wrapping class org.apache.lucene.index.TieredMergePolicy: [TieredMergePolicy: maxMergeAtOnce=23, maxMergeAtOnceExplicit=42, maxMergedSegmentMB=89.234375, floorSegmentMB=0.455078125, forceMergeDeletesPctAllowed=12.14149818850256, segmentsPerTier=33.0, maxCFSSegmentSizeMB=8.796093022207999E12, noCFSRatio=0.0
   [junit4]   2> 183272 INFO  (coreLoadExecutor-386-thread-1-processing-n:127.0.0.1:45254_cu_i%2Ffg) [n:127.0.0.1:45254_cu_i%2Ffg c:control_collection s:shard1 r:core_node1 x:collection1] o.a.s.c.SolrDeletionPolicy SolrDeletionPolicy.onInit: commits: num=1
   [junit4]   2> 	commit{dir=MockDirectoryWrapper(RAMDirectory@6311f14f lockFactory=org.apache.lucene.store.SingleInstanceLockFactory@2ef9ac59),segFN=segments_1,generation=1}
   [junit4]   2> 183272 INFO  (coreLoadExecutor-386-thread-1-processing-n:127.0.0.1:45254_cu_i%2Ffg) [n:127.0.0.1:45254_cu_i%2Ffg c:control_collection s:shard1 r:core_node1 x:collection1] o.a.s.c.SolrDeletionPolicy newest commit generation = 1
   [junit4]   2> 183272 INFO  (coreLoadExecutor-386-thread-1-processing-n:127.0.0.1:45254_cu_i%2Ffg) [n:127.0.0.1:45254_cu_i%2Ffg c:control_collection s:shard1 r:core_node1 x:collection1] o.a.s.s.SolrIndexSearcher Opening Searcher@1e724c64[collection1] main
   [junit4]   2> 183273 INFO  (coreLoadExecutor-386-thread-1-processing-n:127.0.0.1:45254_cu_i%2Ffg) [n:127.0.0.1:45254_cu_i%2Ffg c:control_collection s:shard1 r:core_node1 x:collection1] o.a.s.c.c.ZkStateReader Load collection config from: [/collections/control_collection]
   [junit4]   2> 183274 INFO  (coreLoadExecutor-386-thread-1-processing-n:127.0.0.1:45254_cu_i%2Ffg) [n:127.0.0.1:45254_cu_i%2Ffg c:control_collection s:shard1 r:core_node1 x:collection1] o.a.s.c.c.ZkStateReader path=[/collections/control_collection] [configName]=[conf1] specified config exists in ZooKeeper
   [junit4]   2> 183274 INFO  (coreLoadExecutor-386-thread-1-processing-n:127.0.0.1:45254_cu_i%2Ffg) [n:127.0.0.1:45254_cu_i%2Ffg c:control_collection s:shard1 r:core_node1 x:collection1] o.a.s.r.ManagedResourceStorage Setting up ZooKeeper-based storage for the RestManager with znodeBase: /configs/conf1
   [junit4]   2> 183274 INFO  (coreLoadExecutor-386-thread-1-processing-n:127.0.0.1:45254_cu_i%2Ffg) [n:127.0.0.1:45254_cu_i%2Ffg c:control_collection s:shard1 r:core_node1 x:collection1] o.a.s.r.ManagedResourceStorage Configured ZooKeeperStorageIO with znodeBase: /configs/conf1
   [junit4]   2> 183274 INFO  (coreLoadExecutor-386-thread-1-processing-n:127.0.0.1:45254_cu_i%2Ffg) [n:127.0.0.1:45254_cu_i%2Ffg c:control_collection s:shard1 r:core_node1 x:collection1] o.a.s.r.RestManager Initializing RestManager with initArgs: {}
   [junit4]   2> 183274 INFO  (coreLoadExecutor-386-thread-1-processing-n:127.0.0.1:45254_cu_i%2Ffg) [n:127.0.0.1:45254_cu_i%2Ffg c:control_collection s:shard1 r:core_node1 x:collection1] o.a.s.r.ManagedResourceStorage Reading _rest_managed.json using ZooKeeperStorageIO:path=/configs/conf1
   [junit4]   2> 183275 INFO  (coreLoadExecutor-386-thread-1-processing-n:127.0.0.1:45254_cu_i%2Ffg) [n:127.0.0.1:45254_cu_i%2Ffg c:control_collection s:shard1 r:core_node1 x:collection1] o.a.s.r.ManagedResourceStorage No data found for znode /configs/conf1/_rest_managed.json
   [junit4]   2> 183275 INFO  (coreLoadExecutor-386-thread-1-processing-n:127.0.0.1:45254_cu_i%2Ffg) [n:127.0.0.1:45254_cu_i%2Ffg c:control_collection s:shard1 r:core_node1 x:collection1] o.a.s.r.ManagedResourceStorage Loaded null at path _rest_managed.json using ZooKeeperStorageIO:path=/configs/conf1
   [junit4]   2> 183275 INFO  (coreLoadExecutor-386-thread-1-processing-n:127.0.0.1:45254_cu_i%2Ffg) [n:127.0.0.1:45254_cu_i%2Ffg c:control_collection s:shard1 r:core_node1 x:collection1] o.a.s.r.RestManager Initializing 0 registered ManagedResources
   [junit4]   2> 183275 INFO  (coreLoadExecutor-386-thread-1-processing-n:127.0.0.1:45254_cu_i%2Ffg) [n:127.0.0.1:45254_cu_i%2Ffg c:control_collection s:shard1 r:core_node1 x:collection1] o.a.s.h.ReplicationHandler Commits will be reserved for  10000
   [junit4]   2> 183277 INFO  (searcherExecutor-387-thread-1-processing-s:shard1 r:core_node1 n:127.0.0.1:45254_cu_i%2Ffg c:control_collection x:collection1) [n:127.0.0.1:45254_cu_i%2Ffg c:control_collection s:shard1 r:core_node1 x:collection1] o.a.s.c.SolrCore [collection1] Registered new searcher Searcher@1e724c64[collection1] main{ExitableDirectoryReader(UninvertingDirectoryReader())}
   [junit4]   2> 183277 INFO  (coreLoadExecutor-386-thread-1-processing-n:127.0.0.1:45254_cu_i%2Ffg) [n:127.0.0.1:45254_cu_i%2Ffg c:control_collection s:shard1 r:core_node1 x:collection1] o.a.s.u.UpdateLog Looking up max value of version field to seed version buckets
   [junit4]   2> 183277 INFO  (coreLoadExecutor-386-thread-1-processing-n:127.0.0.1:45254_cu_i%2Ffg) [n:127.0.0.1:45254_cu_i%2Ffg c:control_collection s:shard1 r:core_node1 x:collection1] o.a.s.u.VersionInfo Refreshing highest value of _version_ for 65536 version buckets from index
   [junit4]   2> 183277 INFO  (coreLoadExecutor-386-thread-1-processing-n:127.0.0.1:45254_cu_i%2Ffg) [n:127.0.0.1:45254_cu_i%2Ffg c:control_collection s:shard1 r:core_node1 x:collection1] o.a.s.u.VersionInfo No terms found for _version_, cannot seed version bucket highest value from index
   [junit4]   2> 183277 INFO  (coreLoadExecutor-386-thread-1-processing-n:127.0.0.1:45254_cu_i%2Ffg) [n:127.0.0.1:45254_cu_i%2Ffg c:control_collection s:shard1 r:core_node1 x:collection1] o.a.s.u.UpdateLog Could not find max version in index or recent updates, using new clock 1526423819820990464
   [junit4]   2> 183279 INFO  (coreLoadExecutor-386-thread-1-processing-n:127.0.0.1:45254_cu_i%2Ffg) [n:127.0.0.1:45254_cu_i%2Ffg c:control_collection s:shard1 r:core_node1 x:collection1] o.a.s.u.UpdateLog Took 2.0ms to seed version buckets with highest version 1526423819820990464
   [junit4]   2> 183280 INFO  (coreLoadExecutor-386-thread-1-processing-n:127.0.0.1:45254_cu_i%2Ffg) [n:127.0.0.1:45254_cu_i%2Ffg c:control_collection s:shard1 r:core_node1 x:collection1] o.a.s.c.ZkController watch zkdir /configs/conf1
   [junit4]   2> 183280 INFO  (coreLoadExecutor-386-thread-1-processing-n:127.0.0.1:45254_cu_i%2Ffg) [n:127.0.0.1:45254_cu_i%2Ffg c:control_collection s:shard1 r:core_node1 x:collection1] o.a.s.c.CoreContainer registering core: collection1
   [junit4]   2> 183281 INFO  (coreZkRegister-380-thread-1-processing-s:shard1 r:core_node1 n:127.0.0.1:45254_cu_i%2Ffg c:control_collection x:collection1) [n:127.0.0.1:45254_cu_i%2Ffg c:control_collection s:shard1 r:core_node1 x:collection1] o.a.s.c.ZkController Register replica - core:collection1 address:http://127.0.0.1:45254/cu_i/fg collection:control_collection shard:shard1
   [junit4]   2> 183282 INFO  (coreZkRegister-380-thread-1-processing-s:shard1 r:core_node1 n:127.0.0.1:45254_cu_i%2Ffg c:control_collection x:collection1) [n:127.0.0.1:45254_cu_i%2Ffg c:control_collection s:shard1 r:core_node1 x:collection1] o.a.s.c.c.SolrZkClient makePath: /collections/control_collection/leader_elect/shard1/election
   [junit4]   2> 183285 INFO  (coreZkRegister-380-thread-1-processing-s:shard1 r:core_node1 n:127.0.0.1:45254_cu_i%2Ffg c:control_collection x:collection1) [n:127.0.0.1:45254_cu_i%2Ffg c:control_collection s:shard1 r:core_node1 x:collection1] o.a.s.c.LeaderElector Joined leadership election with path: /collections/control_collection/leader_elect/shard1/election/95401488593059846-core_node1-n_0000000000
   [junit4]   2> 183286 INFO  (coreZkRegister-380-thread-1-processing-s:shard1 r:core_node1 n:127.0.0.1:45254_cu_i%2Ffg c:control_collection x:collection1) [n:127.0.0.1:45254_cu_i%2Ffg c:control_collection s:shard1 r:core_node1 x:collection1] o.a.s.c.ShardLeaderElectionContext Running the leader process for shard=shard1 and weAreReplacement=false and leaderVoteWait=180000
   [junit4]   2> 183287 INFO  (coreZkRegister-380-thread-1-processing-s:shard1 r:core_node1 n:127.0.0.1:45254_cu_i%2Ffg c:control_collection x:collection1) [n:127.0.0.1:45254_cu_i%2Ffg c:control_collection s:shard1 r:core_node1 x:collection1] o.a.s.c.ShardLeaderElectionContext Enough replicas found to continue.
   [junit4]   2> 183287 INFO  (coreZkRegister-380-thread-1-processing-s:shard1 r:core_node1 n:127.0.0.1:45254_cu_i%2Ffg c:control_collection x:collection1) [n:127.0.0.1:45254_cu_i%2Ffg c:control_collection s:shard1 r:core_node1 x:collection1] o.a.s.c.ShardLeaderElectionContext I may be the new leader - try and sync
   [junit4]   2> 183287 INFO  (coreZkRegister-380-thread-1-processing-s:shard1 r:core_node1 n:127.0.0.1:45254_cu_i%2Ffg c:control_collection x:collection1) [n:127.0.0.1:45254_cu_i%2Ffg c:control_collection s:shard1 r:core_node1 x:collection1] o.a.s.c.SyncStrategy Sync replicas to http://127.0.0.1:45254/cu_i/fg/collection1/
   [junit4]   2> 183288 INFO  (coreZkRegister-380-thread-1-processing-s:shard1 r:core_node1 n:127.0.0.1:45254_cu_i%2Ffg c:control_collection x:collection1) [n:127.0.0.1:45254_cu_i%2Ffg c:control_collection s:shard1 r:core_node1 x:collection1] o.a.s.c.SyncStrategy Sync Success - now sync replicas to me
   [junit4]   2> 183288 INFO  (coreZkRegister-380-thread-1-processing-s:shard1 r:core_node1 n:127.0.0.1:45254_cu_i%2Ffg c:control_collection x:collection1) [n:127.0.0.1:45254_cu_i%2Ffg c:control_collection s:shard1 r:core_node1 x:collection1] o.a.s.c.SyncStrategy http://127.0.0.1:45254/cu_i/fg/collection1/ has no replicas
   [junit4]   2> 183288 INFO  (OverseerStateUpdate-95401488593059846-127.0.0.1:45254_cu_i%2Ffg-n_0000000000) [n:127.0.0.1:45254_cu_i%2Ffg    ] o.a.s.c.Overseer processMessage: queueSize: 1, message = {
   [junit4]   2>   "operation":"leader",
   [junit4]   2>   "shard":"shard1",
   [junit4]   2>   "collection":"control_collection"} current state version: 1
   [junit4]   2> 183289 INFO  (coreZkRegister-380-thread-1-processing-s:shard1 r:core_node1 n:127.0.0.1:45254_cu_i%2Ffg c:control_collection x:collection1) [n:127.0.0.1:45254_cu_i%2Ffg c:control_collection s:shard1 r:core_node1 x:collection1] o.a.s.c.c.SolrZkClient makePath: /collections/control_collection/leaders/shard1
   [junit4]   2> 183292 INFO  (coreZkRegister-380-thread-1-processing-s:shard1 r:core_node1 n:127.0.0.1:45254_cu_i%2Ffg c:control_collection x:collection1) [n:127.0.0.1:45254_cu_i%2Ffg c:control_collection s:shard1 r:core_node1 x:collection1] o.a.s.c.ShardLeaderElectionContextBase Creating leader registration node
   [junit4]   2> 183295 INFO  (coreZkRegister-380-thread-1-processing-s:shard1 r:core_node1 n:127.0.0.1:45254_cu_i%2Ffg c:control_collection x:collection1) [n:127.0.0.1:45254_cu_i%2Ffg c:control_collection s:shard1 r:core_node1 x:collection1] o.a.s.c.ShardLeaderElectionContext I am the new leader: http://127.0.0.1:45254/cu_i/fg/collection1/ shard1
   [junit4]   2> 183296 INFO  (OverseerStateUpdate-95401488593059846-127.0.0.1:45254_cu_i%2Ffg-n_0000000000) [n:127.0.0.1:45254_cu_i%2Ffg    ] o.a.s.c.Overseer processMessage: queueSize: 1, message = {
   [junit4]   2>   "operation":"leader",
   [junit4]   2>   "shard":"shard1",
   [junit4]   2>   "collection":"control_collection",
   [junit4]   2>   "base_url":"http://127.0.0.1:45254/cu_i/fg",
   [junit4]   2>   "core":"collection1",
   [junit4]   2>   "state":"active"} current state version: 1
   [junit4]   2> 183339 INFO  (TEST-CollectionsAPIDistributedZkTest.test-seed#[3D49B6BCFBA4BC04]) [    ] o.a.s.c.c.SolrZkClient Using default ZkCredentialsProvider
   [junit4]   2> 183340 INFO  (TEST-CollectionsAPIDistributedZkTest.test-seed#[3D49B6BCFBA4BC04]) [    ] o.a.s.c.c.ConnectionManager Waiting for client to connect to ZooKeeper
   [junit4]   2> 183341 INFO  (zkCallback-143-thread-1) [    ] o.a.s.c.c.ConnectionManager Watcher org.apache.solr.common.cloud.ConnectionManager@26d51159 name:ZooKeeperConnection Watcher:127.0.0.1:52759/solr got event WatchedEvent state:SyncConnected type:None path:null path:null type:None
   [junit4]   2> 183342 INFO  (TEST-CollectionsAPIDistributedZkTest.test-seed#[3D49B6BCFBA4BC04]) [    ] o.a.s.c.c.ConnectionManager Client is connected to ZooKeeper
   [junit4]   2> 183342 INFO  (TEST-CollectionsAPIDistributedZkTest.test-seed#[3D49B6BCFBA4BC04]) [    ] o.a.s.c.c.SolrZkClient Using default ZkACLProvider
   [junit4]   2> 183342 INFO  (TEST-CollectionsAPIDistributedZkTest.test-seed#[3D49B6BCFBA4BC04]) [    ] o.a.s.c.c.ZkStateReader Updating cluster state from ZooKeeper... 
   [junit4]   2> 183347 INFO  (TEST-CollectionsAPIDistributedZkTest.test-seed#[3D49B6BCFBA4BC04]) [    ] o.a.s.c.ChaosMonkey monkey: init - expire sessions:false cause connection loss:false
   [junit4]   2> 183400 INFO  (zkCallback-143-thread-1) [    ] o.a.s.c.c.ZkStateReader A cluster state change: [WatchedEvent state:SyncConnected type:NodeDataChanged path:/clusterstate.json], has occurred - updating... (live nodes size: [1])
   [junit4]   2> 183400 INFO  (zkCallback-141-thread-2-processing-n:127.0.0.1:45254_cu_i%2Ffg) [n:127.0.0.1:45254_cu_i%2Ffg    ] o.a.s.c.c.ZkStateReader A cluster state change: [WatchedEvent state:SyncConnected type:NodeDataChanged path:/clusterstate.json], has occurred - updating... (live nodes size: [1])
   [junit4]   2> 183400 INFO  (zkCallback-141-thread-3-processing-n:127.0.0.1:45254_cu_i%2Ffg) [n:127.0.0.1:45254_cu_i%2Ffg    ] o.a.s.c.c.ZkStateReader A cluster state change: [WatchedEvent state:SyncConnected type:NodeDataChanged path:/clusterstate.json], has occurred - updating... (live nodes size: [1])
   [junit4]   2> 183442 INFO  (TEST-CollectionsAPIDistributedZkTest.test-seed#[3D49B6BCFBA4BC04]) [    ] o.a.s.SolrTestCaseJ4 Writing core.properties file to /x1/jenkins/jenkins-slave/workspace/Lucene-Solr-NightlyTests-5.x/solr/build/solr-core/test/J1/temp/solr.cloud.CollectionsAPIDistributedZkTest_3D49B6BCFBA4BC04-001/shard-1-001/cores/collection1
   [junit4]   2> 183443 INFO  (TEST-CollectionsAPIDistributedZkTest.test-seed#[3D49B6BCFBA4BC04]) [    ] o.a.s.c.AbstractFullDistribZkTestBase create jetty 1 in directory /x1/jenkins/jenkins-slave/workspace/Lucene-Solr-NightlyTests-5.x/solr/build/solr-core/test/J1/temp/solr.cloud.CollectionsAPIDistributedZkTest_3D49B6BCFBA4BC04-001/shard-1-001
   [junit4]   2> 183444 INFO  (TEST-CollectionsAPIDistributedZkTest.test-seed#[3D49B6BCFBA4BC04]) [    ] o.e.j.s.Server jetty-9.2.13.v20150730
   [junit4]   2> 183446 INFO  (TEST-CollectionsAPIDistributedZkTest.test-seed#[3D49B6BCFBA4BC04]) [    ] o.e.j.s.h.ContextHandler Started o.e.j.s.ServletContextHandler@76e0fdd0{/cu_i/fg,null,AVAILABLE}
   [junit4]   2> 183446 INFO  (TEST-CollectionsAPIDistributedZkTest.test-seed#[3D49B6BCFBA4BC04]) [    ] o.e.j.s.ServerConnector Started ServerConnector@1ed32770{HTTP/1.1}{127.0.0.1:40080}
   [junit4]   2> 183446 INFO  (TEST-CollectionsAPIDistributedZkTest.test-seed#[3D49B6BCFBA4BC04]) [    ] o.e.j.s.Server Started @186521ms
   [junit4]   2> 183446 INFO  (TEST-CollectionsAPIDistributedZkTest.test-seed#[3D49B6BCFBA4BC04]) [    ] o.a.s.c.s.e.JettySolrRunner Jetty properties: {solr.data.dir=/x1/jenkins/jenkins-slave/workspace/Lucene-Solr-NightlyTests-5.x/solr/build/solr-core/test/J1/temp/solr.cloud.CollectionsAPIDistributedZkTest_3D49B6BCFBA4BC04-001/tempDir-001/jetty1, hostContext=/cu_i/fg, hostPort=40080, coreRootDirectory=/x1/jenkins/jenkins-slave/workspace/Lucene-Solr-NightlyTests-5.x/solr/build/solr-core/test/J1/../../../../../../../../../../x1/jenkins/jenkins-slave/workspace/Lucene-Solr-NightlyTests-5.x/solr/build/solr-core/test/J1/temp/solr.cloud.CollectionsAPIDistributedZkTest_3D49B6BCFBA4BC04-001/shard-1-001/cores, solrconfig=solrconfig.xml}
   [junit4]   2> 183447 INFO  (TEST-CollectionsAPIDistributedZkTest.test-seed#[3D49B6BCFBA4BC04]) [    ] o.a.s.s.SolrDispatchFilter SolrDispatchFilter.init(): sun.misc.Launcher$AppClassLoader@41692a49
   [junit4]   2> 183447 INFO  (TEST-CollectionsAPIDistributedZkTest.test-seed#[3D49B6BCFBA4BC04]) [    ] o.a.s.c.SolrResourceLoader new SolrResourceLoader for directory: '/x1/jenkins/jenkins-slave/workspace/Lucene-Solr-NightlyTests-5.x/solr/build/solr-core/test/J1/temp/solr.cloud.CollectionsAPIDistributedZkTest_3D49B6BCFBA4BC04-001/shard-1-001'
   [junit4]   2> 183447 INFO  (TEST-CollectionsAPIDistributedZkTest.test-seed#[3D49B6BCFBA4BC04]) [    ] o.a.s.c.SolrResourceLoader JNDI not configured for solr (NoInitialContextEx)
   [junit4]   2> 183447 INFO  (coreZkRegister-380-thread-1-processing-s:shard1 r:core_node1 n:127.0.0.1:45254_cu_i%2Ffg c:control_collection x:collection1) [n:127.0.0.1:45254_cu_i%2Ffg c:control_collection s:shard1 r:core_node1 x:collection1] o.a.s.c.ZkController We are http://127.0.0.1:45254/cu_i/fg/collection1/ and leader is http://127.0.0.1:45254/cu_i/fg/collection1/
   [junit4]   2> 183447 INFO  (TEST-CollectionsAPIDistributedZkTest.test-seed#[3D49B6BCFBA4BC04]) [    ] o.a.s.c.SolrResourceLoader solr home defaulted to 'solr/' (could not find system property or JNDI)
   [junit4]   2> 183447 INFO  (coreZkRegister-380-thread-1-processing-s:shard1 r:core_node1 n:127.0.0.1:45254_cu_i%2Ffg c:control_collection x:collection1) [n:127.0.0.1:45254_cu_i%2Ffg c:control_collection s:shard1 r:core_node1 x:collection1] o.a.s.c.ZkController No LogReplay needed for core=collection1 baseURL=http://127.0.0.1:45254/cu_i/fg
   [junit4]   2> 183447 INFO  (coreZkRegister-380-thread-1-processing-s:shard1 r:core_node1 n:127.0.0.1:45254_cu_i%2Ffg c:control_collection x:collection1) [n:127.0.0.1:45254_cu_i%2Ffg c:control_collection s:shard1 r:core_node1 x:collection1] o.a.s.c.ZkController I am the leader, no recovery necessary
   [junit4]   2> 183447 INFO  (coreZkRegister-380-thread-1-processing-s:shard1 r:core_node1 n:127.0.0.1:45254_cu_i%2Ffg c:control_collection x:collection1) [n:127.0.0.1:45254_cu_i%2Ffg c:control_collection s:shard1 r:core_node1 x:collection1] o.a.s.c.ZkController publishing state=active
   [junit4]   2> 183447 INFO  (coreZkRegister-380-thread-1-processing-s:shard1 r:core_node1 n:127.0.0.1:45254_cu_i%2Ffg c:control_collection x:collection1) [n:127.0.0.1:45254_cu_i%2Ffg c:control_collection s:shard1 r:core_node1 x:collection1] o.a.s.c.ZkController numShards not found on descriptor - reading it from system property
   [junit4]   2> 183447 INFO  (TEST-CollectionsAPIDistributedZkTest.test-seed#[3D49B6BCFBA4BC04]) [    ] o.a.s.c.c.SolrZkClient Using default ZkCredentialsProvider
   [junit4]   2> 183448 INFO  (TEST-CollectionsAPIDistributedZkTest.test-seed#[3D49B6BCFBA4BC04]) [    ] o.a.s.c.c.ConnectionManager Waiting for client to connect to ZooKeeper
   [junit4]   2> 183449 INFO  (zkCallback-144-thread-1) [    ] o.a.s.c.c.ConnectionManager Watcher org.apache.solr.common.cloud.ConnectionManager@2b03330e name:ZooKeeperConnection Watcher:127.0.0.1:52759/solr got event WatchedEvent state:SyncConnected type:None path:null path:null type:None
   [junit4]   2> 183450 INFO  (TEST-CollectionsAPIDistributedZkTest.test-seed#[3D49B6BCFBA4BC04]) [    ] o.a.s.c.c.ConnectionManager Client is connected to ZooKeeper
   [junit4]   2> 183450 INFO  (TEST-CollectionsAPIDistributedZkTest.test-seed#[3D49B6BCFBA4BC04]) [    ] o.a.s.c.c.SolrZkClient Using default ZkACLProvider
   [junit4]   2> 183450 INFO  (OverseerStateUpdate-95401488593059846-127.0.0.1:45254_cu_i%2Ffg-n_0000000000) [n:127.0.0.1:45254_cu_i%2Ffg    ] o.a.s.c.Overseer processMessage: queueSize: 1, message = {
   [junit4]   2>   "shard":"shard1",
   [junit4]   2>   "base_url":"http://127.0.0.1:45254/cu_i/fg",
   [junit4]   2>   "operation":"state",
   [junit4]   2>   "node_name":"127.0.0.1:45254_cu_i%2Ffg",
   [junit4]   2>   "core_node_name":"core_node1",
   [junit4]   2>   "numShards":"2",
   [junit4]   2>   "roles":null,
   [junit4]   2>   "state":"active",
   [junit4]   2>   "collection":"control_collection",
   [junit4]   2>   "core":"collection1"} current state version: 2
   [junit4]   2> 183451 INFO  (OverseerStateUpdate-95401488593059846-127.0.0.1:45254_cu_i%2Ffg-n_0000000000) [n:127.0.0.1:45254_cu_i%2Ffg    ] o.a.s.c.o.ReplicaMutator Update state numShards=2 message={
   [junit4]   2>   "shard":"shard1",
   [junit4]   2>   "base_url":"http://127.0.0.1:45254/cu_i/fg",
   [junit4]   2>   "operation":"state",
   [junit4]   2>   "node_name":"127.0.0.1:45254_cu_i%2Ffg",
   [junit4]   2>   "core_node_name":"core_node1",
   [junit4]   2>   "numShards":"2",
   [junit4]   2>   "roles":null,
   [junit4]   2>   "state":"active",
   [junit4]   2>   "collection":"control_collection",
   [junit4]   2>   "core":"collection1"}
   [junit4]   2> 183451 INFO  (TEST-CollectionsAPIDistributedZkTest.test-seed#[3D49B6BCFBA4BC04]) [    ] o.a.s.s.SolrDispatchFilter Loading solr.xml from SolrHome (not found in ZooKeeper)
   [junit4]   2> 183451 INFO  (TEST-CollectionsAPIDistributedZkTest.test-seed#[3D49B6BCFBA4BC04]) [    ] o.a.s.c.SolrXmlConfig Loading container configuration from /x1/jenkins/jenkins-slave/workspace/Lucene-Solr-NightlyTests-5.x/solr/build/solr-core/test/J1/temp/solr.cloud.CollectionsAPIDistributedZkTest_3D49B6BCFBA4BC04-001/shard-1-001/solr.xml
   [junit4]   2> 183475 INFO  (TEST-CollectionsAPIDistributedZkTest.test-seed#[3D49B6BCFBA4BC04]) [    ] o.a.s.c.CorePropertiesLocator Config-defined core root directory: /x1/jenkins/jenkins-slave/workspace/Lucene-Solr-NightlyTests-5.x/solr/build/solr-core/test/J1/../../../../../../../../../../x1/jenkins/jenkins-slave/workspace/Lucene-Solr-NightlyTests-5.x/solr/build/solr-core/test/J1/temp/solr.cloud.CollectionsAPIDistributedZkTest_3D49B6BCFBA4BC04-001/shard-1-001/cores
   [junit4]   2> 183475 INFO  (TEST-CollectionsAPIDistributedZkTest.test-seed#[3D49B6BCFBA4BC04]) [    ] o.a.s.c.CoreContainer New CoreContainer 38918159
   [junit4]   2> 183475 INFO  (TEST-CollectionsAPIDistributedZkTest.test-seed#[3D49B6BCFBA4BC04]) [    ] o.a.s.c.CoreContainer Loading cores into CoreContainer [instanceDir=/x1/jenkins/jenkins-slave/workspace/Lucene-Solr-NightlyTests-5.x/solr/build/solr-core/test/J1/temp/solr.cloud.CollectionsAPIDistributedZkTest_3D49B6BCFBA4BC04-001/shard-1-001]
   [junit4]   2> 183476 WARN  (TEST-CollectionsAPIDistributedZkTest.test-seed#[3D49B6BCFBA4BC04]) [    ] o.a.s.c.CoreContainer Couldn't add files from /x1/jenkins/jenkins-slave/workspace/Lucene-Solr-NightlyTests-5.x/solr/build/solr-core/test/J1/temp/solr.cloud.CollectionsAPIDistributedZkTest_3D49B6BCFBA4BC04-001/shard-1-001/lib to classpath: /x1/jenkins/jenkins-slave/workspace/Lucene-Solr-NightlyTests-5.x/solr/build/solr-core/test/J1/temp/solr.cloud.CollectionsAPIDistributedZkTest_3D49B6BCFBA4BC04-001/shard-1-001/lib
   [junit4]   2> 183476 INFO  (TEST-CollectionsAPIDistributedZkTest.test-seed#[3D49B6BCFBA4BC04]) [    ] o.a.s.h.c.HttpShardHandlerFactory created with socketTimeout : 90000,urlScheme : ,connTimeout : 15000,maxConnectionsPerHost : 20,maxConnections : 10000,corePoolSize : 0,maximumPoolSize : 2147483647,maxThreadIdleTime : 5,sizeOfQueue : -1,fairnessPolicy : false,useRetries : false,
   [junit4]   2> 183477 INFO  (TEST-CollectionsAPIDistributedZkTest.test-seed#[3D49B6BCFBA4BC04]) [    ] o.a.s.u.UpdateShardHandler Creating UpdateShardHandler HTTP client with params: socketTimeout=340000&connTimeout=45000&retry=true
   [junit4]   2> 183478 INFO  (TEST-CollectionsAPIDistributedZkTest.test-seed#[3D49B6BCFBA4BC04]) [    ] o.a.s.l.LogWatcher SLF4J impl is org.slf4j.impl.Log4jLoggerFactory
   [junit4]   2> 183478 INFO  (TEST-CollectionsAPIDistributedZkTest.test-seed#[3D49B6BCFBA4BC04]) [    ] o.a.s.l.LogWatcher Registering Log Listener [Log4j (org.slf4j.impl.Log4jLoggerFactory)]
   [junit4]   2> 183478 INFO  (TEST-CollectionsAPIDistributedZkTest.test-seed#[3D49B6BCFBA4BC04]) [    ] o.a.s.c.ZkContainer Zookeeper client=127.0.0.1:52759/solr
   [junit4]   2> 183478 INFO  (TEST-CollectionsAPIDistributedZkTest.test-seed#[3D49B6BCFBA4BC04]) [    ] o.a.s.c.ZkController zkHost includes chroot
   [junit4]   2> 183478 INFO  (TEST-CollectionsAPIDistributedZkTest.test-seed#[3D49B6BCFBA4BC04]) [    ] o.a.s.c.c.SolrZkClient Using default ZkCredentialsProvider
   [junit4]   2> 183478 INFO  (TEST-CollectionsAPIDistributedZkTest.test-seed#[3D49B6BCFBA4BC04]) [    ] o.a.s.c.c.ConnectionManager Waiting for client to connect to ZooKeeper
   [junit4]   2> 183480 INFO  (zkCallback-147-thread-1) [    ] o.a.s.c.c.ConnectionManager Watcher org.apache.solr.common.cloud.ConnectionManager@2c5bb455 name:ZooKeeperConnection Watcher:127.0.0.1:52759 got event WatchedEvent state:SyncConnected type:None path:null path:null type:None
   [junit4]   2> 183480 INFO  (TEST-CollectionsAPIDistributedZkTest.test-seed#[3D49B6BCFBA4BC04]) [    ] o.a.s.c.c.ConnectionManager Client is connected to ZooKeeper
   [junit4]   2> 183481 INFO  (TEST-CollectionsAPIDistributedZkTest.test-seed#[3D49B6BCFBA4BC04]) [    ] o.a.s.c.c.SolrZkClient Using default ZkACLProvider
   [junit4]   2> 183482 INFO  (TEST-CollectionsAPIDistributedZkTest.test-seed#[3D49B6BCFBA4BC04]) [n:127.0.0.1:40080_cu_i%2Ffg    ] o.a.s.c.c.ConnectionManager Waiting for client to connect to ZooKeeper
   [junit4]   2> 183484 INFO  (zkCallback-148-thread-1-processing-n:127.0.0.1:40080_cu_i%2Ffg) [n:127.0.0.1:40080_cu_i%2Ffg    ] o.a.s.c.c.ConnectionManager Watcher org.apache.solr.common.cloud.ConnectionManager@3fbd64fe name:ZooKeeperConnection Watcher:127.0.0.1:52759/solr got event WatchedEvent state:SyncConnected type:None path:null path:null type:None
   [junit4]   2> 183484 INFO  (TEST-CollectionsAPIDistributedZkTest.test-seed#[3D49B6BCFBA4BC04]) [n:127.0.0.1:40080_cu_i%2Ffg    ] o.a.s.c.c.ConnectionManager Client is connected to ZooKeeper
   [junit4]   2> 183490 INFO  (TEST-CollectionsAPIDistributedZkTest.test-seed#[3D49B6BCFBA4BC04]) [n:127.0.0.1:40080_cu_i%2Ffg    ] o.a.s.c.c.ZkStateReader Updating cluster state from ZooKeeper... 
   [junit4]   2> 183554 INFO  (zkCallback-141-thread-3-processing-n:127.0.0.1:45254_cu_i%2Ffg) [n:127.0.0.1:45254_cu_i%2Ffg    ] o.a.s.c.c.ZkStateReader A cluster state change: [WatchedEvent state:SyncConnected type:NodeDataChanged path:/clusterstate.json], has occurred - updating... (live nodes size: [1])
   [junit4]   2> 183554 INFO  (zkCallback-141-thread-2-processing-n:127.0.0.1:45254_cu_i%2Ffg) [n:127.0.0.1:45254_cu_i%2Ffg    ] o.a.s.c.c.ZkStateReader A cluster state change: [WatchedEvent state:SyncConnected type:NodeDataChanged path:/clusterstate.json], has occurred - updating... (live nodes size: [1])
   [junit4]   2> 183554 INFO  (zkCallback-143-thread-1) [    ] o.a.s.c.c.ZkStateReader A cluster state change: [WatchedEvent state:SyncConnected type:NodeDataChanged path:/clusterstate.json], has occurred - updating... (live nodes size: [1]

[...truncated too long message...]

SolrCloudCollection_shard1_replica1] o.a.s.c.CachingDirectoryFactory Closing directory: data/index
   [junit4]   2> 11733416 INFO  (jetty-launcher-2599-thread-7) [    ] o.a.s.c.Overseer Overseer (id=95401772438781963-127.0.0.1:44981_solr-n_0000000001) closing
   [junit4]   2> 11733420 INFO  (jetty-launcher-2599-thread-7) [    ] o.e.j.s.h.ContextHandler Stopped o.e.j.s.ServletContextHandler@69afbfa2{/solr,null,UNAVAILABLE}
   [junit4]   2> 11733422 INFO  (jetty-launcher-2599-thread-9) [    ] o.e.j.s.h.ContextHandler Stopped o.e.j.s.ServletContextHandler@368db9ff{/solr,null,UNAVAILABLE}
   [junit4]   2> 11733434 INFO  (coreCloseExecutor-10228-thread-1) [n:127.0.0.1:33428_solr c:testSolrCloudCollection s:shard2 r:core_node4 x:testSolrCloudCollection_shard2_replica2] o.a.s.c.CachingDirectoryFactory Closing RAMDirectoryFactory - 2 directories currently being tracked
   [junit4]   2> 11733435 INFO  (coreCloseExecutor-10228-thread-1) [n:127.0.0.1:33428_solr c:testSolrCloudCollection s:shard2 r:core_node4 x:testSolrCloudCollection_shard2_replica2] o.a.s.c.CachingDirectoryFactory looking to close data/index [CachedDir<<refCount=0;path=data/index;done=false>>]
   [junit4]   2> 11733435 INFO  (coreCloseExecutor-10228-thread-1) [n:127.0.0.1:33428_solr c:testSolrCloudCollection s:shard2 r:core_node4 x:testSolrCloudCollection_shard2_replica2] o.a.s.c.CachingDirectoryFactory Closing directory: data/index
   [junit4]   2> 11733435 INFO  (coreCloseExecutor-10228-thread-1) [n:127.0.0.1:33428_solr c:testSolrCloudCollection s:shard2 r:core_node4 x:testSolrCloudCollection_shard2_replica2] o.a.s.c.CachingDirectoryFactory looking to close data [CachedDir<<refCount=0;path=data;done=false>>]
   [junit4]   2> 11733435 INFO  (coreCloseExecutor-10228-thread-1) [n:127.0.0.1:33428_solr c:testSolrCloudCollection s:shard2 r:core_node4 x:testSolrCloudCollection_shard2_replica2] o.a.s.c.CachingDirectoryFactory Closing directory: data
   [junit4]   2> 11733440 INFO  (jetty-launcher-2599-thread-8) [    ] o.e.j.s.h.ContextHandler Stopped o.e.j.s.ServletContextHandler@1e7c4ee2{/solr,null,UNAVAILABLE}
   [junit4]   2> 11733442 INFO  (TEST-BasicAuthIntegrationTest.testBasics-seed#[3D49B6BCFBA4BC04]) [    ] o.a.s.c.ZkTestServer connecting to 127.0.0.1:44006 44006
   [junit4]   2> NOTE: leaving temporary files on disk at: /x1/jenkins/jenkins-slave/workspace/Lucene-Solr-NightlyTests-5.x/solr/build/solr-core/test/J1/temp/solr.security.BasicAuthIntegrationTest_3D49B6BCFBA4BC04-001
   [junit4]   2> 11733862 WARN  (jetty-launcher-2599-thread-2-SendThread(127.0.0.1:44006)) [n:127.0.0.1:44981_solr    ] o.a.z.c.StaticHostProvider Unexpected exception
   [junit4]   2> java.lang.InterruptedException: sleep interrupted
   [junit4]   2> 	at java.lang.Thread.sleep(Native Method)
   [junit4]   2> 	at org.apache.zookeeper.client.StaticHostProvider.next(StaticHostProvider.java:101)
   [junit4]   2> 	at org.apache.zookeeper.ClientCnxn$SendThread.startConnect(ClientCnxn.java:940)
   [junit4]   2> 	at org.apache.zookeeper.ClientCnxn$SendThread.run(ClientCnxn.java:1003)
   [junit4]   2> 11733862 WARN  (TEST-BasicAuthIntegrationTest.testBasics-seed#[3D49B6BCFBA4BC04]-SendThread(127.0.0.1:44006)) [n:127.0.0.1:49605_solr    ] o.a.z.c.StaticHostProvider Unexpected exception
   [junit4]   2> java.lang.InterruptedException: sleep interrupted
   [junit4]   2> 	at java.lang.Thread.sleep(Native Method)
   [junit4]   2> 	at org.apache.zookeeper.client.StaticHostProvider.next(StaticHostProvider.java:101)
   [junit4]   2> 	at org.apache.zookeeper.ClientCnxn$SendThread.startConnect(ClientCnxn.java:940)
   [junit4]   2> 	at org.apache.zookeeper.ClientCnxn$SendThread.run(ClientCnxn.java:1003)
   [junit4]   2> Feb 17, 2016 3:25:43 PM com.carrotsearch.randomizedtesting.ThreadLeakControl tryToInterruptAll
   [junit4]   2> INFO: All leaked threads terminated.
   [junit4]   2> NOTE: test params are: codec=Asserting(Lucene54): {range_facet_l=TestBloomFilteredLucenePostings(BloomFilteringPostingsFormat(Lucene50(blocksize=128))), id=Lucene50(blocksize=128), timestamp=TestBloomFilteredLucenePostings(BloomFilteringPostingsFormat(Lucene50(blocksize=128))), multiDefault=FSTOrd50, intDefault=TestBloomFilteredLucenePostings(BloomFilteringPostingsFormat(Lucene50(blocksize=128))), range_facet_i_dv=TestBloomFilteredLucenePostings(BloomFilteringPostingsFormat(Lucene50(blocksize=128))), _version_=TestBloomFilteredLucenePostings(BloomFilteringPostingsFormat(Lucene50(blocksize=128))), range_facet_l_dv=Lucene50(blocksize=128)}, docValues:{timestamp=DocValuesFormat(name=Memory), range_facet_i_dv=DocValuesFormat(name=Memory), range_facet_l_dv=DocValuesFormat(name=Lucene54)}, sim=DefaultSimilarity, locale=nl-BE, timezone=America/Santa_Isabel
   [junit4]   2> NOTE: Linux 3.13.0-52-generic amd64/Oracle Corporation 1.7.0_80 (64-bit)/cpus=4,threads=2,free=43864272,total=453509120
   [junit4]   2> NOTE: All tests run in this JVM: [ShardRoutingTest, TestPartialUpdateDeduplication, OverseerStatusTest, TermsComponentTest, TestShardHandlerFactory, SpellingQueryConverterTest, DocValuesTest, BlockCacheTest, ConfigSetsAPITest, TestDistributedGrouping, HdfsDirectoryFactoryTest, CollectionsAPIDistributedZkTest, CollectionTooManyReplicasTest, DirectSolrSpellCheckerTest, TestCloudManagedSchema, TestRequestStatusCollectionAPI, DistributedSuggestComponentTest, ConvertedLegacyTest, RemoteQueryErrorTest, CoreAdminCreateDiscoverTest, TestSurroundQueryParser, TestLFUCache, TestRebalanceLeaders, LoggingHandlerTest, FileUtilsTest, SpellCheckCollatorTest, DistributedIntervalFacetingTest, TestUpdate, TestCustomSort, HdfsBasicDistributedZkTest, TestSolrXml, SoftAutoCommitTest, WordBreakSolrSpellCheckerTest, DOMUtilTest, TestSystemIdResolver, EnumFieldTest, DistanceFunctionTest, DistributedDebugComponentTest, UpdateRequestProcessorFactoryTest, TestBM25SimilarityFactory, HdfsCollectionsAPIDistributedZkTest, ChaosMonkeyNothingIsSafeTest, SolrInfoMBeanTest, TestCollationFieldDocValues, JavabinLoaderTest, SolrPluginUtilsTest, TestDownShardTolerantSearch, SpatialFilterTest, ZkStateWriterTest, DistributedFacetPivotWhiteBoxTest, BlockJoinFacetRandomTest, TestDefaultStatsCache, DistributedTermsComponentTest, MBeansHandlerTest, TestLMJelinekMercerSimilarityFactory, UniqFieldsUpdateProcessorFactoryTest, OpenCloseCoreStressTest, CloudExitableDirectoryReaderTest, OverriddenZkACLAndCredentialsProvidersTest, DistributedFacetPivotLongTailTest, TestConfigSetsAPIZkFailure, CheckHdfsIndexTest, SolrCmdDistributorTest, SparseHLLTest, TestCustomDocTransformer, TestSortByMinMaxFunction, DistributedVersionInfoTest, SchemaVersionSpecificBehaviorTest, BasicFunctionalityTest, TestRemoveLastDynamicCopyField, TestCodecSupport, PreAnalyzedUpdateProcessorTest, SimpleMLTQParserTest, TestSolrCoreProperties, DeleteInactiveReplicaTest, NotRequiredUniqueKeyTest, MoreLikeThisHandlerTest, TestLeaderInitiatedRecoveryThread, TestSimpleTrackingShardHandler, TestSolrCLIRunExample, CSVRequestHandlerTest, TestEmbeddedSolrServerConstructors, ShardSplitTest, TestQueryUtils, ChaosMonkeySafeLeaderTest, DistanceUnitsTest, TestSolrDeletionPolicy2, StressHdfsTest, CachingDirectoryFactoryTest, OpenExchangeRatesOrgProviderTest, NumericFieldsTest, TestSmileRequest, TestCollectionAPI, TestMiniSolrCloudClusterBase, TestMiniSolrCloudClusterSSL, TestReplicaProperties, TriLevelCompositeIdRoutingTest, HdfsChaosMonkeyNothingIsSafeTest, HdfsRecoverLeaseTest, HdfsRecoveryZkTest, HdfsThreadLeakTest, TestClusterStateMutator, RuleEngineTest, RulesTest, TestReplicationHandlerBackup, TestRestoreCore, SegmentsInfoRequestHandlerTest, DistributedFacetPivotSmallAdvancedTest, DistributedFacetPivotSmallTest, FacetPivotSmallTest, SpatialHeatmapFacetsTest, TestDistributedStatsComponentCardinality, TestScoreJoinQPScore, TestNonDefinedSimilarityFactory, TestExactSharedStatsCache, BasicAuthIntegrationTest]
   [junit4]   2> NOTE: download the large Jenkins line-docs file by running 'ant get-jenkins-line-docs' in the lucene directory.
   [junit4]   2> NOTE: reproduce with: ant test  -Dtestcase=BasicAuthIntegrationTest -Dtests.seed=3D49B6BCFBA4BC04 -Dtests.multiplier=2 -Dtests.nightly=true -Dtests.slow=true -Dtests.linedocsfile=/x1/jenkins/lucene-data/enwiki.random.lines.txt -Dtests.locale=nl-BE -Dtests.timezone=America/Santa_Isabel -Dtests.asserts=true -Dtests.file.encoding=US-ASCII
   [junit4] ERROR   0.00s J1 | BasicAuthIntegrationTest (suite) <<<
   [junit4]    > Throwable #1: java.lang.Exception: Suite timeout exceeded (>= 7200000 msec).
   [junit4]    > 	at __randomizedtesting.SeedInfo.seed([3D49B6BCFBA4BC04]:0)
   [junit4] Completed [566/566 (3!)] on J1 in 7221.80s, 1 test, 2 errors <<< FAILURES!

[...truncated 14 lines...]
BUILD FAILED
/x1/jenkins/jenkins-slave/workspace/Lucene-Solr-NightlyTests-5.x/build.xml:757: The following error occurred while executing this line:
/x1/jenkins/jenkins-slave/workspace/Lucene-Solr-NightlyTests-5.x/build.xml:694: The following error occurred while executing this line:
/x1/jenkins/jenkins-slave/workspace/Lucene-Solr-NightlyTests-5.x/build.xml:59: The following error occurred while executing this line:
/x1/jenkins/jenkins-slave/workspace/Lucene-Solr-NightlyTests-5.x/solr/build.xml:233: The following error occurred while executing this line:
/x1/jenkins/jenkins-slave/workspace/Lucene-Solr-NightlyTests-5.x/solr/common-build.xml:534: The following error occurred while executing this line:
/x1/jenkins/jenkins-slave/workspace/Lucene-Solr-NightlyTests-5.x/lucene/common-build.xml:1477: The following error occurred while executing this line:
/x1/jenkins/jenkins-slave/workspace/Lucene-Solr-NightlyTests-5.x/lucene/common-build.xml:1033: There were test failures: 566 suites (7 ignored), 2279 tests, 2 suite-level errors, 2 errors, 34 ignored (18 assumptions) [seed: 3D49B6BCFBA4BC04]

Total time: 350 minutes 19 seconds
Build step 'Invoke Ant' marked build as failure
Archiving artifacts
Recording test results
Email was triggered for: Failure - Any
Sending email for trigger: Failure - Any



Mime
View raw message