lucene-dev mailing list archives

Site index · List index
Message view « Date » · « Thread »
Top « Date » · « Thread »
From Policeman Jenkins Server <jenk...@thetaphi.de>
Subject [JENKINS] Lucene-Solr-5.x-Solaris (64bit/jdk1.8.0) - Build # 398 - Failure!
Date Wed, 17 Feb 2016 14:57:15 GMT
Build: http://jenkins.thetaphi.de/job/Lucene-Solr-5.x-Solaris/398/
Java: 64bit/jdk1.8.0 -XX:-UseCompressedOops -XX:+UseParallelGC

1 tests failed.
FAILED:  org.apache.solr.cloud.SyncSliceTest.test

Error Message:
expected:<5> but was:<4>

Stack Trace:
java.lang.AssertionError: expected:<5> but was:<4>
	at __randomizedtesting.SeedInfo.seed([E9E3F56593F8E51C:61B7CABF3D0488E4]:0)
	at org.junit.Assert.fail(Assert.java:93)
	at org.junit.Assert.failNotEquals(Assert.java:647)
	at org.junit.Assert.assertEquals(Assert.java:128)
	at org.junit.Assert.assertEquals(Assert.java:472)
	at org.junit.Assert.assertEquals(Assert.java:456)
	at org.apache.solr.cloud.SyncSliceTest.test(SyncSliceTest.java:153)
	at sun.reflect.NativeMethodAccessorImpl.invoke0(Native Method)
	at sun.reflect.NativeMethodAccessorImpl.invoke(NativeMethodAccessorImpl.java:62)
	at sun.reflect.DelegatingMethodAccessorImpl.invoke(DelegatingMethodAccessorImpl.java:43)
	at java.lang.reflect.Method.invoke(Method.java:498)
	at com.carrotsearch.randomizedtesting.RandomizedRunner.invoke(RandomizedRunner.java:1764)
	at com.carrotsearch.randomizedtesting.RandomizedRunner$8.evaluate(RandomizedRunner.java:871)
	at com.carrotsearch.randomizedtesting.RandomizedRunner$9.evaluate(RandomizedRunner.java:907)
	at com.carrotsearch.randomizedtesting.RandomizedRunner$10.evaluate(RandomizedRunner.java:921)
	at org.apache.solr.BaseDistributedSearchTestCase$ShardsRepeatRule$ShardsFixedStatement.callStatement(BaseDistributedSearchTestCase.java:964)
	at org.apache.solr.BaseDistributedSearchTestCase$ShardsRepeatRule$ShardsStatement.evaluate(BaseDistributedSearchTestCase.java:939)
	at com.carrotsearch.randomizedtesting.rules.SystemPropertiesRestoreRule$1.evaluate(SystemPropertiesRestoreRule.java:57)
	at org.apache.lucene.util.TestRuleSetupTeardownChained$1.evaluate(TestRuleSetupTeardownChained.java:49)
	at org.apache.lucene.util.AbstractBeforeAfterRule$1.evaluate(AbstractBeforeAfterRule.java:45)
	at org.apache.lucene.util.TestRuleThreadAndTestName$1.evaluate(TestRuleThreadAndTestName.java:48)
	at org.apache.lucene.util.TestRuleIgnoreAfterMaxFailures$1.evaluate(TestRuleIgnoreAfterMaxFailures.java:64)
	at org.apache.lucene.util.TestRuleMarkFailure$1.evaluate(TestRuleMarkFailure.java:47)
	at com.carrotsearch.randomizedtesting.rules.StatementAdapter.evaluate(StatementAdapter.java:36)
	at com.carrotsearch.randomizedtesting.ThreadLeakControl$StatementRunner.run(ThreadLeakControl.java:367)
	at com.carrotsearch.randomizedtesting.ThreadLeakControl.forkTimeoutingTask(ThreadLeakControl.java:809)
	at com.carrotsearch.randomizedtesting.ThreadLeakControl$3.evaluate(ThreadLeakControl.java:460)
	at com.carrotsearch.randomizedtesting.RandomizedRunner.runSingleTest(RandomizedRunner.java:880)
	at com.carrotsearch.randomizedtesting.RandomizedRunner$5.evaluate(RandomizedRunner.java:781)
	at com.carrotsearch.randomizedtesting.RandomizedRunner$6.evaluate(RandomizedRunner.java:816)
	at com.carrotsearch.randomizedtesting.RandomizedRunner$7.evaluate(RandomizedRunner.java:827)
	at com.carrotsearch.randomizedtesting.rules.StatementAdapter.evaluate(StatementAdapter.java:36)
	at com.carrotsearch.randomizedtesting.rules.SystemPropertiesRestoreRule$1.evaluate(SystemPropertiesRestoreRule.java:57)
	at org.apache.lucene.util.AbstractBeforeAfterRule$1.evaluate(AbstractBeforeAfterRule.java:45)
	at com.carrotsearch.randomizedtesting.rules.StatementAdapter.evaluate(StatementAdapter.java:36)
	at org.apache.lucene.util.TestRuleStoreClassName$1.evaluate(TestRuleStoreClassName.java:41)
	at com.carrotsearch.randomizedtesting.rules.NoShadowingOrOverridesOnMethodsRule$1.evaluate(NoShadowingOrOverridesOnMethodsRule.java:40)
	at com.carrotsearch.randomizedtesting.rules.NoShadowingOrOverridesOnMethodsRule$1.evaluate(NoShadowingOrOverridesOnMethodsRule.java:40)
	at com.carrotsearch.randomizedtesting.rules.StatementAdapter.evaluate(StatementAdapter.java:36)
	at com.carrotsearch.randomizedtesting.rules.StatementAdapter.evaluate(StatementAdapter.java:36)
	at com.carrotsearch.randomizedtesting.rules.StatementAdapter.evaluate(StatementAdapter.java:36)
	at org.apache.lucene.util.TestRuleAssertionsRequired$1.evaluate(TestRuleAssertionsRequired.java:53)
	at org.apache.lucene.util.TestRuleMarkFailure$1.evaluate(TestRuleMarkFailure.java:47)
	at org.apache.lucene.util.TestRuleIgnoreAfterMaxFailures$1.evaluate(TestRuleIgnoreAfterMaxFailures.java:64)
	at org.apache.lucene.util.TestRuleIgnoreTestSuites$1.evaluate(TestRuleIgnoreTestSuites.java:54)
	at com.carrotsearch.randomizedtesting.rules.StatementAdapter.evaluate(StatementAdapter.java:36)
	at com.carrotsearch.randomizedtesting.ThreadLeakControl$StatementRunner.run(ThreadLeakControl.java:367)
	at java.lang.Thread.run(Thread.java:745)




Build Log:
[...truncated 11437 lines...]
   [junit4] Suite: org.apache.solr.cloud.SyncSliceTest
   [junit4]   2> Creating dataDir: /export/home/jenkins/workspace/Lucene-Solr-5.x-Solaris/solr/build/solr-core/test/J1/temp/solr.cloud.SyncSliceTest_E9E3F56593F8E51C-001/init-core-data-001
   [junit4]   2> 1325619 INFO  (SUITE-SyncSliceTest-seed#[E9E3F56593F8E51C]-worker) [    ] o.a.s.SolrTestCaseJ4 Randomized ssl (true) and clientAuth (true)
   [junit4]   2> 1325619 INFO  (SUITE-SyncSliceTest-seed#[E9E3F56593F8E51C]-worker) [    ] o.a.s.BaseDistributedSearchTestCase Setting hostContext system property: /
   [junit4]   2> 1325621 INFO  (TEST-SyncSliceTest.test-seed#[E9E3F56593F8E51C]) [    ] o.a.s.c.ZkTestServer STARTING ZK TEST SERVER
   [junit4]   2> 1325621 INFO  (Thread-6314) [    ] o.a.s.c.ZkTestServer client port:0.0.0.0/0.0.0.0:0
   [junit4]   2> 1325621 INFO  (Thread-6314) [    ] o.a.s.c.ZkTestServer Starting server
   [junit4]   2> 1325725 INFO  (TEST-SyncSliceTest.test-seed#[E9E3F56593F8E51C]) [    ] o.a.s.c.ZkTestServer start zk server on port:59447
   [junit4]   2> 1325725 INFO  (TEST-SyncSliceTest.test-seed#[E9E3F56593F8E51C]) [    ] o.a.s.c.c.SolrZkClient Using default ZkCredentialsProvider
   [junit4]   2> 1325726 INFO  (TEST-SyncSliceTest.test-seed#[E9E3F56593F8E51C]) [    ] o.a.s.c.c.ConnectionManager Waiting for client to connect to ZooKeeper
   [junit4]   2> 1325728 INFO  (zkCallback-1357-thread-1) [    ] o.a.s.c.c.ConnectionManager Watcher org.apache.solr.common.cloud.ConnectionManager@e3940d0 name:ZooKeeperConnection Watcher:127.0.0.1:59447 got event WatchedEvent state:SyncConnected type:None path:null path:null type:None
   [junit4]   2> 1325728 INFO  (TEST-SyncSliceTest.test-seed#[E9E3F56593F8E51C]) [    ] o.a.s.c.c.ConnectionManager Client is connected to ZooKeeper
   [junit4]   2> 1325728 INFO  (TEST-SyncSliceTest.test-seed#[E9E3F56593F8E51C]) [    ] o.a.s.c.c.SolrZkClient Using default ZkACLProvider
   [junit4]   2> 1325728 INFO  (TEST-SyncSliceTest.test-seed#[E9E3F56593F8E51C]) [    ] o.a.s.c.c.SolrZkClient makePath: /solr
   [junit4]   2> 1325732 INFO  (TEST-SyncSliceTest.test-seed#[E9E3F56593F8E51C]) [    ] o.a.s.c.c.SolrZkClient Using default ZkCredentialsProvider
   [junit4]   2> 1325732 INFO  (TEST-SyncSliceTest.test-seed#[E9E3F56593F8E51C]) [    ] o.a.s.c.c.ConnectionManager Waiting for client to connect to ZooKeeper
   [junit4]   2> 1325733 INFO  (zkCallback-1358-thread-1) [    ] o.a.s.c.c.ConnectionManager Watcher org.apache.solr.common.cloud.ConnectionManager@78cfb41a name:ZooKeeperConnection Watcher:127.0.0.1:59447/solr got event WatchedEvent state:SyncConnected type:None path:null path:null type:None
   [junit4]   2> 1325734 INFO  (TEST-SyncSliceTest.test-seed#[E9E3F56593F8E51C]) [    ] o.a.s.c.c.ConnectionManager Client is connected to ZooKeeper
   [junit4]   2> 1325734 INFO  (TEST-SyncSliceTest.test-seed#[E9E3F56593F8E51C]) [    ] o.a.s.c.c.SolrZkClient Using default ZkACLProvider
   [junit4]   2> 1325734 INFO  (TEST-SyncSliceTest.test-seed#[E9E3F56593F8E51C]) [    ] o.a.s.c.c.SolrZkClient makePath: /collections/collection1
   [junit4]   2> 1325736 INFO  (TEST-SyncSliceTest.test-seed#[E9E3F56593F8E51C]) [    ] o.a.s.c.c.SolrZkClient makePath: /collections/collection1/shards
   [junit4]   2> 1325738 INFO  (TEST-SyncSliceTest.test-seed#[E9E3F56593F8E51C]) [    ] o.a.s.c.c.SolrZkClient makePath: /collections/control_collection
   [junit4]   2> 1325740 INFO  (TEST-SyncSliceTest.test-seed#[E9E3F56593F8E51C]) [    ] o.a.s.c.c.SolrZkClient makePath: /collections/control_collection/shards
   [junit4]   2> 1325742 INFO  (TEST-SyncSliceTest.test-seed#[E9E3F56593F8E51C]) [    ] o.a.s.c.AbstractZkTestCase put /export/home/jenkins/workspace/Lucene-Solr-5.x-Solaris/solr/core/src/test-files/solr/collection1/conf/solrconfig-tlog.xml to /configs/conf1/solrconfig.xml
   [junit4]   2> 1325742 INFO  (TEST-SyncSliceTest.test-seed#[E9E3F56593F8E51C]) [    ] o.a.s.c.c.SolrZkClient makePath: /configs/conf1/solrconfig.xml
   [junit4]   2> 1325745 INFO  (TEST-SyncSliceTest.test-seed#[E9E3F56593F8E51C]) [    ] o.a.s.c.AbstractZkTestCase put /export/home/jenkins/workspace/Lucene-Solr-5.x-Solaris/solr/core/src/test-files/solr/collection1/conf/schema.xml to /configs/conf1/schema.xml
   [junit4]   2> 1325745 INFO  (TEST-SyncSliceTest.test-seed#[E9E3F56593F8E51C]) [    ] o.a.s.c.c.SolrZkClient makePath: /configs/conf1/schema.xml
   [junit4]   2> 1325748 INFO  (TEST-SyncSliceTest.test-seed#[E9E3F56593F8E51C]) [    ] o.a.s.c.AbstractZkTestCase put /export/home/jenkins/workspace/Lucene-Solr-5.x-Solaris/solr/core/src/test-files/solr/collection1/conf/solrconfig.snippet.randomindexconfig.xml to /configs/conf1/solrconfig.snippet.randomindexconfig.xml
   [junit4]   2> 1325748 INFO  (TEST-SyncSliceTest.test-seed#[E9E3F56593F8E51C]) [    ] o.a.s.c.c.SolrZkClient makePath: /configs/conf1/solrconfig.snippet.randomindexconfig.xml
   [junit4]   2> 1325750 INFO  (TEST-SyncSliceTest.test-seed#[E9E3F56593F8E51C]) [    ] o.a.s.c.AbstractZkTestCase put /export/home/jenkins/workspace/Lucene-Solr-5.x-Solaris/solr/core/src/test-files/solr/collection1/conf/stopwords.txt to /configs/conf1/stopwords.txt
   [junit4]   2> 1325750 INFO  (TEST-SyncSliceTest.test-seed#[E9E3F56593F8E51C]) [    ] o.a.s.c.c.SolrZkClient makePath: /configs/conf1/stopwords.txt
   [junit4]   2> 1325753 INFO  (TEST-SyncSliceTest.test-seed#[E9E3F56593F8E51C]) [    ] o.a.s.c.AbstractZkTestCase put /export/home/jenkins/workspace/Lucene-Solr-5.x-Solaris/solr/core/src/test-files/solr/collection1/conf/protwords.txt to /configs/conf1/protwords.txt
   [junit4]   2> 1325753 INFO  (TEST-SyncSliceTest.test-seed#[E9E3F56593F8E51C]) [    ] o.a.s.c.c.SolrZkClient makePath: /configs/conf1/protwords.txt
   [junit4]   2> 1325755 INFO  (TEST-SyncSliceTest.test-seed#[E9E3F56593F8E51C]) [    ] o.a.s.c.AbstractZkTestCase put /export/home/jenkins/workspace/Lucene-Solr-5.x-Solaris/solr/core/src/test-files/solr/collection1/conf/currency.xml to /configs/conf1/currency.xml
   [junit4]   2> 1325755 INFO  (TEST-SyncSliceTest.test-seed#[E9E3F56593F8E51C]) [    ] o.a.s.c.c.SolrZkClient makePath: /configs/conf1/currency.xml
   [junit4]   2> 1325757 INFO  (TEST-SyncSliceTest.test-seed#[E9E3F56593F8E51C]) [    ] o.a.s.c.AbstractZkTestCase put /export/home/jenkins/workspace/Lucene-Solr-5.x-Solaris/solr/core/src/test-files/solr/collection1/conf/enumsConfig.xml to /configs/conf1/enumsConfig.xml
   [junit4]   2> 1325758 INFO  (TEST-SyncSliceTest.test-seed#[E9E3F56593F8E51C]) [    ] o.a.s.c.c.SolrZkClient makePath: /configs/conf1/enumsConfig.xml
   [junit4]   2> 1325760 INFO  (TEST-SyncSliceTest.test-seed#[E9E3F56593F8E51C]) [    ] o.a.s.c.AbstractZkTestCase put /export/home/jenkins/workspace/Lucene-Solr-5.x-Solaris/solr/core/src/test-files/solr/collection1/conf/open-exchange-rates.json to /configs/conf1/open-exchange-rates.json
   [junit4]   2> 1325760 INFO  (TEST-SyncSliceTest.test-seed#[E9E3F56593F8E51C]) [    ] o.a.s.c.c.SolrZkClient makePath: /configs/conf1/open-exchange-rates.json
   [junit4]   2> 1325762 INFO  (TEST-SyncSliceTest.test-seed#[E9E3F56593F8E51C]) [    ] o.a.s.c.AbstractZkTestCase put /export/home/jenkins/workspace/Lucene-Solr-5.x-Solaris/solr/core/src/test-files/solr/collection1/conf/mapping-ISOLatin1Accent.txt to /configs/conf1/mapping-ISOLatin1Accent.txt
   [junit4]   2> 1325762 INFO  (TEST-SyncSliceTest.test-seed#[E9E3F56593F8E51C]) [    ] o.a.s.c.c.SolrZkClient makePath: /configs/conf1/mapping-ISOLatin1Accent.txt
   [junit4]   2> 1325764 INFO  (TEST-SyncSliceTest.test-seed#[E9E3F56593F8E51C]) [    ] o.a.s.c.AbstractZkTestCase put /export/home/jenkins/workspace/Lucene-Solr-5.x-Solaris/solr/core/src/test-files/solr/collection1/conf/old_synonyms.txt to /configs/conf1/old_synonyms.txt
   [junit4]   2> 1325764 INFO  (TEST-SyncSliceTest.test-seed#[E9E3F56593F8E51C]) [    ] o.a.s.c.c.SolrZkClient makePath: /configs/conf1/old_synonyms.txt
   [junit4]   2> 1325767 INFO  (TEST-SyncSliceTest.test-seed#[E9E3F56593F8E51C]) [    ] o.a.s.c.AbstractZkTestCase put /export/home/jenkins/workspace/Lucene-Solr-5.x-Solaris/solr/core/src/test-files/solr/collection1/conf/synonyms.txt to /configs/conf1/synonyms.txt
   [junit4]   2> 1325767 INFO  (TEST-SyncSliceTest.test-seed#[E9E3F56593F8E51C]) [    ] o.a.s.c.c.SolrZkClient makePath: /configs/conf1/synonyms.txt
   [junit4]   2> 1325770 INFO  (TEST-SyncSliceTest.test-seed#[E9E3F56593F8E51C]) [    ] o.a.s.c.c.SolrZkClient Using default ZkCredentialsProvider
   [junit4]   2> 1325771 INFO  (TEST-SyncSliceTest.test-seed#[E9E3F56593F8E51C]) [    ] o.a.s.c.c.ConnectionManager Waiting for client to connect to ZooKeeper
   [junit4]   2> 1325772 INFO  (zkCallback-1359-thread-1) [    ] o.a.s.c.c.ConnectionManager Watcher org.apache.solr.common.cloud.ConnectionManager@63b75e5e name:ZooKeeperConnection Watcher:127.0.0.1:59447/solr got event WatchedEvent state:SyncConnected type:None path:null path:null type:None
   [junit4]   2> 1325773 INFO  (TEST-SyncSliceTest.test-seed#[E9E3F56593F8E51C]) [    ] o.a.s.c.c.ConnectionManager Client is connected to ZooKeeper
   [junit4]   2> 1325773 INFO  (TEST-SyncSliceTest.test-seed#[E9E3F56593F8E51C]) [    ] o.a.s.c.c.SolrZkClient Using default ZkACLProvider
   [junit4]   2> 1326013 INFO  (TEST-SyncSliceTest.test-seed#[E9E3F56593F8E51C]) [    ] o.a.s.SolrTestCaseJ4 Writing core.properties file to /export/home/jenkins/workspace/Lucene-Solr-5.x-Solaris/solr/build/solr-core/test/J1/temp/solr.cloud.SyncSliceTest_E9E3F56593F8E51C-001/control-001/cores/collection1
   [junit4]   2> 1326014 INFO  (TEST-SyncSliceTest.test-seed#[E9E3F56593F8E51C]) [    ] o.e.j.s.Server jetty-9.2.13.v20150730
   [junit4]   2> 1326016 INFO  (TEST-SyncSliceTest.test-seed#[E9E3F56593F8E51C]) [    ] o.e.j.s.h.ContextHandler Started o.e.j.s.ServletContextHandler@331403b3{/,null,AVAILABLE}
   [junit4]   2> 1326020 INFO  (TEST-SyncSliceTest.test-seed#[E9E3F56593F8E51C]) [    ] o.e.j.s.ServerConnector Started ServerConnector@7aaa7a39{SSL-http/1.1}{127.0.0.1:45022}
   [junit4]   2> 1326020 INFO  (TEST-SyncSliceTest.test-seed#[E9E3F56593F8E51C]) [    ] o.e.j.s.Server Started @1329630ms
   [junit4]   2> 1326020 INFO  (TEST-SyncSliceTest.test-seed#[E9E3F56593F8E51C]) [    ] o.a.s.c.s.e.JettySolrRunner Jetty properties: {solr.data.dir=/export/home/jenkins/workspace/Lucene-Solr-5.x-Solaris/solr/build/solr-core/test/J1/temp/solr.cloud.SyncSliceTest_E9E3F56593F8E51C-001/tempDir-001/control/data, hostContext=/, hostPort=45022, coreRootDirectory=/export/home/jenkins/workspace/Lucene-Solr-5.x-Solaris/solr/build/solr-core/test/J1/temp/solr.cloud.SyncSliceTest_E9E3F56593F8E51C-001/control-001/cores}
   [junit4]   2> 1326020 INFO  (TEST-SyncSliceTest.test-seed#[E9E3F56593F8E51C]) [    ] o.a.s.s.SolrDispatchFilter SolrDispatchFilter.init(): sun.misc.Launcher$AppClassLoader@6d06d69c
   [junit4]   2> 1326020 INFO  (TEST-SyncSliceTest.test-seed#[E9E3F56593F8E51C]) [    ] o.a.s.c.SolrResourceLoader new SolrResourceLoader for directory: '/export/home/jenkins/workspace/Lucene-Solr-5.x-Solaris/solr/build/solr-core/test/J1/temp/solr.cloud.SyncSliceTest_E9E3F56593F8E51C-001/control-001'
   [junit4]   2> 1326020 INFO  (TEST-SyncSliceTest.test-seed#[E9E3F56593F8E51C]) [    ] o.a.s.c.SolrResourceLoader JNDI not configured for solr (NoInitialContextEx)
   [junit4]   2> 1326020 INFO  (TEST-SyncSliceTest.test-seed#[E9E3F56593F8E51C]) [    ] o.a.s.c.SolrResourceLoader solr home defaulted to 'solr/' (could not find system property or JNDI)
   [junit4]   2> 1326021 INFO  (TEST-SyncSliceTest.test-seed#[E9E3F56593F8E51C]) [    ] o.a.s.c.c.SolrZkClient Using default ZkCredentialsProvider
   [junit4]   2> 1326021 INFO  (TEST-SyncSliceTest.test-seed#[E9E3F56593F8E51C]) [    ] o.a.s.c.c.ConnectionManager Waiting for client to connect to ZooKeeper
   [junit4]   2> 1326023 INFO  (zkCallback-1360-thread-1) [    ] o.a.s.c.c.ConnectionManager Watcher org.apache.solr.common.cloud.ConnectionManager@3cf52ece name:ZooKeeperConnection Watcher:127.0.0.1:59447/solr got event WatchedEvent state:SyncConnected type:None path:null path:null type:None
   [junit4]   2> 1326023 INFO  (TEST-SyncSliceTest.test-seed#[E9E3F56593F8E51C]) [    ] o.a.s.c.c.ConnectionManager Client is connected to ZooKeeper
   [junit4]   2> 1326023 INFO  (TEST-SyncSliceTest.test-seed#[E9E3F56593F8E51C]) [    ] o.a.s.c.c.SolrZkClient Using default ZkACLProvider
   [junit4]   2> 1326024 INFO  (TEST-SyncSliceTest.test-seed#[E9E3F56593F8E51C]) [    ] o.a.s.s.SolrDispatchFilter Loading solr.xml from SolrHome (not found in ZooKeeper)
   [junit4]   2> 1326024 INFO  (TEST-SyncSliceTest.test-seed#[E9E3F56593F8E51C]) [    ] o.a.s.c.SolrXmlConfig Loading container configuration from /export/home/jenkins/workspace/Lucene-Solr-5.x-Solaris/solr/build/solr-core/test/J1/temp/solr.cloud.SyncSliceTest_E9E3F56593F8E51C-001/control-001/solr.xml
   [junit4]   2> 1326030 INFO  (TEST-SyncSliceTest.test-seed#[E9E3F56593F8E51C]) [    ] o.a.s.c.CorePropertiesLocator Config-defined core root directory: /export/home/jenkins/workspace/Lucene-Solr-5.x-Solaris/solr/build/solr-core/test/J1/temp/solr.cloud.SyncSliceTest_E9E3F56593F8E51C-001/control-001/cores
   [junit4]   2> 1326030 INFO  (TEST-SyncSliceTest.test-seed#[E9E3F56593F8E51C]) [    ] o.a.s.c.CoreContainer New CoreContainer 923762907
   [junit4]   2> 1326030 INFO  (TEST-SyncSliceTest.test-seed#[E9E3F56593F8E51C]) [    ] o.a.s.c.CoreContainer Loading cores into CoreContainer [instanceDir=/export/home/jenkins/workspace/Lucene-Solr-5.x-Solaris/solr/build/solr-core/test/J1/temp/solr.cloud.SyncSliceTest_E9E3F56593F8E51C-001/control-001]
   [junit4]   2> 1326030 WARN  (TEST-SyncSliceTest.test-seed#[E9E3F56593F8E51C]) [    ] o.a.s.c.CoreContainer Couldn't add files from /export/home/jenkins/workspace/Lucene-Solr-5.x-Solaris/solr/build/solr-core/test/J1/temp/solr.cloud.SyncSliceTest_E9E3F56593F8E51C-001/control-001/lib to classpath: /export/home/jenkins/workspace/Lucene-Solr-5.x-Solaris/solr/build/solr-core/test/J1/temp/solr.cloud.SyncSliceTest_E9E3F56593F8E51C-001/control-001/lib
   [junit4]   2> 1326030 INFO  (TEST-SyncSliceTest.test-seed#[E9E3F56593F8E51C]) [    ] o.a.s.h.c.HttpShardHandlerFactory created with socketTimeout : 90000,urlScheme : ,connTimeout : 15000,maxConnectionsPerHost : 20,maxConnections : 10000,corePoolSize : 0,maximumPoolSize : 2147483647,maxThreadIdleTime : 5,sizeOfQueue : -1,fairnessPolicy : false,useRetries : false,
   [junit4]   2> 1326032 INFO  (TEST-SyncSliceTest.test-seed#[E9E3F56593F8E51C]) [    ] o.a.s.u.UpdateShardHandler Creating UpdateShardHandler HTTP client with params: socketTimeout=340000&connTimeout=45000&retry=true
   [junit4]   2> 1326033 INFO  (TEST-SyncSliceTest.test-seed#[E9E3F56593F8E51C]) [    ] o.a.s.l.LogWatcher SLF4J impl is org.slf4j.impl.Log4jLoggerFactory
   [junit4]   2> 1326033 INFO  (TEST-SyncSliceTest.test-seed#[E9E3F56593F8E51C]) [    ] o.a.s.l.LogWatcher Registering Log Listener [Log4j (org.slf4j.impl.Log4jLoggerFactory)]
   [junit4]   2> 1326033 INFO  (TEST-SyncSliceTest.test-seed#[E9E3F56593F8E51C]) [    ] o.a.s.c.ZkContainer Zookeeper client=127.0.0.1:59447/solr
   [junit4]   2> 1326033 INFO  (TEST-SyncSliceTest.test-seed#[E9E3F56593F8E51C]) [    ] o.a.s.c.ZkController zkHost includes chroot
   [junit4]   2> 1326033 INFO  (TEST-SyncSliceTest.test-seed#[E9E3F56593F8E51C]) [    ] o.a.s.c.c.SolrZkClient Using default ZkCredentialsProvider
   [junit4]   2> 1326034 INFO  (TEST-SyncSliceTest.test-seed#[E9E3F56593F8E51C]) [    ] o.a.s.c.c.ConnectionManager Waiting for client to connect to ZooKeeper
   [junit4]   2> 1326035 INFO  (zkCallback-1363-thread-1) [    ] o.a.s.c.c.ConnectionManager Watcher org.apache.solr.common.cloud.ConnectionManager@1dec8438 name:ZooKeeperConnection Watcher:127.0.0.1:59447 got event WatchedEvent state:SyncConnected type:None path:null path:null type:None
   [junit4]   2> 1326035 INFO  (TEST-SyncSliceTest.test-seed#[E9E3F56593F8E51C]) [    ] o.a.s.c.c.ConnectionManager Client is connected to ZooKeeper
   [junit4]   2> 1326035 INFO  (TEST-SyncSliceTest.test-seed#[E9E3F56593F8E51C]) [    ] o.a.s.c.c.SolrZkClient Using default ZkACLProvider
   [junit4]   2> 1326038 INFO  (TEST-SyncSliceTest.test-seed#[E9E3F56593F8E51C]) [n:127.0.0.1:45022_    ] o.a.s.c.c.ConnectionManager Waiting for client to connect to ZooKeeper
   [junit4]   2> 1326040 INFO  (zkCallback-1364-thread-1-processing-n:127.0.0.1:45022_) [n:127.0.0.1:45022_    ] o.a.s.c.c.ConnectionManager Watcher org.apache.solr.common.cloud.ConnectionManager@265c7e04 name:ZooKeeperConnection Watcher:127.0.0.1:59447/solr got event WatchedEvent state:SyncConnected type:None path:null path:null type:None
   [junit4]   2> 1326040 INFO  (TEST-SyncSliceTest.test-seed#[E9E3F56593F8E51C]) [n:127.0.0.1:45022_    ] o.a.s.c.c.ConnectionManager Client is connected to ZooKeeper
   [junit4]   2> 1326042 INFO  (TEST-SyncSliceTest.test-seed#[E9E3F56593F8E51C]) [n:127.0.0.1:45022_    ] o.a.s.c.c.SolrZkClient makePath: /overseer/queue
   [junit4]   2> 1326045 INFO  (TEST-SyncSliceTest.test-seed#[E9E3F56593F8E51C]) [n:127.0.0.1:45022_    ] o.a.s.c.c.SolrZkClient makePath: /overseer/collection-queue-work
   [junit4]   2> 1326049 INFO  (TEST-SyncSliceTest.test-seed#[E9E3F56593F8E51C]) [n:127.0.0.1:45022_    ] o.a.s.c.c.SolrZkClient makePath: /overseer/collection-map-running
   [junit4]   2> 1326053 INFO  (TEST-SyncSliceTest.test-seed#[E9E3F56593F8E51C]) [n:127.0.0.1:45022_    ] o.a.s.c.c.SolrZkClient makePath: /overseer/collection-map-completed
   [junit4]   2> 1326056 INFO  (TEST-SyncSliceTest.test-seed#[E9E3F56593F8E51C]) [n:127.0.0.1:45022_    ] o.a.s.c.c.SolrZkClient makePath: /overseer/collection-map-failure
   [junit4]   2> 1326059 INFO  (TEST-SyncSliceTest.test-seed#[E9E3F56593F8E51C]) [n:127.0.0.1:45022_    ] o.a.s.c.c.SolrZkClient makePath: /live_nodes
   [junit4]   2> 1326062 INFO  (TEST-SyncSliceTest.test-seed#[E9E3F56593F8E51C]) [n:127.0.0.1:45022_    ] o.a.s.c.c.SolrZkClient makePath: /aliases.json
   [junit4]   2> 1326063 INFO  (TEST-SyncSliceTest.test-seed#[E9E3F56593F8E51C]) [n:127.0.0.1:45022_    ] o.a.s.c.c.SolrZkClient makePath: /clusterstate.json
   [junit4]   2> 1326066 INFO  (TEST-SyncSliceTest.test-seed#[E9E3F56593F8E51C]) [n:127.0.0.1:45022_    ] o.a.s.c.c.SolrZkClient makePath: /security.json
   [junit4]   2> 1326067 INFO  (TEST-SyncSliceTest.test-seed#[E9E3F56593F8E51C]) [n:127.0.0.1:45022_    ] o.a.s.c.ZkController Register node as live in ZooKeeper:/live_nodes/127.0.0.1:45022_
   [junit4]   2> 1326068 INFO  (TEST-SyncSliceTest.test-seed#[E9E3F56593F8E51C]) [n:127.0.0.1:45022_    ] o.a.s.c.c.SolrZkClient makePath: /live_nodes/127.0.0.1:45022_
   [junit4]   2> 1326071 INFO  (TEST-SyncSliceTest.test-seed#[E9E3F56593F8E51C]) [n:127.0.0.1:45022_    ] o.a.s.c.c.SolrZkClient makePath: /overseer_elect
   [junit4]   2> 1326073 INFO  (TEST-SyncSliceTest.test-seed#[E9E3F56593F8E51C]) [n:127.0.0.1:45022_    ] o.a.s.c.c.SolrZkClient makePath: /overseer_elect/election
   [junit4]   2> 1326075 INFO  (TEST-SyncSliceTest.test-seed#[E9E3F56593F8E51C]) [n:127.0.0.1:45022_    ] o.a.s.c.Overseer Overseer (id=null) closing
   [junit4]   2> 1326075 INFO  (TEST-SyncSliceTest.test-seed#[E9E3F56593F8E51C]) [n:127.0.0.1:45022_    ] o.a.s.c.LeaderElector Joined leadership election with path: /overseer_elect/election/95402014563565573-127.0.0.1:45022_-n_0000000000
   [junit4]   2> 1326076 INFO  (TEST-SyncSliceTest.test-seed#[E9E3F56593F8E51C]) [n:127.0.0.1:45022_    ] o.a.s.c.OverseerElectionContext I am going to be the leader 127.0.0.1:45022_
   [junit4]   2> 1326076 INFO  (TEST-SyncSliceTest.test-seed#[E9E3F56593F8E51C]) [n:127.0.0.1:45022_    ] o.a.s.c.c.SolrZkClient makePath: /overseer_elect/leader
   [junit4]   2> 1326078 INFO  (TEST-SyncSliceTest.test-seed#[E9E3F56593F8E51C]) [n:127.0.0.1:45022_    ] o.a.s.c.Overseer Overseer (id=95402014563565573-127.0.0.1:45022_-n_0000000000) starting
   [junit4]   2> 1326081 INFO  (TEST-SyncSliceTest.test-seed#[E9E3F56593F8E51C]) [n:127.0.0.1:45022_    ] o.a.s.c.c.SolrZkClient makePath: /overseer/queue-work
   [junit4]   2> 1326090 INFO  (TEST-SyncSliceTest.test-seed#[E9E3F56593F8E51C]) [n:127.0.0.1:45022_    ] o.a.s.c.OverseerAutoReplicaFailoverThread Starting OverseerAutoReplicaFailoverThread autoReplicaFailoverWorkLoopDelay=10000 autoReplicaFailoverWaitAfterExpiration=30000 autoReplicaFailoverBadNodeExpiration=60000
   [junit4]   2> 1326090 INFO  (TEST-SyncSliceTest.test-seed#[E9E3F56593F8E51C]) [n:127.0.0.1:45022_    ] o.a.s.c.c.ZkStateReader Updating cluster state from ZooKeeper... 
   [junit4]   2> 1326090 INFO  (OverseerCollectionConfigSetProcessor-95402014563565573-127.0.0.1:45022_-n_0000000000) [n:127.0.0.1:45022_    ] o.a.s.c.OverseerTaskProcessor Process current queue of overseer operations
   [junit4]   2> 1326091 INFO  (OverseerStateUpdate-95402014563565573-127.0.0.1:45022_-n_0000000000) [n:127.0.0.1:45022_    ] o.a.s.c.Overseer Starting to work on the main queue
   [junit4]   2> 1326114 INFO  (TEST-SyncSliceTest.test-seed#[E9E3F56593F8E51C]) [n:127.0.0.1:45022_    ] o.a.s.c.CoreContainer Security conf doesn't exist. Skipping setup for authorization module.
   [junit4]   2> 1326175 INFO  (TEST-SyncSliceTest.test-seed#[E9E3F56593F8E51C]) [n:127.0.0.1:45022_    ] o.a.s.c.CoreContainer No authentication plugin used.
   [junit4]   2> 1326176 INFO  (TEST-SyncSliceTest.test-seed#[E9E3F56593F8E51C]) [n:127.0.0.1:45022_    ] o.a.s.c.CorePropertiesLocator Looking for core definitions underneath /export/home/jenkins/workspace/Lucene-Solr-5.x-Solaris/solr/build/solr-core/test/J1/temp/solr.cloud.SyncSliceTest_E9E3F56593F8E51C-001/control-001/cores
   [junit4]   2> 1326177 INFO  (TEST-SyncSliceTest.test-seed#[E9E3F56593F8E51C]) [n:127.0.0.1:45022_    ] o.a.s.c.CoreDescriptor Created CoreDescriptor: {name=collection1, config=solrconfig.xml, transient=false, schema=schema.xml, loadOnStartup=true, configSetProperties=configsetprops.json, collection=control_collection, coreNodeName=, dataDir=data/, shard=}
   [junit4]   2> 1326177 INFO  (TEST-SyncSliceTest.test-seed#[E9E3F56593F8E51C]) [n:127.0.0.1:45022_    ] o.a.s.c.CorePropertiesLocator Found core collection1 in /export/home/jenkins/workspace/Lucene-Solr-5.x-Solaris/solr/build/solr-core/test/J1/temp/solr.cloud.SyncSliceTest_E9E3F56593F8E51C-001/control-001/cores/collection1
   [junit4]   2> 1326177 INFO  (TEST-SyncSliceTest.test-seed#[E9E3F56593F8E51C]) [n:127.0.0.1:45022_    ] o.a.s.c.CorePropertiesLocator Found 1 core definitions
   [junit4]   2> 1326178 INFO  (TEST-SyncSliceTest.test-seed#[E9E3F56593F8E51C]) [n:127.0.0.1:45022_    ] o.a.s.s.SolrDispatchFilter user.dir=/export/home/jenkins/workspace/Lucene-Solr-5.x-Solaris/solr/build/solr-core/test/J1
   [junit4]   2> 1326178 INFO  (TEST-SyncSliceTest.test-seed#[E9E3F56593F8E51C]) [n:127.0.0.1:45022_    ] o.a.s.s.SolrDispatchFilter SolrDispatchFilter.init() done
   [junit4]   2> 1326179 INFO  (coreLoadExecutor-5094-thread-1-processing-n:127.0.0.1:45022_) [n:127.0.0.1:45022_ c:control_collection   x:collection1] o.a.s.c.ZkController publishing state=down
   [junit4]   2> 1326179 INFO  (coreLoadExecutor-5094-thread-1-processing-n:127.0.0.1:45022_) [n:127.0.0.1:45022_ c:control_collection   x:collection1] o.a.s.c.ZkController numShards not found on descriptor - reading it from system property
   [junit4]   2> 1326182 INFO  (OverseerStateUpdate-95402014563565573-127.0.0.1:45022_-n_0000000000) [n:127.0.0.1:45022_    ] o.a.s.c.Overseer processMessage: queueSize: 1, message = {
   [junit4]   2>   "core":"collection1",
   [junit4]   2>   "roles":null,
   [junit4]   2>   "base_url":"https://127.0.0.1:45022",
   [junit4]   2>   "node_name":"127.0.0.1:45022_",
   [junit4]   2>   "numShards":"1",
   [junit4]   2>   "state":"down",
   [junit4]   2>   "shard":null,
   [junit4]   2>   "collection":"control_collection",
   [junit4]   2>   "operation":"state"} current state version: 0
   [junit4]   2> 1326182 INFO  (coreLoadExecutor-5094-thread-1-processing-n:127.0.0.1:45022_) [n:127.0.0.1:45022_ c:control_collection   x:collection1] o.a.s.c.ZkController look for our core node name
   [junit4]   2> 1326183 INFO  (OverseerStateUpdate-95402014563565573-127.0.0.1:45022_-n_0000000000) [n:127.0.0.1:45022_    ] o.a.s.c.o.ReplicaMutator Update state numShards=1 message={
   [junit4]   2>   "core":"collection1",
   [junit4]   2>   "roles":null,
   [junit4]   2>   "base_url":"https://127.0.0.1:45022",
   [junit4]   2>   "node_name":"127.0.0.1:45022_",
   [junit4]   2>   "numShards":"1",
   [junit4]   2>   "state":"down",
   [junit4]   2>   "shard":null,
   [junit4]   2>   "collection":"control_collection",
   [junit4]   2>   "operation":"state"}
   [junit4]   2> 1326184 INFO  (OverseerStateUpdate-95402014563565573-127.0.0.1:45022_-n_0000000000) [n:127.0.0.1:45022_    ] o.a.s.c.o.ClusterStateMutator building a new cName: control_collection
   [junit4]   2> 1326185 INFO  (OverseerStateUpdate-95402014563565573-127.0.0.1:45022_-n_0000000000) [n:127.0.0.1:45022_    ] o.a.s.c.o.ReplicaMutator Assigning new node to shard shard=shard1
   [junit4]   2> 1326186 INFO  (zkCallback-1364-thread-1-processing-n:127.0.0.1:45022_) [n:127.0.0.1:45022_    ] o.a.s.c.c.ZkStateReader A cluster state change: [WatchedEvent state:SyncConnected type:NodeDataChanged path:/clusterstate.json], has occurred - updating... (live nodes size: [1])
   [junit4]   2> 1327184 INFO  (coreLoadExecutor-5094-thread-1-processing-n:127.0.0.1:45022_) [n:127.0.0.1:45022_ c:control_collection   x:collection1] o.a.s.c.ZkController waiting to find shard id in clusterstate for collection1
   [junit4]   2> 1327184 INFO  (coreLoadExecutor-5094-thread-1-processing-n:127.0.0.1:45022_) [n:127.0.0.1:45022_ c:control_collection   x:collection1] o.a.s.c.ZkController Check for collection zkNode:control_collection
   [junit4]   2> 1327185 INFO  (coreLoadExecutor-5094-thread-1-processing-n:127.0.0.1:45022_) [n:127.0.0.1:45022_ c:control_collection   x:collection1] o.a.s.c.ZkController Collection zkNode exists
   [junit4]   2> 1327185 INFO  (coreLoadExecutor-5094-thread-1-processing-n:127.0.0.1:45022_) [n:127.0.0.1:45022_ c:control_collection   x:collection1] o.a.s.c.c.ZkStateReader Load collection config from: [/collections/control_collection]
   [junit4]   2> 1327185 INFO  (coreLoadExecutor-5094-thread-1-processing-n:127.0.0.1:45022_) [n:127.0.0.1:45022_ c:control_collection   x:collection1] o.a.s.c.c.ZkStateReader path=[/collections/control_collection] [configName]=[conf1] specified config exists in ZooKeeper
   [junit4]   2> 1327186 INFO  (coreLoadExecutor-5094-thread-1-processing-n:127.0.0.1:45022_) [n:127.0.0.1:45022_ c:control_collection   x:collection1] o.a.s.c.SolrResourceLoader new SolrResourceLoader for directory: '/export/home/jenkins/workspace/Lucene-Solr-5.x-Solaris/solr/build/solr-core/test/J1/temp/solr.cloud.SyncSliceTest_E9E3F56593F8E51C-001/control-001/cores/collection1'
   [junit4]   2> 1327186 INFO  (coreLoadExecutor-5094-thread-1-processing-n:127.0.0.1:45022_) [n:127.0.0.1:45022_ c:control_collection   x:collection1] o.a.s.c.SolrResourceLoader JNDI not configured for solr (NoInitialContextEx)
   [junit4]   2> 1327186 INFO  (coreLoadExecutor-5094-thread-1-processing-n:127.0.0.1:45022_) [n:127.0.0.1:45022_ c:control_collection   x:collection1] o.a.s.c.SolrResourceLoader solr home defaulted to 'solr/' (could not find system property or JNDI)
   [junit4]   2> 1327187 INFO  (coreLoadExecutor-5094-thread-1-processing-n:127.0.0.1:45022_) [n:127.0.0.1:45022_ c:control_collection   x:collection1] o.a.s.c.Config loaded config solrconfig.xml with version 0 
   [junit4]   2> 1327192 INFO  (coreLoadExecutor-5094-thread-1-processing-n:127.0.0.1:45022_) [n:127.0.0.1:45022_ c:control_collection   x:collection1] o.a.s.c.SolrConfig current version of requestparams : -1
   [junit4]   2> 1327196 INFO  (coreLoadExecutor-5094-thread-1-processing-n:127.0.0.1:45022_) [n:127.0.0.1:45022_ c:control_collection   x:collection1] o.a.s.c.SolrConfig Using Lucene MatchVersion: 5.6.0
   [junit4]   2> 1327202 INFO  (coreLoadExecutor-5094-thread-1-processing-n:127.0.0.1:45022_) [n:127.0.0.1:45022_ c:control_collection   x:collection1] o.a.s.c.SolrConfig Loaded SolrConfig: solrconfig.xml
   [junit4]   2> 1327207 INFO  (coreLoadExecutor-5094-thread-1-processing-n:127.0.0.1:45022_) [n:127.0.0.1:45022_ c:control_collection   x:collection1] o.a.s.s.IndexSchema [collection1] Schema name=test
   [junit4]   2> 1327274 INFO  (coreLoadExecutor-5094-thread-1-processing-n:127.0.0.1:45022_) [n:127.0.0.1:45022_ c:control_collection   x:collection1] o.a.s.s.OpenExchangeRatesOrgProvider Initialized with rates=open-exchange-rates.json, refreshInterval=1440.
   [junit4]   2> 1327279 INFO  (coreLoadExecutor-5094-thread-1-processing-n:127.0.0.1:45022_) [n:127.0.0.1:45022_ c:control_collection   x:collection1] o.a.s.s.IndexSchema default search field in schema is text
   [junit4]   2> 1327280 INFO  (coreLoadExecutor-5094-thread-1-processing-n:127.0.0.1:45022_) [n:127.0.0.1:45022_ c:control_collection   x:collection1] o.a.s.s.IndexSchema unique key field: id
   [junit4]   2> 1327290 INFO  (coreLoadExecutor-5094-thread-1-processing-n:127.0.0.1:45022_) [n:127.0.0.1:45022_ c:control_collection   x:collection1] o.a.s.s.FileExchangeRateProvider Reloading exchange rates from file currency.xml
   [junit4]   2> 1327292 INFO  (coreLoadExecutor-5094-thread-1-processing-n:127.0.0.1:45022_) [n:127.0.0.1:45022_ c:control_collection   x:collection1] o.a.s.s.FileExchangeRateProvider Reloading exchange rates from file currency.xml
   [junit4]   2> 1327294 INFO  (coreLoadExecutor-5094-thread-1-processing-n:127.0.0.1:45022_) [n:127.0.0.1:45022_ c:control_collection   x:collection1] o.a.s.s.OpenExchangeRatesOrgProvider Reloading exchange rates from open-exchange-rates.json
   [junit4]   2> 1327295 INFO  (coreLoadExecutor-5094-thread-1-processing-n:127.0.0.1:45022_) [n:127.0.0.1:45022_ c:control_collection   x:collection1] o.a.s.s.OpenExchangeRatesOrgProvider Reloading exchange rates from open-exchange-rates.json
   [junit4]   2> 1327297 INFO  (coreLoadExecutor-5094-thread-1-processing-n:127.0.0.1:45022_) [n:127.0.0.1:45022_ c:control_collection   x:collection1] o.a.s.c.ConfigSetProperties Did not find ConfigSet properties, assuming default properties: Can't find resource 'configsetprops.json' in classpath or '/configs/conf1', cwd=/export/home/jenkins/workspace/Lucene-Solr-5.x-Solaris/solr/build/solr-core/test/J1
   [junit4]   2> 1327297 INFO  (coreLoadExecutor-5094-thread-1-processing-n:127.0.0.1:45022_) [n:127.0.0.1:45022_ c:control_collection   x:collection1] o.a.s.c.CoreContainer Creating SolrCore 'collection1' using configuration from collection control_collection
   [junit4]   2> 1327298 INFO  (coreLoadExecutor-5094-thread-1-processing-n:127.0.0.1:45022_) [n:127.0.0.1:45022_ c:control_collection s:shard1 r:core_node1 x:collection1] o.a.s.c.SolrCore org.apache.solr.core.MockDirectoryFactory
   [junit4]   2> 1327298 INFO  (coreLoadExecutor-5094-thread-1-processing-n:127.0.0.1:45022_) [n:127.0.0.1:45022_ c:control_collection s:shard1 r:core_node1 x:collection1] o.a.s.c.SolrCore [[collection1] ] Opening new SolrCore at [/export/home/jenkins/workspace/Lucene-Solr-5.x-Solaris/solr/build/solr-core/test/J1/temp/solr.cloud.SyncSliceTest_E9E3F56593F8E51C-001/control-001/cores/collection1], dataDir=[/export/home/jenkins/workspace/Lucene-Solr-5.x-Solaris/solr/build/solr-core/test/J1/temp/solr.cloud.SyncSliceTest_E9E3F56593F8E51C-001/control-001/cores/collection1/data/]
   [junit4]   2> 1327298 INFO  (coreLoadExecutor-5094-thread-1-processing-n:127.0.0.1:45022_) [n:127.0.0.1:45022_ c:control_collection s:shard1 r:core_node1 x:collection1] o.a.s.c.JmxMonitoredMap JMX monitoring is enabled. Adding Solr mbeans to JMX Server: com.sun.jmx.mbeanserver.JmxMBeanServer@4bba2b74
   [junit4]   2> 1327298 INFO  (coreLoadExecutor-5094-thread-1-processing-n:127.0.0.1:45022_) [n:127.0.0.1:45022_ c:control_collection s:shard1 r:core_node1 x:collection1] o.a.s.c.CachingDirectoryFactory return new directory for /export/home/jenkins/workspace/Lucene-Solr-5.x-Solaris/solr/build/solr-core/test/J1/temp/solr.cloud.SyncSliceTest_E9E3F56593F8E51C-001/control-001/cores/collection1/data
   [junit4]   2> 1327298 INFO  (coreLoadExecutor-5094-thread-1-processing-n:127.0.0.1:45022_) [n:127.0.0.1:45022_ c:control_collection s:shard1 r:core_node1 x:collection1] o.a.s.c.SolrCore New index directory detected: old=null new=/export/home/jenkins/workspace/Lucene-Solr-5.x-Solaris/solr/build/solr-core/test/J1/temp/solr.cloud.SyncSliceTest_E9E3F56593F8E51C-001/control-001/cores/collection1/data/index/
   [junit4]   2> 1327298 WARN  (coreLoadExecutor-5094-thread-1-processing-n:127.0.0.1:45022_) [n:127.0.0.1:45022_ c:control_collection s:shard1 r:core_node1 x:collection1] o.a.s.c.SolrCore [collection1] Solr index directory '/export/home/jenkins/workspace/Lucene-Solr-5.x-Solaris/solr/build/solr-core/test/J1/temp/solr.cloud.SyncSliceTest_E9E3F56593F8E51C-001/control-001/cores/collection1/data/index' doesn't exist. Creating new index...
   [junit4]   2> 1327298 INFO  (coreLoadExecutor-5094-thread-1-processing-n:127.0.0.1:45022_) [n:127.0.0.1:45022_ c:control_collection s:shard1 r:core_node1 x:collection1] o.a.s.c.CachingDirectoryFactory return new directory for /export/home/jenkins/workspace/Lucene-Solr-5.x-Solaris/solr/build/solr-core/test/J1/temp/solr.cloud.SyncSliceTest_E9E3F56593F8E51C-001/control-001/cores/collection1/data/index
   [junit4]   2> 1327299 INFO  (coreLoadExecutor-5094-thread-1-processing-n:127.0.0.1:45022_) [n:127.0.0.1:45022_ c:control_collection s:shard1 r:core_node1 x:collection1] o.a.s.u.RandomMergePolicy RandomMergePolicy wrapping class org.apache.lucene.index.LogDocMergePolicy: [LogDocMergePolicy: minMergeSize=1000, mergeFactor=18, maxMergeSize=9223372036854775807, maxMergeSizeForForcedMerge=9223372036854775807, calibrateSizeByDeletes=true, maxMergeDocs=2147483647, maxCFSSegmentSizeMB=8.796093022207999E12, noCFSRatio=0.42165427927152466]
   [junit4]   2> 1327299 INFO  (coreLoadExecutor-5094-thread-1-processing-n:127.0.0.1:45022_) [n:127.0.0.1:45022_ c:control_collection s:shard1 r:core_node1 x:collection1] o.a.s.c.SolrDeletionPolicy SolrDeletionPolicy.onCommit: commits: num=1
   [junit4]   2> 	commit{dir=MockDirectoryWrapper(RAMDirectory@1ce19436 lockFactory=org.apache.lucene.store.SingleInstanceLockFactory@6b9ba723),segFN=segments_1,generation=1}
   [junit4]   2> 1327299 INFO  (coreLoadExecutor-5094-thread-1-processing-n:127.0.0.1:45022_) [n:127.0.0.1:45022_ c:control_collection s:shard1 r:core_node1 x:collection1] o.a.s.c.SolrDeletionPolicy newest commit generation = 1
   [junit4]   2> 1327299 INFO  (OldIndexDirectoryCleanupThreadForCore-collection1) [n:127.0.0.1:45022_ c:control_collection s:shard1 r:core_node1 x:collection1] o.a.s.c.SolrCore Looking for old index directories to cleanup for core collection1 in /export/home/jenkins/workspace/Lucene-Solr-5.x-Solaris/solr/build/solr-core/test/J1/temp/solr.cloud.SyncSliceTest_E9E3F56593F8E51C-001/control-001/cores/collection1/data/
   [junit4]   2> 1327299 WARN  (OldIndexDirectoryCleanupThreadForCore-collection1) [n:127.0.0.1:45022_ c:control_collection s:shard1 r:core_node1 x:collection1] o.a.s.c.DirectoryFactory /export/home/jenkins/workspace/Lucene-Solr-5.x-Solaris/solr/build/solr-core/test/J1/temp/solr.cloud.SyncSliceTest_E9E3F56593F8E51C-001/control-001/cores/collection1/data/ does not point to a valid data directory; skipping clean-up of old index directories.
   [junit4]   2> 1327301 INFO  (coreLoadExecutor-5094-thread-1-processing-n:127.0.0.1:45022_) [n:127.0.0.1:45022_ c:control_collection s:shard1 r:core_node1 x:collection1] o.a.s.u.p.UpdateRequestProcessorChain creating updateRequestProcessorChain "nodistrib"
   [junit4]   2> 1327301 INFO  (coreLoadExecutor-5094-thread-1-processing-n:127.0.0.1:45022_) [n:127.0.0.1:45022_ c:control_collection s:shard1 r:core_node1 x:collection1] o.a.s.u.p.UpdateRequestProcessorChain creating updateRequestProcessorChain "dedupe"
   [junit4]   2> 1327301 INFO  (coreLoadExecutor-5094-thread-1-processing-n:127.0.0.1:45022_) [n:127.0.0.1:45022_ c:control_collection s:shard1 r:core_node1 x:collection1] o.a.s.u.p.UpdateRequestProcessorChain inserting DistributedUpdateProcessorFactory into updateRequestProcessorChain "dedupe"
   [junit4]   2> 1327301 INFO  (coreLoadExecutor-5094-thread-1-processing-n:127.0.0.1:45022_) [n:127.0.0.1:45022_ c:control_collection s:shard1 r:core_node1 x:collection1] o.a.s.u.p.UpdateRequestProcessorChain creating updateRequestProcessorChain "stored_sig"
   [junit4]   2> 1327301 INFO  (coreLoadExecutor-5094-thread-1-processing-n:127.0.0.1:45022_) [n:127.0.0.1:45022_ c:control_collection s:shard1 r:core_node1 x:collection1] o.a.s.u.p.UpdateRequestProcessorChain inserting DistributedUpdateProcessorFactory into updateRequestProcessorChain "stored_sig"
   [junit4]   2> 1327302 INFO  (coreLoadExecutor-5094-thread-1-processing-n:127.0.0.1:45022_) [n:127.0.0.1:45022_ c:control_collection s:shard1 r:core_node1 x:collection1] o.a.s.u.p.UpdateRequestProcessorChain creating updateRequestProcessorChain "distrib-dup-test-chain-explicit"
   [junit4]   2> 1327302 INFO  (coreLoadExecutor-5094-thread-1-processing-n:127.0.0.1:45022_) [n:127.0.0.1:45022_ c:control_collection s:shard1 r:core_node1 x:collection1] o.a.s.u.p.UpdateRequestProcessorChain creating updateRequestProcessorChain "distrib-dup-test-chain-implicit"
   [junit4]   2> 1327302 INFO  (coreLoadExecutor-5094-thread-1-processing-n:127.0.0.1:45022_) [n:127.0.0.1:45022_ c:control_collection s:shard1 r:core_node1 x:collection1] o.a.s.u.p.UpdateRequestProcessorChain inserting DistributedUpdateProcessorFactory into updateRequestProcessorChain "distrib-dup-test-chain-implicit"
   [junit4]   2> 1327302 INFO  (coreLoadExecutor-5094-thread-1-processing-n:127.0.0.1:45022_) [n:127.0.0.1:45022_ c:control_collection s:shard1 r:core_node1 x:collection1] o.a.s.c.SolrCore no updateRequestProcessorChain defined as default, creating implicit default
   [junit4]   2> 1327302 WARN  (coreLoadExecutor-5094-thread-1-processing-n:127.0.0.1:45022_) [n:127.0.0.1:45022_ c:control_collection s:shard1 r:core_node1 x:collection1] o.a.s.c.RequestHandlers INVALID paramSet a in requestHandler {type = requestHandler,name = /dump,class = DumpRequestHandler,args = {defaults={a=A,b=B}}}
   [junit4]   2> 1327303 INFO  (coreLoadExecutor-5094-thread-1-processing-n:127.0.0.1:45022_) [n:127.0.0.1:45022_ c:control_collection s:shard1 r:core_node1 x:collection1] o.a.s.h.l.XMLLoader xsltCacheLifetimeSeconds=60
   [junit4]   2> 1327304 INFO  (coreLoadExecutor-5094-thread-1-processing-n:127.0.0.1:45022_) [n:127.0.0.1:45022_ c:control_collection s:shard1 r:core_node1 x:collection1] o.a.s.h.l.XMLLoader xsltCacheLifetimeSeconds=60
   [junit4]   2> 1327305 INFO  (coreLoadExecutor-5094-thread-1-processing-n:127.0.0.1:45022_) [n:127.0.0.1:45022_ c:control_collection s:shard1 r:core_node1 x:collection1] o.a.s.h.l.XMLLoader xsltCacheLifetimeSeconds=60
   [junit4]   2> 1327306 INFO  (coreLoadExecutor-5094-thread-1-processing-n:127.0.0.1:45022_) [n:127.0.0.1:45022_ c:control_collection s:shard1 r:core_node1 x:collection1] o.a.s.h.l.XMLLoader xsltCacheLifetimeSeconds=60
   [junit4]   2> 1327308 INFO  (coreLoadExecutor-5094-thread-1-processing-n:127.0.0.1:45022_) [n:127.0.0.1:45022_ c:control_collection s:shard1 r:core_node1 x:collection1] o.a.s.c.RequestHandlers Registered paths: /admin/mbeans,standard,/dump,/update/csv,/update/json/docs,/admin/luke,/admin/segments,/get,/admin/system,/replication,/admin/properties,/config,/schema,/admin/plugins,/admin/logging,/update/json,/admin/threads,/admin/ping,/update,/admin/file
   [junit4]   2> 1327308 INFO  (coreLoadExecutor-5094-thread-1-processing-n:127.0.0.1:45022_) [n:127.0.0.1:45022_ c:control_collection s:shard1 r:core_node1 x:collection1] o.a.s.c.SolrCore Using default statsCache cache: org.apache.solr.search.stats.LocalStatsCache
   [junit4]   2> 1327309 INFO  (coreLoadExecutor-5094-thread-1-processing-n:127.0.0.1:45022_) [n:127.0.0.1:45022_ c:control_collection s:shard1 r:core_node1 x:collection1] o.a.s.u.UpdateHandler Using UpdateLog implementation: org.apache.solr.update.UpdateLog
   [junit4]   2> 1327309 INFO  (coreLoadExecutor-5094-thread-1-processing-n:127.0.0.1:45022_) [n:127.0.0.1:45022_ c:control_collection s:shard1 r:core_node1 x:collection1] o.a.s.u.UpdateLog Initializing UpdateLog: dataDir= defaultSyncLevel=FLUSH numRecordsToKeep=100 maxNumLogsToKeep=10 numVersionBuckets=65536
   [junit4]   2> 1327309 INFO  (coreLoadExecutor-5094-thread-1-processing-n:127.0.0.1:45022_) [n:127.0.0.1:45022_ c:control_collection s:shard1 r:core_node1 x:collection1] o.a.s.u.CommitTracker Hard AutoCommit: disabled
   [junit4]   2> 1327309 INFO  (coreLoadExecutor-5094-thread-1-processing-n:127.0.0.1:45022_) [n:127.0.0.1:45022_ c:control_collection s:shard1 r:core_node1 x:collection1] o.a.s.u.CommitTracker Soft AutoCommit: disabled
   [junit4]   2> 1327310 INFO  (coreLoadExecutor-5094-thread-1-processing-n:127.0.0.1:45022_) [n:127.0.0.1:45022_ c:control_collection s:shard1 r:core_node1 x:collection1] o.a.s.u.RandomMergePolicy RandomMergePolicy wrapping class org.apache.lucene.index.TieredMergePolicy: [TieredMergePolicy: maxMergeAtOnce=28, maxMergeAtOnceExplicit=13, maxMergedSegmentMB=74.5986328125, floorSegmentMB=1.3994140625, forceMergeDeletesPctAllowed=4.933558866517207, segmentsPerTier=26.0, maxCFSSegmentSizeMB=8.796093022207999E12, noCFSRatio=0.7599281080736388
   [junit4]   2> 1327310 INFO  (coreLoadExecutor-5094-thread-1-processing-n:127.0.0.1:45022_) [n:127.0.0.1:45022_ c:control_collection s:shard1 r:core_node1 x:collection1] o.a.s.c.SolrDeletionPolicy SolrDeletionPolicy.onInit: commits: num=1
   [junit4]   2> 	commit{dir=MockDirectoryWrapper(RAMDirectory@1ce19436 lockFactory=org.apache.lucene.store.SingleInstanceLockFactory@6b9ba723),segFN=segments_1,generation=1}
   [junit4]   2> 1327310 INFO  (coreLoadExecutor-5094-thread-1-processing-n:127.0.0.1:45022_) [n:127.0.0.1:45022_ c:control_collection s:shard1 r:core_node1 x:collection1] o.a.s.c.SolrDeletionPolicy newest commit generation = 1
   [junit4]   2> 1327310 INFO  (coreLoadExecutor-5094-thread-1-processing-n:127.0.0.1:45022_) [n:127.0.0.1:45022_ c:control_collection s:shard1 r:core_node1 x:collection1] o.a.s.s.SolrIndexSearcher Opening Searcher@6c9b05be[collection1] main
   [junit4]   2> 1327310 INFO  (coreLoadExecutor-5094-thread-1-processing-n:127.0.0.1:45022_) [n:127.0.0.1:45022_ c:control_collection s:shard1 r:core_node1 x:collection1] o.a.s.c.c.ZkStateReader Load collection config from: [/collections/control_collection]
   [junit4]   2> 1327311 INFO  (coreLoadExecutor-5094-thread-1-processing-n:127.0.0.1:45022_) [n:127.0.0.1:45022_ c:control_collection s:shard1 r:core_node1 x:collection1] o.a.s.c.c.ZkStateReader path=[/collections/control_collection] [configName]=[conf1] specified config exists in ZooKeeper
   [junit4]   2> 1327311 INFO  (coreLoadExecutor-5094-thread-1-processing-n:127.0.0.1:45022_) [n:127.0.0.1:45022_ c:control_collection s:shard1 r:core_node1 x:collection1] o.a.s.r.ManagedResourceStorage Setting up ZooKeeper-based storage for the RestManager with znodeBase: /configs/conf1
   [junit4]   2> 1327312 INFO  (coreLoadExecutor-5094-thread-1-processing-n:127.0.0.1:45022_) [n:127.0.0.1:45022_ c:control_collection s:shard1 r:core_node1 x:collection1] o.a.s.r.ManagedResourceStorage Configured ZooKeeperStorageIO with znodeBase: /configs/conf1
   [junit4]   2> 1327312 INFO  (coreLoadExecutor-5094-thread-1-processing-n:127.0.0.1:45022_) [n:127.0.0.1:45022_ c:control_collection s:shard1 r:core_node1 x:collection1] o.a.s.r.RestManager Initializing RestManager with initArgs: {}
   [junit4]   2> 1327312 INFO  (coreLoadExecutor-5094-thread-1-processing-n:127.0.0.1:45022_) [n:127.0.0.1:45022_ c:control_collection s:shard1 r:core_node1 x:collection1] o.a.s.r.ManagedResourceStorage Reading _rest_managed.json using ZooKeeperStorageIO:path=/configs/conf1
   [junit4]   2> 1327312 INFO  (coreLoadExecutor-5094-thread-1-processing-n:127.0.0.1:45022_) [n:127.0.0.1:45022_ c:control_collection s:shard1 r:core_node1 x:collection1] o.a.s.r.ManagedResourceStorage No data found for znode /configs/conf1/_rest_managed.json
   [junit4]   2> 1327312 INFO  (coreLoadExecutor-5094-thread-1-processing-n:127.0.0.1:45022_) [n:127.0.0.1:45022_ c:control_collection s:shard1 r:core_node1 x:collection1] o.a.s.r.ManagedResourceStorage Loaded null at path _rest_managed.json using ZooKeeperStorageIO:path=/configs/conf1
   [junit4]   2> 1327312 INFO  (coreLoadExecutor-5094-thread-1-processing-n:127.0.0.1:45022_) [n:127.0.0.1:45022_ c:control_collection s:shard1 r:core_node1 x:collection1] o.a.s.r.RestManager Initializing 0 registered ManagedResources
   [junit4]   2> 1327313 INFO  (coreLoadExecutor-5094-thread-1-processing-n:127.0.0.1:45022_) [n:127.0.0.1:45022_ c:control_collection s:shard1 r:core_node1 x:collection1] o.a.s.h.ReplicationHandler Commits will be reserved for  10000
   [junit4]   2> 1327313 INFO  (searcherExecutor-5095-thread-1-processing-n:127.0.0.1:45022_ x:collection1 s:shard1 c:control_collection r:core_node1) [n:127.0.0.1:45022_ c:control_collection s:shard1 r:core_node1 x:collection1] o.a.s.c.SolrCore [collection1] Registered new searcher Searcher@6c9b05be[collection1] main{ExitableDirectoryReader(UninvertingDirectoryReader())}
   [junit4]   2> 1327313 INFO  (coreLoadExecutor-5094-thread-1-processing-n:127.0.0.1:45022_) [n:127.0.0.1:45022_ c:control_collection s:shard1 r:core_node1 x:collection1] o.a.s.u.UpdateLog Looking up max value of version field to seed version buckets
   [junit4]   2> 1327313 INFO  (coreLoadExecutor-5094-thread-1-processing-n:127.0.0.1:45022_) [n:127.0.0.1:45022_ c:control_collection s:shard1 r:core_node1 x:collection1] o.a.s.u.VersionInfo Refreshing highest value of _version_ for 65536 version buckets from index
   [junit4]   2> 1327313 INFO  (coreLoadExecutor-5094-thread-1-processing-n:127.0.0.1:45022_) [n:127.0.0.1:45022_ c:control_collection s:shard1 r:core_node1 x:collection1] o.a.s.u.VersionInfo No terms found for _version_, cannot seed version bucket highest value from index
   [junit4]   2> 1327313 INFO  (coreLoadExecutor-5094-thread-1-processing-n:127.0.0.1:45022_) [n:127.0.0.1:45022_ c:control_collection s:shard1 r:core_node1 x:collection1] o.a.s.u.UpdateLog Could not find max version in index or recent updates, using new clock 1526432234790191104
   [junit4]   2> 1327315 INFO  (coreLoadExecutor-5094-thread-1-processing-n:127.0.0.1:45022_) [n:127.0.0.1:45022_ c:control_collection s:shard1 r:core_node1 x:collection1] o.a.s.u.UpdateLog Took 1.0ms to seed version buckets with highest version 1526432234790191104
   [junit4]   2> 1327315 INFO  (coreLoadExecutor-5094-thread-1-processing-n:127.0.0.1:45022_) [n:127.0.0.1:45022_ c:control_collection s:shard1 r:core_node1 x:collection1] o.a.s.c.ZkController watch zkdir /configs/conf1
   [junit4]   2> 1327316 INFO  (coreLoadExecutor-5094-thread-1-processing-n:127.0.0.1:45022_) [n:127.0.0.1:45022_ c:control_collection s:shard1 r:core_node1 x:collection1] o.a.s.c.CoreContainer registering core: collection1
   [junit4]   2> 1327316 INFO  (coreZkRegister-5088-thread-1-processing-n:127.0.0.1:45022_ x:collection1 s:shard1 c:control_collection r:core_node1) [n:127.0.0.1:45022_ c:control_collection s:shard1 r:core_node1 x:collection1] o.a.s.c.ZkController Register replica - core:collection1 address:https://127.0.0.1:45022 collection:control_collection shard:shard1
   [junit4]   2> 1327317 INFO  (coreZkRegister-5088-thread-1-processing-n:127.0.0.1:45022_ x:collection1 s:shard1 c:control_collection r:core_node1) [n:127.0.0.1:45022_ c:control_collection s:shard1 r:core_node1 x:collection1] o.a.s.c.c.SolrZkClient makePath: /collections/control_collection/leader_elect/shard1/election
   [junit4]   2> 1327322 INFO  (coreZkRegister-5088-thread-1-processing-n:127.0.0.1:45022_ x:collection1 s:shard1 c:control_collection r:core_node1) [n:127.0.0.1:45022_ c:control_collection s:shard1 r:core_node1 x:collection1] o.a.s.c.LeaderElector Joined leadership election with path: /collections/control_collection/leader_elect/shard1/election/95402014563565573-core_node1-n_0000000000
   [junit4]   2> 1327322 INFO  (coreZkRegister-5088-thread-1-processing-n:127.0.0.1:45022_ x:collection1 s:shard1 c:control_collection r:core_node1) [n:127.0.0.1:45022_ c:control_collection s:shard1 r:core_node1 x:collection1] o.a.s.c.ShardLeaderElectionContext Running the leader process for shard=shard1 and weAreReplacement=false and leaderVoteWait=10000
   [junit4]   2> 1327325 INFO  (coreZkRegister-5088-thread-1-processing-n:127.0.0.1:45022_ x:collection1 s:shard1 c:control_collection r:core_node1) [n:127.0.0.1:45022_ c:control_collection s:shard1 r:core_node1 x:collection1] o.a.s.c.ShardLeaderElectionContext Enough replicas found to continue.
   [junit4]   2> 1327325 INFO  (coreZkRegister-5088-thread-1-processing-n:127.0.0.1:45022_ x:collection1 s:shard1 c:control_collection r:core_node1) [n:127.0.0.1:45022_ c:control_collection s:shard1 r:core_node1 x:collection1] o.a.s.c.ShardLeaderElectionContext I may be the new leader - try and sync
   [junit4]   2> 1327325 INFO  (coreZkRegister-5088-thread-1-processing-n:127.0.0.1:45022_ x:collection1 s:shard1 c:control_collection r:core_node1) [n:127.0.0.1:45022_ c:control_collection s:shard1 r:core_node1 x:collection1] o.a.s.c.SyncStrategy Sync replicas to https://127.0.0.1:45022/collection1/
   [junit4]   2> 1327325 INFO  (coreZkRegister-5088-thread-1-processing-n:127.0.0.1:45022_ x:collection1 s:shard1 c:control_collection r:core_node1) [n:127.0.0.1:45022_ c:control_collection s:shard1 r:core_node1 x:collection1] o.a.s.c.SyncStrategy Sync Success - now sync replicas to me
   [junit4]   2> 1327325 INFO  (coreZkRegister-5088-thread-1-processing-n:127.0.0.1:45022_ x:collection1 s:shard1 c:control_collection r:core_node1) [n:127.0.0.1:45022_ c:control_collection s:shard1 r:core_node1 x:collection1] o.a.s.c.SyncStrategy https://127.0.0.1:45022/collection1/ has no replicas
   [junit4]   2> 1327326 INFO  (OverseerStateUpdate-95402014563565573-127.0.0.1:45022_-n_0000000000) [n:127.0.0.1:45022_    ] o.a.s.c.Overseer processMessage: queueSize: 1, message = {
   [junit4]   2>   "operation":"leader",
   [junit4]   2>   "shard":"shard1",
   [junit4]   2>   "collection":"control_collection"} current state version: 1
   [junit4]   2> 1327327 INFO  (coreZkRegister-5088-thread-1-processing-n:127.0.0.1:45022_ x:collection1 s:shard1 c:control_collection r:core_node1) [n:127.0.0.1:45022_ c:control_collection s:shard1 r:core_node1 x:collection1] o.a.s.c.c.SolrZkClient makePath: /collections/control_collection/leaders/shard1
   [junit4]   2> 1327330 INFO  (coreZkRegister-5088-thread-1-processing-n:127.0.0.1:45022_ x:collection1 s:shard1 c:control_collection r:core_node1) [n:127.0.0.1:45022_ c:control_collection s:shard1 r:core_node1 x:collection1] o.a.s.c.ShardLeaderElectionContextBase Creating leader registration node
   [junit4]   2> 1327333 INFO  (coreZkRegister-5088-thread-1-processing-n:127.0.0.1:45022_ x:collection1 s:shard1 c:control_collection r:core_node1) [n:127.0.0.1:45022_ c:control_collection s:shard1 r:core_node1 x:collection1] o.a.s.c.ShardLeaderElectionContext I am the new leader: https://127.0.0.1:45022/collection1/ shard1
   [junit4]   2> 1327334 INFO  (OverseerStateUpdate-95402014563565573-127.0.0.1:45022_-n_0000000000) [n:127.0.0.1:45022_    ] o.a.s.c.Overseer processMessage: queueSize: 1, message = {
   [junit4]   2>   "operation":"leader",
   [junit4]   2>   "shard":"shard1",
   [junit4]   2>   "collection":"control_collection",
   [junit4]   2>   "base_url":"https://127.0.0.1:45022",
   [junit4]   2>   "core":"collection1",
   [junit4]   2>   "state":"active"} current state version: 1
   [junit4]   2> 1327441 INFO  (zkCallback-1364-thread-1-processing-n:127.0.0.1:45022_) [n:127.0.0.1:45022_    ] o.a.s.c.c.ZkStateReader A cluster state change: [WatchedEvent state:SyncConnected type:NodeDataChanged path:/clusterstate.json], has occurred - updating... (live nodes size: [1])
   [junit4]   2> 1327485 INFO  (coreZkRegister-5088-thread-1-processing-n:127.0.0.1:45022_ x:collection1 s:shard1 c:control_collection r:core_node1) [n:127.0.0.1:45022_ c:control_collection s:shard1 r:core_node1 x:collection1] o.a.s.c.ZkController We are https://127.0.0.1:45022/collection1/ and leader is https://127.0.0.1:45022/collection1/
   [junit4]   2> 1327485 INFO  (coreZkRegister-5088-thread-1-processing-n:127.0.0.1:45022_ x:collection1 s:shard1 c:control_collection r:core_node1) [n:127.0.0.1:45022_ c:control_collection s:shard1 r:core_node1 x:collection1] o.a.s.c.ZkController No LogReplay needed for core=collection1 baseURL=https://127.0.0.1:45022
   [junit4]   2> 1327485 INFO  (coreZkRegister-5088-thread-1-processing-n:127.0.0.1:45022_ x:collection1 s:shard1 c:control_collection r:core_node1) [n:127.0.0.1:45022_ c:control_collection s:shard1 r:core_node1 x:collection1] o.a.s.c.ZkController I am the leader, no recovery necessary
   [junit4]   2> 1327485 INFO  (coreZkRegister-5088-thread-1-processing-n:127.0.0.1:45022_ x:collection1 s:shard1 c:control_collection r:core_node1) [n:127.0.0.1:45022_ c:control_collection s:shard1 r:core_node1 x:collection1] o.a.s.c.ZkController publishing state=active
   [junit4]   2> 1327485 INFO  (coreZkRegister-5088-thread-1-processing-n:127.0.0.1:45022_ x:collection1 s:shard1 c:control_collection r:core_node1) [n:127.0.0.1:45022_ c:control_collection s:shard1 r:core_node1 x:collection1] o.a.s.c.ZkController numShards not found on descriptor - reading it from system property
   [junit4]   2> 1327488 INFO  (OverseerStateUpdate-95402014563565573-127.0.0.1:45022_-n_0000000000) [n:127.0.0.1:45022_    ] o.a.s.c.Overseer processMessage: queueSize: 1, message = {
   [junit4]   2>   "core":"collection1",
   [junit4]   2>   "core_node_name":"core_node1",
   [junit4]   2>   "roles":null,
   [junit4]   2>   "base_url":"https://127.0.0.1:45022",
   [junit4]   2>   "node_name":"127.0.0.1:45022_",
   [junit4]   2>   "numShards":"1",
   [junit4]   2>   "state":"active",
   [junit4]   2>   "shard":"shard1",
   [junit4]   2>   "collection":"control_collection",
   [junit4]   2>   "operation":"state"} current state version: 2
   [junit4]   2> 1327489 INFO  (OverseerStateUpdate-95402014563565573-127.0.0.1:45022_-n_0000000000) [n:127.0.0.1:45022_    ] o.a.s.c.o.ReplicaMutator Update state numShards=1 message={
   [junit4]   2>   "core":"collection1",
   [junit4]   2>   "core_node_name":"core_node1",
   [junit4]   2>   "roles":null,
   [junit4]   2>   "base_url":"https://127.0.0.1:45022",
   [junit4]   2>   "node_name":"127.0.0.1:45022_",
   [junit4]   2>   "numShards":"1",
   [junit4]   2>   "state":"active",
   [junit4]   2>   "shard":"shard1",
   [junit4]   2>   "collection":"control_collection",
   [junit4]   2>   "operation":"state"}
   [junit4]   2> 1327593 INFO  (zkCallback-1364-thread-1-processing-n:127.0.0.1:45022_) [n:127.0.0.1:45022_    ] o.a.s.c.c.ZkStateReader A cluster state change: [WatchedEvent state:SyncConnected type:NodeDataChanged path:/clusterstate.json], has occurred - updating... (live nodes size: [1])
   [junit4]   2> 1327686 INFO  (TEST-SyncSliceTest.test-seed#[E9E3F56593F8E51C]) [    ] o.a.s.c.c.SolrZkClient Using default ZkCredentialsProvider
   [junit4]   2> 1327686 INFO  (TEST-SyncSliceTest.test-seed#[E9E3F56593F8E51C]) [    ] o.a.s.c.c.ConnectionManager Waiting for client to connect to ZooKeeper
   [junit4]   2> 1327687 INFO  (zkCallback-1366-thread-1) [    ] o.a.s.c.c.ConnectionManager Watcher org.apache.solr.common.cloud.ConnectionManager@2966674 name:ZooKeeperConnection Watcher:127.0.0.1:59447/solr got event WatchedEvent state:SyncConnected type:None path:null path:null type:None
   [junit4]   2> 1327687 INFO  (TEST-SyncSliceTest.test-seed#[E9E3F56593F8E51C]) [    ] o.a.s.c.c.ConnectionManager Client is connected to ZooKeeper
   [junit4]   2> 1327688 INFO  (TEST-SyncSliceTest.test-seed#[E9E3F56593F8E51C]) [    ] o.a.s.c.c.SolrZkClient Using default ZkACLProvider
   [junit4]   2> 1327688 INFO  (TEST-SyncSliceTest.test-seed#[E9E3F56593F8E51C]) [    ] o.a.s.c.c.ZkStateReader Updating cluster state from ZooKeeper... 
   [junit4]   2> 1327691 INFO  (TEST-SyncSliceTest.test-seed#[E9E3F56593F8E51C]) [    ] o.a.s.c.ChaosMonkey monkey: init - expire sessions:false cause connection loss:false
   [junit4]   2> 1328091 INFO  (TEST-SyncSliceTest.test-seed#[E9E3F56593F8E51C]) [    ] o.a.s.SolrTestCaseJ4 Writing core.properties file to /export/home/jenkins/workspace/Lucene-Solr-5.x-Solaris/solr/build/solr-core/test/J1/temp/solr.cloud.SyncSliceTest_E9E3F56593F8E51C-001/shard-1-001/cores/collection1
   [junit4]   2> 1328092 INFO  (TEST-SyncSliceTest.test-seed#[E9E3F56593F8E51C]) [    ] o.a.s.c.AbstractFullDistribZkTestBase create jetty 1 in directory /export/home/jenkins/workspace/Lucene-Solr-5.x-Solaris/solr/build/solr-core/test/J1/temp/solr.cloud.SyncSliceTest_E9E3F56593F8E51C-001/shard-1-001
   [junit4]   2> 1328093 INFO  (TEST-SyncSliceTest.test-seed#[E9E3F56593F8E51C]) [    ] o.e.j.s.Server jetty-9.2.13.v20150730
   [junit4]   2> 1328095 INFO  (TEST-SyncSliceTest.test-seed#[E9E3F56593F8E51C]) [    ] o.e.j.s.h.ContextHandler Started o.e.j.s.ServletContextHandler@361b1ea{/,null,AVAILABLE}
   [junit4]   2> 1328097 INFO  (TEST-SyncSliceTest.test-seed#[E9E3F56593F8E51C]) [    ] o.e.j.s.ServerConnector Started ServerConnector@2e8abf7{SSL-http/1.1}{127.0.0.1:41638}
   [junit4]   2> 1328098 INFO  (TEST-SyncSliceTest.test-seed#[E9E3F56593F8E51C]) [    ] o.e.j.s.Server Started @1331708ms
   [junit4]   2> 1328098 INFO  (TEST-SyncSliceTest.test-seed#[E9E3F56593F8E51C]) [    ] o.a.s.c.s.e.JettySolrRunner Jetty properties: {solr.data.dir=/export/home/jenkins/workspace/Lucene-Solr-5.x-Solaris/solr/build/solr-core/test/J1/temp/solr.cloud.SyncSliceTest_E9E3F56593F8E51C-001/tempDir-001/jetty1, solrconfig=solrconfig.xml, hostContext=/, hostPort=41638, coreRootDirectory=/export/home/jenkins/workspace/Lucene-Solr-5.x-Solaris/solr/build/solr-core/test/J1/../../../../../../../../../../export/home/jenkins/workspace/Lucene-Solr-5.x-Solaris/solr/build/solr-core/test/J1/temp/solr.cloud.SyncSliceTest_E9E3F56593F8E51C-001/shard-1-001/cores}
   [junit4]   2> 1328098 INFO  (TEST-SyncSliceTest.test-seed#[E9E3F56593F8E51C]) [    ] o.a.s.s.SolrDispatchFilter SolrDispatchFilter.init(): sun.misc.Launcher$AppClassLoader@6d06d69c
   [junit4]   2> 1328098 INFO  (TEST-SyncSliceTest.test-seed#[E9E3F56593F8E51C]) [    ] o.a.s.c.SolrResourceLoader new SolrResourceLoader for directory: '/export/home/jenkins/workspace/Lucene-Solr-5.x-Solaris/solr/build/solr-core/test/J1/temp/solr.cloud.SyncSliceTest_E9E3F56593F8E51C-001/shard-1-001'
   [junit4]   2> 1328098 INFO  (TEST-SyncSliceTest.test-seed#[E9E3F56593F8E51C]) [    ] o.a.s.c.SolrResourceLoader JNDI not configured for solr (NoInitialContextEx)
   [junit4]   2> 1328098 INFO  (TEST-SyncSliceTest.test-seed#[E9E3F56593F8E51C]) [    ] o.a.s.c.SolrResourceLoader solr home defaulted to 'solr/' (could not find system property or JNDI)
   [junit4]   2> 1328098 INFO  (TEST-SyncSliceTest.test-seed#[E9E3F56593F8E51C]) [    ] o.a.s.c.c.SolrZkClient Using default ZkCredentialsProvider
   [junit4]   2> 1328099 INFO  (TEST-SyncSliceTest.test-seed#[E9E3F56593F8E51C]) [    ] o.a.s.c.c.ConnectionManager Waiting for client to connect to ZooKeeper
   [junit4]   2> 1328100 INFO  (zkCallback-1367-thread-1) [    ] o.a.s.c.c.ConnectionManager Watcher org.apache.solr.common.cloud.ConnectionManager@62abe804 name:ZooKeeperConnection Watcher:127.0.0.1:59447/solr got event WatchedEvent state:SyncConnected type:None path:null path:null type:None
   [junit4]   2> 1328100 INFO  (TEST-SyncSliceTest.test-seed#[E9E3F56593F8E51C]) [    ] o.a.s.c.c.ConnectionManager Client is connected to ZooKeeper
   [junit4]   2> 1328100 INFO  (TEST-SyncSliceTest.test-seed#[E9E3F56593F8E51C]) [    ] o.a.s.c.c.SolrZkClient Using default ZkACLProvider
   [junit4]   2> 1328102 INFO  (TEST-SyncSliceTest.test-seed#[E9E3F56593F8E51C]) [    ] o.a.s.s.SolrDispatchFilter Loading solr.xml from SolrHome (not found in ZooKeeper)
   [junit4]   2> 1328102 INFO  (TEST-SyncSliceTest.test-seed#[E9E3F56593F8E51C]) [    ] o.a.s.c.SolrXmlConfig Loading container configuration from /export/home/jenkins/workspace/Lucene-Solr-5.x-Solaris/solr/build/solr-core/test/J1/temp/solr.cloud.SyncSliceTest_E9E3F56593F8E51C-001/shard-1-001/solr.xml
   [junit4]   2> 1328106 INFO  (TEST-SyncSliceTest.test-seed#[E9E3F56593F8E51C]) [    ] o.a.s.c.CorePropertiesLocator Config-defined core root directory: /export/home/jenkins/workspace/Lucene-Solr-5.x-Solaris/solr/build/solr-core/test/J1/../../../../../../../../../../export/home/jenkins/workspace/Lucene-Solr-5.x-Solaris/solr/build/solr-core/test/J1/temp/solr.cloud.SyncSliceTest_E9E3F56593F8E51C-001/shard-1-001/cores
   [junit4]   2> 1328106 INFO  (TEST-SyncSliceTest.test-seed#[E9E3F56593F8E51C]) [    ] o.a.s.c.CoreContainer New CoreContainer 1690585674
   [junit4]   2> 1328106 INFO  (TEST-SyncSliceTest.test-seed#[E9E3F56593F8E51C]) [    ] o.a.s.c.CoreContainer Loading cores into CoreContainer [instanceDir=/export/home/jenkins/workspace/Lucene-Solr-5.x-Solaris/solr/build/solr-core/test/J1/temp/solr.cloud.SyncSliceTest_E9E3F56593F8E51C-001/shard-1-001]
   [junit4]   2> 1328106 WARN  (TEST-SyncSliceTest.test-seed#[E9E3F56593F8E51C]) [    ] o.a.s.c.CoreContainer Couldn't add files from /export/home/jenkins/workspace/Lucene-Solr-5.x-Solaris/solr/build/solr-core/test/J1/temp/solr.cloud.SyncSliceTest_E9E3F56593F8E51C-001/shard-1-001/lib to classpath: /export/home/jenkins/workspace/Lucene-Solr-5.x-Solaris/solr/build/solr-core/test/J1/temp/solr.cloud.SyncSliceTest_E9E3F56593F8E51C-001/shard-1-001/lib
   [junit4]   2> 1328106 INFO  (TEST-SyncSliceTest.test-seed#[E9E3F56593F8E51C]) [    ] o.a.s.h.c.HttpShardHandlerFactory created with socketTimeout : 90000,urlScheme : ,connTimeout : 15000,maxConnectionsPerHost : 20,maxConnections : 10000,corePoolSize : 0,maximumPoolSize : 2147483647,maxThreadIdleTime : 5,sizeOfQueue : -1,fairnessPolicy : false,useRetries : false,
   [junit4]   2> 1328108 INFO  (TEST-SyncSliceTest.test-seed#[E9E3F56593F8E51C]) [    ] o.a.s.u.UpdateShardHandler Creating UpdateShardHandler HTTP client with params: socketTimeout=340000&connTimeout=45000&retry=true
   [junit4]   2> 1328109 INFO  (TEST-SyncSliceTest.test-seed#[E9E3F56593F8E51C]) [    ] o.a.s.l.LogWatcher SLF4J impl is org.slf4j.impl.Log4jLoggerFactory
   [junit4]   2> 1328109 INFO  (TEST-SyncSliceTest.test-seed#[E9E3F56593F8E51C]) [    ] o.a.s.l.LogWatcher Registering Log Listener [Log4j (org.slf4j.impl.Log4jLoggerFactory)]
   [junit4]   2> 1328109 INFO  (TEST-SyncSliceTest.test-seed#[E9E3F56593F8E51C]) [    ] o.a.s.c.ZkContainer Zookeeper client=127.0.0.1:59447/solr
   [junit4]   2> 1328109 INFO  (TEST-SyncSliceTest.test-seed#[E9E3F56593F8E51C]) [    ] o.a.s.c.ZkController zkHost includes chroot
   [junit4]   2> 1328109 INFO  (TEST-SyncSliceTest.test-seed#[E9E3F56593F8E51C]) [    ] o.a.s.c.c.SolrZkClient Using default ZkCredentialsProvider
   [junit4]   2> 1328110 INFO  (TEST-SyncSliceTest.test-seed#[E9E3F56593F8E51C]) [    ] o.a.s.c.c.ConnectionManager Waiting for client to connect to ZooKeeper
   [junit4]   2> 1328111 INFO  (zkCallback-1370-thread-1) [    ] o.a.s.c.c.ConnectionManager Watcher org.apache.solr.common.cloud.ConnectionManager@1b01b593 name:ZooKeeperConnection Watcher:127.0.0.1:59447 got event WatchedEvent state:SyncConnected type:None path:null path:null type:None
   [junit4]   2> 1328111 INFO  (TEST-SyncSliceTest.test-seed#[E9E3F56593F8E51C]) [    ] o.a.s.c.c.ConnectionManager Client is connected to ZooKeeper
   [junit4]   2> 1328112 INFO  (TEST-SyncSliceTest.test-seed#[E9E3F56593F8E51C]) [    ] o.a.s.c.c.SolrZkClient Using default ZkACLProvider
   [junit4]   2> 1328114 INFO  (TEST-SyncSliceTest.test-seed#[E9E3F56593F8E51C]) [n:127.0.0.1:41638_    ] o.a.s.c.c.ConnectionManager Waiting for client to connect to ZooKeeper
   [junit4]   2> 1328115 INFO  (zkCallback-1371-thread-1-processing-n:127.0.0.1:41638_) [n:127.0.0.1:41638_    ] o.a.s.c.c.ConnectionManager Watcher org.apache.solr.common.cloud.ConnectionManager@441b552f name:ZooKeeperConnection Watcher:127.0.0.1:59447/solr got event WatchedEvent state:SyncConnected type:None path:null path:null type:None
   [junit4]   2> 1328115 INFO  (TEST-SyncSliceTest.test-seed#[E9E3F56593F8E51C]) [n:127.0.0.1:41638_    ] o.a.s.c.c.ConnectionManager Client is connected to ZooKeeper
   [junit4]   2> 1328123 INFO  (TEST-SyncSliceTest.test-seed#[E9E3F56593F8E51C]) [n:127.0.0.1:41638_    ] o.a.s.c.c.ZkStateReader Updating cluster state from ZooKeeper... 
   [junit4]   2> 1329133 INFO  (TEST-SyncSliceTest.test-seed#[E9E3F56593F8E51C]) [n:127.0.0.1:41638_    ] o.a.s.c.ZkController Register node as live in ZooKeeper:/live_nodes/127.0.0.1:41638_
   [junit4]   2> 1329134 INFO  (TEST-SyncSliceTest.test-seed#[E9E3F56593F8E51C]) [n:127.0.0.1:41638_    ] o.a.s.c.c.SolrZkClient makePath: /live_nodes/127.0.0.1:41638_
   [junit4]   2> 1329135 INFO  (zkCallback-1364-thread-1-processing-n:127.0.0.1:45022_) [n:127.0.0.1:45022_    ] o.a.s.c.c.ZkStateReader A live node change: [WatchedEvent state:SyncConnected type:NodeChildrenChanged path:/live_nodes], has occurred - updating... (live nodes size: [1])
   [junit4]   2> 1329135 INFO  (zkCallback-1366-thread-1) [    ] o.a.s.c.c.ZkStateReader A live node change: [WatchedEvent state:SyncConnected type:NodeChildrenChanged path:/live_nodes], has occurred - updating... (live nodes size: [1])
   [junit4]   2> 1329136 INFO  (zkCallback-1371-thread-1-processing-n:127.0.0.1:41638_) [n:127.0.0.1:41638_    ] o.a.s.c.c.ZkStateReader A live node change: [WatchedEvent state:SyncConnected type:NodeChildrenChanged path:/live_nodes], has occurred - updating... (live nodes size: [1])
   [junit4]   2> 1329138 INFO  (TEST-SyncSliceTest.test-seed#[E9E3F56593F8E51C]) [n:127.0.0.1:41638_    ] o.a.s.c.Overseer Overseer (id=null) closing
   [junit4]   2> 1329139 INFO  (TEST-SyncSliceTest.test-seed#[E9E3F56593F8E51C]) [n:127.0.0.1:41638_    ] o.a.s.c.LeaderElector Joined leadership election with path: /overseer_elect/election/95402014563565577-127.0.0.1:41638_-n_0000000001
   [junit4]   2> 1329140 INFO  (TEST-SyncSliceTest.test-seed#[E9E3F56593F8E51C]) [n:127.0.0.1:41638_    ] o.a.s.c.LeaderElector Watching path /overseer_elect/election/95402014563565573-127.0.0.1:45022_-n_0000000000 to know if I could be the leader
   [junit4]   2> 1329174 INFO  (TEST-SyncSliceTest.test-seed#[E9E3F56593F8E51C]) [n:127.0.0.1:41638_    ] o.a.s.c.CoreContainer Security conf doesn't exist. Skipping setup for authorization module.
   [junit4]   2> 1329174 INFO  (TEST-SyncSliceTest.test-seed#[E9E3F56593F8E51C]) [n:127.0.0.1:41638_    ] o.a.s.c.CoreContainer No authentication plugin used.
   [junit4]   2> 1329174 INFO  (TEST-SyncSliceTest.test-seed#[E9E3F56593F8E51C]) [n:127.0.0.1:41638_    ] o.a.s.c.CorePropertiesLocator Looking for core definitions underneath /export/home/jenkins/workspace/Lucene-Solr-5.x-Solaris/solr/build/solr-core/test/J1/../../../../../../../../../../export/home/jenkins/workspace/Lucene-Solr-5.x-Solaris/solr/build/solr-core/test/J1/temp/solr.cloud.SyncSliceTest_E9E3F56593F8E51C-001/shard-1-001/cores
   [junit4]   2> 1329175 INFO  (TEST-SyncSliceTest.test-seed#[E9E3F56593F8E51C]) [n:127.0.0.1:41638_    ] o.a.s.c.CoreDescriptor Created CoreDescriptor: {name=collection1, config=solrconfig.xml, transient=false, schema=schema.xml, loadOnStartup=true, configSetProperties=configsetprops.json, collection=collection1, coreNodeName=, dataDir=data/, shard=}
   [junit4]   2> 1329175 INFO  (TEST-SyncSliceTest.test-seed#[E9E3F56593F8E51C]) [n:127.0.0.1:41638_    ] o.a.s.c.CorePropertiesLocator Found core collection1 in /export/home/jenkins/workspace/Lucene-Solr-5.x-Solaris/solr/build/solr-core/test/J1/../../../../../../../../../../export/home/jenkins/workspace/Lucene-Solr-5.x-Solaris/solr/build/solr-core/test/J1/temp/solr.cloud.SyncSliceTest_E9E3F56593F8E51C-001/shard-1-001/cores/collection1
   [junit4]   2> 1329175 INFO  (TEST-SyncSliceTest.test-seed#[E9E3F56593F8E51C]) [n:127.0.0.1:41638_    ] o.a.s.c.CorePropertiesLocator Found 1 core definitions
   [junit4]   2> 1329177 INFO  (TEST-SyncSliceTest.test-seed#[E9E3F56593F8E51C]) [n:127.0.0.1:41638_    ] o.a.s.s.SolrDispatchFilter user.dir=/export/home/jenkins/workspace/Lucene-Solr-5.x-Solaris/solr/build/solr-core/test/J1
   [junit4]   2> 1329177 INFO  (TEST-SyncSliceTest.test-seed#[E9E3F56593F8E51C]) [n:127.0.0.1:41638_    ] o.a.s.s.SolrDispatchFilter SolrDispatchFilter.init() done
   [junit4]   2> 1329178 INFO  (coreLoadExecutor-5105-thread-1-processing-n:127.0.0.1:41638_) [n:127.0.0.1:41638_ c:collection1   x:collection1] o.a.s.c.ZkController publishing state=down
   [junit4]   2> 1329178 INFO  (coreLoadExecutor-5105-thread-1-processing-n:127.0.0.1:41638_) [n:127.0.0.1:41638_ c:collection1   x:collection1] o.a.s.c.ZkController numShards not found on descriptor - reading it from system property
   [junit4]   2> 1329181 INFO  (OverseerStateUpdate-95402014563565573-127.0.0.1:45022_-n_0000000000) [n:127.0.0.1:45022_    ] o.a.s.c.Overseer processMessage: queueSize: 1, message = {
   [junit4]   2>   "core":"collection1",
   [junit4]   2>   "roles":null,
   [junit4]   2>   "base_url":"https://127.0.0.1:41638",
   [junit4]   2>   "node_name":"127.0.0.1:41638_",
   [junit4]   2>   "numShards":"1",
   [junit4]   2>   "state":"down",
   [junit4]   2>   "shard":null,
   [junit4]   2>   "collection":"collection1",
   [junit4]   2>   "operation":"state"} current state version: 3
   [junit4]   2> 1329181 INFO  (coreLoadExecutor-5105-thread-1-processing-n:127.0.0.1:41638_) [n:127.0.0.1:41638_ c:collection1   x:collection1] o.a.s.c.ZkController look for our core node name
   [junit4]   2> 1329182 INFO  (OverseerStateUpdate-95402014563565573-127.0.0.1:45022_-n_0000000000) [n:127.0.0.1:45022_    ] o.a.s.c.o.ReplicaMutator Update state numShards=1 message={
   [junit4]   2>   "core":"collection1",
   [junit4]   2>   "roles":null,
   [junit4]   2>   "base_url":"https://127.0.0.1:41638",
   [junit4]   2>   "node_name":"127.0.0.1:41638_",
   [junit4]   2>   "numShards":"1",
   [junit4]   2>   "state":"down",
   [junit4]   2>   "shard":null,
   [junit4]   2>   "collection":"collection1",
   [junit4]   2>   "operation":"state"}
   [junit4]   2> 1329182 INFO  (OverseerStateUpdate-95402014563565573-127.0.0.1:45022_-n_0000000000) [n:127.0.0.1:45022_    ] o.a.s.c.o.ClusterStateMutator building a new cName: collection1
   [junit4]   2> 1329182 INFO  (OverseerStateUpdate-95402014563565573-127.0.0.1:45022_-n_0000000000) [n:127.0.0.1:45022_    ] o.a.s.c.o.ReplicaMutator Assigning new node to shard shard=shard1
   [junit4]   2> 1329184 INFO  (zkCallback-1364-thread-1-processing-n:127.0.0.1:45022_) [n:127.0.0.1:45022_    ] o.a.s.c.c.ZkStateReader A cluster state change: [WatchedEvent state:SyncConnected type:NodeDataChanged path:/clusterstate.json], has occurred - updating... (live nodes size: [2])
   [junit4]   2> 1329184 INFO  (zkCallback-1371-thread-1-processing-n:127.0.0.1:41638_) [n:127.0.0.1:41638_    ] o.a.s.c.c.ZkStateReader A cluster state change: [WatchedEvent state:SyncConnected type:NodeDataChanged path:/clusterstate.json], has occurred - updating... (live nodes size: [2])
   [junit4]   2> 1329184 INFO  (zkCallback-1366-thread-1) [    ] o.a.s.c.c.ZkStateReader A cluster state change: [WatchedEvent state:SyncConnected type:NodeDataChanged path:/clusterstate.json], has occurred - updating... (live nodes size: [2])
   [junit4]   2> 1330183 INFO  (coreLoadExecutor-5105-thread-1-processing-n:127.0.0.1:41638_) [n:127.0.0.1:41638_ c:collection1   x:collection1] o.a.s.c.ZkController waiting to find shard id in clusterstate for collection1
   [junit4]   2> 1330183 INFO  (coreLoadExecutor-5105-thread-1-processing-n:127.0.0.1:41638_) [n:127.0.0.1:41638_ c:collection1   x:collection1] o.a.s.c.ZkController Check for collection zkNode:collection1
   [junit4]   2> 1330184 INFO  (coreLoadExecutor-5105-thread-1-processing-n:127.0.0.1:41638_) [n:127.0.0.1:41638_ c:collection1   x:collection1] o.a.s.c.ZkController Collection zkNode exists
   [junit4]   2> 1330184 INFO  (coreLoadExecutor-5105-thread-1-processing-n:127.0.0.1:41638_) [n:127.0.0.1:41638_ c:collection1   x:collection1] o.a.s.c.c.ZkStateReader Load collection config from: [/collections/collection1]
   [junit4]   2> 1330185 INFO  (coreLoadExecutor-5105-thread-1-processing-n:127.0.0.1:41638_) [n:127.0.0.1:41638_ c:collection1   x:collection1] o.a.s.c.c.ZkStateReader path=[/collections/collection1] [configName]=[conf1] specified config exists in ZooKeeper
   [junit4]   2> 1330185 INFO  (coreLoadExecutor-5105-thread-1-processing-n:127.0.0.1:41638_) [n:127.0.0.1:41638_ c:collection1   x:collection1] o.a.s.c.SolrResourceLoader new SolrResourceLoader for directory: '/export/home/jenkins/workspace/Lucene-Solr-5.x-Solaris/solr/build/solr-core/test/J1/temp/solr.cloud.SyncSliceTest_E9E3F56593F8E51C-001/shard-1-001/cores/collection1'
   [junit4]   2> 1330185 INFO  (coreLoadExecutor-5105-thread-1-processing-n:127.0.0.1:41638_) [n:127.0.0.1:41638_ c:collection1   x:collection1] o.a.s.c.SolrResourceLoader JNDI not configured for solr (NoInitialContextEx)
   [junit4]   2> 1330185 INFO  (coreLoadExecutor-5105-thread-1-processing-n:127.0.0.1:41638_) [n:127.0.0.1:41638_ c:collection1   x:collection1] o.a.s.c.SolrResourceLoader solr home defaulted to 'solr/' (could not find system property or JNDI)
   [junit4]   2> 1330187 INFO  (coreLoadExecutor-5105-thread-1-processing-n:127.0.0.1:41638_) [n:127.0.0.1:41638_ c:collection1   x:collection1] o.a.s.c.Config loaded config solrconfig.xml with version 0 
   [junit4]   2> 1330192 INFO  (coreLoadExecutor-5105-thread-1-processing-n:127.0.0.1:41638_) [n:127.0.0.1:41638_ c:collection1   x:collection1] o.a.s.c.SolrConfig current version of requestparams : -1
   [junit4]   2> 1330194 INFO  (coreLoadExecutor-5105-thread-1-processing-n:127.0.0.1:41638_) [n:127.0.0.1:41638_ c:collection1   x:collection1] o.a.s.c.SolrConfig Using Lucene MatchVersion: 5.6.0
   [junit4]   2> 1330201 INFO  (coreLoadExecutor-5105-thread-1-processing-n:127.0.0.1:41638_) [n:127.0.0.1:41638_ c:collection1   x:collection1] o.a.s.c.SolrConfig Loaded SolrConfig: solrconfig.xml
   [junit4]   2> 1330205 INFO  (coreLoadExecutor-5105-thread-1-processing-n:127.0.0.1:41638_) [n:127.0.0.1:41638_ c:collection1   x:collection1] o.a.s.s.IndexSchema [collection1] Schema name=test
   [junit4]   2> 1330272 INFO  (coreLoadExecutor-5105-thread-1-processing-n:127.0.0.1:41638_) [n:127.0.0.1:41638_ c:collection1   x:collection1] o.a.s.s.OpenExchangeRatesOrgProvider Initialized with rates=open-exchange-rates.json, refreshInterval=1440.
   [junit4]   2> 1330277 INFO  (coreLoadExecutor-5105-thread-1-processing-n:127.0.0.1:41638_) [n:127.0.0.1:41638_ c:collection1   x:collection1] o.a.s.s.IndexSchema default search field in schema is text
   [junit4]   2> 1330277 INFO  (coreLoadExecutor-5105-thread-1-processing-n:127.0.0.1:41638_) [n:127.0.0.1:41638_ c:collection1   x:collection1] o.a.s.s.IndexSchema unique key field: id
   [junit4]   2> 1330288 INFO  (coreLoadExecutor-5105-thread-1-processing-n:127.0.0.1:41638_) [n:127.0.0.1:41638_ c:collection1   x:collection1] o.a.s.s.FileExchangeRateProvider Reloading exchange rates from file currency.xml
   [junit4]   2> 1330290 INFO  (coreLoadExecutor-5105-thread-1-processing-n:127.0.0.1:41638_) [n:127.0.0.1:41638_ c:collection1   x:collection1] o.a.s.s.FileExchangeRateProvider Reloading exchange rates from file currency.xml
   [junit4]   2> 1330301 INFO  (coreLoadExecutor-5105-thread-1-processing-n:127.0.0.1:41638_) [n:127.0.0.1:41638_ c:collection1   x:collection1] o.a.s.s.OpenExchangeRatesOrgProvider Reloading exchange rates from open-exchange-rates.json
   [junit4]   2> 1330302 INFO  (coreLoadExecutor-5105-thread-1-processing-n:127.0.0.1:41638_) [n:127.0.0.1:41638_ c:collection1   x:collection1] o.a.s.s.OpenExchangeRatesOrgProvider Reloading exchange rates from open-exchange-rates.json
   [junit4]   2> 1330304 INFO  (coreLoadExecutor-5105-thread-1-processing-n:127.0.0.1:41638_) [n:127.0.0.1:41638_ c:collection1   x:collection1] o.a.s.c.ConfigSetProperties Did not find ConfigSet properties, assuming default properties: Can't find resource 'configsetprops.json' in classpath or '/configs/conf1', cwd=/export/home/jenkins/workspace/Lucene-Solr-5.x-Solaris/solr/build/solr-core/test/J1
   [junit4]   2> 1330304 INFO  (coreLoadExecutor-5105-thread-1-processing-n:127.0.0.1:41638_) [n:127.0.0.1:41638_ c:collection1   x:collection1] o.a.s.c.CoreContainer Creating SolrCore 'collection1' using configuration from collection collection1
   [junit4]   2> 1330304 INFO  (coreLoadExecutor-5105-thread-1-processing-n:127.0.0.1:41638_) [n:127.0.0.1:41638_ c:collection1 s:shard1 r:core_node1 x:collection1] o.a.s.c.SolrCore org.apache.solr.core.MockDirectoryFactory
   [junit4]   2> 1330304 INFO  (coreLoadExecutor-5105-thread-1-processing-n:127.0.0.1:41638_) [n:127.0.0.1:41638_ c:collection1 s:shard1 r:core_node1 x:collection1] o.a.s.c.SolrCore [[collection1] ] Opening new SolrCore at [/export/home/jenkins/workspace/Lucene-Solr-5.x-Solaris/solr/build/solr-core/test/J1/temp/solr.cloud.SyncSliceTest_E9E3F56593F8E51C-001/shard-1-001/cores/collection1], dataDir=[/export/home/jenkins/workspace/Lucene-Solr-5.x-Solaris/solr/build/solr-core/test/J1/../../../../../../../../../../export/home/jenkins/workspace/Lucene-Solr-5.x-Solaris/solr/build/solr-core/test/J1/temp/solr.cloud.SyncSliceTest_E9E3F56593F8E51C-001/shard-1-001/cores/collection1/data/]
   [junit4]   2> 1330305 INFO  (coreLoadExecutor-5105-thread-1-processing-n:127.0.0.1:41638_) [n:127.0.0.1:41638_ c:collection1 s:shard1 r:core_node1 x:collection1] o.a.s.c.JmxMonitoredMap JMX monitoring is enabled. Adding Solr mbeans to JMX Server: com.sun.jmx.mbeanserver.JmxMBeanServer@4bba2b74
   [junit4]   2> 1330305 INFO  (coreLoadExecutor-5105-thread-1-processing-n:127.0.0.1:41638_) [n:127.0.0.1:41638_ c:collection1 s:shard1 r:core_node1 x:collection1] o.a.s.c.CachingDirectoryFactory return new directory for /export/home/jenkins/workspace/Lucene-Solr-5.x-Solaris/solr/build/solr-core/test/J1/../../../../../../../../../../export/home/jenkins/workspace/Lucene-Solr-5.x-Solaris/solr/build/solr-core/test/J1/temp/solr.cloud.SyncSliceTest_E9E3F56593F8E51C-001/shard-1-001/cores/collection1/data
   [junit4]   2> 1330305 INFO  (coreLoadExecutor-5105-thread-1-processing-n:127.0.0.1:41638_) [n:127.0.0.1:41638_ c:collection1 s:shard1 r:core_node1 x:collection1] o.a.s.c.SolrCore New index directory detected: old=null new=/export/home/jenkins/workspace/Lucene-Solr-5.x-Solaris/solr/build/solr-core/test/J1/../../../../../../../../../../export/home/jenkins/workspace/Lucene-Solr-5.x-Solaris/solr/build/solr-core/test/J1/temp/solr.cloud.SyncSliceTest_E9E3F56593F8E51C-001/shard-1-001/cores/collection1/data/index/
   [junit4]   2> 1330305 WARN  (coreLoadExecutor-5105-thread-1-processing-n:127.0.0.1:41638_) [n:127.0.0.1:41638_ c:collection1 s:shard1 r:core_node1 x:collection1] o.a.s.c.SolrCore [collection1] Solr index directory '/export/home/jenkins/workspace/Lucene-Solr-5.x-Solaris/solr/build/solr-core/test/J1/../../../../../../../../../../export/home/jenkins/workspace/Lucene-Solr-5.x-Solaris/solr/build/solr-core/test/J1/temp/solr.cloud.SyncSliceTest_E9E3F56593F8E51C-001/shard-1-001/cores/collection1/data/index' doesn't exist. Creating new index...
   [junit4]   2> 1330305 INFO  (coreLoadExecutor-5105-thread-1-processing-n:127.0.0.1:41638_) [n:127.0.0.1:41638_ c:collection1 s:shard1 r:core_node1 x:collection1] o.a.s.c.CachingDirectoryFactory return new directory for /export/home/jenkins/workspace/Lucene-Solr-5.x-Solaris/solr/build/solr-core/test/J1/../../../../../../../../../../export/home/jenkins/workspace/Lucene-Solr-5.x-Solaris/solr/build/solr-core/test/J1/temp/solr.cloud.SyncSliceTest_E9E3F56593F8E51C-001/shard-1-001/cores/collection1/data/index
   [junit4]   2> 1330305 INFO  (coreLoadExecutor-5105-thread-1-processing-n:127.0.0.1:41638_) [n:127.0.0.1:41638_ c:collection1 s:shard1 r:core_node1 x:collection1] o.a.s.u.RandomMergePolicy RandomMergePolicy wrapping class org.apache.lucene.index.LogDocMergePolicy: [LogDocMergePolicy: minMergeSize=1000, mergeFactor=18, maxMergeSize=9223372036854775807, maxMergeSizeForForcedMerge=9223372036854775807, calibrateSizeByDeletes=true, maxMergeDocs=2147483647, maxCFSSegmentSizeMB=8.796093022207999E12, noCFSRatio=0.42165427927152466]
   [junit4]   2> 1330306 INFO  (coreLoadExecutor-5105-thread-1-processing-n:127.0.0.1:41638_) [n:127.0.0.1:41638_ c:collection1 s:shard1 r:core_node1 x:collection1] o.a.s.c.SolrDeletionPolicy SolrDeletionPolicy.onCommit: commits: num=1
   [junit4]   2> 	commit{dir=MockDirectoryWrapper(RAMDirectory@2206b3d lockFactory=org.apache.lucene.store.SingleInstanceLockFactory@3da893c6),segFN=segments_1,generation=1}
   [junit4]   2> 1330306 INFO  (coreLoadExecutor-5105-thread-1-processing-n:127.0.0.1:41638_) [n:127.0.0.1:41638_ c:collection1 s:shard1 r:core_node1 x:collection1] o.a.s.c.SolrDeletionPolicy newest commit generation = 1
   [junit4]   2> 1330306 INFO  (OldIndexDirectoryCleanupThreadForCore-collection1) [n:127.0.0.1:41638_ c:collection1 s:shard1 r:core_node1 x:collection1] o.a.s.c.SolrCore Looking for old index directories to cleanup for core collection1 in /export/home/jenkins/workspace/Lucene-Solr-5.x-Solaris/solr/build/solr-core/test/J1/../../../../../../../../../../export/home/jenkins/workspace/Lucene-Solr-5.x-Solaris/solr/build/solr-core/test/J1/temp/solr.cloud.SyncSliceTest_E9E3F56593F8E51C-001/shard-1-001/cores/collection1/data/
   [junit4]   2> 1330307 WARN  (OldIndexDirectoryCleanupThreadForCore-collection1) [n:127.0.0.1:41638_ c:collection1 s:shard1 r:core_node1 x:collection1] o.a.s.c.DirectoryFactory /export/home/jenkins/workspace/Lucene-Solr-5.x-Solaris/solr/build/solr-core/test/J1/../../../../../../../../../../export/home/jenkins/workspace/Lucene-Solr-5.x-Solaris/solr/build/solr-core/test/J1/temp/solr.cloud.SyncSliceTest_E9E3F56593F8E51C-001/shard-1-001/cores/collection1/data/ does not point to a valid data directory; skipping clean-up of old index directories.
   [junit4]   2> 1330309 INFO  (coreLoadExecutor-5105-thread-1-processing-n:127.0.0.1:41638_) [n:127.0.0.1:41638_ c:collection1 s:shard1 r:core_node1 x:collection1] o.a.s.u.p.UpdateRequestProcessorChain creating updateRequestProcessorChain "nodistrib"
   [junit4]   2> 1330309 INFO  (coreLoadExecutor-5105-thread-1-processing-n:127.0.0.1:41638_) [n:127.0.0.1:41638_ c:collection1 s:shard1 r:core_node1 x:collection1] o.a.s.u.p.UpdateRequestProcessorChain creating updateRequestProcessorChain "dedupe"
   [junit4]   2> 1330309 INFO  (coreLoadExecutor-5105-thread-1-processing-n:127.0.0.1:41638_) [n:127.0.0.1:41638_ c:collection1 s:shard1 r:core_node1 x:collection1] o.a.s.u.p.UpdateRequestProcessorChain inserting DistributedUpdateProcessorFactory into updateRequestProcessorChain "dedupe"
   [junit4]   2> 1330309 INFO  (coreLoadExecutor-5105-thread-1-processing-n:127.0.0.1:41638_) [n:127.0.0.1:41638_ c:collection1 s:shard1 r:core_node1 x:collection1] o.a.s.u.p.UpdateRequestProcessorChain creating updateRequestProcessorChain "stored_sig"
   [junit4]   2> 1330309 INFO  (coreLoadExecutor-5105-thread-1-processing-n:127.0.0.1:41638_) [n:127.0.0.1:41638_ c:collection1 s:shard1 r:core_node1 x:collection1] o.a.s.u.p.UpdateRequestProcessorChain inserting DistributedUpdateProcessorFactory into updateRequestProcessorChain "stored_sig"
   [junit4]   2> 1330309 INFO  (coreLoadExecutor-5105-thread-1-processing-n:127.0.0.1:41638_) [n:127.0.0.1:41638_ c:collection1 s:shard1 r:core_node1 x:collection1] o.a.s.u.p.UpdateRequestProcessorChain creating updateRequestProcessorChain "distrib-dup-test-chain-explicit"
   [junit4]   2> 1330309 INFO  (coreLoadExecutor-5105-thread-1-processing-n:127.0.0.1:41638_) [n:127.0.0.1:41638_ c:collection1 s:shard1 r:core_node1 x:collection1] o.a.s.u.p.UpdateRequestProcessorChain creating updateRequestProcessorChain "distrib-dup-test-chain-implicit"
   [junit4]   2> 1330309 INFO  (coreLoadExecutor-5105-thread-1-processing-n:127.0.0.1:41638_) [n:127.0.0.1:41638_ c:collection1 s:shard1 r:core_node1 x:collection1] o.a.s.u.p.UpdateRequestProcessorChain inserting DistributedUpdateProcessorFactory into updateRequestProcessorChain "distrib-dup-test-chain-implicit"
   [junit4]   2> 1330309 INFO  (coreLoadExecutor-5105-thread-1-processing-n:127.0.0.1:41638_) [n:127.0.0.1:41638_ c:collection1 s:shard1 r:core_node1 x:collection1] o.a.s.c.SolrCore no updateRequestProcessorChain defined as default, creating implicit default
   [junit4]   2> 1330309 WARN  (coreLoadExecutor-5105-thread-1-processing-n:127.0.0.1:41638_) [n:127.0.0.1:41638_ c:collection1 s:shard1 r:core_node1 x:collection1] o.a.s.c.RequestHandlers INVALID paramSet a in requestHandler {type = requestHandler,name = /dump,class = DumpRequestHandler,args = {defaults={a=A,b=B}}}
   [junit4]   2> 1330311 INFO  (coreLoadExecutor-5105-thread-1-processing-n:127.0.0.1:41638_) [n:127.0.0.1:41638_ c:collection1 s:shard1 r:core_node1 x:col

[...truncated too long message...]

1:54902_ c:collection1 s:shard1 r:core_node4 x:collection1] o.a.s.c.CachingDirectoryFactory looking to close /export/home/jenkins/workspace/Lucene-Solr-5.x-Solaris/solr/build/solr-core/test/J1/../../../../../../../../../../export/home/jenkins/workspace/Lucene-Solr-5.x-Solaris/solr/build/solr-core/test/J1/temp/solr.cloud.SyncSliceTest_E9E3F56593F8E51C-001/shard-4-001/cores/collection1/data/index [CachedDir<<refCount=0;path=/export/home/jenkins/workspace/Lucene-Solr-5.x-Solaris/solr/build/solr-core/test/J1/../../../../../../../../../../export/home/jenkins/workspace/Lucene-Solr-5.x-Solaris/solr/build/solr-core/test/J1/temp/solr.cloud.SyncSliceTest_E9E3F56593F8E51C-001/shard-4-001/cores/collection1/data/index;done=false>>]
   [junit4]   2> 1367659 INFO  (zkCallback-1388-thread-1-processing-n:127.0.0.1:54902_) [n:127.0.0.1:54902_ c:collection1 s:shard1 r:core_node4 x:collection1] o.a.s.c.CachingDirectoryFactory Closing directory: /export/home/jenkins/workspace/Lucene-Solr-5.x-Solaris/solr/build/solr-core/test/J1/../../../../../../../../../../export/home/jenkins/workspace/Lucene-Solr-5.x-Solaris/solr/build/solr-core/test/J1/temp/solr.cloud.SyncSliceTest_E9E3F56593F8E51C-001/shard-4-001/cores/collection1/data/index
   [junit4]   2> 1367661 INFO  (TEST-SyncSliceTest.test-seed#[E9E3F56593F8E51C]) [    ] o.e.j.s.ServerConnector Stopped ServerConnector@2cf72253{SSL-http/1.1}{127.0.0.1:0}
   [junit4]   2> 1367662 INFO  (TEST-SyncSliceTest.test-seed#[E9E3F56593F8E51C]) [    ] o.e.j.s.h.ContextHandler Stopped o.e.j.s.ServletContextHandler@4bbd242{/,null,UNAVAILABLE}
   [junit4]   2> 1367665 INFO  (TEST-SyncSliceTest.test-seed#[E9E3F56593F8E51C]) [    ] o.a.s.c.ZkTestServer connecting to 127.0.0.1:59447 59447
   [junit4]   2> 1367678 INFO  (Thread-6314) [    ] o.a.s.c.ZkTestServer connecting to 127.0.0.1:59447 59447
   [junit4]   2> 1367679 WARN  (Thread-6314) [    ] o.a.s.c.ZkTestServer Watch limit violations: 
   [junit4]   2> Maximum concurrent create/delete watches above limit:
   [junit4]   2> 
   [junit4]   2> 	6	/solr/aliases.json
   [junit4]   2> 	5	/solr/security.json
   [junit4]   2> 	5	/solr/configs/conf1
   [junit4]   2> 
   [junit4]   2> Maximum concurrent data watches above limit:
   [junit4]   2> 
   [junit4]   2> 	6	/solr/clusterstate.json
   [junit4]   2> 	2	/solr/overseer_elect/election/95402014563565573-127.0.0.1:45022_-n_0000000000
   [junit4]   2> 
   [junit4]   2> Maximum concurrent children watches above limit:
   [junit4]   2> 
   [junit4]   2> 	6	/solr/live_nodes
   [junit4]   2> 	6	/solr/collections
   [junit4]   2> 	4	/solr/overseer/queue
   [junit4]   2> 	4	/solr/overseer/collection-queue-work
   [junit4]   2> 	2	/solr/overseer/queue-work
   [junit4]   2> 
   [junit4]   2> NOTE: reproduce with: ant test  -Dtestcase=SyncSliceTest -Dtests.method=test -Dtests.seed=E9E3F56593F8E51C -Dtests.slow=true -Dtests.locale=ko -Dtests.timezone=Africa/Kigali -Dtests.asserts=true -Dtests.file.encoding=UTF-8
   [junit4] FAILURE 42.1s J1 | SyncSliceTest.test <<<
   [junit4]    > Throwable #1: java.lang.AssertionError: expected:<5> but was:<4>
   [junit4]    > 	at __randomizedtesting.SeedInfo.seed([E9E3F56593F8E51C:61B7CABF3D0488E4]:0)
   [junit4]    > 	at org.apache.solr.cloud.SyncSliceTest.test(SyncSliceTest.java:153)
   [junit4]    > 	at org.apache.solr.BaseDistributedSearchTestCase$ShardsRepeatRule$ShardsFixedStatement.callStatement(BaseDistributedSearchTestCase.java:964)
   [junit4]    > 	at org.apache.solr.BaseDistributedSearchTestCase$ShardsRepeatRule$ShardsStatement.evaluate(BaseDistributedSearchTestCase.java:939)
   [junit4]    > 	at java.lang.Thread.run(Thread.java:745)
   [junit4]   2> 1367715 INFO  (SUITE-SyncSliceTest-seed#[E9E3F56593F8E51C]-worker) [    ] o.a.s.SolrTestCaseJ4 ###deleteCore
   [junit4]   2> NOTE: leaving temporary files on disk at: /export/home/jenkins/workspace/Lucene-Solr-5.x-Solaris/solr/build/solr-core/test/J1/temp/solr.cloud.SyncSliceTest_E9E3F56593F8E51C-001
   [junit4]   2> Feb 17, 2016 2:27:38 PM com.carrotsearch.randomizedtesting.ThreadLeakControl checkThreadLeaks
   [junit4]   2> WARNING: Will linger awaiting termination of 1 leaked thread(s).
   [junit4]   2> NOTE: test params are: codec=Asserting(Lucene54): {other_tl1=PostingsFormat(name=LuceneVarGapFixedInterval), range_facet_l_dv=PostingsFormat(name=Asserting), multiDefault=BlockTreeOrds(blocksize=128), intDefault=PostingsFormat(name=LuceneVarGapFixedInterval), a_i1=PostingsFormat(name=LuceneVarGapFixedInterval), range_facet_l=PostingsFormat(name=LuceneVarGapFixedInterval), rnd_b=PostingsFormat(name=Asserting), _version_=PostingsFormat(name=LuceneVarGapFixedInterval), a_t=PostingsFormat(name=LuceneVarGapFixedInterval), id=PostingsFormat(name=Asserting), range_facet_i_dv=PostingsFormat(name=LuceneVarGapFixedInterval), text=PostingsFormat(name=Memory doPackFST= true), timestamp=PostingsFormat(name=LuceneVarGapFixedInterval)}, docValues:{range_facet_l_dv=DocValuesFormat(name=Memory), range_facet_i_dv=DocValuesFormat(name=Lucene54), timestamp=DocValuesFormat(name=Lucene54)}, sim=DefaultSimilarity, locale=ko, timezone=Africa/Kigali
   [junit4]   2> NOTE: SunOS 5.11 amd64/Oracle Corporation 1.8.0_72 (64-bit)/cpus=3,threads=1,free=103233376,total=471859200
   [junit4]   2> NOTE: All tests run in this JVM: [TestValueSourceCache, ConjunctionSolrSpellCheckerTest, DistributedVersionInfoTest, ConfigSetsAPITest, RequestHandlersTest, TestSolrDeletionPolicy2, TestQueryUtils, TestJsonRequest, HdfsChaosMonkeySafeLeaderTest, SpatialHeatmapFacetsTest, SpellingQueryConverterTest, UUIDUpdateProcessorFallbackTest, ZkNodePropsTest, RecoveryAfterSoftCommitTest, CloneFieldUpdateProcessorFactoryTest, CloudExitableDirectoryReaderTest, TestOverriddenPrefixQueryForCustomFieldType, SolrInfoMBeanTest, TestComplexPhraseQParserPlugin, HdfsSyncSliceTest, BlockJoinFacetRandomTest, TestReversedWildcardFilterFactory, CollectionsAPIDistributedZkTest, TestFieldCollectionResource, FieldAnalysisRequestHandlerTest, TestQueryTypes, TestDownShardTolerantSearch, TestSolr4Spatial, HighlighterConfigTest, TestJsonFacets, StatsComponentTest, BufferStoreTest, TestSchemaManager, TestBinaryField, TestStandardQParsers, BasicDistributedZk2Test, RuleEngineTest, HighlighterMaxOffsetTest, DirectSolrConnectionTest, TestRestoreCore, SuggesterWFSTTest, TestFiltering, RollingRestartTest, OpenCloseCoreStressTest, TestSortingResponseWriter, SuggesterTSTTest, TestCSVResponseWriter, TestCollectionAPI, NoCacheHeaderTest, TestFastOutputStream, IgnoreCommitOptimizeUpdateProcessorFactoryTest, TestSolrConfigHandlerConcurrent, TestSolrXml, ResponseLogComponentTest, SimpleCollectionCreateDeleteTest, TestExpandComponent, DateRangeFieldTest, TestBadConfig, TestCollationField, TestPHPSerializedResponseWriter, TestReplicationHandlerBackup, ShardRoutingCustomTest, TestFastWriter, TestJoin, TermVectorComponentDistributedTest, SuggestComponentTest, HdfsLockFactoryTest, SolrCmdDistributorTest, TestExactSharedStatsCache, TestFreeTextSuggestions, DirectUpdateHandlerOptimizeTest, SortByFunctionTest, BadCopyFieldTest, InfoHandlerTest, TestSolrCloudWithKerberosAlt, PluginInfoTest, SpellPossibilityIteratorTest, AsyncCallRequestStatusResponseTest, DeleteShardTest, TestSystemIdResolver, CoreAdminHandlerTest, TestCharFilters, FullHLLTest, DistributedFacetPivotLongTailTest, TestConfigSets, DistribCursorPagingTest, TestCoreDiscovery, TestWriterPerf, TestFieldSortValues, TestManagedStopFilterFactory, TestReloadAndDeleteDocs, SynonymTokenizerTest, TestManagedSchemaDynamicFieldResource, DistributedTermsComponentTest, WordBreakSolrSpellCheckerTest, LeaderInitiatedRecoveryOnCommitTest, BadIndexSchemaTest, TestFieldTypeCollectionResource, FullSolrCloudDistribCmdsTest, VMParamsZkACLAndCredentialsProvidersTest, BitVectorTest, EchoParamsTest, TestIndexSearcher, SpellCheckComponentTest, BasicFunctionalityTest, TestStressRecovery, TestSolrQueryParser, SearchHandlerTest, OverseerStatusTest, StressHdfsTest, TestSearcherReuse, CacheHeaderTest, TestSchemaSimilarityResource, TestBulkSchemaConcurrent, TestSolrJ, TestLRUStatsCache, HdfsUnloadDistributedZkTest, SharedFSAutoReplicaFailoverTest, NumericFieldsTest, TestManagedResourceStorage, ResourceLoaderTest, TestOmitPositions, TestInitParams, ShowFileRequestHandlerTest, NotRequiredUniqueKeyTest, QueryParsingTest, TestInitQParser, LeaderElectionIntegrationTest, SuggesterTest, CheckHdfsIndexTest, QueryResultKeyTest, UpdateRequestProcessorFactoryTest, DefaultValueUpdateProcessorTest, TestAtomicUpdateErrorCases, TestCrossCoreJoin, ConvertedLegacyTest, BasicDistributedZkTest, ChaosMonkeySafeLeaderTest, SyncSliceTest]
   [junit4] Completed [280/566 (1!)] on J1 in 42.88s, 1 test, 1 failure <<< FAILURES!

[...truncated 898 lines...]
BUILD FAILED
/export/home/jenkins/workspace/Lucene-Solr-5.x-Solaris/build.xml:750: The following error occurred while executing this line:
/export/home/jenkins/workspace/Lucene-Solr-5.x-Solaris/build.xml:694: The following error occurred while executing this line:
/export/home/jenkins/workspace/Lucene-Solr-5.x-Solaris/build.xml:59: The following error occurred while executing this line:
/export/home/jenkins/workspace/Lucene-Solr-5.x-Solaris/solr/build.xml:233: The following error occurred while executing this line:
/export/home/jenkins/workspace/Lucene-Solr-5.x-Solaris/solr/common-build.xml:534: The following error occurred while executing this line:
/export/home/jenkins/workspace/Lucene-Solr-5.x-Solaris/lucene/common-build.xml:1477: The following error occurred while executing this line:
/export/home/jenkins/workspace/Lucene-Solr-5.x-Solaris/lucene/common-build.xml:1033: There were test failures: 566 suites (7 ignored), 2279 tests, 1 failure, 55 ignored (39 assumptions) [seed: E9E3F56593F8E51C]

Total time: 72 minutes 35 seconds
Build step 'Invoke Ant' marked build as failure
Archiving artifacts
[WARNINGS] Skipping publisher since build result is FAILURE
Recording test results
Email was triggered for: Failure - Any
Sending email for trigger: Failure - Any



Mime
View raw message