lucene-dev mailing list archives

Site index · List index
Message view « Date » · « Thread »
Top « Date » · « Thread »
From Apache Jenkins Server <jenk...@builds.apache.org>
Subject [JENKINS] Lucene-Solr-Tests-trunk-Java8 - Build # 836 - Failure
Date Sun, 14 Feb 2016 22:34:44 GMT
Build: https://builds.apache.org/job/Lucene-Solr-Tests-trunk-Java8/836/

1 tests failed.
FAILED:  org.apache.solr.core.TestDynamicLoading.testDynamicLoading

Error Message:
Could not get expected value  'X val changed' for path 'x' full output: {   "responseHeader":{     "status":0,     "QTime":0},   "params":{"wt":"json"},   "context":{     "webapp":"",     "path":"/test1",     "httpMethod":"GET"},   "class":"org.apache.solr.core.BlobStoreTestRequestHandler",   "x":"X val"}

Stack Trace:
java.lang.AssertionError: Could not get expected value  'X val changed' for path 'x' full output: {
  "responseHeader":{
    "status":0,
    "QTime":0},
  "params":{"wt":"json"},
  "context":{
    "webapp":"",
    "path":"/test1",
    "httpMethod":"GET"},
  "class":"org.apache.solr.core.BlobStoreTestRequestHandler",
  "x":"X val"}
	at __randomizedtesting.SeedInfo.seed([C3CEC20D07226EA3:1B83EF5AF0FFCB03]:0)
	at org.junit.Assert.fail(Assert.java:93)
	at org.junit.Assert.assertTrue(Assert.java:43)
	at org.apache.solr.core.TestSolrConfigHandler.testForResponseElement(TestSolrConfigHandler.java:456)
	at org.apache.solr.core.TestDynamicLoading.testDynamicLoading(TestDynamicLoading.java:255)
	at sun.reflect.NativeMethodAccessorImpl.invoke0(Native Method)
	at sun.reflect.NativeMethodAccessorImpl.invoke(NativeMethodAccessorImpl.java:62)
	at sun.reflect.DelegatingMethodAccessorImpl.invoke(DelegatingMethodAccessorImpl.java:43)
	at java.lang.reflect.Method.invoke(Method.java:497)
	at com.carrotsearch.randomizedtesting.RandomizedRunner.invoke(RandomizedRunner.java:1764)
	at com.carrotsearch.randomizedtesting.RandomizedRunner$8.evaluate(RandomizedRunner.java:871)
	at com.carrotsearch.randomizedtesting.RandomizedRunner$9.evaluate(RandomizedRunner.java:907)
	at com.carrotsearch.randomizedtesting.RandomizedRunner$10.evaluate(RandomizedRunner.java:921)
	at org.apache.solr.BaseDistributedSearchTestCase$ShardsRepeatRule$ShardsFixedStatement.callStatement(BaseDistributedSearchTestCase.java:964)
	at org.apache.solr.BaseDistributedSearchTestCase$ShardsRepeatRule$ShardsStatement.evaluate(BaseDistributedSearchTestCase.java:939)
	at com.carrotsearch.randomizedtesting.rules.SystemPropertiesRestoreRule$1.evaluate(SystemPropertiesRestoreRule.java:57)
	at org.apache.lucene.util.TestRuleSetupTeardownChained$1.evaluate(TestRuleSetupTeardownChained.java:49)
	at org.apache.lucene.util.AbstractBeforeAfterRule$1.evaluate(AbstractBeforeAfterRule.java:45)
	at org.apache.lucene.util.TestRuleThreadAndTestName$1.evaluate(TestRuleThreadAndTestName.java:48)
	at org.apache.lucene.util.TestRuleIgnoreAfterMaxFailures$1.evaluate(TestRuleIgnoreAfterMaxFailures.java:64)
	at org.apache.lucene.util.TestRuleMarkFailure$1.evaluate(TestRuleMarkFailure.java:47)
	at com.carrotsearch.randomizedtesting.rules.StatementAdapter.evaluate(StatementAdapter.java:36)
	at com.carrotsearch.randomizedtesting.ThreadLeakControl$StatementRunner.run(ThreadLeakControl.java:367)
	at com.carrotsearch.randomizedtesting.ThreadLeakControl.forkTimeoutingTask(ThreadLeakControl.java:809)
	at com.carrotsearch.randomizedtesting.ThreadLeakControl$3.evaluate(ThreadLeakControl.java:460)
	at com.carrotsearch.randomizedtesting.RandomizedRunner.runSingleTest(RandomizedRunner.java:880)
	at com.carrotsearch.randomizedtesting.RandomizedRunner$5.evaluate(RandomizedRunner.java:781)
	at com.carrotsearch.randomizedtesting.RandomizedRunner$6.evaluate(RandomizedRunner.java:816)
	at com.carrotsearch.randomizedtesting.RandomizedRunner$7.evaluate(RandomizedRunner.java:827)
	at com.carrotsearch.randomizedtesting.rules.StatementAdapter.evaluate(StatementAdapter.java:36)
	at com.carrotsearch.randomizedtesting.rules.SystemPropertiesRestoreRule$1.evaluate(SystemPropertiesRestoreRule.java:57)
	at org.apache.lucene.util.AbstractBeforeAfterRule$1.evaluate(AbstractBeforeAfterRule.java:45)
	at com.carrotsearch.randomizedtesting.rules.StatementAdapter.evaluate(StatementAdapter.java:36)
	at org.apache.lucene.util.TestRuleStoreClassName$1.evaluate(TestRuleStoreClassName.java:41)
	at com.carrotsearch.randomizedtesting.rules.NoShadowingOrOverridesOnMethodsRule$1.evaluate(NoShadowingOrOverridesOnMethodsRule.java:40)
	at com.carrotsearch.randomizedtesting.rules.NoShadowingOrOverridesOnMethodsRule$1.evaluate(NoShadowingOrOverridesOnMethodsRule.java:40)
	at com.carrotsearch.randomizedtesting.rules.StatementAdapter.evaluate(StatementAdapter.java:36)
	at com.carrotsearch.randomizedtesting.rules.StatementAdapter.evaluate(StatementAdapter.java:36)
	at com.carrotsearch.randomizedtesting.rules.StatementAdapter.evaluate(StatementAdapter.java:36)
	at org.apache.lucene.util.TestRuleAssertionsRequired$1.evaluate(TestRuleAssertionsRequired.java:53)
	at org.apache.lucene.util.TestRuleMarkFailure$1.evaluate(TestRuleMarkFailure.java:47)
	at org.apache.lucene.util.TestRuleIgnoreAfterMaxFailures$1.evaluate(TestRuleIgnoreAfterMaxFailures.java:64)
	at org.apache.lucene.util.TestRuleIgnoreTestSuites$1.evaluate(TestRuleIgnoreTestSuites.java:54)
	at com.carrotsearch.randomizedtesting.rules.StatementAdapter.evaluate(StatementAdapter.java:36)
	at com.carrotsearch.randomizedtesting.ThreadLeakControl$StatementRunner.run(ThreadLeakControl.java:367)
	at java.lang.Thread.run(Thread.java:745)




Build Log:
[...truncated 11162 lines...]
   [junit4] Suite: org.apache.solr.core.TestDynamicLoading
   [junit4]   2> Creating dataDir: /x1/jenkins/jenkins-slave/workspace/Lucene-Solr-Tests-trunk-Java8/solr/build/solr-core/test/J2/temp/solr.core.TestDynamicLoading_C3CEC20D07226EA3-001/init-core-data-001
   [junit4]   2> 794438 INFO  (SUITE-TestDynamicLoading-seed#[C3CEC20D07226EA3]-worker) [    ] o.a.s.SolrTestCaseJ4 Randomized ssl (false) and clientAuth (false)
   [junit4]   2> 794438 INFO  (SUITE-TestDynamicLoading-seed#[C3CEC20D07226EA3]-worker) [    ] o.a.s.BaseDistributedSearchTestCase Setting hostContext system property: /
   [junit4]   2> 794440 INFO  (TEST-TestDynamicLoading.testDynamicLoading-seed#[C3CEC20D07226EA3]) [    ] o.a.s.c.ZkTestServer STARTING ZK TEST SERVER
   [junit4]   2> 794441 INFO  (Thread-2876) [    ] o.a.s.c.ZkTestServer client port:0.0.0.0/0.0.0.0:0
   [junit4]   2> 794441 INFO  (Thread-2876) [    ] o.a.s.c.ZkTestServer Starting server
   [junit4]   2> 794541 INFO  (TEST-TestDynamicLoading.testDynamicLoading-seed#[C3CEC20D07226EA3]) [    ] o.a.s.c.ZkTestServer start zk server on port:54749
   [junit4]   2> 794541 INFO  (TEST-TestDynamicLoading.testDynamicLoading-seed#[C3CEC20D07226EA3]) [    ] o.a.s.c.c.SolrZkClient Using default ZkCredentialsProvider
   [junit4]   2> 794548 INFO  (TEST-TestDynamicLoading.testDynamicLoading-seed#[C3CEC20D07226EA3]) [    ] o.a.s.c.c.ConnectionManager Waiting for client to connect to ZooKeeper
   [junit4]   2> 794553 INFO  (zkCallback-1023-thread-1) [    ] o.a.s.c.c.ConnectionManager Watcher org.apache.solr.common.cloud.ConnectionManager@2beea97a name:ZooKeeperConnection Watcher:127.0.0.1:54749 got event WatchedEvent state:SyncConnected type:None path:null path:null type:None
   [junit4]   2> 794553 INFO  (TEST-TestDynamicLoading.testDynamicLoading-seed#[C3CEC20D07226EA3]) [    ] o.a.s.c.c.ConnectionManager Client is connected to ZooKeeper
   [junit4]   2> 794553 INFO  (TEST-TestDynamicLoading.testDynamicLoading-seed#[C3CEC20D07226EA3]) [    ] o.a.s.c.c.SolrZkClient Using default ZkACLProvider
   [junit4]   2> 794553 INFO  (TEST-TestDynamicLoading.testDynamicLoading-seed#[C3CEC20D07226EA3]) [    ] o.a.s.c.c.SolrZkClient makePath: /solr
   [junit4]   2> 794557 INFO  (TEST-TestDynamicLoading.testDynamicLoading-seed#[C3CEC20D07226EA3]) [    ] o.a.s.c.c.SolrZkClient Using default ZkCredentialsProvider
   [junit4]   2> 794561 INFO  (TEST-TestDynamicLoading.testDynamicLoading-seed#[C3CEC20D07226EA3]) [    ] o.a.s.c.c.ConnectionManager Waiting for client to connect to ZooKeeper
   [junit4]   2> 794567 INFO  (zkCallback-1024-thread-1) [    ] o.a.s.c.c.ConnectionManager Watcher org.apache.solr.common.cloud.ConnectionManager@766e02a9 name:ZooKeeperConnection Watcher:127.0.0.1:54749/solr got event WatchedEvent state:SyncConnected type:None path:null path:null type:None
   [junit4]   2> 794567 INFO  (TEST-TestDynamicLoading.testDynamicLoading-seed#[C3CEC20D07226EA3]) [    ] o.a.s.c.c.ConnectionManager Client is connected to ZooKeeper
   [junit4]   2> 794567 INFO  (TEST-TestDynamicLoading.testDynamicLoading-seed#[C3CEC20D07226EA3]) [    ] o.a.s.c.c.SolrZkClient Using default ZkACLProvider
   [junit4]   2> 794567 INFO  (TEST-TestDynamicLoading.testDynamicLoading-seed#[C3CEC20D07226EA3]) [    ] o.a.s.c.c.SolrZkClient makePath: /collections/collection1
   [junit4]   2> 794569 INFO  (TEST-TestDynamicLoading.testDynamicLoading-seed#[C3CEC20D07226EA3]) [    ] o.a.s.c.c.SolrZkClient makePath: /collections/collection1/shards
   [junit4]   2> 794570 INFO  (TEST-TestDynamicLoading.testDynamicLoading-seed#[C3CEC20D07226EA3]) [    ] o.a.s.c.c.SolrZkClient makePath: /collections/control_collection
   [junit4]   2> 794571 INFO  (TEST-TestDynamicLoading.testDynamicLoading-seed#[C3CEC20D07226EA3]) [    ] o.a.s.c.c.SolrZkClient makePath: /collections/control_collection/shards
   [junit4]   2> 794572 INFO  (TEST-TestDynamicLoading.testDynamicLoading-seed#[C3CEC20D07226EA3]) [    ] o.a.s.c.AbstractZkTestCase put /x1/jenkins/jenkins-slave/workspace/Lucene-Solr-Tests-trunk-Java8/solr/core/src/test-files/solr/collection1/conf/solrconfig-tlog.xml to /configs/conf1/solrconfig.xml
   [junit4]   2> 794572 INFO  (TEST-TestDynamicLoading.testDynamicLoading-seed#[C3CEC20D07226EA3]) [    ] o.a.s.c.c.SolrZkClient makePath: /configs/conf1/solrconfig.xml
   [junit4]   2> 794573 INFO  (TEST-TestDynamicLoading.testDynamicLoading-seed#[C3CEC20D07226EA3]) [    ] o.a.s.c.AbstractZkTestCase put /x1/jenkins/jenkins-slave/workspace/Lucene-Solr-Tests-trunk-Java8/solr/core/src/test-files/solr/collection1/conf/schema.xml to /configs/conf1/schema.xml
   [junit4]   2> 794574 INFO  (TEST-TestDynamicLoading.testDynamicLoading-seed#[C3CEC20D07226EA3]) [    ] o.a.s.c.c.SolrZkClient makePath: /configs/conf1/schema.xml
   [junit4]   2> 794575 INFO  (TEST-TestDynamicLoading.testDynamicLoading-seed#[C3CEC20D07226EA3]) [    ] o.a.s.c.AbstractZkTestCase put /x1/jenkins/jenkins-slave/workspace/Lucene-Solr-Tests-trunk-Java8/solr/core/src/test-files/solr/collection1/conf/solrconfig.snippet.randomindexconfig.xml to /configs/conf1/solrconfig.snippet.randomindexconfig.xml
   [junit4]   2> 794575 INFO  (TEST-TestDynamicLoading.testDynamicLoading-seed#[C3CEC20D07226EA3]) [    ] o.a.s.c.c.SolrZkClient makePath: /configs/conf1/solrconfig.snippet.randomindexconfig.xml
   [junit4]   2> 794576 INFO  (TEST-TestDynamicLoading.testDynamicLoading-seed#[C3CEC20D07226EA3]) [    ] o.a.s.c.AbstractZkTestCase put /x1/jenkins/jenkins-slave/workspace/Lucene-Solr-Tests-trunk-Java8/solr/core/src/test-files/solr/collection1/conf/stopwords.txt to /configs/conf1/stopwords.txt
   [junit4]   2> 794576 INFO  (TEST-TestDynamicLoading.testDynamicLoading-seed#[C3CEC20D07226EA3]) [    ] o.a.s.c.c.SolrZkClient makePath: /configs/conf1/stopwords.txt
   [junit4]   2> 794577 INFO  (TEST-TestDynamicLoading.testDynamicLoading-seed#[C3CEC20D07226EA3]) [    ] o.a.s.c.AbstractZkTestCase put /x1/jenkins/jenkins-slave/workspace/Lucene-Solr-Tests-trunk-Java8/solr/core/src/test-files/solr/collection1/conf/protwords.txt to /configs/conf1/protwords.txt
   [junit4]   2> 794577 INFO  (TEST-TestDynamicLoading.testDynamicLoading-seed#[C3CEC20D07226EA3]) [    ] o.a.s.c.c.SolrZkClient makePath: /configs/conf1/protwords.txt
   [junit4]   2> 794578 INFO  (TEST-TestDynamicLoading.testDynamicLoading-seed#[C3CEC20D07226EA3]) [    ] o.a.s.c.AbstractZkTestCase put /x1/jenkins/jenkins-slave/workspace/Lucene-Solr-Tests-trunk-Java8/solr/core/src/test-files/solr/collection1/conf/currency.xml to /configs/conf1/currency.xml
   [junit4]   2> 794578 INFO  (TEST-TestDynamicLoading.testDynamicLoading-seed#[C3CEC20D07226EA3]) [    ] o.a.s.c.c.SolrZkClient makePath: /configs/conf1/currency.xml
   [junit4]   2> 794579 INFO  (TEST-TestDynamicLoading.testDynamicLoading-seed#[C3CEC20D07226EA3]) [    ] o.a.s.c.AbstractZkTestCase put /x1/jenkins/jenkins-slave/workspace/Lucene-Solr-Tests-trunk-Java8/solr/core/src/test-files/solr/collection1/conf/enumsConfig.xml to /configs/conf1/enumsConfig.xml
   [junit4]   2> 794580 INFO  (TEST-TestDynamicLoading.testDynamicLoading-seed#[C3CEC20D07226EA3]) [    ] o.a.s.c.c.SolrZkClient makePath: /configs/conf1/enumsConfig.xml
   [junit4]   2> 794580 INFO  (TEST-TestDynamicLoading.testDynamicLoading-seed#[C3CEC20D07226EA3]) [    ] o.a.s.c.AbstractZkTestCase put /x1/jenkins/jenkins-slave/workspace/Lucene-Solr-Tests-trunk-Java8/solr/core/src/test-files/solr/collection1/conf/open-exchange-rates.json to /configs/conf1/open-exchange-rates.json
   [junit4]   2> 794581 INFO  (TEST-TestDynamicLoading.testDynamicLoading-seed#[C3CEC20D07226EA3]) [    ] o.a.s.c.c.SolrZkClient makePath: /configs/conf1/open-exchange-rates.json
   [junit4]   2> 794582 INFO  (TEST-TestDynamicLoading.testDynamicLoading-seed#[C3CEC20D07226EA3]) [    ] o.a.s.c.AbstractZkTestCase put /x1/jenkins/jenkins-slave/workspace/Lucene-Solr-Tests-trunk-Java8/solr/core/src/test-files/solr/collection1/conf/mapping-ISOLatin1Accent.txt to /configs/conf1/mapping-ISOLatin1Accent.txt
   [junit4]   2> 794582 INFO  (TEST-TestDynamicLoading.testDynamicLoading-seed#[C3CEC20D07226EA3]) [    ] o.a.s.c.c.SolrZkClient makePath: /configs/conf1/mapping-ISOLatin1Accent.txt
   [junit4]   2> 794583 INFO  (TEST-TestDynamicLoading.testDynamicLoading-seed#[C3CEC20D07226EA3]) [    ] o.a.s.c.AbstractZkTestCase put /x1/jenkins/jenkins-slave/workspace/Lucene-Solr-Tests-trunk-Java8/solr/core/src/test-files/solr/collection1/conf/old_synonyms.txt to /configs/conf1/old_synonyms.txt
   [junit4]   2> 794584 INFO  (TEST-TestDynamicLoading.testDynamicLoading-seed#[C3CEC20D07226EA3]) [    ] o.a.s.c.c.SolrZkClient makePath: /configs/conf1/old_synonyms.txt
   [junit4]   2> 794585 INFO  (TEST-TestDynamicLoading.testDynamicLoading-seed#[C3CEC20D07226EA3]) [    ] o.a.s.c.AbstractZkTestCase put /x1/jenkins/jenkins-slave/workspace/Lucene-Solr-Tests-trunk-Java8/solr/core/src/test-files/solr/collection1/conf/synonyms.txt to /configs/conf1/synonyms.txt
   [junit4]   2> 794585 INFO  (TEST-TestDynamicLoading.testDynamicLoading-seed#[C3CEC20D07226EA3]) [    ] o.a.s.c.c.SolrZkClient makePath: /configs/conf1/synonyms.txt
   [junit4]   2> 794682 INFO  (TEST-TestDynamicLoading.testDynamicLoading-seed#[C3CEC20D07226EA3]) [    ] o.a.s.SolrTestCaseJ4 Writing core.properties file to /x1/jenkins/jenkins-slave/workspace/Lucene-Solr-Tests-trunk-Java8/solr/build/solr-core/test/J2/temp/solr.core.TestDynamicLoading_C3CEC20D07226EA3-001/control-001/cores/collection1
   [junit4]   2> 794684 INFO  (TEST-TestDynamicLoading.testDynamicLoading-seed#[C3CEC20D07226EA3]) [    ] o.e.j.s.Server jetty-9.2.13.v20150730
   [junit4]   2> 794688 INFO  (TEST-TestDynamicLoading.testDynamicLoading-seed#[C3CEC20D07226EA3]) [    ] o.e.j.s.h.ContextHandler Started o.e.j.s.ServletContextHandler@6def4536{/,null,AVAILABLE}
   [junit4]   2> 794689 INFO  (TEST-TestDynamicLoading.testDynamicLoading-seed#[C3CEC20D07226EA3]) [    ] o.e.j.s.ServerConnector Started ServerConnector@6ddb2ed6{HTTP/1.1}{127.0.0.1:59323}
   [junit4]   2> 794689 INFO  (TEST-TestDynamicLoading.testDynamicLoading-seed#[C3CEC20D07226EA3]) [    ] o.e.j.s.Server Started @798100ms
   [junit4]   2> 794689 INFO  (TEST-TestDynamicLoading.testDynamicLoading-seed#[C3CEC20D07226EA3]) [    ] o.a.s.c.s.e.JettySolrRunner Jetty properties: {solr.data.dir=/x1/jenkins/jenkins-slave/workspace/Lucene-Solr-Tests-trunk-Java8/solr/build/solr-core/test/J2/temp/solr.core.TestDynamicLoading_C3CEC20D07226EA3-001/tempDir-001/control/data, hostContext=/, hostPort=59323, coreRootDirectory=/x1/jenkins/jenkins-slave/workspace/Lucene-Solr-Tests-trunk-Java8/solr/build/solr-core/test/J2/temp/solr.core.TestDynamicLoading_C3CEC20D07226EA3-001/control-001/cores}
   [junit4]   2> 794689 INFO  (TEST-TestDynamicLoading.testDynamicLoading-seed#[C3CEC20D07226EA3]) [    ] o.a.s.s.SolrDispatchFilter SolrDispatchFilter.init(): sun.misc.Launcher$AppClassLoader@4e0e2f2a
   [junit4]   2> 794689 INFO  (TEST-TestDynamicLoading.testDynamicLoading-seed#[C3CEC20D07226EA3]) [    ] o.a.s.c.SolrResourceLoader new SolrResourceLoader for directory: '/x1/jenkins/jenkins-slave/workspace/Lucene-Solr-Tests-trunk-Java8/solr/build/solr-core/test/J2/temp/solr.core.TestDynamicLoading_C3CEC20D07226EA3-001/control-001'
   [junit4]   2> 794689 INFO  (TEST-TestDynamicLoading.testDynamicLoading-seed#[C3CEC20D07226EA3]) [    ] o.a.s.c.SolrResourceLoader JNDI not configured for solr (NoInitialContextEx)
   [junit4]   2> 794689 INFO  (TEST-TestDynamicLoading.testDynamicLoading-seed#[C3CEC20D07226EA3]) [    ] o.a.s.c.SolrResourceLoader solr home defaulted to 'solr/' (could not find system property or JNDI)
   [junit4]   2> 794690 INFO  (TEST-TestDynamicLoading.testDynamicLoading-seed#[C3CEC20D07226EA3]) [    ] o.a.s.c.c.SolrZkClient Using default ZkCredentialsProvider
   [junit4]   2> 794691 INFO  (TEST-TestDynamicLoading.testDynamicLoading-seed#[C3CEC20D07226EA3]) [    ] o.a.s.c.c.ConnectionManager Waiting for client to connect to ZooKeeper
   [junit4]   2> 794692 INFO  (zkCallback-1025-thread-1) [    ] o.a.s.c.c.ConnectionManager Watcher org.apache.solr.common.cloud.ConnectionManager@3984c05e name:ZooKeeperConnection Watcher:127.0.0.1:54749/solr got event WatchedEvent state:SyncConnected type:None path:null path:null type:None
   [junit4]   2> 794692 INFO  (TEST-TestDynamicLoading.testDynamicLoading-seed#[C3CEC20D07226EA3]) [    ] o.a.s.c.c.ConnectionManager Client is connected to ZooKeeper
   [junit4]   2> 794692 INFO  (TEST-TestDynamicLoading.testDynamicLoading-seed#[C3CEC20D07226EA3]) [    ] o.a.s.c.c.SolrZkClient Using default ZkACLProvider
   [junit4]   2> 794693 INFO  (TEST-TestDynamicLoading.testDynamicLoading-seed#[C3CEC20D07226EA3]) [    ] o.a.s.s.SolrDispatchFilter Loading solr.xml from SolrHome (not found in ZooKeeper)
   [junit4]   2> 794693 INFO  (TEST-TestDynamicLoading.testDynamicLoading-seed#[C3CEC20D07226EA3]) [    ] o.a.s.c.SolrXmlConfig Loading container configuration from /x1/jenkins/jenkins-slave/workspace/Lucene-Solr-Tests-trunk-Java8/solr/build/solr-core/test/J2/temp/solr.core.TestDynamicLoading_C3CEC20D07226EA3-001/control-001/solr.xml
   [junit4]   2> 794699 INFO  (TEST-TestDynamicLoading.testDynamicLoading-seed#[C3CEC20D07226EA3]) [    ] o.a.s.c.CorePropertiesLocator Config-defined core root directory: /x1/jenkins/jenkins-slave/workspace/Lucene-Solr-Tests-trunk-Java8/solr/build/solr-core/test/J2/temp/solr.core.TestDynamicLoading_C3CEC20D07226EA3-001/control-001/cores
   [junit4]   2> 794699 INFO  (TEST-TestDynamicLoading.testDynamicLoading-seed#[C3CEC20D07226EA3]) [    ] o.a.s.c.CoreContainer New CoreContainer 1333399443
   [junit4]   2> 794699 INFO  (TEST-TestDynamicLoading.testDynamicLoading-seed#[C3CEC20D07226EA3]) [    ] o.a.s.c.CoreContainer Loading cores into CoreContainer [instanceDir=/x1/jenkins/jenkins-slave/workspace/Lucene-Solr-Tests-trunk-Java8/solr/build/solr-core/test/J2/temp/solr.core.TestDynamicLoading_C3CEC20D07226EA3-001/control-001]
   [junit4]   2> 794699 WARN  (TEST-TestDynamicLoading.testDynamicLoading-seed#[C3CEC20D07226EA3]) [    ] o.a.s.c.CoreContainer Couldn't add files from /x1/jenkins/jenkins-slave/workspace/Lucene-Solr-Tests-trunk-Java8/solr/build/solr-core/test/J2/temp/solr.core.TestDynamicLoading_C3CEC20D07226EA3-001/control-001/lib to classpath: /x1/jenkins/jenkins-slave/workspace/Lucene-Solr-Tests-trunk-Java8/solr/build/solr-core/test/J2/temp/solr.core.TestDynamicLoading_C3CEC20D07226EA3-001/control-001/lib
   [junit4]   2> 794700 INFO  (TEST-TestDynamicLoading.testDynamicLoading-seed#[C3CEC20D07226EA3]) [    ] o.a.s.h.c.HttpShardHandlerFactory created with socketTimeout : 90000,urlScheme : ,connTimeout : 15000,maxConnectionsPerHost : 20,maxConnections : 10000,corePoolSize : 0,maximumPoolSize : 2147483647,maxThreadIdleTime : 5,sizeOfQueue : -1,fairnessPolicy : false,useRetries : false,
   [junit4]   2> 794701 INFO  (TEST-TestDynamicLoading.testDynamicLoading-seed#[C3CEC20D07226EA3]) [    ] o.a.s.u.UpdateShardHandler Creating UpdateShardHandler HTTP client with params: socketTimeout=340000&connTimeout=45000&retry=true
   [junit4]   2> 794701 INFO  (TEST-TestDynamicLoading.testDynamicLoading-seed#[C3CEC20D07226EA3]) [    ] o.a.s.l.LogWatcher SLF4J impl is org.slf4j.impl.Log4jLoggerFactory
   [junit4]   2> 794701 INFO  (TEST-TestDynamicLoading.testDynamicLoading-seed#[C3CEC20D07226EA3]) [    ] o.a.s.l.LogWatcher Registering Log Listener [Log4j (org.slf4j.impl.Log4jLoggerFactory)]
   [junit4]   2> 794702 INFO  (TEST-TestDynamicLoading.testDynamicLoading-seed#[C3CEC20D07226EA3]) [    ] o.a.s.c.ZkContainer Zookeeper client=127.0.0.1:54749/solr
   [junit4]   2> 794702 INFO  (TEST-TestDynamicLoading.testDynamicLoading-seed#[C3CEC20D07226EA3]) [    ] o.a.s.c.ZkController zkHost includes chroot
   [junit4]   2> 794702 INFO  (TEST-TestDynamicLoading.testDynamicLoading-seed#[C3CEC20D07226EA3]) [    ] o.a.s.c.c.SolrZkClient Using default ZkCredentialsProvider
   [junit4]   2> 794706 INFO  (TEST-TestDynamicLoading.testDynamicLoading-seed#[C3CEC20D07226EA3]) [    ] o.a.s.c.c.ConnectionManager Waiting for client to connect to ZooKeeper
   [junit4]   2> 794706 INFO  (zkCallback-1028-thread-1) [    ] o.a.s.c.c.ConnectionManager Watcher org.apache.solr.common.cloud.ConnectionManager@2b214a75 name:ZooKeeperConnection Watcher:127.0.0.1:54749 got event WatchedEvent state:SyncConnected type:None path:null path:null type:None
   [junit4]   2> 794706 INFO  (TEST-TestDynamicLoading.testDynamicLoading-seed#[C3CEC20D07226EA3]) [    ] o.a.s.c.c.ConnectionManager Client is connected to ZooKeeper
   [junit4]   2> 794706 INFO  (TEST-TestDynamicLoading.testDynamicLoading-seed#[C3CEC20D07226EA3]) [    ] o.a.s.c.c.SolrZkClient Using default ZkACLProvider
   [junit4]   2> 794708 INFO  (TEST-TestDynamicLoading.testDynamicLoading-seed#[C3CEC20D07226EA3]) [n:127.0.0.1:59323_    ] o.a.s.c.c.ConnectionManager Waiting for client to connect to ZooKeeper
   [junit4]   2> 794709 INFO  (zkCallback-1029-thread-1-processing-n:127.0.0.1:59323_) [n:127.0.0.1:59323_    ] o.a.s.c.c.ConnectionManager Watcher org.apache.solr.common.cloud.ConnectionManager@4b555bb5 name:ZooKeeperConnection Watcher:127.0.0.1:54749/solr got event WatchedEvent state:SyncConnected type:None path:null path:null type:None
   [junit4]   2> 794709 INFO  (TEST-TestDynamicLoading.testDynamicLoading-seed#[C3CEC20D07226EA3]) [n:127.0.0.1:59323_    ] o.a.s.c.c.ConnectionManager Client is connected to ZooKeeper
   [junit4]   2> 794710 INFO  (TEST-TestDynamicLoading.testDynamicLoading-seed#[C3CEC20D07226EA3]) [n:127.0.0.1:59323_    ] o.a.s.c.c.SolrZkClient makePath: /overseer/queue
   [junit4]   2> 794711 INFO  (TEST-TestDynamicLoading.testDynamicLoading-seed#[C3CEC20D07226EA3]) [n:127.0.0.1:59323_    ] o.a.s.c.c.SolrZkClient makePath: /overseer/collection-queue-work
   [junit4]   2> 794713 INFO  (TEST-TestDynamicLoading.testDynamicLoading-seed#[C3CEC20D07226EA3]) [n:127.0.0.1:59323_    ] o.a.s.c.c.SolrZkClient makePath: /overseer/collection-map-running
   [junit4]   2> 794714 INFO  (TEST-TestDynamicLoading.testDynamicLoading-seed#[C3CEC20D07226EA3]) [n:127.0.0.1:59323_    ] o.a.s.c.c.SolrZkClient makePath: /overseer/collection-map-completed
   [junit4]   2> 794715 INFO  (TEST-TestDynamicLoading.testDynamicLoading-seed#[C3CEC20D07226EA3]) [n:127.0.0.1:59323_    ] o.a.s.c.c.SolrZkClient makePath: /overseer/collection-map-failure
   [junit4]   2> 794717 INFO  (TEST-TestDynamicLoading.testDynamicLoading-seed#[C3CEC20D07226EA3]) [n:127.0.0.1:59323_    ] o.a.s.c.c.SolrZkClient makePath: /live_nodes
   [junit4]   2> 794718 INFO  (TEST-TestDynamicLoading.testDynamicLoading-seed#[C3CEC20D07226EA3]) [n:127.0.0.1:59323_    ] o.a.s.c.c.SolrZkClient makePath: /aliases.json
   [junit4]   2> 794719 INFO  (TEST-TestDynamicLoading.testDynamicLoading-seed#[C3CEC20D07226EA3]) [n:127.0.0.1:59323_    ] o.a.s.c.c.SolrZkClient makePath: /clusterstate.json
   [junit4]   2> 794719 INFO  (TEST-TestDynamicLoading.testDynamicLoading-seed#[C3CEC20D07226EA3]) [n:127.0.0.1:59323_    ] o.a.s.c.c.SolrZkClient makePath: /security.json
   [junit4]   2> 794720 INFO  (TEST-TestDynamicLoading.testDynamicLoading-seed#[C3CEC20D07226EA3]) [n:127.0.0.1:59323_    ] o.a.s.c.ZkController Register node as live in ZooKeeper:/live_nodes/127.0.0.1:59323_
   [junit4]   2> 794720 INFO  (TEST-TestDynamicLoading.testDynamicLoading-seed#[C3CEC20D07226EA3]) [n:127.0.0.1:59323_    ] o.a.s.c.c.SolrZkClient makePath: /live_nodes/127.0.0.1:59323_
   [junit4]   2> 794721 INFO  (TEST-TestDynamicLoading.testDynamicLoading-seed#[C3CEC20D07226EA3]) [n:127.0.0.1:59323_    ] o.a.s.c.c.SolrZkClient makePath: /overseer_elect
   [junit4]   2> 794722 INFO  (TEST-TestDynamicLoading.testDynamicLoading-seed#[C3CEC20D07226EA3]) [n:127.0.0.1:59323_    ] o.a.s.c.c.SolrZkClient makePath: /overseer_elect/election
   [junit4]   2> 794723 INFO  (TEST-TestDynamicLoading.testDynamicLoading-seed#[C3CEC20D07226EA3]) [n:127.0.0.1:59323_    ] o.a.s.c.Overseer Overseer (id=null) closing
   [junit4]   2> 794723 INFO  (TEST-TestDynamicLoading.testDynamicLoading-seed#[C3CEC20D07226EA3]) [n:127.0.0.1:59323_    ] o.a.s.c.LeaderElector Joined leadership election with path: /overseer_elect/election/95386859640782852-127.0.0.1:59323_-n_0000000000
   [junit4]   2> 794723 INFO  (TEST-TestDynamicLoading.testDynamicLoading-seed#[C3CEC20D07226EA3]) [n:127.0.0.1:59323_    ] o.a.s.c.OverseerElectionContext I am going to be the leader 127.0.0.1:59323_
   [junit4]   2> 794723 INFO  (TEST-TestDynamicLoading.testDynamicLoading-seed#[C3CEC20D07226EA3]) [n:127.0.0.1:59323_    ] o.a.s.c.c.SolrZkClient makePath: /overseer_elect/leader
   [junit4]   2> 794724 INFO  (TEST-TestDynamicLoading.testDynamicLoading-seed#[C3CEC20D07226EA3]) [n:127.0.0.1:59323_    ] o.a.s.c.Overseer Overseer (id=95386859640782852-127.0.0.1:59323_-n_0000000000) starting
   [junit4]   2> 794725 INFO  (TEST-TestDynamicLoading.testDynamicLoading-seed#[C3CEC20D07226EA3]) [n:127.0.0.1:59323_    ] o.a.s.c.c.SolrZkClient makePath: /overseer/queue-work
   [junit4]   2> 794731 INFO  (TEST-TestDynamicLoading.testDynamicLoading-seed#[C3CEC20D07226EA3]) [n:127.0.0.1:59323_    ] o.a.s.c.OverseerAutoReplicaFailoverThread Starting OverseerAutoReplicaFailoverThread autoReplicaFailoverWorkLoopDelay=10000 autoReplicaFailoverWaitAfterExpiration=30000 autoReplicaFailoverBadNodeExpiration=60000
   [junit4]   2> 794732 INFO  (OverseerStateUpdate-95386859640782852-127.0.0.1:59323_-n_0000000000) [n:127.0.0.1:59323_    ] o.a.s.c.Overseer Starting to work on the main queue
   [junit4]   2> 794732 INFO  (OverseerCollectionConfigSetProcessor-95386859640782852-127.0.0.1:59323_-n_0000000000) [n:127.0.0.1:59323_    ] o.a.s.c.OverseerTaskProcessor Process current queue of overseer operations
   [junit4]   2> 794733 INFO  (OverseerStateUpdate-95386859640782852-127.0.0.1:59323_-n_0000000000) [n:127.0.0.1:59323_    ] o.a.s.c.c.ZkStateReader Updating cluster state from ZooKeeper... 
   [junit4]   2> 794745 INFO  (TEST-TestDynamicLoading.testDynamicLoading-seed#[C3CEC20D07226EA3]) [n:127.0.0.1:59323_    ] o.a.s.c.c.ZkStateReader Updating cluster state from ZooKeeper... 
   [junit4]   2> 794759 INFO  (TEST-TestDynamicLoading.testDynamicLoading-seed#[C3CEC20D07226EA3]) [n:127.0.0.1:59323_    ] o.a.s.c.CoreContainer Security conf doesn't exist. Skipping setup for authorization module.
   [junit4]   2> 794759 INFO  (TEST-TestDynamicLoading.testDynamicLoading-seed#[C3CEC20D07226EA3]) [n:127.0.0.1:59323_    ] o.a.s.c.CoreContainer No authentication plugin used.
   [junit4]   2> 794760 INFO  (TEST-TestDynamicLoading.testDynamicLoading-seed#[C3CEC20D07226EA3]) [n:127.0.0.1:59323_    ] o.a.s.c.CorePropertiesLocator Looking for core definitions underneath /x1/jenkins/jenkins-slave/workspace/Lucene-Solr-Tests-trunk-Java8/solr/build/solr-core/test/J2/temp/solr.core.TestDynamicLoading_C3CEC20D07226EA3-001/control-001/cores
   [junit4]   2> 794761 INFO  (TEST-TestDynamicLoading.testDynamicLoading-seed#[C3CEC20D07226EA3]) [n:127.0.0.1:59323_    ] o.a.s.c.CoreDescriptor Created CoreDescriptor: {name=collection1, config=solrconfig.xml, transient=false, schema=schema.xml, loadOnStartup=true, configSetProperties=configsetprops.json, collection=control_collection, coreNodeName=, dataDir=data/, shard=}
   [junit4]   2> 794761 INFO  (TEST-TestDynamicLoading.testDynamicLoading-seed#[C3CEC20D07226EA3]) [n:127.0.0.1:59323_    ] o.a.s.c.CorePropertiesLocator Found core collection1 in /x1/jenkins/jenkins-slave/workspace/Lucene-Solr-Tests-trunk-Java8/solr/build/solr-core/test/J2/temp/solr.core.TestDynamicLoading_C3CEC20D07226EA3-001/control-001/cores/collection1
   [junit4]   2> 794761 INFO  (TEST-TestDynamicLoading.testDynamicLoading-seed#[C3CEC20D07226EA3]) [n:127.0.0.1:59323_    ] o.a.s.c.CorePropertiesLocator Found 1 core definitions
   [junit4]   2> 794763 INFO  (coreLoadExecutor-2979-thread-1-processing-n:127.0.0.1:59323_) [n:127.0.0.1:59323_ c:control_collection   x:collection1] o.a.s.c.ZkController publishing state=down
   [junit4]   2> 794763 INFO  (coreLoadExecutor-2979-thread-1-processing-n:127.0.0.1:59323_) [n:127.0.0.1:59323_ c:control_collection   x:collection1] o.a.s.c.ZkController numShards not found on descriptor - reading it from system property
   [junit4]   2> 794767 INFO  (coreLoadExecutor-2979-thread-1-processing-n:127.0.0.1:59323_) [n:127.0.0.1:59323_ c:control_collection   x:collection1] o.a.s.c.ZkController look for our core node name
   [junit4]   2> 794768 INFO  (TEST-TestDynamicLoading.testDynamicLoading-seed#[C3CEC20D07226EA3]) [n:127.0.0.1:59323_    ] o.a.s.s.SolrDispatchFilter user.dir=/x1/jenkins/jenkins-slave/workspace/Lucene-Solr-Tests-trunk-Java8/solr/build/solr-core/test/J2
   [junit4]   2> 794768 INFO  (TEST-TestDynamicLoading.testDynamicLoading-seed#[C3CEC20D07226EA3]) [n:127.0.0.1:59323_    ] o.a.s.s.SolrDispatchFilter SolrDispatchFilter.init() done
   [junit4]   2> 794769 INFO  (OverseerStateUpdate-95386859640782852-127.0.0.1:59323_-n_0000000000) [n:127.0.0.1:59323_    ] o.a.s.c.Overseer processMessage: queueSize: 1, message = {
   [junit4]   2>   "core":"collection1",
   [junit4]   2>   "roles":null,
   [junit4]   2>   "base_url":"http://127.0.0.1:59323",
   [junit4]   2>   "node_name":"127.0.0.1:59323_",
   [junit4]   2>   "numShards":"1",
   [junit4]   2>   "state":"down",
   [junit4]   2>   "shard":null,
   [junit4]   2>   "collection":"control_collection",
   [junit4]   2>   "operation":"state"} current state version: 0
   [junit4]   2> 794769 INFO  (OverseerStateUpdate-95386859640782852-127.0.0.1:59323_-n_0000000000) [n:127.0.0.1:59323_    ] o.a.s.c.o.ReplicaMutator Update state numShards=1 message={
   [junit4]   2>   "core":"collection1",
   [junit4]   2>   "roles":null,
   [junit4]   2>   "base_url":"http://127.0.0.1:59323",
   [junit4]   2>   "node_name":"127.0.0.1:59323_",
   [junit4]   2>   "numShards":"1",
   [junit4]   2>   "state":"down",
   [junit4]   2>   "shard":null,
   [junit4]   2>   "collection":"control_collection",
   [junit4]   2>   "operation":"state"}
   [junit4]   2> 794770 INFO  (OverseerStateUpdate-95386859640782852-127.0.0.1:59323_-n_0000000000) [n:127.0.0.1:59323_    ] o.a.s.c.o.ClusterStateMutator building a new cName: control_collection
   [junit4]   2> 794770 INFO  (OverseerStateUpdate-95386859640782852-127.0.0.1:59323_-n_0000000000) [n:127.0.0.1:59323_    ] o.a.s.c.o.ReplicaMutator Assigning new node to shard shard=shard1
   [junit4]   2> 794772 INFO  (zkCallback-1029-thread-1-processing-n:127.0.0.1:59323_) [n:127.0.0.1:59323_    ] o.a.s.c.c.ZkStateReader A cluster state change: [WatchedEvent state:SyncConnected type:NodeDataChanged path:/clusterstate.json], has occurred - updating... (live nodes size: [1])
   [junit4]   2> 794781 INFO  (zkCallback-1029-thread-2-processing-n:127.0.0.1:59323_) [n:127.0.0.1:59323_    ] o.a.s.c.c.ZkStateReader A cluster state change: [WatchedEvent state:SyncConnected type:NodeDataChanged path:/clusterstate.json], has occurred - updating... (live nodes size: [1])
   [junit4]   2> 795767 INFO  (coreLoadExecutor-2979-thread-1-processing-n:127.0.0.1:59323_) [n:127.0.0.1:59323_ c:control_collection   x:collection1] o.a.s.c.ZkController waiting to find shard id in clusterstate for collection1
   [junit4]   2> 795767 INFO  (coreLoadExecutor-2979-thread-1-processing-n:127.0.0.1:59323_) [n:127.0.0.1:59323_ c:control_collection   x:collection1] o.a.s.c.ZkController Check for collection zkNode:control_collection
   [junit4]   2> 795768 INFO  (coreLoadExecutor-2979-thread-1-processing-n:127.0.0.1:59323_) [n:127.0.0.1:59323_ c:control_collection   x:collection1] o.a.s.c.ZkController Collection zkNode exists
   [junit4]   2> 795768 INFO  (coreLoadExecutor-2979-thread-1-processing-n:127.0.0.1:59323_) [n:127.0.0.1:59323_ c:control_collection   x:collection1] o.a.s.c.c.ZkStateReader Load collection config from: [/collections/control_collection]
   [junit4]   2> 795768 INFO  (coreLoadExecutor-2979-thread-1-processing-n:127.0.0.1:59323_) [n:127.0.0.1:59323_ c:control_collection   x:collection1] o.a.s.c.c.ZkStateReader path=[/collections/control_collection] [configName]=[conf1] specified config exists in ZooKeeper
   [junit4]   2> 795768 INFO  (coreLoadExecutor-2979-thread-1-processing-n:127.0.0.1:59323_) [n:127.0.0.1:59323_ c:control_collection   x:collection1] o.a.s.c.SolrResourceLoader new SolrResourceLoader for directory: '/x1/jenkins/jenkins-slave/workspace/Lucene-Solr-Tests-trunk-Java8/solr/build/solr-core/test/J2/temp/solr.core.TestDynamicLoading_C3CEC20D07226EA3-001/control-001/cores/collection1'
   [junit4]   2> 795768 INFO  (coreLoadExecutor-2979-thread-1-processing-n:127.0.0.1:59323_) [n:127.0.0.1:59323_ c:control_collection   x:collection1] o.a.s.c.SolrResourceLoader JNDI not configured for solr (NoInitialContextEx)
   [junit4]   2> 795768 INFO  (coreLoadExecutor-2979-thread-1-processing-n:127.0.0.1:59323_) [n:127.0.0.1:59323_ c:control_collection   x:collection1] o.a.s.c.SolrResourceLoader solr home defaulted to 'solr/' (could not find system property or JNDI)
   [junit4]   2> 795770 INFO  (coreLoadExecutor-2979-thread-1-processing-n:127.0.0.1:59323_) [n:127.0.0.1:59323_ c:control_collection   x:collection1] o.a.s.c.Config loaded config solrconfig.xml with version 0 
   [junit4]   2> 795774 INFO  (coreLoadExecutor-2979-thread-1-processing-n:127.0.0.1:59323_) [n:127.0.0.1:59323_ c:control_collection   x:collection1] o.a.s.c.SolrConfig current version of requestparams : -1
   [junit4]   2> 795778 INFO  (coreLoadExecutor-2979-thread-1-processing-n:127.0.0.1:59323_) [n:127.0.0.1:59323_ c:control_collection   x:collection1] o.a.s.c.SolrConfig Using Lucene MatchVersion: 6.0.0
   [junit4]   2> 795788 INFO  (coreLoadExecutor-2979-thread-1-processing-n:127.0.0.1:59323_) [n:127.0.0.1:59323_ c:control_collection   x:collection1] o.a.s.c.SolrConfig Loaded SolrConfig: solrconfig.xml
   [junit4]   2> 795796 INFO  (coreLoadExecutor-2979-thread-1-processing-n:127.0.0.1:59323_) [n:127.0.0.1:59323_ c:control_collection   x:collection1] o.a.s.s.IndexSchema [collection1] Schema name=test
   [junit4]   2> 795900 INFO  (coreLoadExecutor-2979-thread-1-processing-n:127.0.0.1:59323_) [n:127.0.0.1:59323_ c:control_collection   x:collection1] o.a.s.s.OpenExchangeRatesOrgProvider Initialized with rates=open-exchange-rates.json, refreshInterval=1440.
   [junit4]   2> 795905 INFO  (coreLoadExecutor-2979-thread-1-processing-n:127.0.0.1:59323_) [n:127.0.0.1:59323_ c:control_collection   x:collection1] o.a.s.s.IndexSchema default search field in schema is text
   [junit4]   2> 795906 INFO  (coreLoadExecutor-2979-thread-1-processing-n:127.0.0.1:59323_) [n:127.0.0.1:59323_ c:control_collection   x:collection1] o.a.s.s.IndexSchema unique key field: id
   [junit4]   2> 795921 INFO  (coreLoadExecutor-2979-thread-1-processing-n:127.0.0.1:59323_) [n:127.0.0.1:59323_ c:control_collection   x:collection1] o.a.s.s.FileExchangeRateProvider Reloading exchange rates from file currency.xml
   [junit4]   2> 795926 INFO  (coreLoadExecutor-2979-thread-1-processing-n:127.0.0.1:59323_) [n:127.0.0.1:59323_ c:control_collection   x:collection1] o.a.s.s.FileExchangeRateProvider Reloading exchange rates from file currency.xml
   [junit4]   2> 795927 INFO  (coreLoadExecutor-2979-thread-1-processing-n:127.0.0.1:59323_) [n:127.0.0.1:59323_ c:control_collection   x:collection1] o.a.s.s.OpenExchangeRatesOrgProvider Reloading exchange rates from open-exchange-rates.json
   [junit4]   2> 795928 INFO  (coreLoadExecutor-2979-thread-1-processing-n:127.0.0.1:59323_) [n:127.0.0.1:59323_ c:control_collection   x:collection1] o.a.s.s.OpenExchangeRatesOrgProvider Reloading exchange rates from open-exchange-rates.json
   [junit4]   2> 795930 INFO  (coreLoadExecutor-2979-thread-1-processing-n:127.0.0.1:59323_) [n:127.0.0.1:59323_ c:control_collection   x:collection1] o.a.s.c.ConfigSetProperties Did not find ConfigSet properties, assuming default properties: Can't find resource 'configsetprops.json' in classpath or '/configs/conf1', cwd=/x1/jenkins/jenkins-slave/workspace/Lucene-Solr-Tests-trunk-Java8/solr/build/solr-core/test/J2
   [junit4]   2> 795930 INFO  (coreLoadExecutor-2979-thread-1-processing-n:127.0.0.1:59323_) [n:127.0.0.1:59323_ c:control_collection   x:collection1] o.a.s.c.CoreContainer Creating SolrCore 'collection1' using configuration from collection control_collection
   [junit4]   2> 795931 INFO  (coreLoadExecutor-2979-thread-1-processing-n:127.0.0.1:59323_) [n:127.0.0.1:59323_ c:control_collection s:shard1 r:core_node1 x:collection1] o.a.s.c.SolrCore org.apache.solr.core.MockDirectoryFactory
   [junit4]   2> 795933 INFO  (coreLoadExecutor-2979-thread-1-processing-n:127.0.0.1:59323_) [n:127.0.0.1:59323_ c:control_collection s:shard1 r:core_node1 x:collection1] o.a.s.c.SolrCore [[collection1] ] Opening new SolrCore at [/x1/jenkins/jenkins-slave/workspace/Lucene-Solr-Tests-trunk-Java8/solr/build/solr-core/test/J2/temp/solr.core.TestDynamicLoading_C3CEC20D07226EA3-001/control-001/cores/collection1], dataDir=[/x1/jenkins/jenkins-slave/workspace/Lucene-Solr-Tests-trunk-Java8/solr/build/solr-core/test/J2/temp/solr.core.TestDynamicLoading_C3CEC20D07226EA3-001/control-001/cores/collection1/data/]
   [junit4]   2> 795933 INFO  (coreLoadExecutor-2979-thread-1-processing-n:127.0.0.1:59323_) [n:127.0.0.1:59323_ c:control_collection s:shard1 r:core_node1 x:collection1] o.a.s.c.JmxMonitoredMap JMX monitoring is enabled. Adding Solr mbeans to JMX Server: com.sun.jmx.mbeanserver.JmxMBeanServer@10fe64f3
   [junit4]   2> 795933 INFO  (coreLoadExecutor-2979-thread-1-processing-n:127.0.0.1:59323_) [n:127.0.0.1:59323_ c:control_collection s:shard1 r:core_node1 x:collection1] o.a.s.c.CachingDirectoryFactory return new directory for /x1/jenkins/jenkins-slave/workspace/Lucene-Solr-Tests-trunk-Java8/solr/build/solr-core/test/J2/temp/solr.core.TestDynamicLoading_C3CEC20D07226EA3-001/control-001/cores/collection1/data
   [junit4]   2> 795933 INFO  (coreLoadExecutor-2979-thread-1-processing-n:127.0.0.1:59323_) [n:127.0.0.1:59323_ c:control_collection s:shard1 r:core_node1 x:collection1] o.a.s.c.SolrCore New index directory detected: old=null new=/x1/jenkins/jenkins-slave/workspace/Lucene-Solr-Tests-trunk-Java8/solr/build/solr-core/test/J2/temp/solr.core.TestDynamicLoading_C3CEC20D07226EA3-001/control-001/cores/collection1/data/index/
   [junit4]   2> 795933 WARN  (coreLoadExecutor-2979-thread-1-processing-n:127.0.0.1:59323_) [n:127.0.0.1:59323_ c:control_collection s:shard1 r:core_node1 x:collection1] o.a.s.c.SolrCore [collection1] Solr index directory '/x1/jenkins/jenkins-slave/workspace/Lucene-Solr-Tests-trunk-Java8/solr/build/solr-core/test/J2/temp/solr.core.TestDynamicLoading_C3CEC20D07226EA3-001/control-001/cores/collection1/data/index' doesn't exist. Creating new index...
   [junit4]   2> 795934 INFO  (coreLoadExecutor-2979-thread-1-processing-n:127.0.0.1:59323_) [n:127.0.0.1:59323_ c:control_collection s:shard1 r:core_node1 x:collection1] o.a.s.c.CachingDirectoryFactory return new directory for /x1/jenkins/jenkins-slave/workspace/Lucene-Solr-Tests-trunk-Java8/solr/build/solr-core/test/J2/temp/solr.core.TestDynamicLoading_C3CEC20D07226EA3-001/control-001/cores/collection1/data/index
   [junit4]   2> 795934 INFO  (coreLoadExecutor-2979-thread-1-processing-n:127.0.0.1:59323_) [n:127.0.0.1:59323_ c:control_collection s:shard1 r:core_node1 x:collection1] o.a.s.u.RandomMergePolicy RandomMergePolicy wrapping class org.apache.lucene.index.TieredMergePolicy: [TieredMergePolicy: maxMergeAtOnce=50, maxMergeAtOnceExplicit=11, maxMergedSegmentMB=32.9208984375, floorSegmentMB=0.689453125, forceMergeDeletesPctAllowed=13.0907814780921, segmentsPerTier=15.0, maxCFSSegmentSizeMB=8.796093022207999E12, noCFSRatio=0.525548860792068
   [junit4]   2> 795934 INFO  (coreLoadExecutor-2979-thread-1-processing-n:127.0.0.1:59323_) [n:127.0.0.1:59323_ c:control_collection s:shard1 r:core_node1 x:collection1] o.a.s.c.SolrDeletionPolicy SolrDeletionPolicy.onCommit: commits: num=1
   [junit4]   2> 	commit{dir=MockDirectoryWrapper(RAMDirectory@7c7edace lockFactory=org.apache.lucene.store.SingleInstanceLockFactory@610afe19),segFN=segments_1,generation=1}
   [junit4]   2> 795935 INFO  (coreLoadExecutor-2979-thread-1-processing-n:127.0.0.1:59323_) [n:127.0.0.1:59323_ c:control_collection s:shard1 r:core_node1 x:collection1] o.a.s.c.SolrDeletionPolicy newest commit generation = 1
   [junit4]   2> 795941 INFO  (OldIndexDirectoryCleanupThreadForCore-collection1) [n:127.0.0.1:59323_ c:control_collection s:shard1 r:core_node1 x:collection1] o.a.s.c.SolrCore Looking for old index directories to cleanup for core collection1 in /x1/jenkins/jenkins-slave/workspace/Lucene-Solr-Tests-trunk-Java8/solr/build/solr-core/test/J2/temp/solr.core.TestDynamicLoading_C3CEC20D07226EA3-001/control-001/cores/collection1/data/
   [junit4]   2> 795941 WARN  (OldIndexDirectoryCleanupThreadForCore-collection1) [n:127.0.0.1:59323_ c:control_collection s:shard1 r:core_node1 x:collection1] o.a.s.c.DirectoryFactory /x1/jenkins/jenkins-slave/workspace/Lucene-Solr-Tests-trunk-Java8/solr/build/solr-core/test/J2/temp/solr.core.TestDynamicLoading_C3CEC20D07226EA3-001/control-001/cores/collection1/data/ does not point to a valid data directory; skipping clean-up of old index directories.
   [junit4]   2> 795944 INFO  (coreLoadExecutor-2979-thread-1-processing-n:127.0.0.1:59323_) [n:127.0.0.1:59323_ c:control_collection s:shard1 r:core_node1 x:collection1] o.a.s.u.p.UpdateRequestProcessorChain creating updateRequestProcessorChain "nodistrib"
   [junit4]   2> 795944 INFO  (coreLoadExecutor-2979-thread-1-processing-n:127.0.0.1:59323_) [n:127.0.0.1:59323_ c:control_collection s:shard1 r:core_node1 x:collection1] o.a.s.u.p.UpdateRequestProcessorChain creating updateRequestProcessorChain "dedupe"
   [junit4]   2> 795944 INFO  (coreLoadExecutor-2979-thread-1-processing-n:127.0.0.1:59323_) [n:127.0.0.1:59323_ c:control_collection s:shard1 r:core_node1 x:collection1] o.a.s.u.p.UpdateRequestProcessorChain inserting DistributedUpdateProcessorFactory into updateRequestProcessorChain "dedupe"
   [junit4]   2> 795945 INFO  (coreLoadExecutor-2979-thread-1-processing-n:127.0.0.1:59323_) [n:127.0.0.1:59323_ c:control_collection s:shard1 r:core_node1 x:collection1] o.a.s.u.p.UpdateRequestProcessorChain creating updateRequestProcessorChain "stored_sig"
   [junit4]   2> 795945 INFO  (coreLoadExecutor-2979-thread-1-processing-n:127.0.0.1:59323_) [n:127.0.0.1:59323_ c:control_collection s:shard1 r:core_node1 x:collection1] o.a.s.u.p.UpdateRequestProcessorChain inserting DistributedUpdateProcessorFactory into updateRequestProcessorChain "stored_sig"
   [junit4]   2> 795945 INFO  (coreLoadExecutor-2979-thread-1-processing-n:127.0.0.1:59323_) [n:127.0.0.1:59323_ c:control_collection s:shard1 r:core_node1 x:collection1] o.a.s.u.p.UpdateRequestProcessorChain creating updateRequestProcessorChain "distrib-dup-test-chain-explicit"
   [junit4]   2> 795945 INFO  (coreLoadExecutor-2979-thread-1-processing-n:127.0.0.1:59323_) [n:127.0.0.1:59323_ c:control_collection s:shard1 r:core_node1 x:collection1] o.a.s.u.p.UpdateRequestProcessorChain creating updateRequestProcessorChain "distrib-dup-test-chain-implicit"
   [junit4]   2> 795945 INFO  (coreLoadExecutor-2979-thread-1-processing-n:127.0.0.1:59323_) [n:127.0.0.1:59323_ c:control_collection s:shard1 r:core_node1 x:collection1] o.a.s.u.p.UpdateRequestProcessorChain inserting DistributedUpdateProcessorFactory into updateRequestProcessorChain "distrib-dup-test-chain-implicit"
   [junit4]   2> 795945 INFO  (coreLoadExecutor-2979-thread-1-processing-n:127.0.0.1:59323_) [n:127.0.0.1:59323_ c:control_collection s:shard1 r:core_node1 x:collection1] o.a.s.c.SolrCore no updateRequestProcessorChain defined as default, creating implicit default
   [junit4]   2> 795945 WARN  (coreLoadExecutor-2979-thread-1-processing-n:127.0.0.1:59323_) [n:127.0.0.1:59323_ c:control_collection s:shard1 r:core_node1 x:collection1] o.a.s.c.RequestHandlers INVALID paramSet a in requestHandler {type = requestHandler,name = /dump,class = DumpRequestHandler,args = {defaults={a=A,b=B}}}
   [junit4]   2> 795947 INFO  (coreLoadExecutor-2979-thread-1-processing-n:127.0.0.1:59323_) [n:127.0.0.1:59323_ c:control_collection s:shard1 r:core_node1 x:collection1] o.a.s.h.l.XMLLoader xsltCacheLifetimeSeconds=60
   [junit4]   2> 795953 INFO  (coreLoadExecutor-2979-thread-1-processing-n:127.0.0.1:59323_) [n:127.0.0.1:59323_ c:control_collection s:shard1 r:core_node1 x:collection1] o.a.s.h.l.XMLLoader xsltCacheLifetimeSeconds=60
   [junit4]   2> 795954 INFO  (coreLoadExecutor-2979-thread-1-processing-n:127.0.0.1:59323_) [n:127.0.0.1:59323_ c:control_collection s:shard1 r:core_node1 x:collection1] o.a.s.h.l.XMLLoader xsltCacheLifetimeSeconds=60
   [junit4]   2> 795955 INFO  (coreLoadExecutor-2979-thread-1-processing-n:127.0.0.1:59323_) [n:127.0.0.1:59323_ c:control_collection s:shard1 r:core_node1 x:collection1] o.a.s.h.l.XMLLoader xsltCacheLifetimeSeconds=60
   [junit4]   2> 795959 INFO  (coreLoadExecutor-2979-thread-1-processing-n:127.0.0.1:59323_) [n:127.0.0.1:59323_ c:control_collection s:shard1 r:core_node1 x:collection1] o.a.s.c.RequestHandlers Registered paths: /admin/mbeans,standard,/dump,/update/csv,/sql,/update/json/docs,/admin/luke,/export,/admin/segments,/get,/admin/system,/replication,/admin/properties,/config,/stream,/schema,/admin/plugins,/admin/logging,/update/json,/admin/threads,/admin/ping,/update,/admin/file
   [junit4]   2> 795960 INFO  (coreLoadExecutor-2979-thread-1-processing-n:127.0.0.1:59323_) [n:127.0.0.1:59323_ c:control_collection s:shard1 r:core_node1 x:collection1] o.a.s.c.SolrCore Using default statsCache cache: org.apache.solr.search.stats.LocalStatsCache
   [junit4]   2> 795960 INFO  (coreLoadExecutor-2979-thread-1-processing-n:127.0.0.1:59323_) [n:127.0.0.1:59323_ c:control_collection s:shard1 r:core_node1 x:collection1] o.a.s.u.UpdateHandler Using UpdateLog implementation: org.apache.solr.update.UpdateLog
   [junit4]   2> 795961 INFO  (coreLoadExecutor-2979-thread-1-processing-n:127.0.0.1:59323_) [n:127.0.0.1:59323_ c:control_collection s:shard1 r:core_node1 x:collection1] o.a.s.u.UpdateLog Initializing UpdateLog: dataDir= defaultSyncLevel=FLUSH numRecordsToKeep=100 maxNumLogsToKeep=10 numVersionBuckets=65536
   [junit4]   2> 795961 INFO  (coreLoadExecutor-2979-thread-1-processing-n:127.0.0.1:59323_) [n:127.0.0.1:59323_ c:control_collection s:shard1 r:core_node1 x:collection1] o.a.s.u.CommitTracker Hard AutoCommit: disabled
   [junit4]   2> 795961 INFO  (coreLoadExecutor-2979-thread-1-processing-n:127.0.0.1:59323_) [n:127.0.0.1:59323_ c:control_collection s:shard1 r:core_node1 x:collection1] o.a.s.u.CommitTracker Soft AutoCommit: disabled
   [junit4]   2> 795962 INFO  (coreLoadExecutor-2979-thread-1-processing-n:127.0.0.1:59323_) [n:127.0.0.1:59323_ c:control_collection s:shard1 r:core_node1 x:collection1] o.a.s.u.RandomMergePolicy RandomMergePolicy wrapping class org.apache.lucene.index.TieredMergePolicy: [TieredMergePolicy: maxMergeAtOnce=46, maxMergeAtOnceExplicit=40, maxMergedSegmentMB=18.853515625, floorSegmentMB=2.0234375, forceMergeDeletesPctAllowed=17.913968079856453, segmentsPerTier=15.0, maxCFSSegmentSizeMB=8.796093022207999E12, noCFSRatio=0.71847334651766
   [junit4]   2> 795962 INFO  (coreLoadExecutor-2979-thread-1-processing-n:127.0.0.1:59323_) [n:127.0.0.1:59323_ c:control_collection s:shard1 r:core_node1 x:collection1] o.a.s.c.SolrDeletionPolicy SolrDeletionPolicy.onInit: commits: num=1
   [junit4]   2> 	commit{dir=MockDirectoryWrapper(RAMDirectory@7c7edace lockFactory=org.apache.lucene.store.SingleInstanceLockFactory@610afe19),segFN=segments_1,generation=1}
   [junit4]   2> 795962 INFO  (coreLoadExecutor-2979-thread-1-processing-n:127.0.0.1:59323_) [n:127.0.0.1:59323_ c:control_collection s:shard1 r:core_node1 x:collection1] o.a.s.c.SolrDeletionPolicy newest commit generation = 1
   [junit4]   2> 795962 INFO  (coreLoadExecutor-2979-thread-1-processing-n:127.0.0.1:59323_) [n:127.0.0.1:59323_ c:control_collection s:shard1 r:core_node1 x:collection1] o.a.s.s.SolrIndexSearcher Opening [Searcher@7e6ace43[collection1] main]
   [junit4]   2> 795962 INFO  (coreLoadExecutor-2979-thread-1-processing-n:127.0.0.1:59323_) [n:127.0.0.1:59323_ c:control_collection s:shard1 r:core_node1 x:collection1] o.a.s.c.c.ZkStateReader Load collection config from: [/collections/control_collection]
   [junit4]   2> 795963 INFO  (coreLoadExecutor-2979-thread-1-processing-n:127.0.0.1:59323_) [n:127.0.0.1:59323_ c:control_collection s:shard1 r:core_node1 x:collection1] o.a.s.c.c.ZkStateReader path=[/collections/control_collection] [configName]=[conf1] specified config exists in ZooKeeper
   [junit4]   2> 795963 INFO  (coreLoadExecutor-2979-thread-1-processing-n:127.0.0.1:59323_) [n:127.0.0.1:59323_ c:control_collection s:shard1 r:core_node1 x:collection1] o.a.s.r.ManagedResourceStorage Setting up ZooKeeper-based storage for the RestManager with znodeBase: /configs/conf1
   [junit4]   2> 795963 INFO  (coreLoadExecutor-2979-thread-1-processing-n:127.0.0.1:59323_) [n:127.0.0.1:59323_ c:control_collection s:shard1 r:core_node1 x:collection1] o.a.s.r.ManagedResourceStorage Configured ZooKeeperStorageIO with znodeBase: /configs/conf1
   [junit4]   2> 795964 INFO  (coreLoadExecutor-2979-thread-1-processing-n:127.0.0.1:59323_) [n:127.0.0.1:59323_ c:control_collection s:shard1 r:core_node1 x:collection1] o.a.s.r.RestManager Initializing RestManager with initArgs: {}
   [junit4]   2> 795964 INFO  (coreLoadExecutor-2979-thread-1-processing-n:127.0.0.1:59323_) [n:127.0.0.1:59323_ c:control_collection s:shard1 r:core_node1 x:collection1] o.a.s.r.ManagedResourceStorage Reading _rest_managed.json using ZooKeeperStorageIO:path=/configs/conf1
   [junit4]   2> 795964 INFO  (coreLoadExecutor-2979-thread-1-processing-n:127.0.0.1:59323_) [n:127.0.0.1:59323_ c:control_collection s:shard1 r:core_node1 x:collection1] o.a.s.r.ManagedResourceStorage No data found for znode /configs/conf1/_rest_managed.json
   [junit4]   2> 795964 INFO  (coreLoadExecutor-2979-thread-1-processing-n:127.0.0.1:59323_) [n:127.0.0.1:59323_ c:control_collection s:shard1 r:core_node1 x:collection1] o.a.s.r.ManagedResourceStorage Loaded null at path _rest_managed.json using ZooKeeperStorageIO:path=/configs/conf1
   [junit4]   2> 795964 INFO  (coreLoadExecutor-2979-thread-1-processing-n:127.0.0.1:59323_) [n:127.0.0.1:59323_ c:control_collection s:shard1 r:core_node1 x:collection1] o.a.s.r.RestManager Initializing 0 registered ManagedResources
   [junit4]   2> 795964 INFO  (coreLoadExecutor-2979-thread-1-processing-n:127.0.0.1:59323_) [n:127.0.0.1:59323_ c:control_collection s:shard1 r:core_node1 x:collection1] o.a.s.h.ReplicationHandler Commits will be reserved for  10000
   [junit4]   2> 795965 INFO  (coreLoadExecutor-2979-thread-1-processing-n:127.0.0.1:59323_) [n:127.0.0.1:59323_ c:control_collection s:shard1 r:core_node1 x:collection1] o.a.s.u.UpdateLog Looking up max value of version field to seed version buckets
   [junit4]   2> 795965 INFO  (coreLoadExecutor-2979-thread-1-processing-n:127.0.0.1:59323_) [n:127.0.0.1:59323_ c:control_collection s:shard1 r:core_node1 x:collection1] o.a.s.u.VersionInfo Refreshing highest value of _version_ for 65536 version buckets from index
   [junit4]   2> 795965 INFO  (coreLoadExecutor-2979-thread-1-processing-n:127.0.0.1:59323_) [n:127.0.0.1:59323_ c:control_collection s:shard1 r:core_node1 x:collection1] o.a.s.u.VersionInfo No terms found for _version_, cannot seed version bucket highest value from index
   [junit4]   2> 795965 INFO  (coreLoadExecutor-2979-thread-1-processing-n:127.0.0.1:59323_) [n:127.0.0.1:59323_ c:control_collection s:shard1 r:core_node1 x:collection1] o.a.s.u.UpdateLog Could not find max version in index or recent updates, using new clock 1526189755842166784
   [junit4]   2> 795967 INFO  (coreLoadExecutor-2979-thread-1-processing-n:127.0.0.1:59323_) [n:127.0.0.1:59323_ c:control_collection s:shard1 r:core_node1 x:collection1] o.a.s.u.UpdateLog Took 2.0ms to seed version buckets with highest version 1526189755842166784
   [junit4]   2> 795967 INFO  (coreLoadExecutor-2979-thread-1-processing-n:127.0.0.1:59323_) [n:127.0.0.1:59323_ c:control_collection s:shard1 r:core_node1 x:collection1] o.a.s.c.ZkController watch zkdir /configs/conf1
   [junit4]   2> 795968 INFO  (searcherExecutor-2980-thread-1-processing-n:127.0.0.1:59323_ x:collection1 s:shard1 c:control_collection r:core_node1) [n:127.0.0.1:59323_ c:control_collection s:shard1 r:core_node1 x:collection1] o.a.s.c.SolrCore [collection1] Registered new searcher Searcher@7e6ace43[collection1] main{ExitableDirectoryReader(UninvertingDirectoryReader())}
   [junit4]   2> 795973 INFO  (coreLoadExecutor-2979-thread-1-processing-n:127.0.0.1:59323_) [n:127.0.0.1:59323_ c:control_collection s:shard1 r:core_node1 x:collection1] o.a.s.c.CoreContainer registering core: collection1
   [junit4]   2> 795981 INFO  (coreZkRegister-2973-thread-1-processing-n:127.0.0.1:59323_ x:collection1 s:shard1 c:control_collection r:core_node1) [n:127.0.0.1:59323_ c:control_collection s:shard1 r:core_node1 x:collection1] o.a.s.c.ZkController Register replica - core:collection1 address:http://127.0.0.1:59323 collection:control_collection shard:shard1
   [junit4]   2> 795983 INFO  (coreZkRegister-2973-thread-1-processing-n:127.0.0.1:59323_ x:collection1 s:shard1 c:control_collection r:core_node1) [n:127.0.0.1:59323_ c:control_collection s:shard1 r:core_node1 x:collection1] o.a.s.c.c.SolrZkClient makePath: /collections/control_collection/leader_elect/shard1/election
   [junit4]   2> 795985 INFO  (coreZkRegister-2973-thread-1-processing-n:127.0.0.1:59323_ x:collection1 s:shard1 c:control_collection r:core_node1) [n:127.0.0.1:59323_ c:control_collection s:shard1 r:core_node1 x:collection1] o.a.s.c.LeaderElector Joined leadership election with path: /collections/control_collection/leader_elect/shard1/election/95386859640782852-core_node1-n_0000000000
   [junit4]   2> 795986 INFO  (coreZkRegister-2973-thread-1-processing-n:127.0.0.1:59323_ x:collection1 s:shard1 c:control_collection r:core_node1) [n:127.0.0.1:59323_ c:control_collection s:shard1 r:core_node1 x:collection1] o.a.s.c.ShardLeaderElectionContext Running the leader process for shard=shard1 and weAreReplacement=false and leaderVoteWait=10000
   [junit4]   2> 795987 INFO  (coreZkRegister-2973-thread-1-processing-n:127.0.0.1:59323_ x:collection1 s:shard1 c:control_collection r:core_node1) [n:127.0.0.1:59323_ c:control_collection s:shard1 r:core_node1 x:collection1] o.a.s.c.ShardLeaderElectionContext Enough replicas found to continue.
   [junit4]   2> 795987 INFO  (coreZkRegister-2973-thread-1-processing-n:127.0.0.1:59323_ x:collection1 s:shard1 c:control_collection r:core_node1) [n:127.0.0.1:59323_ c:control_collection s:shard1 r:core_node1 x:collection1] o.a.s.c.ShardLeaderElectionContext I may be the new leader - try and sync
   [junit4]   2> 795987 INFO  (coreZkRegister-2973-thread-1-processing-n:127.0.0.1:59323_ x:collection1 s:shard1 c:control_collection r:core_node1) [n:127.0.0.1:59323_ c:control_collection s:shard1 r:core_node1 x:collection1] o.a.s.c.SyncStrategy Sync replicas to http://127.0.0.1:59323/collection1/
   [junit4]   2> 795987 INFO  (coreZkRegister-2973-thread-1-processing-n:127.0.0.1:59323_ x:collection1 s:shard1 c:control_collection r:core_node1) [n:127.0.0.1:59323_ c:control_collection s:shard1 r:core_node1 x:collection1] o.a.s.c.SyncStrategy Sync Success - now sync replicas to me
   [junit4]   2> 795987 INFO  (coreZkRegister-2973-thread-1-processing-n:127.0.0.1:59323_ x:collection1 s:shard1 c:control_collection r:core_node1) [n:127.0.0.1:59323_ c:control_collection s:shard1 r:core_node1 x:collection1] o.a.s.c.SyncStrategy http://127.0.0.1:59323/collection1/ has no replicas
   [junit4]   2> 795987 INFO  (OverseerStateUpdate-95386859640782852-127.0.0.1:59323_-n_0000000000) [n:127.0.0.1:59323_    ] o.a.s.c.Overseer processMessage: queueSize: 1, message = {
   [junit4]   2>   "operation":"leader",
   [junit4]   2>   "shard":"shard1",
   [junit4]   2>   "collection":"control_collection"} current state version: 1
   [junit4]   2> 795988 INFO  (coreZkRegister-2973-thread-1-processing-n:127.0.0.1:59323_ x:collection1 s:shard1 c:control_collection r:core_node1) [n:127.0.0.1:59323_ c:control_collection s:shard1 r:core_node1 x:collection1] o.a.s.c.c.SolrZkClient makePath: /collections/control_collection/leaders/shard1
   [junit4]   2> 795991 INFO  (coreZkRegister-2973-thread-1-processing-n:127.0.0.1:59323_ x:collection1 s:shard1 c:control_collection r:core_node1) [n:127.0.0.1:59323_ c:control_collection s:shard1 r:core_node1 x:collection1] o.a.s.c.ShardLeaderElectionContextBase Creating leader registration node
   [junit4]   2> 795997 INFO  (coreZkRegister-2973-thread-1-processing-n:127.0.0.1:59323_ x:collection1 s:shard1 c:control_collection r:core_node1) [n:127.0.0.1:59323_ c:control_collection s:shard1 r:core_node1 x:collection1] o.a.s.c.ShardLeaderElectionContext I am the new leader: http://127.0.0.1:59323/collection1/ shard1
   [junit4]   2> 795997 INFO  (OverseerStateUpdate-95386859640782852-127.0.0.1:59323_-n_0000000000) [n:127.0.0.1:59323_    ] o.a.s.c.Overseer processMessage: queueSize: 1, message = {
   [junit4]   2>   "operation":"leader",
   [junit4]   2>   "shard":"shard1",
   [junit4]   2>   "collection":"control_collection",
   [junit4]   2>   "base_url":"http://127.0.0.1:59323",
   [junit4]   2>   "core":"collection1",
   [junit4]   2>   "state":"active"} current state version: 1
   [junit4]   2> 796099 INFO  (zkCallback-1029-thread-2-processing-n:127.0.0.1:59323_) [n:127.0.0.1:59323_    ] o.a.s.c.c.ZkStateReader A cluster state change: [WatchedEvent state:SyncConnected type:NodeDataChanged path:/clusterstate.json], has occurred - updating... (live nodes size: [1])
   [junit4]   2> 796099 INFO  (zkCallback-1029-thread-3-processing-n:127.0.0.1:59323_) [n:127.0.0.1:59323_    ] o.a.s.c.c.ZkStateReader A cluster state change: [WatchedEvent state:SyncConnected type:NodeDataChanged path:/clusterstate.json], has occurred - updating... (live nodes size: [1])
   [junit4]   2> 796148 INFO  (coreZkRegister-2973-thread-1-processing-n:127.0.0.1:59323_ x:collection1 s:shard1 c:control_collection r:core_node1) [n:127.0.0.1:59323_ c:control_collection s:shard1 r:core_node1 x:collection1] o.a.s.c.ZkController We are http://127.0.0.1:59323/collection1/ and leader is http://127.0.0.1:59323/collection1/
   [junit4]   2> 796148 INFO  (coreZkRegister-2973-thread-1-processing-n:127.0.0.1:59323_ x:collection1 s:shard1 c:control_collection r:core_node1) [n:127.0.0.1:59323_ c:control_collection s:shard1 r:core_node1 x:collection1] o.a.s.c.ZkController No LogReplay needed for core=collection1 baseURL=http://127.0.0.1:59323
   [junit4]   2> 796148 INFO  (coreZkRegister-2973-thread-1-processing-n:127.0.0.1:59323_ x:collection1 s:shard1 c:control_collection r:core_node1) [n:127.0.0.1:59323_ c:control_collection s:shard1 r:core_node1 x:collection1] o.a.s.c.ZkController I am the leader, no recovery necessary
   [junit4]   2> 796148 INFO  (coreZkRegister-2973-thread-1-processing-n:127.0.0.1:59323_ x:collection1 s:shard1 c:control_collection r:core_node1) [n:127.0.0.1:59323_ c:control_collection s:shard1 r:core_node1 x:collection1] o.a.s.c.ZkController publishing state=active
   [junit4]   2> 796148 INFO  (coreZkRegister-2973-thread-1-processing-n:127.0.0.1:59323_ x:collection1 s:shard1 c:control_collection r:core_node1) [n:127.0.0.1:59323_ c:control_collection s:shard1 r:core_node1 x:collection1] o.a.s.c.ZkController numShards not found on descriptor - reading it from system property
   [junit4]   2> 796154 INFO  (OverseerStateUpdate-95386859640782852-127.0.0.1:59323_-n_0000000000) [n:127.0.0.1:59323_    ] o.a.s.c.Overseer processMessage: queueSize: 1, message = {
   [junit4]   2>   "core":"collection1",
   [junit4]   2>   "core_node_name":"core_node1",
   [junit4]   2>   "roles":null,
   [junit4]   2>   "base_url":"http://127.0.0.1:59323",
   [junit4]   2>   "node_name":"127.0.0.1:59323_",
   [junit4]   2>   "numShards":"1",
   [junit4]   2>   "state":"active",
   [junit4]   2>   "shard":"shard1",
   [junit4]   2>   "collection":"control_collection",
   [junit4]   2>   "operation":"state"} current state version: 2
   [junit4]   2> 796154 INFO  (OverseerStateUpdate-95386859640782852-127.0.0.1:59323_-n_0000000000) [n:127.0.0.1:59323_    ] o.a.s.c.o.ReplicaMutator Update state numShards=1 message={
   [junit4]   2>   "core":"collection1",
   [junit4]   2>   "core_node_name":"core_node1",
   [junit4]   2>   "roles":null,
   [junit4]   2>   "base_url":"http://127.0.0.1:59323",
   [junit4]   2>   "node_name":"127.0.0.1:59323_",
   [junit4]   2>   "numShards":"1",
   [junit4]   2>   "state":"active",
   [junit4]   2>   "shard":"shard1",
   [junit4]   2>   "collection":"control_collection",
   [junit4]   2>   "operation":"state"}
   [junit4]   2> 796258 INFO  (zkCallback-1029-thread-3-processing-n:127.0.0.1:59323_) [n:127.0.0.1:59323_    ] o.a.s.c.c.ZkStateReader A cluster state change: [WatchedEvent state:SyncConnected type:NodeDataChanged path:/clusterstate.json], has occurred - updating... (live nodes size: [1])
   [junit4]   2> 796259 INFO  (zkCallback-1029-thread-2-processing-n:127.0.0.1:59323_) [n:127.0.0.1:59323_    ] o.a.s.c.c.ZkStateReader A cluster state change: [WatchedEvent state:SyncConnected type:NodeDataChanged path:/clusterstate.json], has occurred - updating... (live nodes size: [1])
   [junit4]   2> 796273 INFO  (TEST-TestDynamicLoading.testDynamicLoading-seed#[C3CEC20D07226EA3]) [    ] o.a.s.c.c.SolrZkClient Using default ZkCredentialsProvider
   [junit4]   2> 796275 INFO  (TEST-TestDynamicLoading.testDynamicLoading-seed#[C3CEC20D07226EA3]) [    ] o.a.s.c.c.ConnectionManager Waiting for client to connect to ZooKeeper
   [junit4]   2> 796275 INFO  (zkCallback-1031-thread-1) [    ] o.a.s.c.c.ConnectionManager Watcher org.apache.solr.common.cloud.ConnectionManager@7485c78e name:ZooKeeperConnection Watcher:127.0.0.1:54749/solr got event WatchedEvent state:SyncConnected type:None path:null path:null type:None
   [junit4]   2> 796275 INFO  (TEST-TestDynamicLoading.testDynamicLoading-seed#[C3CEC20D07226EA3]) [    ] o.a.s.c.c.ConnectionManager Client is connected to ZooKeeper
   [junit4]   2> 796275 INFO  (TEST-TestDynamicLoading.testDynamicLoading-seed#[C3CEC20D07226EA3]) [    ] o.a.s.c.c.SolrZkClient Using default ZkACLProvider
   [junit4]   2> 796275 INFO  (TEST-TestDynamicLoading.testDynamicLoading-seed#[C3CEC20D07226EA3]) [    ] o.a.s.c.c.ZkStateReader Updating cluster state from ZooKeeper... 
   [junit4]   2> 796278 INFO  (TEST-TestDynamicLoading.testDynamicLoading-seed#[C3CEC20D07226EA3]) [    ] o.a.s.c.ChaosMonkey monkey: init - expire sessions:false cause connection loss:false
   [junit4]   2> 796389 INFO  (TEST-TestDynamicLoading.testDynamicLoading-seed#[C3CEC20D07226EA3]) [    ] o.a.s.SolrTestCaseJ4 Writing core.properties file to /x1/jenkins/jenkins-slave/workspace/Lucene-Solr-Tests-trunk-Java8/solr/build/solr-core/test/J2/temp/solr.core.TestDynamicLoading_C3CEC20D07226EA3-001/shard-1-001/cores/collection1
   [junit4]   2> 796390 INFO  (TEST-TestDynamicLoading.testDynamicLoading-seed#[C3CEC20D07226EA3]) [    ] o.a.s.c.AbstractFullDistribZkTestBase create jetty 1 in directory /x1/jenkins/jenkins-slave/workspace/Lucene-Solr-Tests-trunk-Java8/solr/build/solr-core/test/J2/temp/solr.core.TestDynamicLoading_C3CEC20D07226EA3-001/shard-1-001
   [junit4]   2> 796390 INFO  (TEST-TestDynamicLoading.testDynamicLoading-seed#[C3CEC20D07226EA3]) [    ] o.e.j.s.Server jetty-9.2.13.v20150730
   [junit4]   2> 796392 INFO  (TEST-TestDynamicLoading.testDynamicLoading-seed#[C3CEC20D07226EA3]) [    ] o.e.j.s.h.ContextHandler Started o.e.j.s.ServletContextHandler@2f12e9ff{/,null,AVAILABLE}
   [junit4]   2> 796393 INFO  (TEST-TestDynamicLoading.testDynamicLoading-seed#[C3CEC20D07226EA3]) [    ] o.e.j.s.ServerConnector Started ServerConnector@7bc1fb03{HTTP/1.1}{127.0.0.1:59834}
   [junit4]   2> 796393 INFO  (TEST-TestDynamicLoading.testDynamicLoading-seed#[C3CEC20D07226EA3]) [    ] o.e.j.s.Server Started @799804ms
   [junit4]   2> 796393 INFO  (TEST-TestDynamicLoading.testDynamicLoading-seed#[C3CEC20D07226EA3]) [    ] o.a.s.c.s.e.JettySolrRunner Jetty properties: {solr.data.dir=/x1/jenkins/jenkins-slave/workspace/Lucene-Solr-Tests-trunk-Java8/solr/build/solr-core/test/J2/temp/solr.core.TestDynamicLoading_C3CEC20D07226EA3-001/tempDir-001/jetty1, solrconfig=solrconfig.xml, hostContext=/, hostPort=59834, coreRootDirectory=/x1/jenkins/jenkins-slave/workspace/Lucene-Solr-Tests-trunk-Java8/solr/build/solr-core/test/J2/temp/solr.core.TestDynamicLoading_C3CEC20D07226EA3-001/shard-1-001/cores}
   [junit4]   2> 796393 INFO  (TEST-TestDynamicLoading.testDynamicLoading-seed#[C3CEC20D07226EA3]) [    ] o.a.s.s.SolrDispatchFilter SolrDispatchFilter.init(): sun.misc.Launcher$AppClassLoader@4e0e2f2a
   [junit4]   2> 796393 INFO  (TEST-TestDynamicLoading.testDynamicLoading-seed#[C3CEC20D07226EA3]) [    ] o.a.s.c.SolrResourceLoader new SolrResourceLoader for directory: '/x1/jenkins/jenkins-slave/workspace/Lucene-Solr-Tests-trunk-Java8/solr/build/solr-core/test/J2/temp/solr.core.TestDynamicLoading_C3CEC20D07226EA3-001/shard-1-001'
   [junit4]   2> 796393 INFO  (TEST-TestDynamicLoading.testDynamicLoading-seed#[C3CEC20D07226EA3]) [    ] o.a.s.c.SolrResourceLoader JNDI not configured for solr (NoInitialContextEx)
   [junit4]   2> 796393 INFO  (TEST-TestDynamicLoading.testDynamicLoading-seed#[C3CEC20D07226EA3]) [    ] o.a.s.c.SolrResourceLoader solr home defaulted to 'solr/' (could not find system property or JNDI)
   [junit4]   2> 796394 INFO  (TEST-TestDynamicLoading.testDynamicLoading-seed#[C3CEC20D07226EA3]) [    ] o.a.s.c.c.SolrZkClient Using default ZkCredentialsProvider
   [junit4]   2> 796395 INFO  (TEST-TestDynamicLoading.testDynamicLoading-seed#[C3CEC20D07226EA3]) [    ] o.a.s.c.c.ConnectionManager Waiting for client to connect to ZooKeeper
   [junit4]   2> 796395 INFO  (zkCallback-1032-thread-1) [    ] o.a.s.c.c.ConnectionManager Watcher org.apache.solr.common.cloud.ConnectionManager@24f919d1 name:ZooKeeperConnection Watcher:127.0.0.1:54749/solr got event WatchedEvent state:SyncConnected type:None path:null path:null type:None
   [junit4]   2> 796395 INFO  (TEST-TestDynamicLoading.testDynamicLoading-seed#[C3CEC20D07226EA3]) [    ] o.a.s.c.c.ConnectionManager Client is connected to ZooKeeper
   [junit4]   2> 796396 INFO  (TEST-TestDynamicLoading.testDynamicLoading-seed#[C3CEC20D07226EA3]) [    ] o.a.s.c.c.SolrZkClient Using default ZkACLProvider
   [junit4]   2> 796397 INFO  (TEST-TestDynamicLoading.testDynamicLoading-seed#[C3CEC20D07226EA3]) [    ] o.a.s.s.SolrDispatchFilter Loading solr.xml from SolrHome (not found in ZooKeeper)
   [junit4]   2> 796397 INFO  (TEST-TestDynamicLoading.testDynamicLoading-seed#[C3CEC20D07226EA3]) [    ] o.a.s.c.SolrXmlConfig Loading container configuration from /x1/jenkins/jenkins-slave/workspace/Lucene-Solr-Tests-trunk-Java8/solr/build/solr-core/test/J2/temp/solr.core.TestDynamicLoading_C3CEC20D07226EA3-001/shard-1-001/solr.xml
   [junit4]   2> 796401 INFO  (TEST-TestDynamicLoading.testDynamicLoading-seed#[C3CEC20D07226EA3]) [    ] o.a.s.c.CorePropertiesLocator Config-defined core root directory: /x1/jenkins/jenkins-slave/workspace/Lucene-Solr-Tests-trunk-Java8/solr/build/solr-core/test/J2/temp/solr.core.TestDynamicLoading_C3CEC20D07226EA3-001/shard-1-001/cores
   [junit4]   2> 796401 INFO  (TEST-TestDynamicLoading.testDynamicLoading-seed#[C3CEC20D07226EA3]) [    ] o.a.s.c.CoreContainer New CoreContainer 166345510
   [junit4]   2> 796402 INFO  (TEST-TestDynamicLoading.testDynamicLoading-seed#[C3CEC20D07226EA3]) [    ] o.a.s.c.CoreContainer Loading cores into CoreContainer [instanceDir=/x1/jenkins/jenkins-slave/workspace/Lucene-Solr-Tests-trunk-Java8/solr/build/solr-core/test/J2/temp/solr.core.TestDynamicLoading_C3CEC20D07226EA3-001/shard-1-001]
   [junit4]   2> 796402 WARN  (TEST-TestDynamicLoading.testDynamicLoading-seed#[C3CEC20D07226EA3]) [    ] o.a.s.c.CoreContainer Couldn't add files from /x1/jenkins/jenkins-slave/workspace/Lucene-Solr-Tests-trunk-Java8/solr/build/solr-core/test/J2/temp/solr.core.TestDynamicLoading_C3CEC20D07226EA3-001/shard-1-001/lib to classpath: /x1/jenkins/jenkins-slave/workspace/Lucene-Solr-Tests-trunk-Java8/solr/build/solr-core/test/J2/temp/solr.core.TestDynamicLoading_C3CEC20D07226EA3-001/shard-1-001/lib
   [junit4]   2> 796402 INFO  (TEST-TestDynamicLoading.testDynamicLoading-seed#[C3CEC20D07226EA3]) [    ] o.a.s.h.c.HttpShardHandlerFactory created with socketTimeout : 90000,urlScheme : ,connTimeout : 15000,maxConnectionsPerHost : 20,maxConnections : 10000,corePoolSize : 0,maximumPoolSize : 2147483647,maxThreadIdleTime : 5,sizeOfQueue : -1,fairnessPolicy : false,useRetries : false,
   [junit4]   2> 796404 INFO  (TEST-TestDynamicLoading.testDynamicLoading-seed#[C3CEC20D07226EA3]) [    ] o.a.s.u.UpdateShardHandler Creating UpdateShardHandler HTTP client with params: socketTimeout=340000&connTimeout=45000&retry=true
   [junit4]   2> 796404 INFO  (TEST-TestDynamicLoading.testDynamicLoading-seed#[C3CEC20D07226EA3]) [    ] o.a.s.l.LogWatcher SLF4J impl is org.slf4j.impl.Log4jLoggerFactory
   [junit4]   2> 796404 INFO  (TEST-TestDynamicLoading.testDynamicLoading-seed#[C3CEC20D07226EA3]) [    ] o.a.s.l.LogWatcher Registering Log Listener [Log4j (org.slf4j.impl.Log4jLoggerFactory)]
   [junit4]   2> 796404 INFO  (TEST-TestDynamicLoading.testDynamicLoading-seed#[C3CEC20D07226EA3]) [    ] o.a.s.c.ZkContainer Zookeeper client=127.0.0.1:54749/solr
   [junit4]   2> 796404 INFO  (TEST-TestDynamicLoading.testDynamicLoading-seed#[C3CEC20D07226EA3]) [    ] o.a.s.c.ZkController zkHost includes chroot
   [junit4]   2> 796405 INFO  (TEST-TestDynamicLoading.testDynamicLoading-seed#[C3CEC20D07226EA3]) [    ] o.a.s.c.c.SolrZkClient Using default ZkCredentialsProvider
   [junit4]   2> 796405 INFO  (TEST-TestDynamicLoading.testDynamicLoading-seed#[C3CEC20D07226EA3]) [    ] o.a.s.c.c.ConnectionManager Waiting for client to connect to ZooKeeper
   [junit4]   2> 796406 INFO  (zkCallback-1035-thread-1) [    ] o.a.s.c.c.ConnectionManager Watcher org.apache.solr.common.cloud.ConnectionManager@2e01697f name:ZooKeeperConnection Watcher:127.0.0.1:54749 got event WatchedEvent state:SyncConnected type:None path:null path:null type:None
   [junit4]   2> 796406 INFO  (TEST-TestDynamicLoading.testDynamicLoading-seed#[C3CEC20D07226EA3]) [    ] o.a.s.c.c.ConnectionManager Client is connected to ZooKeeper
   [junit4]   2> 796406 INFO  (TEST-TestDynamicLoading.testDynamicLoading-seed#[C3CEC20D07226EA3]) [    ] o.a.s.c.c.SolrZkClient Using default ZkACLProvider
   [junit4]   2> 796408 INFO  (TEST-TestDynamicLoading.testDynamicLoading-seed#[C3CEC20D07226EA3]) [n:127.0.0.1:59834_    ] o.a.s.c.c.ConnectionManager Waiting for client to connect to ZooKeeper
   [junit4]   2> 796421 INFO  (zkCallback-1036-thread-1-processing-n:127.0.0.1:59834_) [n:127.0.0.1:59834_    ] o.a.s.c.c.ConnectionManager Watcher org.apache.solr.common.cloud.ConnectionManager@4f248556 name:ZooKeeperConnection Watcher:127.0.0.1:54749/solr got event WatchedEvent state:SyncConnected type:None path:null path:null type:None
   [junit4]   2> 796421 INFO  (TEST-TestDynamicLoading.testDynamicLoading-seed#[C3CEC20D07226EA3]) [n:127.0.0.1:59834_    ] o.a.s.c.c.ConnectionManager Client is connected to ZooKeeper
   [junit4]   2> 796425 INFO  (TEST-TestDynamicLoading.testDynamicLoading-seed#[C3CEC20D07226EA3]) [n:127.0.0.1:59834_    ] o.a.s.c.c.ZkStateReader Updating cluster state from ZooKeeper... 
   [junit4]   2> 797431 INFO  (TEST-TestDynamicLoading.testDynamicLoading-seed#[C3CEC20D07226EA3]) [n:127.0.0.1:59834_    ] o.a.s.c.ZkController Register node as live in ZooKeeper:/live_nodes/127.0.0.1:59834_
   [junit4]   2> 797431 INFO  (TEST-TestDynamicLoading.testDynamicLoading-seed#[C3CEC20D07226EA3]) [n:127.0.0.1:59834_    ] o.a.s.c.c.SolrZkClient makePath: /live_nodes/127.0.0.1:59834_
   [junit4]   2> 797432 INFO  (zkCallback-1029-thread-3-processing-n:127.0.0.1:59323_) [n:127.0.0.1:59323_    ] o.a.s.c.c.ZkStateReader A live node change: [WatchedEvent state:SyncConnected type:NodeChildrenChanged path:/live_nodes], has occurred - updating... (live nodes size: [1])
   [junit4]   2> 797432 INFO  (zkCallback-1029-thread-2-processing-n:127.0.0.1:59323_) [n:127.0.0.1:59323_    ] o.a.s.c.c.ZkStateReader A live node change: [WatchedEvent state:SyncConnected type:NodeChildrenChanged path:/live_nodes], has occurred - updating... (live nodes size: [1])
   [junit4]   2> 797432 INFO  (zkCallback-1031-thread-1) [    ] o.a.s.c.c.ZkStateReader A live node change: [WatchedEvent state:SyncConnected type:NodeChildrenChanged path:/live_nodes], has occurred - updating... (live nodes size: [1])
   [junit4]   2> 797432 INFO  (zkCallback-1036-thread-1-processing-n:127.0.0.1:59834_) [n:127.0.0.1:59834_    ] o.a.s.c.c.ZkStateReader A live node change: [WatchedEvent state:SyncConnected type:NodeChildrenChanged path:/live_nodes], has occurred - updating... (live nodes size: [1])
   [junit4]   2> 797433 INFO  (TEST-TestDynamicLoading.testDynamicLoading-seed#[C3CEC20D07226EA3]) [n:127.0.0.1:59834_    ] o.a.s.c.Overseer Overseer (id=null) closing
   [junit4]   2> 797433 INFO  (TEST-TestDynamicLoading.testDynamicLoading-seed#[C3CEC20D07226EA3]) [n:127.0.0.1:59834_    ] o.a.s.c.LeaderElector Joined leadership election with path: /overseer_elect/election/95386859640782856-127.0.0.1:59834_-n_0000000001
   [junit4]   2> 797434 INFO  (TEST-TestDynamicLoading.testDynamicLoading-seed#[C3CEC20D07226EA3]) [n:127.0.0.1:59834_    ] o.a.s.c.LeaderElector Watching path /overseer_elect/election/95386859640782852-127.0.0.1:59323_-n_0000000000 to know if I could be the leader
   [junit4]   2> 797450 INFO  (TEST-TestDynamicLoading.testDynamicLoading-seed#[C3CEC20D07226EA3]) [n:127.0.0.1:59834_    ] o.a.s.c.CoreContainer Security conf doesn't exist. Skipping setup for authorization module.
   [junit4]   2> 797450 INFO  (TEST-TestDynamicLoading.testDynamicLoading-seed#[C3CEC20D07226EA3]) [n:127.0.0.1:59834_    ] o.a.s.c.CoreContainer No authentication plugin used.
   [junit4]   2> 797451 INFO  (TEST-TestDynamicLoading.testDynamicLoading-seed#[C3CEC20D07226EA3]) [n:127.0.0.1:59834_    ] o.a.s.c.CorePropertiesLocator Looking for core definitions underneath /x1/jenkins/jenkins-slave/workspace/Lucene-Solr-Tests-trunk-Java8/solr/build/solr-core/test/J2/temp/solr.core.TestDynamicLoading_C3CEC20D07226EA3-001/shard-1-001/cores
   [junit4]   2> 797452 INFO  (TEST-TestDynamicLoading.testDynamicLoading-seed#[C3CEC20D07226EA3]) [n:127.0.0.1:59834_    ] o.a.s.c.CoreDescriptor Created CoreDescriptor: {name=collection1, config=solrconfig.xml, transient=false, schema=schema.xml, loadOnStartup=true, configSetProperties=configsetprops.json, collection=collection1, coreNodeName=, dataDir=data/, shard=}
   [junit4]   2> 797452 INFO  (TEST-TestDynamicLoading.testDynamicLoading-seed#[C3CEC20D07226EA3]) [n:127.0.0.1:59834_    ] o.a.s.c.CorePropertiesLocator Found core collection1 in /x1/jenkins/jenkins-slave/workspace/Lucene-Solr-Tests-trunk-Java8/solr/build/solr-core/test/J2/temp/solr.core.TestDynamicLoading_C3CEC20D07226EA3-001/shard-1-001/cores/collection1
   [junit4]   2> 797452 INFO  (TEST-TestDynamicLoading.testDynamicLoading-seed#[C3CEC20D07226EA3]) [n:127.0.0.1:59834_    ] o.a.s.c.CorePropertiesLocator Found 1 core definitions
   [junit4]   2> 797453 INFO  (coreLoadExecutor-2990-thread-1-processing-n:127.0.0.1:59834_) [n:127.0.0.1:59834_ c:collection1   x:collection1] o.a.s.c.ZkController publishing state=down
   [junit4]   2> 797453 INFO  (coreLoadExecutor-2990-thread-1-processing-n:127.0.0.1:59834_) [n:127.0.0.1:59834_ c:collection1   x:collection1] o.a.s.c.ZkController numShards not found on descriptor - reading it from system property
   [junit4]   2> 797455 INFO  (coreLoadExecutor-2990-thread-1-processing-n:127.0.0.1:59834_) [n:127.0.0.1:59834_ c:collection1   x:collection1] o.a.s.c.ZkController look for our core node name
   [junit4]   2> 797455 INFO  (OverseerStateUpdate-95386859640782852-127.0.0.1:59323_-n_0000000000) [n:127.0.0.1:59323_    ] o.a.s.c.Overseer processMessage: queueSize: 1, message = {
   [junit4]   2>   "core":"collection1",
   [junit4]   2>   "roles":null,
   [junit4]   2>   "base_url":"http://127.0.0.1:59834",
   [junit4]   2>   "node_name":"127.0.0.1:59834_",
   [junit4]   2>   "numShards":"2",
   [junit4]   2>   "state":"down",
   [junit4]   2>   "shard":null,
   [junit4]   2>   "collection":"collection1",
   [junit4]   2>   "operation":"state"} current state version: 3
   [junit4]   2> 797456 INFO  (OverseerStateUpdate-95386859640782852-127.0.0.1:59323_-n_0000000000) [n:127.0.0.1:59323_    ] o.a.s.c.o.ReplicaMutator Update state numShards=2 message={
   [junit4]   2>   "core":"collection1",
   [junit4]   2>   "roles":null,
   [junit4]   2>   "base_url":"http://127.0.0.1:59834",
   [junit4]   2>   "node_name":"127.0.0.1:59834_",
   [junit4]   2>   "numShards":"2",
   [junit4]   2>   "state":"down",
   [junit4]   2>   "shard":null,
   [junit4]   2>   "collection":"collection1",
   [junit4]   2>   "operation":"state"}
   [junit4]   2> 797456 INFO  (OverseerStateUpdate-95386859640782852-127.0.0.1:59323_-n_0000000000) [n:127.0.0.1:59323_    ] o.a.s.c.o.ClusterStateMutator building a new cName: collection1
   [junit4]   2> 797456 INFO  (OverseerStateUpdate-95386859640782852-127.0.0.1:59323_-n_0000000000) [n:127.0.0.1:59323_    ] o.a.s.c.o.ReplicaMutator Assigning new node to shard shard=shard2
   [junit4]   2> 797460 INFO  (TEST-TestDynamicLoading.testDynamicLoading-seed#[C3CEC20D07226EA3]) [n:127.0.0.1:59834_    ] o.a.s.s.SolrDispatchFilter user.dir=/x1/jenkins/jenkins-slave/workspace/Lucene-Solr-Tests-trunk-Java8/solr/build/solr-core/test/J2
   [junit4]   2> 797460 INFO  (TEST-TestDynamicLoading.testDynamicLoading-seed#[C3CEC20D07226EA3]) [n:127.0.0.1:59834_    ] o.a.s.s.SolrDispatchFilter SolrDispatchFilter.init() done
   [junit4]   2> 797558 INFO  (zkCallback-1031-thread-1) [    ] o.a.s.c.c.ZkStateReader A cluster state change: [WatchedEvent state:SyncConnected type:NodeDataChanged path:/clusterstate.json], has occurred - updating... (live nodes size: [2])
   [junit4]   2> 797558 INFO  (zkCallback-1036-thread-1-processing-n:127.0.0.1:59834_) [n:127.0.0.1:59834_    ] o.a.s.c.c.ZkStateReader A cluster state change: [WatchedEvent state:SyncConnected type:NodeDataChanged path:/clusterstate.json], has occurred - updating... (live nodes size: [2])
   [junit4]   2> 797558 INFO  (zkCallback-1029-thread-2-processing-n:127.0.0.1:59323_) [n:127.0.0.1:59323_    ] o.a.s.c.c.ZkStateReader A cluster state change: [WatchedEvent state:SyncConnected type:NodeDataChanged path:/clusterstate.json], has occurred - updating... (live nodes size: [2])
   [junit4]   2> 797559 INFO  (zkCallback-1029-thread-3-processing-n:127.0.0.1:59323_) [n:127.0.0.1:59323_    ] o.a.s.c.c.ZkStateReader A cluster state change: [WatchedEvent state:SyncConnected type:NodeDataChanged path:/clusterstate.json], has occurred - updating... (live nodes size: [2])
   [junit4]   2> 798456 INFO  (coreLoadExecutor-2990-thread-1-processing-n:127.0.0.1:59834_) [n:127.0.0.1:59834_ c:collection1   x:collection1] o.a.s.c.ZkController waiting to find shard id in clusterstate for collection1
   [junit4]   2> 798456 INFO  (coreLoadExecutor-2990-thread-1-processing-n:127.0.0.1:59834_) [n:127.0.0.1:59834_ c:collection1   x:collection1] o.a.s.c.ZkController Check for collection zkNode:collection1
   [junit4]   2> 798456 INFO  (coreLoadExecutor-2990-thread-1-processing-n:127.0.0.1:59834_) [n:127.0.0.1:59834_ c:collection1   x:collection1] o.a.s.c.ZkController Collection zkNode exists
   [junit4]   2> 798456 INFO  (coreLoadExecutor-2990-thread-1-processing-n:127.0.0.1:59834_) [n:127.0.0.1:59834_ c:collection1   x:collection1] o.a.s.c.c.ZkStateReader Load collection config from: [/collections/collection1]
   [junit4]   2> 798457 INFO  (coreLoadExecutor-2990-thread-1-processing-n:127.0.0.1:59834_) [n:127.0.0.1:59834_ c:collection1   x:collection1] o.a.s.c.c.ZkStateReader path=[/collections/collection1] [configName]=[conf1] specified config exists in ZooKeeper
   [junit4]   2> 798457 INFO  (coreLoadExecutor-2990-thread-1-processing-n:127.0.0.1:59834_) [n:127.0.0.1:59834_ c:collection1   x:collection1] o.a.s.c.SolrResourceLoader new SolrResourceLoader for directory: '/x1/jenkins/jenkins-slave/workspace/Lucene-Solr-Tests-trunk-Java8/solr/build/solr-core/test/J2/temp/solr.core.TestDynamicLoading_C3CEC20D07226EA3-001/shard-1-001/cores/collection1'
   [junit4]   2> 798457 INFO  (coreLoadExecutor-2990-thread-1-processing-n:127.0.0.1:59834_) [n:127.0.0.1:59834_ c:collection1   x:collection1] o.a.s.c.SolrResourceLoader JNDI not configured for solr (NoInitialContextEx)
   [junit4]   2> 798457 INFO  (coreLoadExecutor-2990-thread-1-processing-n:127.0.0.1:59834_) [n:127.0.0.1:59834_ c:collection1   x:collection1] o.a.s.c.SolrResourceLoader solr home defaulted to 'solr/' (could not find system property or JNDI)
   [junit4]   2> 798459 INFO  (coreLoadExecutor-2990-thread-1-processing-n:127.0.0.1:59834_) [n:127.0.0.1:59834_ c:collection1   x:collection1] o.a.s.c.Config loaded config solrconfig.xml with version 0 
   [junit4]   2> 798467 INFO  (coreLoadExecutor-2990-thread-1-processing-n:127.0.0.1:59834_) [n:127.0.0.1:59834_ c:collection1   x:collection1] o.a.s.c.SolrConfig current version of requestparams : -1
   [junit4]   2> 798470 INFO  (coreLoadExecutor-2990-thread-1-processing-n:127.0.0.1:59834_) [n:127.0.0.1:59834_ c:collection1   x:collection1] o.a.s.c.SolrConfig Using Lucene MatchVersion: 6.0.0
   [junit4]   2> 798479 INFO  (coreLoadExecutor-2990-thread-1-processing-n:127.0.0.1:59834_) [n:127.0.0.1:59834_ c:collection1   x:collection1] o.a.s.c.SolrConfig Loaded SolrConfig: solrconfig.xml
   [junit4]   2> 798484 INFO  (coreLoadExecutor-2990-thread-1-processing-n:127.0.0.1:59834_) [n:127.0.0.1:59834_ c:collection1   x:collection1] o.a.s.s.IndexSchema [collection1] Schema name=test
   [junit4]   2> 798576 INFO  (coreLoadExecutor-2990-thread-1-processing-n:127.0.0.1:59834_) [n:127.0.0.1:59834_ c:collection1   x:collection1] o.a.s.s.OpenExchangeRatesOrgProvider Initialized with rates=open-exchange-rates.json, refreshInterval=1440.
   [junit4]   2> 798581 INFO  (coreLoadExecutor-2990-thread-1-processing-n:127.0.0.1:59834_) [n:127.0.0.1:59834_ c:collection1   x:collection1] o.a.s.s.IndexSchema default search field in schema is text
   [junit4]   2> 798582 INFO  (coreLoadExecutor-2990-thread-1-processing-n:127.0.0.1:59834_) [n:127.0.0.1:59834_ c:collection1   x:collection1] o.a.s.s.IndexSchema unique key field: id
   [junit4]   2> 798591 INFO  (coreLoadExecutor-2990-thread-1-processing-n:127.0.0.1:59834_) [n:127.0.0.1:59834_ c:collection1   x:collection1] o.a.s.s.FileExchangeRateProvider Reloading exchange rates from file currency.xml
   [junit4]   2> 798593 INFO  (coreLoadExecutor-2990-thread-1-processing-n:127.0.0.1:59834_) [n:127.0.0.1:59834_ c:collection1   x:collection1] o.a.s.s.FileExchangeRateProvider Reloading exchange rates from file currency.xml
   [junit4]   2> 798595 INFO  (coreLoadExecutor-2990-thread-1-processing-n:127.0.0.1:59834_) [n:127.0.0.1:59834_ c:collection1   x:collection1] o.a.s.s.OpenExchangeRatesOrgProvider Reloading exchange rates from open-exchange-rates.json
   [junit4]   2> 798595 INFO  (coreLoadExecutor-2990-thread-1-processing-n:127.0.0.1:59834_) [n:127.0.0.1:59834_ c:collection1   x:collection1] o.a.s.s.OpenExchangeRatesOrgProvider Reloading exchange rates from open-exchange-rates.json
   [junit4]   2> 798597 INFO  (coreLoadExecutor-2990-thread-1-processing-n:127.0.0.1:59834_) [n:127.0.0.1:59834_ c:collection1   x:collection1] o.a.s.c.ConfigSetProperties Did not find ConfigSet properties, assuming default properties: Can't find resource 'configsetprops.json' in classpath or '/configs/conf1', cwd=/x1/jenkins/jenkins-slave/workspace/Lucene-Solr-Tests-trunk-Java8/solr/build/solr-core/test/J2
   [junit4]   2> 798597 INFO  (coreLoadExecutor-2990-thread-1-processing-n:127.0.0.1:59834_) [n:127.0.0.1:59834_ c:collection1   x:collection1] o.a.s.c.CoreContainer Creating SolrCore 'collection1' using configuration from collection collection1
   [junit4]   2> 798597 INFO  (coreLoadExecutor-2990-thread-1-processing-n:127.0.0.1:59834_) [n:127.0.0.1:59834_ c:collection1 s:shard2 r:core_node1 x:collection1] o.a.s.c.SolrCore org.apache.solr.core.MockDirectoryFactory
   [junit4]   2> 798597 INFO  (coreLoadExecutor-2990-thread-1-processing-n:127.0.0.1:59834_) [n:127.0.0.1:59834_ c:collection1 s:shard2 r:core_node1 x:collection1] o.a.s.c.SolrCore [[collection1] ] Opening new SolrCore at [/x1/jenkins/jenkins-slave/workspace/Lucene-Solr-Tests-trunk-Java8/solr/build/solr-core/test/J2/temp/solr.core.TestDynamicLoading_C3CEC20D07226EA3-001/shard-1-001/cores/collection1], dataDir=[/x1/jenkins/jenkins-slave/workspace/Lucene-Solr-Tests-trunk-Java8/solr/build/solr-core/test/J2/temp/solr.core.TestDynamicLoading_C3CEC20D07226EA3-001/shard-1-001/cores/collection1/data/]
   [junit4]   2> 798598 INFO  (coreLoadExecutor-2990-thread-1-processing-n:127.0.0.1:59834_) [n:127.0.0.1:59834_ c:collection1 s:shard2 r:core_node1 x:collection1] o.a.s.c.JmxMonitoredMap JMX monitoring is enabled. Adding Solr mbeans to JMX Server: com.sun.jmx.mbeanserver.JmxMBeanServer@10fe64f3
   [junit4]   2> 798598 INFO  (coreLoadExecutor-2990-thread-1-processing-n:127.0.0.1:59834_) [n:127.0.0.1:59834_ c:collection1 s:shard2 r:core_node1 x:collection1] o.a.s.c.CachingDirectoryFactory return new directory for /x1/jenkins/jenkins-slave/workspace/Lucene-Solr-Tests-trunk-Java8/solr/build/solr-core/test/J2/temp/solr.core.TestDynamicLoading_C3CEC20D07226EA3-001/shard-1-001/cores/collection1/data
   [junit4]   2> 798598 INFO  (coreLoadExecutor-2990-thread-1-processing-n:127.0.0.1:59834_) [n:127.0.0.1:59834_ c:collection1 s:shard2 r:core_node1 x:collection1] o.a.s.c.SolrCore New index directory detected: old=null new=/x1/jenkins/jenkins-slave/workspace/Lucene-Solr-Tests-trunk-Java8/solr/build/solr-core/test/J2/temp/solr.core.TestDynamicLoading_C3CEC20D07226EA3-001/shard-1-001/cores/collection1/data/index/
   [junit4]   2> 798598 WARN  (coreLoadExecutor-2990-thread-1-processing-n:127.0.0.1:59834_) [n:127.0.0.1:59834_ c:collection1 s:shard2 r:core_node1 x:collection1] o.a.s.c.SolrCore [collection1] Solr index directory '/x1/jenkins/jenkins-slave/workspace/Lucene-Solr-Tests-trunk-Java8/solr/build/solr-core/test/J2/temp/solr.core.TestDynamicLoading_C3CEC20D07226EA3-001/shard-1-001/cores/collection1/data/index' doesn't exist. Creating new index...
   [junit4]   2> 798599 INFO  (coreLoadExecutor-2990-thread-1-processing-n:127.0.0.1:59834_) [n:127.0.0.1:59834_ c:collection1 s:shard2 r:core_node1 x:collection1] o.a.s.c.CachingDirectoryFactory return new directory for /x1/jenkins/jenkins-slave/workspace/Lucene-Solr-Tests-trunk-Java8/solr/build/solr-core/test/J2/temp/solr.core.TestDynamicLoading_C3CEC20D07226EA3-001/shard-1-001/cores/collection1/data/index
   [junit4]   2> 798599 INFO  (coreLoadExecutor-2990-thread-1-processing-n:127.0.0.1:59834_) [n:127.0.0.1:59834_ c:collection1 s:shard2 r:core_node1 x:collection1] o.a.s.u.RandomMergePolicy RandomMergePolicy wrapping class org.apache.lucene.index.TieredMergePolicy: [TieredMergePolicy: maxMergeAtOnce=50, maxMergeAtOnceExplicit=11, maxMergedSegmentMB=32.9208984375, floorSegmentMB=0.689453125, forceMergeDeletesPctAllowed=13.0907814780921, segmentsPerTier=15.0, maxCFSSegmentSizeMB=8.796093022207999E12, noCFSRatio=0.525548860792068
   [junit4]   2> 798599 INFO  (coreLoadExecutor-2990-thread-1-processing-n:127.0.0.1:59834_) [n:127.0.0.1:59834_ c:collection1 s:shard2 r:core_node1 x:collection1] o.a.s.c.SolrDeletionPolicy SolrDeletionPolicy.onCommit: commits: num=1
   [junit4]   2> 	commit{dir=MockDirectoryWrapper(RAMDirectory@e1f85ed lockFactory=org.apache.lucene.store.SingleInstanceLockFactory@75f62d12),segFN=segments_1,generation=1}
   [junit4]   2> 798599 INFO  (coreLoadExecutor-2990-thread-1-processing-n:127.0.0.1:59834_) [n:127.0.0.1:59834_ c:collection1 s:shard2 r:core_node1 x:collection1] o.a.s.c.SolrDeletionPolicy newest commit generation = 1
   [junit4]   2> 798600 INFO  (OldIndexDirectoryCleanupThreadForCore-collection1) [n:127.0.0.1:59834_ c:collection1 s:shard2 r:core_node1 x:collection1] o.a.s.c.SolrCore Looking for old index directories to cleanup for core collection1 in /x1/jenkins/jenkins-slave/workspace/Lucene-Solr-Tests-trunk-Java8/solr/build/solr-core/test/J2/temp/solr.core.TestDynamicLoading_C3CEC20D07226EA3-001/shard-1-001/cores/collection1/data/
   [junit4]   2> 798600 

[...truncated too long message...]

on$SessionExpiredException: KeeperErrorCode = Session expired for /collections/collection1/leader_elect/shard1/election/95386859640782865-core_node4-n_0000000001
   [junit4]   2> 	at org.apache.zookeeper.KeeperException.create(KeeperException.java:127)
   [junit4]   2> 	at org.apache.zookeeper.KeeperException.create(KeeperException.java:51)
   [junit4]   2> 	at org.apache.zookeeper.ZooKeeper.delete(ZooKeeper.java:873)
   [junit4]   2> 	at org.apache.solr.common.cloud.SolrZkClient$2.execute(SolrZkClient.java:244)
   [junit4]   2> 	at org.apache.solr.common.cloud.SolrZkClient$2.execute(SolrZkClient.java:241)
   [junit4]   2> 	at org.apache.solr.common.cloud.ZkCmdExecutor.retryOperation(ZkCmdExecutor.java:60)
   [junit4]   2> 	at org.apache.solr.common.cloud.SolrZkClient.delete(SolrZkClient.java:241)
   [junit4]   2> 	at org.apache.solr.cloud.ElectionContext.cancelElection(ElectionContext.java:86)
   [junit4]   2> 	at org.apache.solr.cloud.ShardLeaderElectionContextBase.cancelElection(ElectionContext.java:166)
   [junit4]   2> 	at org.apache.solr.cloud.ShardLeaderElectionContext.cancelElection(ElectionContext.java:267)
   [junit4]   2> 	at org.apache.solr.cloud.ShardLeaderElectionContext.runLeaderProcess(ElectionContext.java:443)
   [junit4]   2> 	at org.apache.solr.cloud.LeaderElector.runIamLeaderProcess(LeaderElector.java:197)
   [junit4]   2> 	at org.apache.solr.cloud.LeaderElector.checkIfIamLeader(LeaderElector.java:157)
   [junit4]   2> 	at org.apache.solr.cloud.LeaderElector.access$200(LeaderElector.java:58)
   [junit4]   2> 	at org.apache.solr.cloud.LeaderElector$ElectionWatcher.process(LeaderElector.java:388)
   [junit4]   2> 	at org.apache.solr.common.cloud.SolrZkClient$3$1.run(SolrZkClient.java:269)
   [junit4]   2> 	at java.util.concurrent.Executors$RunnableAdapter.call(Executors.java:511)
   [junit4]   2> 	at java.util.concurrent.FutureTask.run(FutureTask.java:266)
   [junit4]   2> 	at org.apache.solr.common.util.ExecutorUtil$MDCAwareThreadPoolExecutor$1.run(ExecutorUtil.java:231)
   [junit4]   2> 	at java.util.concurrent.ThreadPoolExecutor.runWorker(ThreadPoolExecutor.java:1142)
   [junit4]   2> 	at java.util.concurrent.ThreadPoolExecutor$Worker.run(ThreadPoolExecutor.java:617)
   [junit4]   2> 	at java.lang.Thread.run(Thread.java:745)
   [junit4]   2> 848696 WARN  (zkCallback-1052-thread-3-processing-n:127.0.0.1:48932_) [n:127.0.0.1:48932_    ] o.a.s.c.c.ZkStateReader ZooKeeper watch triggered, but Solr cannot talk to ZK: [KeeperErrorCode = Session expired for /live_nodes]
   [junit4]   2> 848702 INFO  (TEST-TestDynamicLoading.testDynamicLoading-seed#[C3CEC20D07226EA3]) [    ] o.e.j.s.ServerConnector Stopped ServerConnector@406c5a3f{HTTP/1.1}{127.0.0.1:0}
   [junit4]   2> 848702 INFO  (TEST-TestDynamicLoading.testDynamicLoading-seed#[C3CEC20D07226EA3]) [    ] o.e.j.s.h.ContextHandler Stopped o.e.j.s.ServletContextHandler@361d49e{/,null,UNAVAILABLE}
   [junit4]   2> 848705 INFO  (TEST-TestDynamicLoading.testDynamicLoading-seed#[C3CEC20D07226EA3]) [    ] o.a.s.c.ZkTestServer connecting to 127.0.0.1:54749 54749
   [junit4]   2> 848952 INFO  (Thread-2876) [    ] o.a.s.c.ZkTestServer connecting to 127.0.0.1:54749 54749
   [junit4]   2> 848953 WARN  (Thread-2876) [    ] o.a.s.c.ZkTestServer Watch limit violations: 
   [junit4]   2> Maximum concurrent create/delete watches above limit:
   [junit4]   2> 
   [junit4]   2> 	40	/solr/configs/conf1
   [junit4]   2> 	7	/solr/aliases.json
   [junit4]   2> 	6	/solr/security.json
   [junit4]   2> 	2	/solr/configs/.system
   [junit4]   2> 	2	/solr/configs/.system/managed-schema
   [junit4]   2> 
   [junit4]   2> Maximum concurrent data watches above limit:
   [junit4]   2> 
   [junit4]   2> 	24	/solr/clusterstate.json
   [junit4]   2> 	2	/solr/collections/.system/state.json
   [junit4]   2> 
   [junit4]   2> Maximum concurrent children watches above limit:
   [junit4]   2> 
   [junit4]   2> 	11	/solr/live_nodes
   [junit4]   2> 	8	/solr/collections
   [junit4]   2> 	4	/solr/overseer/collection-queue-work
   [junit4]   2> 	3	/solr/overseer/queue
   [junit4]   2> 
   [junit4]   2> NOTE: reproduce with: ant test  -Dtestcase=TestDynamicLoading -Dtests.method=testDynamicLoading -Dtests.seed=C3CEC20D07226EA3 -Dtests.multiplier=2 -Dtests.slow=true -Dtests.locale=ar-OM -Dtests.timezone=Africa/Bangui -Dtests.asserts=true -Dtests.file.encoding=ISO-8859-1
   [junit4] FAILURE 54.5s J2 | TestDynamicLoading.testDynamicLoading <<<
   [junit4]    > Throwable #1: java.lang.AssertionError: Could not get expected value  'X val changed' for path 'x' full output: {
   [junit4]    >   "responseHeader":{
   [junit4]    >     "status":0,
   [junit4]    >     "QTime":0},
   [junit4]    >   "params":{"wt":"json"},
   [junit4]    >   "context":{
   [junit4]    >     "webapp":"",
   [junit4]    >     "path":"/test1",
   [junit4]    >     "httpMethod":"GET"},
   [junit4]    >   "class":"org.apache.solr.core.BlobStoreTestRequestHandler",
   [junit4]    >   "x":"X val"}
   [junit4]    > 	at __randomizedtesting.SeedInfo.seed([C3CEC20D07226EA3:1B83EF5AF0FFCB03]:0)
   [junit4]    > 	at org.apache.solr.core.TestSolrConfigHandler.testForResponseElement(TestSolrConfigHandler.java:456)
   [junit4]    > 	at org.apache.solr.core.TestDynamicLoading.testDynamicLoading(TestDynamicLoading.java:255)
   [junit4]    > 	at org.apache.solr.BaseDistributedSearchTestCase$ShardsRepeatRule$ShardsFixedStatement.callStatement(BaseDistributedSearchTestCase.java:964)
   [junit4]    > 	at org.apache.solr.BaseDistributedSearchTestCase$ShardsRepeatRule$ShardsStatement.evaluate(BaseDistributedSearchTestCase.java:939)
   [junit4]    > 	at java.lang.Thread.run(Thread.java:745)
   [junit4]   2> 848957 INFO  (SUITE-TestDynamicLoading-seed#[C3CEC20D07226EA3]-worker) [    ] o.a.s.SolrTestCaseJ4 ###deleteCore
   [junit4]   2> NOTE: leaving temporary files on disk at: /x1/jenkins/jenkins-slave/workspace/Lucene-Solr-Tests-trunk-Java8/solr/build/solr-core/test/J2/temp/solr.core.TestDynamicLoading_C3CEC20D07226EA3-001
   [junit4]   2> NOTE: test params are: codec=CheapBastard, sim=ClassicSimilarity, locale=ar-OM, timezone=Africa/Bangui
   [junit4]   2> NOTE: Linux 3.13.0-52-generic amd64/Oracle Corporation 1.8.0_66 (64-bit)/cpus=4,threads=1,free=31585424,total=532152320
   [junit4]   2> NOTE: All tests run in this JVM: [CloudMLTQParserTest, TestReversedWildcardFilterFactory, DirectUpdateHandlerTest, DocValuesMissingTest, ClusterStateTest, AnalyticsMergeStrategyTest, TestUniqueKeyFieldResource, LeaderElectionTest, TestFastWriter, TestDistribIDF, OverseerTest, TestLRUStatsCache, TestPerFieldSimilarityWithDefaultOverride, CollectionStateFormat2Test, SegmentsInfoRequestHandlerTest, SpatialHeatmapFacetsTest, TestXIncludeConfig, StatsComponentTest, TestOverriddenPrefixQueryForCustomFieldType, RecoveryZkTest, BaseCdcrDistributedZkTest, TestSolrXml, TestSearchPerf, HdfsTlogReplayBufferedWhileIndexingTest, TestShardHandlerFactory, TestCloudSchemaless, CoreAdminHandlerTest, DistribCursorPagingTest, CoreMergeIndexesAdminHandlerTest, DirectUpdateHandlerOptimizeTest, PluginInfoTest, TestStressUserVersions, TestManagedSchemaFieldTypeResource, FullHLLTest, DeleteReplicaTest, CircularListTest, DateMathParserTest, BadComponentTest, TestIndexSearcher, TestMiniSolrCloudClusterBase, CachingDirectoryFactoryTest, TestGroupingSearch, SliceStateTest, SparseHLLTest, TestCoreDiscovery, DistanceUnitsTest, TestSchemaResource, BigEndianAscendingWordSerializerTest, SuggesterTest, SolrXmlInZkTest, TestChildDocTransformer, CleanupOldIndexTest, RecoveryAfterSoftCommitTest, HdfsChaosMonkeyNothingIsSafeTest, LeaderInitiatedRecoveryOnShardRestartTest, StatelessScriptUpdateProcessorFactoryTest, DistributedQueryComponentOptimizationTest, SampleTest, TestExceedMaxTermLength, HdfsDirectoryFactoryTest, SaslZkACLProviderTest, TestDistribDocBasedVersion, LukeRequestHandlerTest, TestBulkSchemaAPI, TestMaxScoreQueryParser, TestDistributedMissingSort, TestExtendedDismaxParser, HdfsLockFactoryTest, TestTolerantSearch, TestSuggestSpellingConverter, TestElisionMultitermQuery, TestAnalyzeInfixSuggestions, BinaryUpdateRequestHandlerTest, ShowFileRequestHandlerTest, TestDefaultSearchFieldResource, TestSolrJ, TestUtils, TestRandomRequestDistribution, RegexBoostProcessorTest, BadCopyFieldTest, TestSchemaManager, TestSweetSpotSimilarityFactory, BadIndexSchemaTest, CustomCollectionTest, TestJmxIntegration, TestSha256AuthenticationProvider, TestDFISimilarityFactory, TestAddFieldRealTimeGet, TestScoreJoinQPNoScore, TestCollationField, DocValuesMultiTest, NoCacheHeaderTest, AutoCommitTest, TestDynamicLoading]
   [junit4] Completed [247/579 (1!)] on J2 in 54.58s, 1 test, 1 failure <<< FAILURES!

[...truncated 1078 lines...]
BUILD FAILED
/x1/jenkins/jenkins-slave/workspace/Lucene-Solr-Tests-trunk-Java8/build.xml:740: The following error occurred while executing this line:
/x1/jenkins/jenkins-slave/workspace/Lucene-Solr-Tests-trunk-Java8/build.xml:684: The following error occurred while executing this line:
/x1/jenkins/jenkins-slave/workspace/Lucene-Solr-Tests-trunk-Java8/build.xml:59: The following error occurred while executing this line:
/x1/jenkins/jenkins-slave/workspace/Lucene-Solr-Tests-trunk-Java8/solr/build.xml:233: The following error occurred while executing this line:
/x1/jenkins/jenkins-slave/workspace/Lucene-Solr-Tests-trunk-Java8/solr/common-build.xml:524: The following error occurred while executing this line:
/x1/jenkins/jenkins-slave/workspace/Lucene-Solr-Tests-trunk-Java8/lucene/common-build.xml:1457: The following error occurred while executing this line:
/x1/jenkins/jenkins-slave/workspace/Lucene-Solr-Tests-trunk-Java8/lucene/common-build.xml:1014: There were test failures: 579 suites (8 ignored), 2331 tests, 1 failure, 88 ignored (72 assumptions) [seed: C3CEC20D07226EA3]

Total time: 57 minutes 38 seconds
Build step 'Invoke Ant' marked build as failure
Archiving artifacts
Recording test results
Email was triggered for: Failure - Any
Sending email for trigger: Failure - Any



Mime
View raw message