lucene-dev mailing list archives

Site index · List index
Message view « Date » · « Thread »
Top « Date » · « Thread »
From Policeman Jenkins Server <jenk...@thetaphi.de>
Subject [JENKINS] Lucene-Solr-5.5-Linux (64bit/jdk1.7.0_80) - Build # 28 - Failure!
Date Wed, 17 Feb 2016 06:37:10 GMT
Build: http://jenkins.thetaphi.de/job/Lucene-Solr-5.5-Linux/28/
Java: 64bit/jdk1.7.0_80 -XX:+UseCompressedOops -XX:+UseConcMarkSweepGC

1 tests failed.
FAILED:  org.apache.solr.cloud.DistribDocExpirationUpdateProcessorTest.test

Error Message:
Exactly one shard should have changed, instead: [shard2, shard1] nodes=([core_node4(shard1), core_node2(shard1), core_node3(shard2)]) expected:<1> but was:<2>

Stack Trace:
java.lang.AssertionError: Exactly one shard should have changed, instead: [shard2, shard1] nodes=([core_node4(shard1), core_node2(shard1), core_node3(shard2)]) expected:<1> but was:<2>
	at __randomizedtesting.SeedInfo.seed([6181E23CA939E6BF:E9D5DDE607C58B47]:0)
	at org.junit.Assert.fail(Assert.java:93)
	at org.junit.Assert.failNotEquals(Assert.java:647)
	at org.junit.Assert.assertEquals(Assert.java:128)
	at org.junit.Assert.assertEquals(Assert.java:472)
	at org.apache.solr.cloud.DistribDocExpirationUpdateProcessorTest.test(DistribDocExpirationUpdateProcessorTest.java:118)
	at sun.reflect.NativeMethodAccessorImpl.invoke0(Native Method)
	at sun.reflect.NativeMethodAccessorImpl.invoke(NativeMethodAccessorImpl.java:57)
	at sun.reflect.DelegatingMethodAccessorImpl.invoke(DelegatingMethodAccessorImpl.java:43)
	at java.lang.reflect.Method.invoke(Method.java:606)
	at com.carrotsearch.randomizedtesting.RandomizedRunner.invoke(RandomizedRunner.java:1764)
	at com.carrotsearch.randomizedtesting.RandomizedRunner$8.evaluate(RandomizedRunner.java:871)
	at com.carrotsearch.randomizedtesting.RandomizedRunner$9.evaluate(RandomizedRunner.java:907)
	at com.carrotsearch.randomizedtesting.RandomizedRunner$10.evaluate(RandomizedRunner.java:921)
	at org.apache.solr.BaseDistributedSearchTestCase$ShardsRepeatRule$ShardsFixedStatement.callStatement(BaseDistributedSearchTestCase.java:964)
	at org.apache.solr.BaseDistributedSearchTestCase$ShardsRepeatRule$ShardsStatement.evaluate(BaseDistributedSearchTestCase.java:939)
	at com.carrotsearch.randomizedtesting.rules.SystemPropertiesRestoreRule$1.evaluate(SystemPropertiesRestoreRule.java:57)
	at org.apache.lucene.util.TestRuleSetupTeardownChained$1.evaluate(TestRuleSetupTeardownChained.java:49)
	at org.apache.lucene.util.AbstractBeforeAfterRule$1.evaluate(AbstractBeforeAfterRule.java:45)
	at org.apache.lucene.util.TestRuleThreadAndTestName$1.evaluate(TestRuleThreadAndTestName.java:48)
	at org.apache.lucene.util.TestRuleIgnoreAfterMaxFailures$1.evaluate(TestRuleIgnoreAfterMaxFailures.java:64)
	at org.apache.lucene.util.TestRuleMarkFailure$1.evaluate(TestRuleMarkFailure.java:47)
	at com.carrotsearch.randomizedtesting.rules.StatementAdapter.evaluate(StatementAdapter.java:36)
	at com.carrotsearch.randomizedtesting.ThreadLeakControl$StatementRunner.run(ThreadLeakControl.java:367)
	at com.carrotsearch.randomizedtesting.ThreadLeakControl.forkTimeoutingTask(ThreadLeakControl.java:809)
	at com.carrotsearch.randomizedtesting.ThreadLeakControl$3.evaluate(ThreadLeakControl.java:460)
	at com.carrotsearch.randomizedtesting.RandomizedRunner.runSingleTest(RandomizedRunner.java:880)
	at com.carrotsearch.randomizedtesting.RandomizedRunner$5.evaluate(RandomizedRunner.java:781)
	at com.carrotsearch.randomizedtesting.RandomizedRunner$6.evaluate(RandomizedRunner.java:816)
	at com.carrotsearch.randomizedtesting.RandomizedRunner$7.evaluate(RandomizedRunner.java:827)
	at com.carrotsearch.randomizedtesting.rules.StatementAdapter.evaluate(StatementAdapter.java:36)
	at com.carrotsearch.randomizedtesting.rules.SystemPropertiesRestoreRule$1.evaluate(SystemPropertiesRestoreRule.java:57)
	at org.apache.lucene.util.AbstractBeforeAfterRule$1.evaluate(AbstractBeforeAfterRule.java:45)
	at com.carrotsearch.randomizedtesting.rules.StatementAdapter.evaluate(StatementAdapter.java:36)
	at org.apache.lucene.util.TestRuleStoreClassName$1.evaluate(TestRuleStoreClassName.java:41)
	at com.carrotsearch.randomizedtesting.rules.NoShadowingOrOverridesOnMethodsRule$1.evaluate(NoShadowingOrOverridesOnMethodsRule.java:40)
	at com.carrotsearch.randomizedtesting.rules.NoShadowingOrOverridesOnMethodsRule$1.evaluate(NoShadowingOrOverridesOnMethodsRule.java:40)
	at com.carrotsearch.randomizedtesting.rules.StatementAdapter.evaluate(StatementAdapter.java:36)
	at com.carrotsearch.randomizedtesting.rules.StatementAdapter.evaluate(StatementAdapter.java:36)
	at com.carrotsearch.randomizedtesting.rules.StatementAdapter.evaluate(StatementAdapter.java:36)
	at org.apache.lucene.util.TestRuleAssertionsRequired$1.evaluate(TestRuleAssertionsRequired.java:53)
	at org.apache.lucene.util.TestRuleMarkFailure$1.evaluate(TestRuleMarkFailure.java:47)
	at org.apache.lucene.util.TestRuleIgnoreAfterMaxFailures$1.evaluate(TestRuleIgnoreAfterMaxFailures.java:64)
	at org.apache.lucene.util.TestRuleIgnoreTestSuites$1.evaluate(TestRuleIgnoreTestSuites.java:54)
	at com.carrotsearch.randomizedtesting.rules.StatementAdapter.evaluate(StatementAdapter.java:36)
	at com.carrotsearch.randomizedtesting.ThreadLeakControl$StatementRunner.run(ThreadLeakControl.java:367)
	at java.lang.Thread.run(Thread.java:745)




Build Log:
[...truncated 10734 lines...]
   [junit4] Suite: org.apache.solr.cloud.DistribDocExpirationUpdateProcessorTest
   [junit4]   2> Creating dataDir: /home/jenkins/workspace/Lucene-Solr-5.5-Linux/solr/build/solr-core/test/J1/temp/solr.cloud.DistribDocExpirationUpdateProcessorTest_6181E23CA939E6BF-001/init-core-data-001
   [junit4]   2> 90090 INFO  (SUITE-DistribDocExpirationUpdateProcessorTest-seed#[6181E23CA939E6BF]-worker) [    ] o.a.s.SolrTestCaseJ4 Randomized ssl (false) and clientAuth (false)
   [junit4]   2> 90090 INFO  (SUITE-DistribDocExpirationUpdateProcessorTest-seed#[6181E23CA939E6BF]-worker) [    ] o.a.s.BaseDistributedSearchTestCase Setting hostContext system property: /_tg/i
   [junit4]   2> 90093 INFO  (TEST-DistribDocExpirationUpdateProcessorTest.test-seed#[6181E23CA939E6BF]) [    ] o.a.s.c.ZkTestServer STARTING ZK TEST SERVER
   [junit4]   2> 90093 INFO  (Thread-502) [    ] o.a.s.c.ZkTestServer client port:0.0.0.0/0.0.0.0:0
   [junit4]   2> 90093 INFO  (Thread-502) [    ] o.a.s.c.ZkTestServer Starting server
   [junit4]   2> 90193 INFO  (TEST-DistribDocExpirationUpdateProcessorTest.test-seed#[6181E23CA939E6BF]) [    ] o.a.s.c.ZkTestServer start zk server on port:58462
   [junit4]   2> 90193 INFO  (TEST-DistribDocExpirationUpdateProcessorTest.test-seed#[6181E23CA939E6BF]) [    ] o.a.s.c.c.SolrZkClient Using default ZkCredentialsProvider
   [junit4]   2> 90194 INFO  (TEST-DistribDocExpirationUpdateProcessorTest.test-seed#[6181E23CA939E6BF]) [    ] o.a.s.c.c.ConnectionManager Waiting for client to connect to ZooKeeper
   [junit4]   2> 90195 INFO  (zkCallback-133-thread-1) [    ] o.a.s.c.c.ConnectionManager Watcher org.apache.solr.common.cloud.ConnectionManager@2f88ba1c name:ZooKeeperConnection Watcher:127.0.0.1:58462 got event WatchedEvent state:SyncConnected type:None path:null path:null type:None
   [junit4]   2> 90195 INFO  (TEST-DistribDocExpirationUpdateProcessorTest.test-seed#[6181E23CA939E6BF]) [    ] o.a.s.c.c.ConnectionManager Client is connected to ZooKeeper
   [junit4]   2> 90196 INFO  (TEST-DistribDocExpirationUpdateProcessorTest.test-seed#[6181E23CA939E6BF]) [    ] o.a.s.c.c.SolrZkClient Using default ZkACLProvider
   [junit4]   2> 90196 INFO  (TEST-DistribDocExpirationUpdateProcessorTest.test-seed#[6181E23CA939E6BF]) [    ] o.a.s.c.c.SolrZkClient makePath: /solr
   [junit4]   2> 90198 INFO  (TEST-DistribDocExpirationUpdateProcessorTest.test-seed#[6181E23CA939E6BF]) [    ] o.a.s.c.c.SolrZkClient Using default ZkCredentialsProvider
   [junit4]   2> 90198 INFO  (TEST-DistribDocExpirationUpdateProcessorTest.test-seed#[6181E23CA939E6BF]) [    ] o.a.s.c.c.ConnectionManager Waiting for client to connect to ZooKeeper
   [junit4]   2> 90199 INFO  (zkCallback-134-thread-1) [    ] o.a.s.c.c.ConnectionManager Watcher org.apache.solr.common.cloud.ConnectionManager@1d3f82cd name:ZooKeeperConnection Watcher:127.0.0.1:58462/solr got event WatchedEvent state:SyncConnected type:None path:null path:null type:None
   [junit4]   2> 90199 INFO  (TEST-DistribDocExpirationUpdateProcessorTest.test-seed#[6181E23CA939E6BF]) [    ] o.a.s.c.c.ConnectionManager Client is connected to ZooKeeper
   [junit4]   2> 90199 INFO  (TEST-DistribDocExpirationUpdateProcessorTest.test-seed#[6181E23CA939E6BF]) [    ] o.a.s.c.c.SolrZkClient Using default ZkACLProvider
   [junit4]   2> 90199 INFO  (TEST-DistribDocExpirationUpdateProcessorTest.test-seed#[6181E23CA939E6BF]) [    ] o.a.s.c.c.SolrZkClient makePath: /collections/collection1
   [junit4]   2> 90201 INFO  (TEST-DistribDocExpirationUpdateProcessorTest.test-seed#[6181E23CA939E6BF]) [    ] o.a.s.c.c.SolrZkClient makePath: /collections/collection1/shards
   [junit4]   2> 90202 INFO  (TEST-DistribDocExpirationUpdateProcessorTest.test-seed#[6181E23CA939E6BF]) [    ] o.a.s.c.c.SolrZkClient makePath: /collections/control_collection
   [junit4]   2> 90203 INFO  (TEST-DistribDocExpirationUpdateProcessorTest.test-seed#[6181E23CA939E6BF]) [    ] o.a.s.c.c.SolrZkClient makePath: /collections/control_collection/shards
   [junit4]   2> 90204 INFO  (TEST-DistribDocExpirationUpdateProcessorTest.test-seed#[6181E23CA939E6BF]) [    ] o.a.s.c.AbstractZkTestCase put /home/jenkins/workspace/Lucene-Solr-5.5-Linux/solr/core/src/test-files/solr/collection1/conf/solrconfig-doc-expire-update-processor.xml to /configs/conf1/solrconfig.xml
   [junit4]   2> 90204 INFO  (TEST-DistribDocExpirationUpdateProcessorTest.test-seed#[6181E23CA939E6BF]) [    ] o.a.s.c.c.SolrZkClient makePath: /configs/conf1/solrconfig.xml
   [junit4]   2> 90207 INFO  (TEST-DistribDocExpirationUpdateProcessorTest.test-seed#[6181E23CA939E6BF]) [    ] o.a.s.c.AbstractZkTestCase put /home/jenkins/workspace/Lucene-Solr-5.5-Linux/solr/core/src/test-files/solr/collection1/conf/schema15.xml to /configs/conf1/schema.xml
   [junit4]   2> 90207 INFO  (TEST-DistribDocExpirationUpdateProcessorTest.test-seed#[6181E23CA939E6BF]) [    ] o.a.s.c.c.SolrZkClient makePath: /configs/conf1/schema.xml
   [junit4]   2> 90208 INFO  (TEST-DistribDocExpirationUpdateProcessorTest.test-seed#[6181E23CA939E6BF]) [    ] o.a.s.c.AbstractZkTestCase put /home/jenkins/workspace/Lucene-Solr-5.5-Linux/solr/core/src/test-files/solr/collection1/conf/solrconfig.snippet.randomindexconfig.xml to /configs/conf1/solrconfig.snippet.randomindexconfig.xml
   [junit4]   2> 90208 INFO  (TEST-DistribDocExpirationUpdateProcessorTest.test-seed#[6181E23CA939E6BF]) [    ] o.a.s.c.c.SolrZkClient makePath: /configs/conf1/solrconfig.snippet.randomindexconfig.xml
   [junit4]   2> 90210 INFO  (TEST-DistribDocExpirationUpdateProcessorTest.test-seed#[6181E23CA939E6BF]) [    ] o.a.s.c.AbstractZkTestCase put /home/jenkins/workspace/Lucene-Solr-5.5-Linux/solr/core/src/test-files/solr/collection1/conf/stopwords.txt to /configs/conf1/stopwords.txt
   [junit4]   2> 90210 INFO  (TEST-DistribDocExpirationUpdateProcessorTest.test-seed#[6181E23CA939E6BF]) [    ] o.a.s.c.c.SolrZkClient makePath: /configs/conf1/stopwords.txt
   [junit4]   2> 90212 INFO  (TEST-DistribDocExpirationUpdateProcessorTest.test-seed#[6181E23CA939E6BF]) [    ] o.a.s.c.AbstractZkTestCase put /home/jenkins/workspace/Lucene-Solr-5.5-Linux/solr/core/src/test-files/solr/collection1/conf/protwords.txt to /configs/conf1/protwords.txt
   [junit4]   2> 90212 INFO  (TEST-DistribDocExpirationUpdateProcessorTest.test-seed#[6181E23CA939E6BF]) [    ] o.a.s.c.c.SolrZkClient makePath: /configs/conf1/protwords.txt
   [junit4]   2> 90213 INFO  (TEST-DistribDocExpirationUpdateProcessorTest.test-seed#[6181E23CA939E6BF]) [    ] o.a.s.c.AbstractZkTestCase put /home/jenkins/workspace/Lucene-Solr-5.5-Linux/solr/core/src/test-files/solr/collection1/conf/currency.xml to /configs/conf1/currency.xml
   [junit4]   2> 90213 INFO  (TEST-DistribDocExpirationUpdateProcessorTest.test-seed#[6181E23CA939E6BF]) [    ] o.a.s.c.c.SolrZkClient makePath: /configs/conf1/currency.xml
   [junit4]   2> 90214 INFO  (TEST-DistribDocExpirationUpdateProcessorTest.test-seed#[6181E23CA939E6BF]) [    ] o.a.s.c.AbstractZkTestCase put /home/jenkins/workspace/Lucene-Solr-5.5-Linux/solr/core/src/test-files/solr/collection1/conf/enumsConfig.xml to /configs/conf1/enumsConfig.xml
   [junit4]   2> 90214 INFO  (TEST-DistribDocExpirationUpdateProcessorTest.test-seed#[6181E23CA939E6BF]) [    ] o.a.s.c.c.SolrZkClient makePath: /configs/conf1/enumsConfig.xml
   [junit4]   2> 90216 INFO  (TEST-DistribDocExpirationUpdateProcessorTest.test-seed#[6181E23CA939E6BF]) [    ] o.a.s.c.AbstractZkTestCase put /home/jenkins/workspace/Lucene-Solr-5.5-Linux/solr/core/src/test-files/solr/collection1/conf/open-exchange-rates.json to /configs/conf1/open-exchange-rates.json
   [junit4]   2> 90216 INFO  (TEST-DistribDocExpirationUpdateProcessorTest.test-seed#[6181E23CA939E6BF]) [    ] o.a.s.c.c.SolrZkClient makePath: /configs/conf1/open-exchange-rates.json
   [junit4]   2> 90217 INFO  (TEST-DistribDocExpirationUpdateProcessorTest.test-seed#[6181E23CA939E6BF]) [    ] o.a.s.c.AbstractZkTestCase put /home/jenkins/workspace/Lucene-Solr-5.5-Linux/solr/core/src/test-files/solr/collection1/conf/mapping-ISOLatin1Accent.txt to /configs/conf1/mapping-ISOLatin1Accent.txt
   [junit4]   2> 90217 INFO  (TEST-DistribDocExpirationUpdateProcessorTest.test-seed#[6181E23CA939E6BF]) [    ] o.a.s.c.c.SolrZkClient makePath: /configs/conf1/mapping-ISOLatin1Accent.txt
   [junit4]   2> 90219 INFO  (TEST-DistribDocExpirationUpdateProcessorTest.test-seed#[6181E23CA939E6BF]) [    ] o.a.s.c.AbstractZkTestCase put /home/jenkins/workspace/Lucene-Solr-5.5-Linux/solr/core/src/test-files/solr/collection1/conf/old_synonyms.txt to /configs/conf1/old_synonyms.txt
   [junit4]   2> 90219 INFO  (TEST-DistribDocExpirationUpdateProcessorTest.test-seed#[6181E23CA939E6BF]) [    ] o.a.s.c.c.SolrZkClient makePath: /configs/conf1/old_synonyms.txt
   [junit4]   2> 90220 INFO  (TEST-DistribDocExpirationUpdateProcessorTest.test-seed#[6181E23CA939E6BF]) [    ] o.a.s.c.AbstractZkTestCase put /home/jenkins/workspace/Lucene-Solr-5.5-Linux/solr/core/src/test-files/solr/collection1/conf/synonyms.txt to /configs/conf1/synonyms.txt
   [junit4]   2> 90220 INFO  (TEST-DistribDocExpirationUpdateProcessorTest.test-seed#[6181E23CA939E6BF]) [    ] o.a.s.c.c.SolrZkClient makePath: /configs/conf1/synonyms.txt
   [junit4]   2> 90273 INFO  (TEST-DistribDocExpirationUpdateProcessorTest.test-seed#[6181E23CA939E6BF]) [    ] o.a.s.SolrTestCaseJ4 Writing core.properties file to /home/jenkins/workspace/Lucene-Solr-5.5-Linux/solr/build/solr-core/test/J1/temp/solr.cloud.DistribDocExpirationUpdateProcessorTest_6181E23CA939E6BF-001/control-001/cores/collection1
   [junit4]   2> 90274 INFO  (TEST-DistribDocExpirationUpdateProcessorTest.test-seed#[6181E23CA939E6BF]) [    ] o.e.j.s.Server jetty-9.2.13.v20150730
   [junit4]   2> 90275 INFO  (TEST-DistribDocExpirationUpdateProcessorTest.test-seed#[6181E23CA939E6BF]) [    ] o.e.j.s.h.ContextHandler Started o.e.j.s.ServletContextHandler@3d2894a3{/_tg/i,null,AVAILABLE}
   [junit4]   2> 90276 INFO  (TEST-DistribDocExpirationUpdateProcessorTest.test-seed#[6181E23CA939E6BF]) [    ] o.e.j.s.ServerConnector Started ServerConnector@3d2e4a09{HTTP/1.1}{127.0.0.1:50783}
   [junit4]   2> 90276 INFO  (TEST-DistribDocExpirationUpdateProcessorTest.test-seed#[6181E23CA939E6BF]) [    ] o.e.j.s.Server Started @91765ms
   [junit4]   2> 90276 INFO  (TEST-DistribDocExpirationUpdateProcessorTest.test-seed#[6181E23CA939E6BF]) [    ] o.a.s.c.s.e.JettySolrRunner Jetty properties: {coreRootDirectory=/home/jenkins/workspace/Lucene-Solr-5.5-Linux/solr/build/solr-core/test/J1/temp/solr.cloud.DistribDocExpirationUpdateProcessorTest_6181E23CA939E6BF-001/control-001/cores, solr.data.dir=/home/jenkins/workspace/Lucene-Solr-5.5-Linux/solr/build/solr-core/test/J1/temp/solr.cloud.DistribDocExpirationUpdateProcessorTest_6181E23CA939E6BF-001/tempDir-001/control/data, hostContext=/_tg/i, hostPort=50783}
   [junit4]   2> 90276 INFO  (TEST-DistribDocExpirationUpdateProcessorTest.test-seed#[6181E23CA939E6BF]) [    ] o.a.s.s.SolrDispatchFilter SolrDispatchFilter.init(): sun.misc.Launcher$AppClassLoader@1e893918
   [junit4]   2> 90276 INFO  (TEST-DistribDocExpirationUpdateProcessorTest.test-seed#[6181E23CA939E6BF]) [    ] o.a.s.c.SolrResourceLoader new SolrResourceLoader for directory: '/home/jenkins/workspace/Lucene-Solr-5.5-Linux/solr/build/solr-core/test/J1/temp/solr.cloud.DistribDocExpirationUpdateProcessorTest_6181E23CA939E6BF-001/control-001'
   [junit4]   2> 90277 INFO  (TEST-DistribDocExpirationUpdateProcessorTest.test-seed#[6181E23CA939E6BF]) [    ] o.a.s.c.SolrResourceLoader JNDI not configured for solr (NoInitialContextEx)
   [junit4]   2> 90277 INFO  (TEST-DistribDocExpirationUpdateProcessorTest.test-seed#[6181E23CA939E6BF]) [    ] o.a.s.c.SolrResourceLoader solr home defaulted to 'solr/' (could not find system property or JNDI)
   [junit4]   2> 90277 INFO  (TEST-DistribDocExpirationUpdateProcessorTest.test-seed#[6181E23CA939E6BF]) [    ] o.a.s.c.c.SolrZkClient Using default ZkCredentialsProvider
   [junit4]   2> 90277 INFO  (TEST-DistribDocExpirationUpdateProcessorTest.test-seed#[6181E23CA939E6BF]) [    ] o.a.s.c.c.ConnectionManager Waiting for client to connect to ZooKeeper
   [junit4]   2> 90278 INFO  (zkCallback-135-thread-1) [    ] o.a.s.c.c.ConnectionManager Watcher org.apache.solr.common.cloud.ConnectionManager@7e1c8969 name:ZooKeeperConnection Watcher:127.0.0.1:58462/solr got event WatchedEvent state:SyncConnected type:None path:null path:null type:None
   [junit4]   2> 90278 INFO  (TEST-DistribDocExpirationUpdateProcessorTest.test-seed#[6181E23CA939E6BF]) [    ] o.a.s.c.c.ConnectionManager Client is connected to ZooKeeper
   [junit4]   2> 90279 INFO  (TEST-DistribDocExpirationUpdateProcessorTest.test-seed#[6181E23CA939E6BF]) [    ] o.a.s.c.c.SolrZkClient Using default ZkACLProvider
   [junit4]   2> 90280 INFO  (TEST-DistribDocExpirationUpdateProcessorTest.test-seed#[6181E23CA939E6BF]) [    ] o.a.s.s.SolrDispatchFilter Loading solr.xml from SolrHome (not found in ZooKeeper)
   [junit4]   2> 90280 INFO  (TEST-DistribDocExpirationUpdateProcessorTest.test-seed#[6181E23CA939E6BF]) [    ] o.a.s.c.SolrXmlConfig Loading container configuration from /home/jenkins/workspace/Lucene-Solr-5.5-Linux/solr/build/solr-core/test/J1/temp/solr.cloud.DistribDocExpirationUpdateProcessorTest_6181E23CA939E6BF-001/control-001/solr.xml
   [junit4]   2> 90289 INFO  (TEST-DistribDocExpirationUpdateProcessorTest.test-seed#[6181E23CA939E6BF]) [    ] o.a.s.c.CorePropertiesLocator Config-defined core root directory: /home/jenkins/workspace/Lucene-Solr-5.5-Linux/solr/build/solr-core/test/J1/temp/solr.cloud.DistribDocExpirationUpdateProcessorTest_6181E23CA939E6BF-001/control-001/cores
   [junit4]   2> 90289 INFO  (TEST-DistribDocExpirationUpdateProcessorTest.test-seed#[6181E23CA939E6BF]) [    ] o.a.s.c.CoreContainer New CoreContainer 866911322
   [junit4]   2> 90289 INFO  (TEST-DistribDocExpirationUpdateProcessorTest.test-seed#[6181E23CA939E6BF]) [    ] o.a.s.c.CoreContainer Loading cores into CoreContainer [instanceDir=/home/jenkins/workspace/Lucene-Solr-5.5-Linux/solr/build/solr-core/test/J1/temp/solr.cloud.DistribDocExpirationUpdateProcessorTest_6181E23CA939E6BF-001/control-001]
   [junit4]   2> 90289 WARN  (TEST-DistribDocExpirationUpdateProcessorTest.test-seed#[6181E23CA939E6BF]) [    ] o.a.s.c.CoreContainer Couldn't add files from /home/jenkins/workspace/Lucene-Solr-5.5-Linux/solr/build/solr-core/test/J1/temp/solr.cloud.DistribDocExpirationUpdateProcessorTest_6181E23CA939E6BF-001/control-001/lib to classpath: /home/jenkins/workspace/Lucene-Solr-5.5-Linux/solr/build/solr-core/test/J1/temp/solr.cloud.DistribDocExpirationUpdateProcessorTest_6181E23CA939E6BF-001/control-001/lib
   [junit4]   2> 90289 INFO  (TEST-DistribDocExpirationUpdateProcessorTest.test-seed#[6181E23CA939E6BF]) [    ] o.a.s.h.c.HttpShardHandlerFactory created with socketTimeout : 90000,urlScheme : ,connTimeout : 15000,maxConnectionsPerHost : 20,maxConnections : 10000,corePoolSize : 0,maximumPoolSize : 2147483647,maxThreadIdleTime : 5,sizeOfQueue : -1,fairnessPolicy : false,useRetries : false,
   [junit4]   2> 90290 INFO  (TEST-DistribDocExpirationUpdateProcessorTest.test-seed#[6181E23CA939E6BF]) [    ] o.a.s.u.UpdateShardHandler Creating UpdateShardHandler HTTP client with params: socketTimeout=340000&connTimeout=45000&retry=true
   [junit4]   2> 90290 INFO  (TEST-DistribDocExpirationUpdateProcessorTest.test-seed#[6181E23CA939E6BF]) [    ] o.a.s.l.LogWatcher SLF4J impl is org.slf4j.impl.Log4jLoggerFactory
   [junit4]   2> 90290 INFO  (TEST-DistribDocExpirationUpdateProcessorTest.test-seed#[6181E23CA939E6BF]) [    ] o.a.s.l.LogWatcher Registering Log Listener [Log4j (org.slf4j.impl.Log4jLoggerFactory)]
   [junit4]   2> 90290 INFO  (TEST-DistribDocExpirationUpdateProcessorTest.test-seed#[6181E23CA939E6BF]) [    ] o.a.s.c.ZkContainer Zookeeper client=127.0.0.1:58462/solr
   [junit4]   2> 90291 INFO  (TEST-DistribDocExpirationUpdateProcessorTest.test-seed#[6181E23CA939E6BF]) [    ] o.a.s.c.ZkController zkHost includes chroot
   [junit4]   2> 90291 INFO  (TEST-DistribDocExpirationUpdateProcessorTest.test-seed#[6181E23CA939E6BF]) [    ] o.a.s.c.c.SolrZkClient Using default ZkCredentialsProvider
   [junit4]   2> 90295 INFO  (TEST-DistribDocExpirationUpdateProcessorTest.test-seed#[6181E23CA939E6BF]) [    ] o.a.s.c.c.ConnectionManager Waiting for client to connect to ZooKeeper
   [junit4]   2> 90295 INFO  (zkCallback-138-thread-1) [    ] o.a.s.c.c.ConnectionManager Watcher org.apache.solr.common.cloud.ConnectionManager@67aa67cd name:ZooKeeperConnection Watcher:127.0.0.1:58462 got event WatchedEvent state:SyncConnected type:None path:null path:null type:None
   [junit4]   2> 90296 INFO  (TEST-DistribDocExpirationUpdateProcessorTest.test-seed#[6181E23CA939E6BF]) [    ] o.a.s.c.c.ConnectionManager Client is connected to ZooKeeper
   [junit4]   2> 90296 INFO  (TEST-DistribDocExpirationUpdateProcessorTest.test-seed#[6181E23CA939E6BF]) [    ] o.a.s.c.c.SolrZkClient Using default ZkACLProvider
   [junit4]   2> 90297 INFO  (TEST-DistribDocExpirationUpdateProcessorTest.test-seed#[6181E23CA939E6BF]) [n:127.0.0.1:50783__tg%2Fi    ] o.a.s.c.c.ConnectionManager Waiting for client to connect to ZooKeeper
   [junit4]   2> 90299 INFO  (zkCallback-139-thread-1-processing-n:127.0.0.1:50783__tg%2Fi) [n:127.0.0.1:50783__tg%2Fi    ] o.a.s.c.c.ConnectionManager Watcher org.apache.solr.common.cloud.ConnectionManager@55443dcb name:ZooKeeperConnection Watcher:127.0.0.1:58462/solr got event WatchedEvent state:SyncConnected type:None path:null path:null type:None
   [junit4]   2> 90299 INFO  (TEST-DistribDocExpirationUpdateProcessorTest.test-seed#[6181E23CA939E6BF]) [n:127.0.0.1:50783__tg%2Fi    ] o.a.s.c.c.ConnectionManager Client is connected to ZooKeeper
   [junit4]   2> 90300 INFO  (TEST-DistribDocExpirationUpdateProcessorTest.test-seed#[6181E23CA939E6BF]) [n:127.0.0.1:50783__tg%2Fi    ] o.a.s.c.c.SolrZkClient makePath: /overseer/queue
   [junit4]   2> 90302 INFO  (TEST-DistribDocExpirationUpdateProcessorTest.test-seed#[6181E23CA939E6BF]) [n:127.0.0.1:50783__tg%2Fi    ] o.a.s.c.c.SolrZkClient makePath: /overseer/collection-queue-work
   [junit4]   2> 90305 INFO  (TEST-DistribDocExpirationUpdateProcessorTest.test-seed#[6181E23CA939E6BF]) [n:127.0.0.1:50783__tg%2Fi    ] o.a.s.c.c.SolrZkClient makePath: /overseer/collection-map-running
   [junit4]   2> 90307 INFO  (TEST-DistribDocExpirationUpdateProcessorTest.test-seed#[6181E23CA939E6BF]) [n:127.0.0.1:50783__tg%2Fi    ] o.a.s.c.c.SolrZkClient makePath: /overseer/collection-map-completed
   [junit4]   2> 90308 INFO  (TEST-DistribDocExpirationUpdateProcessorTest.test-seed#[6181E23CA939E6BF]) [n:127.0.0.1:50783__tg%2Fi    ] o.a.s.c.c.SolrZkClient makePath: /overseer/collection-map-failure
   [junit4]   2> 90310 INFO  (TEST-DistribDocExpirationUpdateProcessorTest.test-seed#[6181E23CA939E6BF]) [n:127.0.0.1:50783__tg%2Fi    ] o.a.s.c.c.SolrZkClient makePath: /live_nodes
   [junit4]   2> 90311 INFO  (TEST-DistribDocExpirationUpdateProcessorTest.test-seed#[6181E23CA939E6BF]) [n:127.0.0.1:50783__tg%2Fi    ] o.a.s.c.c.SolrZkClient makePath: /aliases.json
   [junit4]   2> 90312 INFO  (TEST-DistribDocExpirationUpdateProcessorTest.test-seed#[6181E23CA939E6BF]) [n:127.0.0.1:50783__tg%2Fi    ] o.a.s.c.c.SolrZkClient makePath: /clusterstate.json
   [junit4]   2> 90316 INFO  (TEST-DistribDocExpirationUpdateProcessorTest.test-seed#[6181E23CA939E6BF]) [n:127.0.0.1:50783__tg%2Fi    ] o.a.s.c.c.SolrZkClient makePath: /security.json
   [junit4]   2> 90316 INFO  (TEST-DistribDocExpirationUpdateProcessorTest.test-seed#[6181E23CA939E6BF]) [n:127.0.0.1:50783__tg%2Fi    ] o.a.s.c.ZkController Register node as live in ZooKeeper:/live_nodes/127.0.0.1:50783__tg%2Fi
   [junit4]   2> 90317 INFO  (TEST-DistribDocExpirationUpdateProcessorTest.test-seed#[6181E23CA939E6BF]) [n:127.0.0.1:50783__tg%2Fi    ] o.a.s.c.c.SolrZkClient makePath: /live_nodes/127.0.0.1:50783__tg%2Fi
   [junit4]   2> 90318 INFO  (TEST-DistribDocExpirationUpdateProcessorTest.test-seed#[6181E23CA939E6BF]) [n:127.0.0.1:50783__tg%2Fi    ] o.a.s.c.c.SolrZkClient makePath: /overseer_elect
   [junit4]   2> 90319 INFO  (TEST-DistribDocExpirationUpdateProcessorTest.test-seed#[6181E23CA939E6BF]) [n:127.0.0.1:50783__tg%2Fi    ] o.a.s.c.c.SolrZkClient makePath: /overseer_elect/election
   [junit4]   2> 90320 INFO  (TEST-DistribDocExpirationUpdateProcessorTest.test-seed#[6181E23CA939E6BF]) [n:127.0.0.1:50783__tg%2Fi    ] o.a.s.c.Overseer Overseer (id=null) closing
   [junit4]   2> 90320 INFO  (TEST-DistribDocExpirationUpdateProcessorTest.test-seed#[6181E23CA939E6BF]) [n:127.0.0.1:50783__tg%2Fi    ] o.a.s.c.LeaderElector Joined leadership election with path: /overseer_elect/election/95400049838981124-127.0.0.1:50783__tg%2Fi-n_0000000000
   [junit4]   2> 90321 INFO  (TEST-DistribDocExpirationUpdateProcessorTest.test-seed#[6181E23CA939E6BF]) [n:127.0.0.1:50783__tg%2Fi    ] o.a.s.c.OverseerElectionContext I am going to be the leader 127.0.0.1:50783__tg%2Fi
   [junit4]   2> 90321 INFO  (TEST-DistribDocExpirationUpdateProcessorTest.test-seed#[6181E23CA939E6BF]) [n:127.0.0.1:50783__tg%2Fi    ] o.a.s.c.c.SolrZkClient makePath: /overseer_elect/leader
   [junit4]   2> 90322 INFO  (TEST-DistribDocExpirationUpdateProcessorTest.test-seed#[6181E23CA939E6BF]) [n:127.0.0.1:50783__tg%2Fi    ] o.a.s.c.Overseer Overseer (id=95400049838981124-127.0.0.1:50783__tg%2Fi-n_0000000000) starting
   [junit4]   2> 90323 INFO  (TEST-DistribDocExpirationUpdateProcessorTest.test-seed#[6181E23CA939E6BF]) [n:127.0.0.1:50783__tg%2Fi    ] o.a.s.c.c.SolrZkClient makePath: /overseer/queue-work
   [junit4]   2> 90328 INFO  (TEST-DistribDocExpirationUpdateProcessorTest.test-seed#[6181E23CA939E6BF]) [n:127.0.0.1:50783__tg%2Fi    ] o.a.s.c.OverseerAutoReplicaFailoverThread Starting OverseerAutoReplicaFailoverThread autoReplicaFailoverWorkLoopDelay=10000 autoReplicaFailoverWaitAfterExpiration=30000 autoReplicaFailoverBadNodeExpiration=60000
   [junit4]   2> 90328 INFO  (TEST-DistribDocExpirationUpdateProcessorTest.test-seed#[6181E23CA939E6BF]) [n:127.0.0.1:50783__tg%2Fi    ] o.a.s.c.c.ZkStateReader Updating cluster state from ZooKeeper... 
   [junit4]   2> 90328 INFO  (OverseerCollectionConfigSetProcessor-95400049838981124-127.0.0.1:50783__tg%2Fi-n_0000000000) [n:127.0.0.1:50783__tg%2Fi    ] o.a.s.c.OverseerTaskProcessor Process current queue of overseer operations
   [junit4]   2> 90329 INFO  (OverseerStateUpdate-95400049838981124-127.0.0.1:50783__tg%2Fi-n_0000000000) [n:127.0.0.1:50783__tg%2Fi    ] o.a.s.c.Overseer Starting to work on the main queue
   [junit4]   2> 90351 INFO  (TEST-DistribDocExpirationUpdateProcessorTest.test-seed#[6181E23CA939E6BF]) [n:127.0.0.1:50783__tg%2Fi    ] o.a.s.c.CoreContainer Security conf doesn't exist. Skipping setup for authorization module.
   [junit4]   2> 90351 INFO  (TEST-DistribDocExpirationUpdateProcessorTest.test-seed#[6181E23CA939E6BF]) [n:127.0.0.1:50783__tg%2Fi    ] o.a.s.c.CoreContainer No authentication plugin used.
   [junit4]   2> 90351 INFO  (TEST-DistribDocExpirationUpdateProcessorTest.test-seed#[6181E23CA939E6BF]) [n:127.0.0.1:50783__tg%2Fi    ] o.a.s.c.CorePropertiesLocator Looking for core definitions underneath /home/jenkins/workspace/Lucene-Solr-5.5-Linux/solr/build/solr-core/test/J1/temp/solr.cloud.DistribDocExpirationUpdateProcessorTest_6181E23CA939E6BF-001/control-001/cores
   [junit4]   2> 90352 INFO  (TEST-DistribDocExpirationUpdateProcessorTest.test-seed#[6181E23CA939E6BF]) [n:127.0.0.1:50783__tg%2Fi    ] o.a.s.c.CoreDescriptor Created CoreDescriptor: {loadOnStartup=true, collection=control_collection, configSetProperties=configsetprops.json, shard=, dataDir=data/, name=collection1, config=solrconfig.xml, transient=false, schema=schema.xml, coreNodeName=}
   [junit4]   2> 90352 INFO  (TEST-DistribDocExpirationUpdateProcessorTest.test-seed#[6181E23CA939E6BF]) [n:127.0.0.1:50783__tg%2Fi    ] o.a.s.c.CorePropertiesLocator Found core collection1 in /home/jenkins/workspace/Lucene-Solr-5.5-Linux/solr/build/solr-core/test/J1/temp/solr.cloud.DistribDocExpirationUpdateProcessorTest_6181E23CA939E6BF-001/control-001/cores/collection1
   [junit4]   2> 90352 INFO  (TEST-DistribDocExpirationUpdateProcessorTest.test-seed#[6181E23CA939E6BF]) [n:127.0.0.1:50783__tg%2Fi    ] o.a.s.c.CorePropertiesLocator Found 1 core definitions
   [junit4]   2> 90353 INFO  (TEST-DistribDocExpirationUpdateProcessorTest.test-seed#[6181E23CA939E6BF]) [n:127.0.0.1:50783__tg%2Fi    ] o.a.s.s.SolrDispatchFilter user.dir=/home/jenkins/workspace/Lucene-Solr-5.5-Linux/solr/build/solr-core/test/J1
   [junit4]   2> 90353 INFO  (TEST-DistribDocExpirationUpdateProcessorTest.test-seed#[6181E23CA939E6BF]) [n:127.0.0.1:50783__tg%2Fi    ] o.a.s.s.SolrDispatchFilter SolrDispatchFilter.init() done
   [junit4]   2> 90353 INFO  (coreLoadExecutor-629-thread-1-processing-n:127.0.0.1:50783__tg%2Fi) [n:127.0.0.1:50783__tg%2Fi c:control_collection   x:collection1] o.a.s.c.ZkController publishing state=down
   [junit4]   2> 90354 INFO  (coreLoadExecutor-629-thread-1-processing-n:127.0.0.1:50783__tg%2Fi) [n:127.0.0.1:50783__tg%2Fi c:control_collection   x:collection1] o.a.s.c.ZkController numShards not found on descriptor - reading it from system property
   [junit4]   2> 90355 INFO  (OverseerStateUpdate-95400049838981124-127.0.0.1:50783__tg%2Fi-n_0000000000) [n:127.0.0.1:50783__tg%2Fi    ] o.a.s.c.Overseer processMessage: queueSize: 1, message = {
   [junit4]   2>   "operation":"state",
   [junit4]   2>   "shard":null,
   [junit4]   2>   "roles":null,
   [junit4]   2>   "numShards":"1",
   [junit4]   2>   "state":"down",
   [junit4]   2>   "core":"collection1",
   [junit4]   2>   "base_url":"http://127.0.0.1:50783/_tg/i",
   [junit4]   2>   "collection":"control_collection",
   [junit4]   2>   "node_name":"127.0.0.1:50783__tg%2Fi"} current state version: 0
   [junit4]   2> 90355 INFO  (coreLoadExecutor-629-thread-1-processing-n:127.0.0.1:50783__tg%2Fi) [n:127.0.0.1:50783__tg%2Fi c:control_collection   x:collection1] o.a.s.c.ZkController look for our core node name
   [junit4]   2> 90357 INFO  (OverseerStateUpdate-95400049838981124-127.0.0.1:50783__tg%2Fi-n_0000000000) [n:127.0.0.1:50783__tg%2Fi    ] o.a.s.c.o.ReplicaMutator Update state numShards=1 message={
   [junit4]   2>   "operation":"state",
   [junit4]   2>   "shard":null,
   [junit4]   2>   "roles":null,
   [junit4]   2>   "numShards":"1",
   [junit4]   2>   "state":"down",
   [junit4]   2>   "core":"collection1",
   [junit4]   2>   "base_url":"http://127.0.0.1:50783/_tg/i",
   [junit4]   2>   "collection":"control_collection",
   [junit4]   2>   "node_name":"127.0.0.1:50783__tg%2Fi"}
   [junit4]   2> 90357 INFO  (OverseerStateUpdate-95400049838981124-127.0.0.1:50783__tg%2Fi-n_0000000000) [n:127.0.0.1:50783__tg%2Fi    ] o.a.s.c.o.ClusterStateMutator building a new cName: control_collection
   [junit4]   2> 90358 INFO  (OverseerStateUpdate-95400049838981124-127.0.0.1:50783__tg%2Fi-n_0000000000) [n:127.0.0.1:50783__tg%2Fi    ] o.a.s.c.o.ReplicaMutator Assigning new node to shard shard=shard1
   [junit4]   2> 90359 INFO  (zkCallback-139-thread-1-processing-n:127.0.0.1:50783__tg%2Fi) [n:127.0.0.1:50783__tg%2Fi    ] o.a.s.c.c.ZkStateReader A cluster state change: [WatchedEvent state:SyncConnected type:NodeDataChanged path:/clusterstate.json], has occurred - updating... (live nodes size: [1])
   [junit4]   2> 91355 INFO  (coreLoadExecutor-629-thread-1-processing-n:127.0.0.1:50783__tg%2Fi) [n:127.0.0.1:50783__tg%2Fi c:control_collection   x:collection1] o.a.s.c.ZkController waiting to find shard id in clusterstate for collection1
   [junit4]   2> 91356 INFO  (coreLoadExecutor-629-thread-1-processing-n:127.0.0.1:50783__tg%2Fi) [n:127.0.0.1:50783__tg%2Fi c:control_collection   x:collection1] o.a.s.c.ZkController Check for collection zkNode:control_collection
   [junit4]   2> 91356 INFO  (coreLoadExecutor-629-thread-1-processing-n:127.0.0.1:50783__tg%2Fi) [n:127.0.0.1:50783__tg%2Fi c:control_collection   x:collection1] o.a.s.c.ZkController Collection zkNode exists
   [junit4]   2> 91356 INFO  (coreLoadExecutor-629-thread-1-processing-n:127.0.0.1:50783__tg%2Fi) [n:127.0.0.1:50783__tg%2Fi c:control_collection   x:collection1] o.a.s.c.c.ZkStateReader Load collection config from: [/collections/control_collection]
   [junit4]   2> 91357 INFO  (coreLoadExecutor-629-thread-1-processing-n:127.0.0.1:50783__tg%2Fi) [n:127.0.0.1:50783__tg%2Fi c:control_collection   x:collection1] o.a.s.c.c.ZkStateReader path=[/collections/control_collection] [configName]=[conf1] specified config exists in ZooKeeper
   [junit4]   2> 91357 INFO  (coreLoadExecutor-629-thread-1-processing-n:127.0.0.1:50783__tg%2Fi) [n:127.0.0.1:50783__tg%2Fi c:control_collection   x:collection1] o.a.s.c.SolrResourceLoader new SolrResourceLoader for directory: '/home/jenkins/workspace/Lucene-Solr-5.5-Linux/solr/build/solr-core/test/J1/temp/solr.cloud.DistribDocExpirationUpdateProcessorTest_6181E23CA939E6BF-001/control-001/cores/collection1'
   [junit4]   2> 91357 INFO  (coreLoadExecutor-629-thread-1-processing-n:127.0.0.1:50783__tg%2Fi) [n:127.0.0.1:50783__tg%2Fi c:control_collection   x:collection1] o.a.s.c.SolrResourceLoader JNDI not configured for solr (NoInitialContextEx)
   [junit4]   2> 91357 INFO  (coreLoadExecutor-629-thread-1-processing-n:127.0.0.1:50783__tg%2Fi) [n:127.0.0.1:50783__tg%2Fi c:control_collection   x:collection1] o.a.s.c.SolrResourceLoader solr home defaulted to 'solr/' (could not find system property or JNDI)
   [junit4]   2> 91358 INFO  (coreLoadExecutor-629-thread-1-processing-n:127.0.0.1:50783__tg%2Fi) [n:127.0.0.1:50783__tg%2Fi c:control_collection   x:collection1] o.a.s.c.Config loaded config solrconfig.xml with version 0 
   [junit4]   2> 91364 INFO  (coreLoadExecutor-629-thread-1-processing-n:127.0.0.1:50783__tg%2Fi) [n:127.0.0.1:50783__tg%2Fi c:control_collection   x:collection1] o.a.s.c.SolrConfig current version of requestparams : -1
   [junit4]   2> 91372 INFO  (coreLoadExecutor-629-thread-1-processing-n:127.0.0.1:50783__tg%2Fi) [n:127.0.0.1:50783__tg%2Fi c:control_collection   x:collection1] o.a.s.c.SolrConfig Using Lucene MatchVersion: 5.5.0
   [junit4]   2> 91387 INFO  (coreLoadExecutor-629-thread-1-processing-n:127.0.0.1:50783__tg%2Fi) [n:127.0.0.1:50783__tg%2Fi c:control_collection   x:collection1] o.a.s.c.SolrConfig Loaded SolrConfig: solrconfig.xml
   [junit4]   2> 91391 INFO  (coreLoadExecutor-629-thread-1-processing-n:127.0.0.1:50783__tg%2Fi) [n:127.0.0.1:50783__tg%2Fi c:control_collection   x:collection1] o.a.s.s.IndexSchema [collection1] Schema name=test
   [junit4]   2> 91521 INFO  (coreLoadExecutor-629-thread-1-processing-n:127.0.0.1:50783__tg%2Fi) [n:127.0.0.1:50783__tg%2Fi c:control_collection   x:collection1] o.a.s.s.IndexSchema default search field in schema is text
   [junit4]   2> 91521 INFO  (coreLoadExecutor-629-thread-1-processing-n:127.0.0.1:50783__tg%2Fi) [n:127.0.0.1:50783__tg%2Fi c:control_collection   x:collection1] o.a.s.s.IndexSchema unique key field: id
   [junit4]   2> 91522 INFO  (coreLoadExecutor-629-thread-1-processing-n:127.0.0.1:50783__tg%2Fi) [n:127.0.0.1:50783__tg%2Fi c:control_collection   x:collection1] o.a.s.s.FileExchangeRateProvider Reloading exchange rates from file currency.xml
   [junit4]   2> 91525 INFO  (coreLoadExecutor-629-thread-1-processing-n:127.0.0.1:50783__tg%2Fi) [n:127.0.0.1:50783__tg%2Fi c:control_collection   x:collection1] o.a.s.s.FileExchangeRateProvider Reloading exchange rates from file currency.xml
   [junit4]   2> 91546 INFO  (coreLoadExecutor-629-thread-1-processing-n:127.0.0.1:50783__tg%2Fi) [n:127.0.0.1:50783__tg%2Fi c:control_collection   x:collection1] o.a.s.c.ConfigSetProperties Did not find ConfigSet properties, assuming default properties: Can't find resource 'configsetprops.json' in classpath or '/configs/conf1', cwd=/home/jenkins/workspace/Lucene-Solr-5.5-Linux/solr/build/solr-core/test/J1
   [junit4]   2> 91546 INFO  (coreLoadExecutor-629-thread-1-processing-n:127.0.0.1:50783__tg%2Fi) [n:127.0.0.1:50783__tg%2Fi c:control_collection   x:collection1] o.a.s.c.CoreContainer Creating SolrCore 'collection1' using configuration from collection control_collection
   [junit4]   2> 91546 INFO  (coreLoadExecutor-629-thread-1-processing-n:127.0.0.1:50783__tg%2Fi) [n:127.0.0.1:50783__tg%2Fi c:control_collection s:shard1 r:core_node1 x:collection1] o.a.s.c.SolrCore org.apache.solr.core.MockDirectoryFactory
   [junit4]   2> 91546 INFO  (coreLoadExecutor-629-thread-1-processing-n:127.0.0.1:50783__tg%2Fi) [n:127.0.0.1:50783__tg%2Fi c:control_collection s:shard1 r:core_node1 x:collection1] o.a.s.c.SolrCore [[collection1] ] Opening new SolrCore at [/home/jenkins/workspace/Lucene-Solr-5.5-Linux/solr/build/solr-core/test/J1/temp/solr.cloud.DistribDocExpirationUpdateProcessorTest_6181E23CA939E6BF-001/control-001/cores/collection1], dataDir=[/home/jenkins/workspace/Lucene-Solr-5.5-Linux/solr/build/solr-core/test/J1/temp/solr.cloud.DistribDocExpirationUpdateProcessorTest_6181E23CA939E6BF-001/control-001/cores/collection1/data/]
   [junit4]   2> 91546 INFO  (coreLoadExecutor-629-thread-1-processing-n:127.0.0.1:50783__tg%2Fi) [n:127.0.0.1:50783__tg%2Fi c:control_collection s:shard1 r:core_node1 x:collection1] o.a.s.c.SolrCore JMX monitoring not detected for core: collection1
   [junit4]   2> 91547 INFO  (coreLoadExecutor-629-thread-1-processing-n:127.0.0.1:50783__tg%2Fi) [n:127.0.0.1:50783__tg%2Fi c:control_collection s:shard1 r:core_node1 x:collection1] o.a.s.c.CachingDirectoryFactory return new directory for /home/jenkins/workspace/Lucene-Solr-5.5-Linux/solr/build/solr-core/test/J1/temp/solr.cloud.DistribDocExpirationUpdateProcessorTest_6181E23CA939E6BF-001/control-001/cores/collection1/data
   [junit4]   2> 91547 INFO  (coreLoadExecutor-629-thread-1-processing-n:127.0.0.1:50783__tg%2Fi) [n:127.0.0.1:50783__tg%2Fi c:control_collection s:shard1 r:core_node1 x:collection1] o.a.s.c.SolrCore New index directory detected: old=null new=/home/jenkins/workspace/Lucene-Solr-5.5-Linux/solr/build/solr-core/test/J1/temp/solr.cloud.DistribDocExpirationUpdateProcessorTest_6181E23CA939E6BF-001/control-001/cores/collection1/data/index/
   [junit4]   2> 91547 WARN  (coreLoadExecutor-629-thread-1-processing-n:127.0.0.1:50783__tg%2Fi) [n:127.0.0.1:50783__tg%2Fi c:control_collection s:shard1 r:core_node1 x:collection1] o.a.s.c.SolrCore [collection1] Solr index directory '/home/jenkins/workspace/Lucene-Solr-5.5-Linux/solr/build/solr-core/test/J1/temp/solr.cloud.DistribDocExpirationUpdateProcessorTest_6181E23CA939E6BF-001/control-001/cores/collection1/data/index' doesn't exist. Creating new index...
   [junit4]   2> 91547 INFO  (coreLoadExecutor-629-thread-1-processing-n:127.0.0.1:50783__tg%2Fi) [n:127.0.0.1:50783__tg%2Fi c:control_collection s:shard1 r:core_node1 x:collection1] o.a.s.c.CachingDirectoryFactory return new directory for /home/jenkins/workspace/Lucene-Solr-5.5-Linux/solr/build/solr-core/test/J1/temp/solr.cloud.DistribDocExpirationUpdateProcessorTest_6181E23CA939E6BF-001/control-001/cores/collection1/data/index
   [junit4]   2> 91548 INFO  (coreLoadExecutor-629-thread-1-processing-n:127.0.0.1:50783__tg%2Fi) [n:127.0.0.1:50783__tg%2Fi c:control_collection s:shard1 r:core_node1 x:collection1] o.a.s.u.RandomMergePolicy RandomMergePolicy wrapping class org.apache.lucene.index.TieredMergePolicy: [TieredMergePolicy: maxMergeAtOnce=15, maxMergeAtOnceExplicit=49, maxMergedSegmentMB=7.2685546875, floorSegmentMB=0.65234375, forceMergeDeletesPctAllowed=21.362411979659228, segmentsPerTier=16.0, maxCFSSegmentSizeMB=8.796093022207999E12, noCFSRatio=1.0
   [junit4]   2> 91548 INFO  (coreLoadExecutor-629-thread-1-processing-n:127.0.0.1:50783__tg%2Fi) [n:127.0.0.1:50783__tg%2Fi c:control_collection s:shard1 r:core_node1 x:collection1] o.a.s.c.SolrDeletionPolicy SolrDeletionPolicy.onCommit: commits: num=1
   [junit4]   2> 	commit{dir=MockDirectoryWrapper(RAMDirectory@54a67dda lockFactory=org.apache.lucene.store.SingleInstanceLockFactory@7e909ea0),segFN=segments_1,generation=1}
   [junit4]   2> 91548 INFO  (coreLoadExecutor-629-thread-1-processing-n:127.0.0.1:50783__tg%2Fi) [n:127.0.0.1:50783__tg%2Fi c:control_collection s:shard1 r:core_node1 x:collection1] o.a.s.c.SolrDeletionPolicy newest commit generation = 1
   [junit4]   2> 91549 INFO  (OldIndexDirectoryCleanupThreadForCore-collection1) [n:127.0.0.1:50783__tg%2Fi c:control_collection s:shard1 r:core_node1 x:collection1] o.a.s.c.SolrCore Looking for old index directories to cleanup for core collection1 in /home/jenkins/workspace/Lucene-Solr-5.5-Linux/solr/build/solr-core/test/J1/temp/solr.cloud.DistribDocExpirationUpdateProcessorTest_6181E23CA939E6BF-001/control-001/cores/collection1/data/
   [junit4]   2> 91549 WARN  (OldIndexDirectoryCleanupThreadForCore-collection1) [n:127.0.0.1:50783__tg%2Fi c:control_collection s:shard1 r:core_node1 x:collection1] o.a.s.c.DirectoryFactory /home/jenkins/workspace/Lucene-Solr-5.5-Linux/solr/build/solr-core/test/J1/temp/solr.cloud.DistribDocExpirationUpdateProcessorTest_6181E23CA939E6BF-001/control-001/cores/collection1/data/ does not point to a valid data directory; skipping clean-up of old index directories.
   [junit4]   2> 91551 INFO  (coreLoadExecutor-629-thread-1-processing-n:127.0.0.1:50783__tg%2Fi) [n:127.0.0.1:50783__tg%2Fi c:control_collection s:shard1 r:core_node1 x:collection1] o.a.s.u.p.UpdateRequestProcessorChain creating updateRequestProcessorChain "convert-ttl-defaults"
   [junit4]   2> 91570 INFO  (coreLoadExecutor-629-thread-1-processing-n:127.0.0.1:50783__tg%2Fi) [n:127.0.0.1:50783__tg%2Fi c:control_collection s:shard1 r:core_node1 x:collection1] o.a.s.u.p.UpdateRequestProcessorChain creating updateRequestProcessorChain "convert-ttl-field"
   [junit4]   2> 91581 INFO  (coreLoadExecutor-629-thread-1-processing-n:127.0.0.1:50783__tg%2Fi) [n:127.0.0.1:50783__tg%2Fi c:control_collection s:shard1 r:core_node1 x:collection1] o.a.s.u.p.UpdateRequestProcessorChain creating updateRequestProcessorChain "convert-ttl-param"
   [junit4]   2> 91581 INFO  (coreLoadExecutor-629-thread-1-processing-n:127.0.0.1:50783__tg%2Fi) [n:127.0.0.1:50783__tg%2Fi c:control_collection s:shard1 r:core_node1 x:collection1] o.a.s.u.p.UpdateRequestProcessorChain creating updateRequestProcessorChain "convert-ttl-field-with-param-default"
   [junit4]   2> 91581 INFO  (coreLoadExecutor-629-thread-1-processing-n:127.0.0.1:50783__tg%2Fi) [n:127.0.0.1:50783__tg%2Fi c:control_collection s:shard1 r:core_node1 x:collection1] o.a.s.u.p.UpdateRequestProcessorChain creating updateRequestProcessorChain "scheduled-delete" (default)
   [junit4]   2> 91601 INFO  (coreLoadExecutor-629-thread-1-processing-n:127.0.0.1:50783__tg%2Fi) [n:127.0.0.1:50783__tg%2Fi c:control_collection s:shard1 r:core_node1 x:collection1] o.a.s.u.p.UpdateRequestProcessorChain inserting DistributedUpdateProcessorFactory into updateRequestProcessorChain "scheduled-delete" (default)
   [junit4]   2> 91604 INFO  (coreLoadExecutor-629-thread-1-processing-n:127.0.0.1:50783__tg%2Fi) [n:127.0.0.1:50783__tg%2Fi c:control_collection s:shard1 r:core_node1 x:collection1] o.a.s.h.l.XMLLoader xsltCacheLifetimeSeconds=60
   [junit4]   2> 91605 INFO  (coreLoadExecutor-629-thread-1-processing-n:127.0.0.1:50783__tg%2Fi) [n:127.0.0.1:50783__tg%2Fi c:control_collection s:shard1 r:core_node1 x:collection1] o.a.s.h.l.XMLLoader xsltCacheLifetimeSeconds=60
   [junit4]   2> 91606 INFO  (coreLoadExecutor-629-thread-1-processing-n:127.0.0.1:50783__tg%2Fi) [n:127.0.0.1:50783__tg%2Fi c:control_collection s:shard1 r:core_node1 x:collection1] o.a.s.h.l.XMLLoader xsltCacheLifetimeSeconds=60
   [junit4]   2> 91607 INFO  (coreLoadExecutor-629-thread-1-processing-n:127.0.0.1:50783__tg%2Fi) [n:127.0.0.1:50783__tg%2Fi c:control_collection s:shard1 r:core_node1 x:collection1] o.a.s.h.l.XMLLoader xsltCacheLifetimeSeconds=60
   [junit4]   2> 91609 INFO  (coreLoadExecutor-629-thread-1-processing-n:127.0.0.1:50783__tg%2Fi) [n:127.0.0.1:50783__tg%2Fi c:control_collection s:shard1 r:core_node1 x:collection1] o.a.s.c.RequestHandlers Registered paths: /admin/ping,/update/json,/admin/segments,/admin/plugins,/admin/mbeans,/replication,/admin/file,/update/json/docs,/update/csv,/admin/properties,/get,/config,/admin/threads,/schema,/update,,/select,/admin/logging,/admin/system,/admin/luke
   [junit4]   2> 91611 INFO  (coreLoadExecutor-629-thread-1-processing-n:127.0.0.1:50783__tg%2Fi) [n:127.0.0.1:50783__tg%2Fi c:control_collection s:shard1 r:core_node1 x:collection1] o.a.s.c.SolrCore Using default statsCache cache: org.apache.solr.search.stats.LocalStatsCache
   [junit4]   2> 91611 INFO  (coreLoadExecutor-629-thread-1-processing-n:127.0.0.1:50783__tg%2Fi) [n:127.0.0.1:50783__tg%2Fi c:control_collection s:shard1 r:core_node1 x:collection1] o.a.s.u.UpdateHandler Using UpdateLog implementation: org.apache.solr.update.UpdateLog
   [junit4]   2> 91611 INFO  (coreLoadExecutor-629-thread-1-processing-n:127.0.0.1:50783__tg%2Fi) [n:127.0.0.1:50783__tg%2Fi c:control_collection s:shard1 r:core_node1 x:collection1] o.a.s.u.UpdateLog Initializing UpdateLog: dataDir= defaultSyncLevel=FLUSH numRecordsToKeep=100 maxNumLogsToKeep=10 numVersionBuckets=65536
   [junit4]   2> 91612 INFO  (coreLoadExecutor-629-thread-1-processing-n:127.0.0.1:50783__tg%2Fi) [n:127.0.0.1:50783__tg%2Fi c:control_collection s:shard1 r:core_node1 x:collection1] o.a.s.u.CommitTracker Hard AutoCommit: disabled
   [junit4]   2> 91612 INFO  (coreLoadExecutor-629-thread-1-processing-n:127.0.0.1:50783__tg%2Fi) [n:127.0.0.1:50783__tg%2Fi c:control_collection s:shard1 r:core_node1 x:collection1] o.a.s.u.CommitTracker Soft AutoCommit: disabled
   [junit4]   2> 91613 INFO  (coreLoadExecutor-629-thread-1-processing-n:127.0.0.1:50783__tg%2Fi) [n:127.0.0.1:50783__tg%2Fi c:control_collection s:shard1 r:core_node1 x:collection1] o.a.s.u.RandomMergePolicy RandomMergePolicy wrapping class org.apache.lucene.index.LogByteSizeMergePolicy: [LogByteSizeMergePolicy: minMergeSize=1677721, mergeFactor=28, maxMergeSize=2147483648, maxMergeSizeForForcedMerge=9223372036854775807, calibrateSizeByDeletes=true, maxMergeDocs=2147483647, maxCFSSegmentSizeMB=8.796093022207999E12, noCFSRatio=0.2173196920932754]
   [junit4]   2> 91613 INFO  (coreLoadExecutor-629-thread-1-processing-n:127.0.0.1:50783__tg%2Fi) [n:127.0.0.1:50783__tg%2Fi c:control_collection s:shard1 r:core_node1 x:collection1] o.a.s.c.SolrDeletionPolicy SolrDeletionPolicy.onInit: commits: num=1
   [junit4]   2> 	commit{dir=MockDirectoryWrapper(RAMDirectory@54a67dda lockFactory=org.apache.lucene.store.SingleInstanceLockFactory@7e909ea0),segFN=segments_1,generation=1}
   [junit4]   2> 91613 INFO  (coreLoadExecutor-629-thread-1-processing-n:127.0.0.1:50783__tg%2Fi) [n:127.0.0.1:50783__tg%2Fi c:control_collection s:shard1 r:core_node1 x:collection1] o.a.s.c.SolrDeletionPolicy newest commit generation = 1
   [junit4]   2> 91614 INFO  (coreLoadExecutor-629-thread-1-processing-n:127.0.0.1:50783__tg%2Fi) [n:127.0.0.1:50783__tg%2Fi c:control_collection s:shard1 r:core_node1 x:collection1] o.a.s.s.SolrIndexSearcher Opening Searcher@3cff58ec[collection1] main
   [junit4]   2> 91614 INFO  (coreLoadExecutor-629-thread-1-processing-n:127.0.0.1:50783__tg%2Fi) [n:127.0.0.1:50783__tg%2Fi c:control_collection s:shard1 r:core_node1 x:collection1] o.a.s.c.c.ZkStateReader Load collection config from: [/collections/control_collection]
   [junit4]   2> 91615 INFO  (coreLoadExecutor-629-thread-1-processing-n:127.0.0.1:50783__tg%2Fi) [n:127.0.0.1:50783__tg%2Fi c:control_collection s:shard1 r:core_node1 x:collection1] o.a.s.c.c.ZkStateReader path=[/collections/control_collection] [configName]=[conf1] specified config exists in ZooKeeper
   [junit4]   2> 91615 INFO  (coreLoadExecutor-629-thread-1-processing-n:127.0.0.1:50783__tg%2Fi) [n:127.0.0.1:50783__tg%2Fi c:control_collection s:shard1 r:core_node1 x:collection1] o.a.s.r.ManagedResourceStorage Setting up ZooKeeper-based storage for the RestManager with znodeBase: /configs/conf1
   [junit4]   2> 91615 INFO  (coreLoadExecutor-629-thread-1-processing-n:127.0.0.1:50783__tg%2Fi) [n:127.0.0.1:50783__tg%2Fi c:control_collection s:shard1 r:core_node1 x:collection1] o.a.s.r.ManagedResourceStorage Configured ZooKeeperStorageIO with znodeBase: /configs/conf1
   [junit4]   2> 91615 INFO  (coreLoadExecutor-629-thread-1-processing-n:127.0.0.1:50783__tg%2Fi) [n:127.0.0.1:50783__tg%2Fi c:control_collection s:shard1 r:core_node1 x:collection1] o.a.s.r.RestManager Initializing RestManager with initArgs: {}
   [junit4]   2> 91615 INFO  (coreLoadExecutor-629-thread-1-processing-n:127.0.0.1:50783__tg%2Fi) [n:127.0.0.1:50783__tg%2Fi c:control_collection s:shard1 r:core_node1 x:collection1] o.a.s.r.ManagedResourceStorage Reading _rest_managed.json using ZooKeeperStorageIO:path=/configs/conf1
   [junit4]   2> 91615 INFO  (coreLoadExecutor-629-thread-1-processing-n:127.0.0.1:50783__tg%2Fi) [n:127.0.0.1:50783__tg%2Fi c:control_collection s:shard1 r:core_node1 x:collection1] o.a.s.r.ManagedResourceStorage No data found for znode /configs/conf1/_rest_managed.json
   [junit4]   2> 91615 INFO  (coreLoadExecutor-629-thread-1-processing-n:127.0.0.1:50783__tg%2Fi) [n:127.0.0.1:50783__tg%2Fi c:control_collection s:shard1 r:core_node1 x:collection1] o.a.s.r.ManagedResourceStorage Loaded null at path _rest_managed.json using ZooKeeperStorageIO:path=/configs/conf1
   [junit4]   2> 91616 INFO  (coreLoadExecutor-629-thread-1-processing-n:127.0.0.1:50783__tg%2Fi) [n:127.0.0.1:50783__tg%2Fi c:control_collection s:shard1 r:core_node1 x:collection1] o.a.s.r.RestManager Initializing 0 registered ManagedResources
   [junit4]   2> 91619 INFO  (coreLoadExecutor-629-thread-1-processing-n:127.0.0.1:50783__tg%2Fi) [n:127.0.0.1:50783__tg%2Fi c:control_collection s:shard1 r:core_node1 x:collection1] o.a.s.h.ReplicationHandler Commits will be reserved for  10000
   [junit4]   2> 91619 INFO  (coreLoadExecutor-629-thread-1-processing-n:127.0.0.1:50783__tg%2Fi) [n:127.0.0.1:50783__tg%2Fi c:control_collection s:shard1 r:core_node1 x:collection1] o.a.s.u.UpdateLog Looking up max value of version field to seed version buckets
   [junit4]   2> 91619 INFO  (searcherExecutor-630-thread-1-processing-s:shard1 x:collection1 r:core_node1 c:control_collection n:127.0.0.1:50783__tg%2Fi) [n:127.0.0.1:50783__tg%2Fi c:control_collection s:shard1 r:core_node1 x:collection1] o.a.s.c.SolrCore [collection1] Registered new searcher Searcher@3cff58ec[collection1] main{ExitableDirectoryReader(UninvertingDirectoryReader())}
   [junit4]   2> 91619 INFO  (coreLoadExecutor-629-thread-1-processing-n:127.0.0.1:50783__tg%2Fi) [n:127.0.0.1:50783__tg%2Fi c:control_collection s:shard1 r:core_node1 x:collection1] o.a.s.u.VersionInfo Refreshing highest value of _version_ for 65536 version buckets from index
   [junit4]   2> 91619 INFO  (coreLoadExecutor-629-thread-1-processing-n:127.0.0.1:50783__tg%2Fi) [n:127.0.0.1:50783__tg%2Fi c:control_collection s:shard1 r:core_node1 x:collection1] o.a.s.u.VersionInfo No terms found for _version_, cannot seed version bucket highest value from index
   [junit4]   2> 91619 INFO  (coreLoadExecutor-629-thread-1-processing-n:127.0.0.1:50783__tg%2Fi) [n:127.0.0.1:50783__tg%2Fi c:control_collection s:shard1 r:core_node1 x:collection1] o.a.s.u.UpdateLog Could not find max version in index or recent updates, using new clock 1526400799021727744
   [junit4]   2> 91621 INFO  (coreLoadExecutor-629-thread-1-processing-n:127.0.0.1:50783__tg%2Fi) [n:127.0.0.1:50783__tg%2Fi c:control_collection s:shard1 r:core_node1 x:collection1] o.a.s.u.UpdateLog Took 2.0ms to seed version buckets with highest version 1526400799021727744
   [junit4]   2> 91622 INFO  (coreLoadExecutor-629-thread-1-processing-n:127.0.0.1:50783__tg%2Fi) [n:127.0.0.1:50783__tg%2Fi c:control_collection s:shard1 r:core_node1 x:collection1] o.a.s.c.ZkController watch zkdir /configs/conf1
   [junit4]   2> 91622 INFO  (coreLoadExecutor-629-thread-1-processing-n:127.0.0.1:50783__tg%2Fi) [n:127.0.0.1:50783__tg%2Fi c:control_collection s:shard1 r:core_node1 x:collection1] o.a.s.c.CoreContainer registering core: collection1
   [junit4]   2> 91623 INFO  (coreZkRegister-623-thread-1-processing-s:shard1 x:collection1 r:core_node1 c:control_collection n:127.0.0.1:50783__tg%2Fi) [n:127.0.0.1:50783__tg%2Fi c:control_collection s:shard1 r:core_node1 x:collection1] o.a.s.c.ZkController Register replica - core:collection1 address:http://127.0.0.1:50783/_tg/i collection:control_collection shard:shard1
   [junit4]   2> 91623 INFO  (coreZkRegister-623-thread-1-processing-s:shard1 x:collection1 r:core_node1 c:control_collection n:127.0.0.1:50783__tg%2Fi) [n:127.0.0.1:50783__tg%2Fi c:control_collection s:shard1 r:core_node1 x:collection1] o.a.s.c.c.SolrZkClient makePath: /collections/control_collection/leader_elect/shard1/election
   [junit4]   2> 91626 INFO  (coreZkRegister-623-thread-1-processing-s:shard1 x:collection1 r:core_node1 c:control_collection n:127.0.0.1:50783__tg%2Fi) [n:127.0.0.1:50783__tg%2Fi c:control_collection s:shard1 r:core_node1 x:collection1] o.a.s.c.LeaderElector Joined leadership election with path: /collections/control_collection/leader_elect/shard1/election/95400049838981124-core_node1-n_0000000000
   [junit4]   2> 91626 INFO  (coreZkRegister-623-thread-1-processing-s:shard1 x:collection1 r:core_node1 c:control_collection n:127.0.0.1:50783__tg%2Fi) [n:127.0.0.1:50783__tg%2Fi c:control_collection s:shard1 r:core_node1 x:collection1] o.a.s.c.ShardLeaderElectionContext Running the leader process for shard=shard1 and weAreReplacement=false and leaderVoteWait=10000
   [junit4]   2> 91628 INFO  (coreZkRegister-623-thread-1-processing-s:shard1 x:collection1 r:core_node1 c:control_collection n:127.0.0.1:50783__tg%2Fi) [n:127.0.0.1:50783__tg%2Fi c:control_collection s:shard1 r:core_node1 x:collection1] o.a.s.c.ShardLeaderElectionContext Enough replicas found to continue.
   [junit4]   2> 91628 INFO  (coreZkRegister-623-thread-1-processing-s:shard1 x:collection1 r:core_node1 c:control_collection n:127.0.0.1:50783__tg%2Fi) [n:127.0.0.1:50783__tg%2Fi c:control_collection s:shard1 r:core_node1 x:collection1] o.a.s.c.ShardLeaderElectionContext I may be the new leader - try and sync
   [junit4]   2> 91628 INFO  (coreZkRegister-623-thread-1-processing-s:shard1 x:collection1 r:core_node1 c:control_collection n:127.0.0.1:50783__tg%2Fi) [n:127.0.0.1:50783__tg%2Fi c:control_collection s:shard1 r:core_node1 x:collection1] o.a.s.c.SyncStrategy Sync replicas to http://127.0.0.1:50783/_tg/i/collection1/
   [junit4]   2> 91628 INFO  (coreZkRegister-623-thread-1-processing-s:shard1 x:collection1 r:core_node1 c:control_collection n:127.0.0.1:50783__tg%2Fi) [n:127.0.0.1:50783__tg%2Fi c:control_collection s:shard1 r:core_node1 x:collection1] o.a.s.c.SyncStrategy Sync Success - now sync replicas to me
   [junit4]   2> 91628 INFO  (coreZkRegister-623-thread-1-processing-s:shard1 x:collection1 r:core_node1 c:control_collection n:127.0.0.1:50783__tg%2Fi) [n:127.0.0.1:50783__tg%2Fi c:control_collection s:shard1 r:core_node1 x:collection1] o.a.s.c.SyncStrategy http://127.0.0.1:50783/_tg/i/collection1/ has no replicas
   [junit4]   2> 91628 INFO  (OverseerStateUpdate-95400049838981124-127.0.0.1:50783__tg%2Fi-n_0000000000) [n:127.0.0.1:50783__tg%2Fi    ] o.a.s.c.Overseer processMessage: queueSize: 1, message = {
   [junit4]   2>   "operation":"leader",
   [junit4]   2>   "shard":"shard1",
   [junit4]   2>   "collection":"control_collection"} current state version: 1
   [junit4]   2> 91628 INFO  (coreZkRegister-623-thread-1-processing-s:shard1 x:collection1 r:core_node1 c:control_collection n:127.0.0.1:50783__tg%2Fi) [n:127.0.0.1:50783__tg%2Fi c:control_collection s:shard1 r:core_node1 x:collection1] o.a.s.c.c.SolrZkClient makePath: /collections/control_collection/leaders/shard1
   [junit4]   2> 91630 INFO  (coreZkRegister-623-thread-1-processing-s:shard1 x:collection1 r:core_node1 c:control_collection n:127.0.0.1:50783__tg%2Fi) [n:127.0.0.1:50783__tg%2Fi c:control_collection s:shard1 r:core_node1 x:collection1] o.a.s.c.ShardLeaderElectionContextBase Creating leader registration node
   [junit4]   2> 91631 INFO  (coreZkRegister-623-thread-1-processing-s:shard1 x:collection1 r:core_node1 c:control_collection n:127.0.0.1:50783__tg%2Fi) [n:127.0.0.1:50783__tg%2Fi c:control_collection s:shard1 r:core_node1 x:collection1] o.a.s.c.ShardLeaderElectionContext I am the new leader: http://127.0.0.1:50783/_tg/i/collection1/ shard1
   [junit4]   2> 91632 INFO  (OverseerStateUpdate-95400049838981124-127.0.0.1:50783__tg%2Fi-n_0000000000) [n:127.0.0.1:50783__tg%2Fi    ] o.a.s.c.Overseer processMessage: queueSize: 1, message = {
   [junit4]   2>   "operation":"leader",
   [junit4]   2>   "shard":"shard1",
   [junit4]   2>   "collection":"control_collection",
   [junit4]   2>   "base_url":"http://127.0.0.1:50783/_tg/i",
   [junit4]   2>   "core":"collection1",
   [junit4]   2>   "state":"active"} current state version: 1
   [junit4]   2> 91734 INFO  (zkCallback-139-thread-1-processing-n:127.0.0.1:50783__tg%2Fi) [n:127.0.0.1:50783__tg%2Fi    ] o.a.s.c.c.ZkStateReader A cluster state change: [WatchedEvent state:SyncConnected type:NodeDataChanged path:/clusterstate.json], has occurred - updating... (live nodes size: [1])
   [junit4]   2> 91782 INFO  (coreZkRegister-623-thread-1-processing-s:shard1 x:collection1 r:core_node1 c:control_collection n:127.0.0.1:50783__tg%2Fi) [n:127.0.0.1:50783__tg%2Fi c:control_collection s:shard1 r:core_node1 x:collection1] o.a.s.c.ZkController We are http://127.0.0.1:50783/_tg/i/collection1/ and leader is http://127.0.0.1:50783/_tg/i/collection1/
   [junit4]   2> 91782 INFO  (coreZkRegister-623-thread-1-processing-s:shard1 x:collection1 r:core_node1 c:control_collection n:127.0.0.1:50783__tg%2Fi) [n:127.0.0.1:50783__tg%2Fi c:control_collection s:shard1 r:core_node1 x:collection1] o.a.s.c.ZkController No LogReplay needed for core=collection1 baseURL=http://127.0.0.1:50783/_tg/i
   [junit4]   2> 91782 INFO  (coreZkRegister-623-thread-1-processing-s:shard1 x:collection1 r:core_node1 c:control_collection n:127.0.0.1:50783__tg%2Fi) [n:127.0.0.1:50783__tg%2Fi c:control_collection s:shard1 r:core_node1 x:collection1] o.a.s.c.ZkController I am the leader, no recovery necessary
   [junit4]   2> 91782 INFO  (coreZkRegister-623-thread-1-processing-s:shard1 x:collection1 r:core_node1 c:control_collection n:127.0.0.1:50783__tg%2Fi) [n:127.0.0.1:50783__tg%2Fi c:control_collection s:shard1 r:core_node1 x:collection1] o.a.s.c.ZkController publishing state=active
   [junit4]   2> 91782 INFO  (coreZkRegister-623-thread-1-processing-s:shard1 x:collection1 r:core_node1 c:control_collection n:127.0.0.1:50783__tg%2Fi) [n:127.0.0.1:50783__tg%2Fi c:control_collection s:shard1 r:core_node1 x:collection1] o.a.s.c.ZkController numShards not found on descriptor - reading it from system property
   [junit4]   2> 91785 INFO  (OverseerStateUpdate-95400049838981124-127.0.0.1:50783__tg%2Fi-n_0000000000) [n:127.0.0.1:50783__tg%2Fi    ] o.a.s.c.Overseer processMessage: queueSize: 1, message = {
   [junit4]   2>   "operation":"state",
   [junit4]   2>   "core_node_name":"core_node1",
   [junit4]   2>   "shard":"shard1",
   [junit4]   2>   "roles":null,
   [junit4]   2>   "numShards":"1",
   [junit4]   2>   "state":"active",
   [junit4]   2>   "core":"collection1",
   [junit4]   2>   "base_url":"http://127.0.0.1:50783/_tg/i",
   [junit4]   2>   "collection":"control_collection",
   [junit4]   2>   "node_name":"127.0.0.1:50783__tg%2Fi"} current state version: 2
   [junit4]   2> 91785 INFO  (OverseerStateUpdate-95400049838981124-127.0.0.1:50783__tg%2Fi-n_0000000000) [n:127.0.0.1:50783__tg%2Fi    ] o.a.s.c.o.ReplicaMutator Update state numShards=1 message={
   [junit4]   2>   "operation":"state",
   [junit4]   2>   "core_node_name":"core_node1",
   [junit4]   2>   "shard":"shard1",
   [junit4]   2>   "roles":null,
   [junit4]   2>   "numShards":"1",
   [junit4]   2>   "state":"active",
   [junit4]   2>   "core":"collection1",
   [junit4]   2>   "base_url":"http://127.0.0.1:50783/_tg/i",
   [junit4]   2>   "collection":"control_collection",
   [junit4]   2>   "node_name":"127.0.0.1:50783__tg%2Fi"}
   [junit4]   2> 91855 INFO  (TEST-DistribDocExpirationUpdateProcessorTest.test-seed#[6181E23CA939E6BF]) [    ] o.a.s.c.c.SolrZkClient Using default ZkCredentialsProvider
   [junit4]   2> 91855 INFO  (TEST-DistribDocExpirationUpdateProcessorTest.test-seed#[6181E23CA939E6BF]) [    ] o.a.s.c.c.ConnectionManager Waiting for client to connect to ZooKeeper
   [junit4]   2> 91857 INFO  (zkCallback-141-thread-1) [    ] o.a.s.c.c.ConnectionManager Watcher org.apache.solr.common.cloud.ConnectionManager@285b8886 name:ZooKeeperConnection Watcher:127.0.0.1:58462/solr got event WatchedEvent state:SyncConnected type:None path:null path:null type:None
   [junit4]   2> 91857 INFO  (TEST-DistribDocExpirationUpdateProcessorTest.test-seed#[6181E23CA939E6BF]) [    ] o.a.s.c.c.ConnectionManager Client is connected to ZooKeeper
   [junit4]   2> 91857 INFO  (TEST-DistribDocExpirationUpdateProcessorTest.test-seed#[6181E23CA939E6BF]) [    ] o.a.s.c.c.SolrZkClient Using default ZkACLProvider
   [junit4]   2> 91857 INFO  (TEST-DistribDocExpirationUpdateProcessorTest.test-seed#[6181E23CA939E6BF]) [    ] o.a.s.c.c.ZkStateReader Updating cluster state from ZooKeeper... 
   [junit4]   2> 91859 INFO  (TEST-DistribDocExpirationUpdateProcessorTest.test-seed#[6181E23CA939E6BF]) [    ] o.a.s.c.ChaosMonkey monkey: init - expire sessions:false cause connection loss:false
   [junit4]   2> 91888 INFO  (zkCallback-139-thread-1-processing-n:127.0.0.1:50783__tg%2Fi) [n:127.0.0.1:50783__tg%2Fi    ] o.a.s.c.c.ZkStateReader A cluster state change: [WatchedEvent state:SyncConnected type:NodeDataChanged path:/clusterstate.json], has occurred - updating... (live nodes size: [1])
   [junit4]   2> 91888 INFO  (zkCallback-141-thread-1) [    ] o.a.s.c.c.ZkStateReader A cluster state change: [WatchedEvent state:SyncConnected type:NodeDataChanged path:/clusterstate.json], has occurred - updating... (live nodes size: [1])
   [junit4]   2> 91912 INFO  (TEST-DistribDocExpirationUpdateProcessorTest.test-seed#[6181E23CA939E6BF]) [    ] o.a.s.SolrTestCaseJ4 Writing core.properties file to /home/jenkins/workspace/Lucene-Solr-5.5-Linux/solr/build/solr-core/test/J1/temp/solr.cloud.DistribDocExpirationUpdateProcessorTest_6181E23CA939E6BF-001/shard-1-001/cores/collection1
   [junit4]   2> 91913 INFO  (TEST-DistribDocExpirationUpdateProcessorTest.test-seed#[6181E23CA939E6BF]) [    ] o.a.s.c.AbstractFullDistribZkTestBase create jetty 1 in directory /home/jenkins/workspace/Lucene-Solr-5.5-Linux/solr/build/solr-core/test/J1/temp/solr.cloud.DistribDocExpirationUpdateProcessorTest_6181E23CA939E6BF-001/shard-1-001
   [junit4]   2> 91914 INFO  (TEST-DistribDocExpirationUpdateProcessorTest.test-seed#[6181E23CA939E6BF]) [    ] o.e.j.s.Server jetty-9.2.13.v20150730
   [junit4]   2> 91915 INFO  (TEST-DistribDocExpirationUpdateProcessorTest.test-seed#[6181E23CA939E6BF]) [    ] o.e.j.s.h.ContextHandler Started o.e.j.s.ServletContextHandler@4618aa1d{/_tg/i,null,AVAILABLE}
   [junit4]   2> 91915 INFO  (TEST-DistribDocExpirationUpdateProcessorTest.test-seed#[6181E23CA939E6BF]) [    ] o.e.j.s.ServerConnector Started ServerConnector@21391e14{HTTP/1.1}{127.0.0.1:36422}
   [junit4]   2> 91915 INFO  (TEST-DistribDocExpirationUpdateProcessorTest.test-seed#[6181E23CA939E6BF]) [    ] o.e.j.s.Server Started @93404ms
   [junit4]   2> 91915 INFO  (TEST-DistribDocExpirationUpdateProcessorTest.test-seed#[6181E23CA939E6BF]) [    ] o.a.s.c.s.e.JettySolrRunner Jetty properties: {hostContext=/_tg/i, hostPort=36422, coreRootDirectory=/home/jenkins/workspace/Lucene-Solr-5.5-Linux/solr/build/solr-core/test/J1/temp/solr.cloud.DistribDocExpirationUpdateProcessorTest_6181E23CA939E6BF-001/shard-1-001/cores, solrconfig=solrconfig.xml, solr.data.dir=/home/jenkins/workspace/Lucene-Solr-5.5-Linux/solr/build/solr-core/test/J1/temp/solr.cloud.DistribDocExpirationUpdateProcessorTest_6181E23CA939E6BF-001/tempDir-001/jetty1}
   [junit4]   2> 91916 INFO  (TEST-DistribDocExpirationUpdateProcessorTest.test-seed#[6181E23CA939E6BF]) [    ] o.a.s.s.SolrDispatchFilter SolrDispatchFilter.init(): sun.misc.Launcher$AppClassLoader@1e893918
   [junit4]   2> 91916 INFO  (TEST-DistribDocExpirationUpdateProcessorTest.test-seed#[6181E23CA939E6BF]) [    ] o.a.s.c.SolrResourceLoader new SolrResourceLoader for directory: '/home/jenkins/workspace/Lucene-Solr-5.5-Linux/solr/build/solr-core/test/J1/temp/solr.cloud.DistribDocExpirationUpdateProcessorTest_6181E23CA939E6BF-001/shard-1-001'
   [junit4]   2> 91916 INFO  (TEST-DistribDocExpirationUpdateProcessorTest.test-seed#[6181E23CA939E6BF]) [    ] o.a.s.c.SolrResourceLoader JNDI not configured for solr (NoInitialContextEx)
   [junit4]   2> 91916 INFO  (TEST-DistribDocExpirationUpdateProcessorTest.test-seed#[6181E23CA939E6BF]) [    ] o.a.s.c.SolrResourceLoader solr home defaulted to 'solr/' (could not find system property or JNDI)
   [junit4]   2> 91916 INFO  (TEST-DistribDocExpirationUpdateProcessorTest.test-seed#[6181E23CA939E6BF]) [    ] o.a.s.c.c.SolrZkClient Using default ZkCredentialsProvider
   [junit4]   2> 91916 INFO  (TEST-DistribDocExpirationUpdateProcessorTest.test-seed#[6181E23CA939E6BF]) [    ] o.a.s.c.c.ConnectionManager Waiting for client to connect to ZooKeeper
   [junit4]   2> 91918 INFO  (zkCallback-142-thread-1) [    ] o.a.s.c.c.ConnectionManager Watcher org.apache.solr.common.cloud.ConnectionManager@32bdb3dc name:ZooKeeperConnection Watcher:127.0.0.1:58462/solr got event WatchedEvent state:SyncConnected type:None path:null path:null type:None
   [junit4]   2> 91918 INFO  (TEST-DistribDocExpirationUpdateProcessorTest.test-seed#[6181E23CA939E6BF]) [    ] o.a.s.c.c.ConnectionManager Client is connected to ZooKeeper
   [junit4]   2> 91918 INFO  (TEST-DistribDocExpirationUpdateProcessorTest.test-seed#[6181E23CA939E6BF]) [    ] o.a.s.c.c.SolrZkClient Using default ZkACLProvider
   [junit4]   2> 91919 INFO  (TEST-DistribDocExpirationUpdateProcessorTest.test-seed#[6181E23CA939E6BF]) [    ] o.a.s.s.SolrDispatchFilter Loading solr.xml from SolrHome (not found in ZooKeeper)
   [junit4]   2> 91919 INFO  (TEST-DistribDocExpirationUpdateProcessorTest.test-seed#[6181E23CA939E6BF]) [    ] o.a.s.c.SolrXmlConfig Loading container configuration from /home/jenkins/workspace/Lucene-Solr-5.5-Linux/solr/build/solr-core/test/J1/temp/solr.cloud.DistribDocExpirationUpdateProcessorTest_6181E23CA939E6BF-001/shard-1-001/solr.xml
   [junit4]   2> 91927 INFO  (TEST-DistribDocExpirationUpdateProcessorTest.test-seed#[6181E23CA939E6BF]) [    ] o.a.s.c.CorePropertiesLocator Config-defined core root directory: /home/jenkins/workspace/Lucene-Solr-5.5-Linux/solr/build/solr-core/test/J1/temp/solr.cloud.DistribDocExpirationUpdateProcessorTest_6181E23CA939E6BF-001/shard-1-001/cores
   [junit4]   2> 91927 INFO  (TEST-DistribDocExpirationUpdateProcessorTest.test-seed#[6181E23CA939E6BF]) [    ] o.a.s.c.CoreContainer New CoreContainer 172870629
   [junit4]   2> 91927 INFO  (TEST-DistribDocExpirationUpdateProcessorTest.test-seed#[6181E23CA939E6BF]) [    ] o.a.s.c.CoreContainer Loading cores into CoreContainer [instanceDir=/home/jenkins/workspace/Lucene-Solr-5.5-Linux/solr/build/solr-core/test/J1/temp/solr.cloud.DistribDocExpirationUpdateProcessorTest_6181E23CA939E6BF-001/shard-1-001]
   [junit4]   2> 91927 WARN  (TEST-DistribDocExpirationUpdateProcessorTest.test-seed#[6181E23CA939E6BF]) [    ] o.a.s.c.CoreContainer Couldn't add files from /home/jenkins/workspace/Lucene-Solr-5.5-Linux/solr/build/solr-core/test/J1/temp/solr.cloud.DistribDocExpirationUpdateProcessorTest_6181E23CA939E6BF-001/shard-1-001/lib to classpath: /home/jenkins/workspace/Lucene-Solr-5.5-Linux/solr/build/solr-core/test/J1/temp/solr.cloud.DistribDocExpirationUpdateProcessorTest_6181E23CA939E6BF-001/shard-1-001/lib
   [junit4]   2> 91928 INFO  (TEST-DistribDocExpirationUpdateProcessorTest.test-seed#[6181E23CA939E6BF]) [    ] o.a.s.h.c.HttpShardHandlerFactory created with socketTimeout : 90000,urlScheme : ,connTimeout : 15000,maxConnectionsPerHost : 20,maxConnections : 10000,corePoolSize : 0,maximumPoolSize : 2147483647,maxThreadIdleTime : 5,sizeOfQueue : -1,fairnessPolicy : false,useRetries : false,
   [junit4]   2> 91929 INFO  (TEST-DistribDocExpirationUpdateProcessorTest.test-seed#[6181E23CA939E6BF]) [    ] o.a.s.u.UpdateShardHandler Creating UpdateShardHandler HTTP client with params: socketTimeout=340000&connTimeout=45000&retry=true
   [junit4]   2> 91929 INFO  (TEST-DistribDocExpirationUpdateProcessorTest.test-seed#[6181E23CA939E6BF]) [    ] o.a.s.l.LogWatcher SLF4J impl is org.slf4j.impl.Log4jLoggerFactory
   [junit4]   2> 91929 INFO  (TEST-DistribDocExpirationUpdateProcessorTest.test-seed#[6181E23CA939E6BF]) [    ] o.a.s.l.LogWatcher Registering Log Listener [Log4j (org.slf4j.impl.Log4jLoggerFactory)]
   [junit4]   2> 91929 INFO  (TEST-DistribDocExpirationUpdateProcessorTest.test-seed#[6181E23CA939E6BF]) [    ] o.a.s.c.ZkContainer Zookeeper client=127.0.0.1:58462/solr
   [junit4]   2> 91929 INFO  (TEST-DistribDocExpirationUpdateProcessorTest.test-seed#[6181E23CA939E6BF]) [    ] o.a.s.c.ZkController zkHost includes chroot
   [junit4]   2> 91929 INFO  (TEST-DistribDocExpirationUpdateProcessorTest.test-seed#[6181E23CA939E6BF]) [    ] o.a.s.c.c.SolrZkClient Using default ZkCredentialsProvider
   [junit4]   2> 91930 INFO  (TEST-DistribDocExpirationUpdateProcessorTest.test-seed#[6181E23CA939E6BF]) [    ] o.a.s.c.c.ConnectionManager Waiting for client to connect to ZooKeeper
   [junit4]   2> 91931 INFO  (zkCallback-145-thread-1) [    ] o.a.s.c.c.ConnectionManager Watcher org.apache.solr.common.cloud.ConnectionManager@4d37fd48 name:ZooKeeperConnection Watcher:127.0.0.1:58462 got event WatchedEvent state:SyncConnected type:None path:null path:null type:None
   [junit4]   2> 91931 INFO  (TEST-DistribDocExpirationUpdateProcessorTest.test-seed#[6181E23CA939E6BF]) [    ] o.a.s.c.c.ConnectionManager Client is connected to ZooKeeper
   [junit4]   2> 91931 INFO  (TEST-DistribDocExpirationUpdateProcessorTest.test-seed#[6181E23CA939E6BF]) [    ] o.a.s.c.c.SolrZkClient Using default ZkACLProvider
   [junit4]   2> 91932 INFO  (TEST-DistribDocExpirationUpdateProcessorTest.test-seed#[6181E23CA939E6BF]) [n:127.0.0.1:36422__tg%2Fi    ] o.a.s.c.c.ConnectionManager Waiting for client to connect to ZooKeeper
   [junit4]   2> 91934 INFO  (zkCallback-146-thread-1-processing-n:127.0.0.1:36422__tg%2Fi) [n:127.0.0.1:36422__tg%2Fi    ] o.a.s.c.c.ConnectionManager Watcher org.apache.solr.common.cloud.ConnectionManager@c800f96 name:ZooKeeperConnection Watcher:127.0.0.1:58462/solr got event WatchedEvent state:SyncConnected type:None path:null path:null type:None
   [junit4]   2> 91934 INFO  (TEST-DistribDocExpirationUpdateProcessorTest.test-seed#[6181E23CA939E6BF]) [n:127.0.0.1:36422__tg%2Fi    ] o.a.s.c.c.ConnectionManager Client is connected to ZooKeeper
   [junit4]   2> 91938 INFO  (TEST-DistribDocExpirationUpdateProcessorTest.test-seed#[6181E23CA939E6BF]) [n:127.0.0.1:36422__tg%2Fi    ] o.a.s.c.c.ZkStateReader Updating cluster state from ZooKeeper... 
   [junit4]   2> 92942 INFO  (TEST-DistribDocExpirationUpdateProcessorTest.test-seed#[6181E23CA939E6BF]) [n:127.0.0.1:36422__tg%2Fi    ] o.a.s.c.ZkController Register node as live in ZooKeeper:/live_nodes/127.0.0.1:36422__tg%2Fi
   [junit4]   2> 92942 INFO  (TEST-DistribDocExpirationUpdateProcessorTest.test-seed#[6181E23CA939E6BF]) [n:127.0.0.1:36422__tg%2Fi    ] o.a.s.c.c.SolrZkClient makePath: /live_nodes/127.0.0.1:36422__tg%2Fi
   [junit4]   2> 92943 INFO  (zkCallback-146-thread-1-processing-n:127.0.0.1:36422__tg%2Fi) [n:127.0.0.1:36422__tg%2Fi    ] o.a.s.c.c.ZkStateReader A live node change: [WatchedEvent state:SyncConnected type:NodeChildrenChanged path:/live_nodes], has occurred - updating... (live nodes size: [1])
   [junit4]   2> 92943 INFO  (zkCallback-139-thread-1-processing-n:127.0.0.1:50783__tg%2Fi) [n:127.0.0.1:50783__tg%2Fi    ] o.a.s.c.c.ZkStateReader A live node change: [WatchedEvent state:SyncConnected type:NodeChildrenChanged path:/live_nodes], has occurred - updating... (live nodes size: [1])
   [junit4]   2> 92943 INFO  (zkCallback-141-thread-1) [    ] o.a.s.c.c.ZkStateReader A live node change: [WatchedEvent state:SyncConnected type:NodeChildrenChanged path:/live_nodes], has occurred - updating... (live nodes size: [1])
   [junit4]   2> 92944 INFO  (TEST-DistribDocExpirationUpdateProcessorTest.test-seed#[6181E23CA939E6BF]) [n:127.0.0.1:36422__tg%2Fi    ] o.a.s.c.Overseer Overseer (id=null) closing
   [junit4]   2> 92944 INFO  (TEST-DistribDocExpirationUpdateProcessorTest.test-seed#[6181E23CA939E6BF]) [n:127.0.0.1:36422__tg%2Fi    ] o.a.s.c.LeaderElector Joined leadership election with path: /overseer_elect/election/95400049838981128-127.0.0.1:36422__tg%2Fi-n_0000000001
   [junit4]   2> 92945 INFO  (TEST-DistribDocExpirationUpdateProcessorTest.test-seed#[6181E23CA939E6BF]) [n:127.0.0.1:36422__tg%2Fi    ] o.a.s.c.LeaderElector Watching path /overseer_elect/election/95400049838981124-127.0.0.1:50783__tg%2Fi-n_0000000000 to know if I could be the leader
   [junit4]   2> 92954 INFO  (TEST-DistribDocExpirationUpdateProcessorTest.test-seed#[6181E23CA939E6BF]) [n:127.0.0.1:36422__tg%2Fi    ] o.a.s.c.CoreContainer Security conf doesn't exist. Skipping setup for authorization module.
   [junit4]   2> 92954 INFO  (TEST-DistribDocExpirationUpdateProcessorTest.test-seed#[6181E23CA939E6BF]) [n:127.0.0.1:36422__tg%2Fi    ] o.a.s.c.CoreContainer No authentication plugin used.
   [junit4]   2> 92955 INFO  (TEST-DistribDocExpirationUpdateProcessorTest.test-seed#[6181E23CA939E6BF]) [n:127.0.0.1:36422__tg%2Fi    ] o.a.s.c.CorePropertiesLocator Looking for core definitions underneath /home/jenkins/workspace/Lucene-Solr-5.5-Linux/solr/build/solr-core/test/J1/temp/solr.cloud.DistribDocExpirationUpdateProcessorTest_6181E23CA939E6BF-001/shard-1-001/cores
   [junit4]   2> 92956 INFO  (TEST-DistribDocExpirationUpdateProcessorTest.test-seed#[6181E23CA939E6BF]) [n:127.0.0.1:36422__tg%2Fi    ] o.a.s.c.CoreDescriptor Created CoreDescriptor: {dataDir=data/, config=solrconfig.xml, loadOnStartup=true, transient=false, name=collection1, coreNodeName=, collection=collection1, shard=, schema=schema.xml, configSetProperties=configsetprops.json}
   [junit4]   2> 92956 INFO  (TEST-DistribDocExpirationUpdateProcessorTest.test-seed#[6181E23CA939E6BF]) [n:127.0.0.1:36422__tg%2Fi    ] o.a.s.c.CorePropertiesLocator Found core collection1 in /home/jenkins/workspace/Lucene-Solr-5.5-Linux/solr/build/solr-core/test/J1/temp/solr.cloud.DistribDocExpirationUpdateProcessorTest_6181E23CA939E6BF-001/shard-1-001/cores/collection1
   [junit4]   2> 92956 INFO  (TEST-DistribDocExpirationUpdateProcessorTest.test-seed#[6181E23CA939E6BF]) [n:127.0.0.1:36422__tg%2Fi    ] o.a.s.c.CorePropertiesLocator Found 1 core definitions
   [junit4]   2> 92956 INFO  (TEST-DistribDocExpirationUpdateProcessorTest.test-seed#[6181E23CA939E6BF]) [n:127.0.0.1:36422__tg%2Fi    ] o.a.s.s.SolrDispatchFilter user.dir=/home/jenkins/workspace/Lucene-Solr-5.5-Linux/solr/build/solr-core/test/J1
   [junit4]   2> 92956 INFO  (TEST-DistribDocExpirationUpdateProcessorTest.test-seed#[6181E23CA939E6BF]) [n:127.0.0.1:36422__tg%2Fi    ] o.a.s.s.SolrDispatchFilter SolrDispatchFilter.init() done
   [junit4]   2> 92957 INFO  (coreLoadExecutor-641-thread-1-processing-n:127.0.0.1:36422__tg%2Fi) [n:127.0.0.1:36422__tg%2Fi c:collection1   x:collection1] o.a.s.c.ZkController publishing state=down
   [junit4]   2> 92957 INFO  (coreLoadExecutor-641-thread-1-processing-n:127.0.0.1:36422__tg%2Fi) [n:127.0.0.1:36422__tg%2Fi c:collection1   x:collection1] o.a.s.c.ZkController numShards not found on descriptor - reading it from system property
   [junit4]   2> 92958 INFO  (coreLoadExecutor-641-thread-1-processing-n:127.0.0.1:36422__tg%2Fi) [n:127.0.0.1:36422__tg%2Fi c:collection1   x:collection1] o.a.s.c.ZkController look for our core node name
   [junit4]   2> 92958 INFO  (OverseerStateUpdate-95400049838981124-127.0.0.1:50783__tg%2Fi-n_0000000000) [n:127.0.0.1:50783__tg%2Fi    ] o.a.s.c.Overseer processMessage: queueSize: 1, message = {
   [junit4]   2>   "operation":"state",
   [junit4]   2>   "shard":null,
   [junit4]   2>   "roles":null,
   [junit4]   2>   "numShards":"2",
   [junit4]   2>   "state":"down",
   [junit4]   2>   "core":"collection1",
   [junit4]   2>   "base_url":"http://127.0.0.1:36422/_tg/i",
   [junit4]   2>   "collection":"collection1",
   [junit4]   2>   "node_name":"127.0.0.1:36422__tg%2Fi"} current state version: 3
   [junit4]   2> 92959 INFO  (OverseerStateUpdate-95400049838981124-127.0.0.1:50783__tg%2Fi-n_0000000000) [n:127.0.0.1:50783__tg%2Fi    ] o.a.s.c.o.ReplicaMutator Update state numShards=2 message={
   [junit4]   2>   "operation":"state",
   [junit4]   2>   "shard":null,
   [junit4]   2>   "roles":null,
   [junit4]   2>   "numShards":"2",
   [junit4]   2>   "state":"down",
   [junit4]   2>   "core":"collection1",
   [junit4]   2>   "base_url":"http://127.0.0.1:36422/_tg/i",
   [junit4]   2>   "collection":"collection1",
   [junit4]   2>   "node_name":"127.0.0.1:36422__tg%2Fi"}
   [junit4]   2> 92959 INFO  (OverseerStateUpdate-95400049838981124-127.0.0.1:50783__tg%2Fi-n_0000000000) [n:127.0.0.1:50783__tg%2Fi    ] o.a.s.c.o.ClusterStateMutator building a new cName: collection1
   [junit4]   2> 92959 INFO  (OverseerStateUpdate-95400049838981124-127.0.0.1:50783__tg%2Fi-n_0000000000) [n:127.0.0.1:50783__tg%2Fi    ] o.a.s.c.o.ReplicaMutator Assigning new node to shard shard=shard2
   [junit4]   2> 93061 INFO  (zkCallback-141-thread-1) [    ] o.a.s.c.c.ZkStateReader A cluster state change: [WatchedEvent state:SyncConnected type:NodeDataChanged path:/clusterstate.json], has occurred - updating... (live nodes size: [2])
   [junit4]   2> 93061 INFO  (zkCallback-146-thread-1-processing-n:127.0.0.1:36422__tg%2Fi) [n:127.0.0.1:36422__tg%2Fi    ] o.a.s.c.c.ZkStateReader A cluster state change: [WatchedEvent state:SyncConnected type:NodeDataChanged path:/clusterstate.json], has occurred - updating... (live nodes size: [2])
   [junit4]   2> 93061 INFO  (zkCallback-139-thread-1-processing-n:127.0.0.1:50783__tg%2Fi) [n:127.0.0.1:50783__tg%2Fi    ] o.a.s.c.c.ZkStateReader A cluster state change: [WatchedEvent state:SyncConnected type:NodeDataChanged path:/clusterstate.json], has occurred - updating... (live nodes size: [2])
   [junit4]   2> 93960 INFO  (coreLoadExecutor-641-thread-1-processing-n:127.0.0.1:36422__tg%2Fi) [n:127.0.0.1:36422__tg%2Fi c:collection1   x:collection1] o.a.s.c.ZkController waiting to find shard id in clusterstate for collection1
   [junit4]   2> 93960 INFO  (coreLoadExecutor-641-thread-1-processing-n:127.0.0.1:36422__tg%2Fi) [n:127.0.0.1:36422__tg%2Fi c:collection1   x:collection1] o.a.s.c.ZkController Check for collection zkNode:collection1
   [junit4]   2> 93960 INFO  (coreLoadExecutor-641-thread-1-processing-n:127.0.0.1:36422__tg%2Fi) [n:127.0.0.1:36422__tg%2Fi c:collection1   x:collection1] o.a.s.c.ZkController Collection zkNode exists
   [junit4]   2> 93960 INFO  (coreLoadExecutor-641-thread-1-processing-n:127.0.0.1:36422__tg%2Fi) [n:127.0.0.1:36422__tg%2Fi c:collection1   x:collection1] o.a.s.c.c.ZkStateReader Load collection config from: [/collections/collection1]
   [junit4]   2> 93961 INFO  (coreLoadExecutor-641-thread-1-processing-n:127.0.0.1:36422__tg%2Fi) [n:127.0.0.1:36422__tg%2Fi c:collection1   x:collection1] o.a.s.c.c.ZkStateReader path=[/collections/collection1] [configName]=[conf1] specified config exists in ZooKeeper
   [junit4]   2> 93961 INFO  (coreLoadExecutor-641-thread-1-processing-n:127.0.0.1:36422__tg%2Fi) [n:127.0.0.1:36422__tg%2Fi c:collection1   x:collection1] o.a.s.c.SolrResourceLoader new SolrResourceLoader for directory: '/home/jenkins/workspace/Lucene-Solr-5.5-Linux/solr/build/solr-core/test/J1/temp/solr.cloud.DistribDocExpirationUpdateProcessorTest_6181E23CA939E6BF-001/shard-1-001/cores/collection1'
   [junit4]   2> 93961 INFO  (coreLoadExecutor-641-thread-1-processing-n:127.0.0.1:36422__tg%2Fi) [n:127.0.0.1:36422__tg%2Fi c:collection1   x:collection1] o.a.s.c.SolrResourceLoader JNDI not configured for solr (NoInitialContextEx)
   [junit4]   2> 93961 INFO  (coreLoadExecutor-641-thread-1-processing-n:127.0.0.1:36422__tg%2Fi) [n:127.0.0.1:36422__tg%2Fi c:collection1   x:collection1] o.a.s.c.SolrResourceLoader solr home defaulted to 'solr/' (could not find system property or JNDI)
   [junit4]   2> 93963 INFO  (coreLoadExecutor-641-thread-1-processing-n:127.0.0.1:36422__tg%2Fi) [n:127.0.0.1:36422__tg%2Fi c:collection1   x:collection1] o.a.s.c.Config loaded config solrconfig.xml with version 0 
   [junit4]   2> 93974 INFO  (coreLoadExecutor-641-thread-1-processing-n:127.0.0.1:36422__tg%2Fi) [n:127.0.0.1:36422__tg%2Fi c:collection1   x:collection1] o.a.s.c.SolrConfig current version of requestparams : -1
   [junit4]   2> 93986 INFO  (coreLoadExecutor-641-thread-1-processing-n:127.0.0.1:36422__tg%2Fi) [n:127.0.0.1:36422__tg%2Fi c:collection1   x:collection1] o.a.s.c.SolrConfig Using Lucene MatchVersion: 5.5.0
   [junit4]   2> 94001 INFO  (coreLoadExecutor-641-thread-1-processing-n:127.0.0.1:36422__tg%2Fi) [n:127.0.0.1:36422__tg%2Fi c:collection1   x:collection1] o.a.s.c.SolrConfig Loaded SolrConfig: solrconfig.xml
   [junit4]   2> 94006 INFO  (coreLoadExecutor-641-thread-1-processing-n:127.0.0.1:36422__tg%2Fi) [n:127.0.0.1:36422__tg%2Fi c:collection1   x:collection1] o.a.s.s.IndexSchema [collection1] Schema name=test
   [junit4]   2> 94177 INFO  (coreLoadExecutor-641-thread-1-processing-n:127.0.0.1:36422__tg%2Fi) [n:127.0.0.1:36422__tg%2Fi c:collection1   x:collection1] o.a.s.s.IndexSchema default search field in schema is text
   [junit4]   2> 94178 INFO  (coreLoadExecutor-641-thread-1-processing-n:127.0.0.1:36422__tg%2Fi) [n:127.0.0.1:36422__tg%2Fi c:collection1   x:collection1] o.a.s.s.IndexSchema unique key field: id
   [junit4]   2> 94180 INFO  (coreLoadExecutor-641-thread-1-processing-n:127.0.0.1:36422__tg%2Fi) [n:127.0.0.1:36422__tg%2Fi c:collection1   x:collection1] o.a.s.s.FileExchangeRateProvider Reloading exchange rates from file currency.xml
   [junit4]   2> 94183 INFO  (coreLoadExecutor-641-thread-1-processing-n:127.0.0.1:36422__tg%2Fi) [n:127.0.0.1:36422__tg%2Fi c:collection1   x:collection1] o.a.s.s.FileExchangeRateProvider Reloading exchange rates from file currency.xml
   [junit4]   2> 94197 INFO  (coreLoadExecutor-641-thread-1-processing-n:127.0.0.1:36422__tg%2Fi) [n:127.0.0.1:36422__tg%2Fi c:collection1   x:collection1] o.a.s.c.ConfigSetProperties Did not find ConfigSet properties, assuming default properties: Can't find resource 'configsetprops.json' in classpath or '/configs/conf1', cwd=/home/jenkins/workspace/Lucene-Solr-5.5-Linux/solr/build/solr-core/test/J1
   [junit4]   2> 94198 INFO  (coreLoadExecutor-641-thread-1-processing-n:127.0.0.1:36422__tg%2Fi) [n:127.0.0.1:36422__tg%2Fi c:collection1   x:collection1] o.a.s.c.CoreContainer Creating SolrCore 'collection1' using configuration from collection collection1
   [junit4]   2> 94198 INFO  (coreLoadExecutor-641-thread-1-processing-n:127.0.0.1:36422__tg%2Fi) [n:127.0.0.1:36422__tg%2Fi c:collection1 s:shard2 r:core_node1 x:collection1] o.a.s.c.SolrCore org.apache.solr.core.MockDirectoryFactory
   [junit4]   2> 94198 INFO  (coreLoadExecutor-641-thread-1-processing-n:127.0.0.1:36422__tg%2Fi) [n:127.0.0.1:36422__tg%2Fi c:collection1 s:shard2 r:core_node1 x:collection1] o.a.s.c.SolrCore [[collection1] ] Opening new SolrCore at [/home/jenkins/workspace/Lucene-Solr-5.5-Linux/solr/build/solr-core/test/J1/temp/solr.cloud.DistribDocExpirationUpdateProcessorTest_6181E23CA939E6BF-001/shard-1-001/cores/collection1], dataDir=[/home/jenkins/workspace/Lucene-Solr-5.5-Linux/solr/build/solr-core/test/J1/temp/solr.cloud.DistribDocExpirationUpdateProcessorTest_6181E23CA939E6BF-001/shard-1-001/cores/collection1/data/]
   [junit4]   2> 94198 INFO  (coreLoadExecutor-641-thread-1-processing-n:127.0.0.1:36422__tg%2Fi) [n:127.0.0.1:36422__tg%2Fi c:collection1 s:shard2 r:core_node1 x:collection1] o.a.s.c.SolrCore JMX monitoring not detected for core: collection1
   [junit4]   2> 94198 INFO  (coreLoadExecutor-641-thread-1-processing-n:127.0.0.1:36422__tg%2Fi) [n:127.0.0.1:36422__tg%2Fi c:collection1 s:shard2 r:core_node1 x:collection1] o.a.s.c.CachingDirectoryFactory return new directory for /home/jenkins/workspace/Lucene-Solr-5.5-Linux/solr/build/solr-core/test/J1/temp/solr.cloud.DistribDocExpirationUpdateProcessorTest_6181E23CA939E6BF-001/shard-1-001/cores/collection1/data
   [junit4]   2> 94199 INFO  (coreLoadExecutor-641-thread-1-processing-n:127.0.0.1:36422__tg%2Fi) [n:127.0.0.1:36422__tg%2Fi c:collection1 s:shard2 r:core_node1 x:collection1] o.a.s.c.SolrCore New index directory detected: old=null new=/home/jenkins/workspace/Lucene-Solr-5.5-Linux/solr/build/solr-core/test/J1/temp/solr.cloud.DistribDocExpirationUpdateProcessorTest_6181E23CA939E6BF-001/shard-1-001/cores/collection1/data/index/
   [junit4]   2> 94199 WARN  (coreLoadExecutor-641-thread-1-processing-n:127.0.0.1:36422__tg%2Fi) [n:127.0.0.1:36422__tg%2Fi c:collection1 s:shard2 r:core_node1 x:collection1] o.a.s.c.SolrCore [collection1] Solr index directory '/home/jenkins/workspace/Lucene-Solr-5.5-Linux/solr/build/solr-core/test/J1/temp/solr.cloud.DistribDocExpirationUpdateProcessorTest_6181E23CA939E6BF-001/shard-1-001/cores/collection1/data/index' doesn't exist. Creating new index...
   [junit4]   2> 94199 INFO  (coreLoadExecutor-641-thread-1-processing-n:127.0.0.1:36422__tg%2Fi) [n:127.0.0.1:36422__tg%2Fi c:collection1 s:shard2 r:core_node1 x:collection1] o.a.s.c.CachingDirectoryFactory return new directory for /home/jenkins/workspace/Lucene-Solr-5.5-Linux/solr/build/solr-core/test/J1/temp/solr.cloud.DistribDocExpirationUpdateProcessorTest_6181E23CA939E6BF-001/shard-1-001/cores/collection1/data/index
   [junit4]   2> 94199 INFO  (coreLoadExecutor-641-thread-1-processing-n:127.0.0.1:36422__tg%2Fi) [n:127.0.0.1:36422__tg%2Fi c:collection1 s:shard2 r:core_node1 x:collection1] o.a.s.u.RandomMergePolicy RandomMergePolicy wrapping class org.apache.lucene.index.TieredMergePolicy: [TieredMergePolicy: maxMergeAtOnce=15, maxMergeAtOnceExplicit=49, maxMergedSegmentMB=7.2685546875, floorSegmentMB=0.65234375, forceMergeDeletesPctAllowed=21.362411979659228, segmentsPerTier=16.0, maxCFSSegmentSizeMB=8.796093022207999E12, noCFSRatio=1.0
   [junit4]   2> 94204 INFO  (coreLoadExecutor-641-thread-1-processing-n:127.0.0.1:36422__tg%2Fi) [n:127.0.0.1:36422__tg%2Fi c:collection1 s:shard2 r:core_node1 x:collection1] o.a.s.c.SolrDeletionPolicy SolrDeletionPolicy.onCommit: commits: num=1
   [junit4]   2> 	commit{dir=MockDirectoryWrapper(RAMDirectory@6235e209 lockFactory=org.apache.lucene.store.SingleInstanceLockFactory@3f8aef3e),segFN=segments_1,generation=1}
   [junit4]   2> 94204 INFO  (coreLoadExecutor-641-thread-1-processing-n:127.0.0.1:36422__tg%2Fi) [n:127.0.0.1:36422__tg%2Fi c:collection1 s:shard2 r:core_node1 x:collection1] o.a.s.c.SolrDeletionPolicy newest commit generation = 1
   [junit4]   2> 94205 INFO  (OldIndexDirectoryCleanupThreadForCore-collection1) [n:127.0.0.1:36422__tg%2Fi c:collection1 s:shard2 r:core_node1 x:collection1] o.a.s.c.SolrCore Looking for old index directories to cleanup for core collection1 in /home/jenkins/workspace/Lucene-Solr-5.5-Linux/solr/build/solr-core/test/J1/temp/solr.cloud.DistribDocExpirationUpdateProcessorTest_6181E23CA939E6BF-001/shard-1-001/cores/collection1/data/
   [junit4]   2> 94205 WARN  (OldIndexDirectoryCleanupThreadForCore-collection1) [n:127.0.0.1:36422__tg%2Fi c:collection1 s:shard2 r:core_node1 x:collection1] o.a.s.c.DirectoryFactory /home/jenkins/workspace/Lucene-Solr-5.5-Linux/solr/build/solr-core/test/J1/temp/solr.cloud.DistribDocExpirationUpdateProcessorTest_6181E23CA939E6BF-001/shard-1-001/cores/collection1/data/ does not point to a valid data directory; skipping clean-up of old index directories.
   [junit4]   2> 94206 INFO  (coreLoadExecutor-641-thread-1-processing-n:127.0.0.1:36422__tg%2Fi) [n:127.0.0.1:36422__tg%2Fi c:collection1 s:shard2 r:core_node1 x:collection1] o.a.s.u.p.UpdateRequestProcessorChain creating updateRequestProcessorChain "convert-ttl-defaults"
   [junit4]   2> 94206 INFO  (coreLoadExecutor-641-thread-1-processing-n:127.0.0.1:36422__tg%2Fi) [n:127.0.0.1:36422__tg%2Fi c:collection1 s:shard2 r:core_node1 x:collection1] o.a.s.u.p.UpdateRequestProcessorChain creating updateRequestProcessorChain "convert-ttl-field"
   [junit4]   2> 94206 INFO  (coreLoadExecutor-641-thread-1-processing-n:127.0.0.1:36422__tg%2Fi) [n:127.0.0.1:36422__tg%2Fi c:collection1 s:shard2 r:core_node1 x:collection1] o.a.s.u.p.UpdateRequestProcessorChain creating updateRequestProcessorChain "convert-ttl-param"
   [junit4]   2> 94206 INFO  (coreLoadExecutor-641-thread-1-processing-n:127.0.0.1:36422__tg%2Fi) [n:127.0.0.1:36422__t

[...truncated too long message...]

ultSolrCoreState closing IndexWriter with IndexWriterCloser
   [junit4]   2> 151615 INFO  (zkCallback-162-thread-1-processing-n:127.0.0.1:35225__tg%2Fi) [n:127.0.0.1:35225__tg%2Fi c:collection1 s:shard1 r:core_node4 x:collection1] o.a.s.u.DirectUpdateHandler2 Committing on IndexWriter close.
   [junit4]   2> 151616 INFO  (zkCallback-162-thread-1-processing-n:127.0.0.1:35225__tg%2Fi) [n:127.0.0.1:35225__tg%2Fi c:collection1 s:shard1 r:core_node4 x:collection1] o.a.s.c.SolrDeletionPolicy SolrDeletionPolicy.onCommit: commits: num=3
   [junit4]   2> 	commit{dir=MockDirectoryWrapper(RAMDirectory@74f5ff09 lockFactory=org.apache.lucene.store.SingleInstanceLockFactory@423ae3dc),segFN=segments_3,generation=3}
   [junit4]   2> 	commit{dir=MockDirectoryWrapper(RAMDirectory@74f5ff09 lockFactory=org.apache.lucene.store.SingleInstanceLockFactory@423ae3dc),segFN=segments_4,generation=4}
   [junit4]   2> 	commit{dir=MockDirectoryWrapper(RAMDirectory@74f5ff09 lockFactory=org.apache.lucene.store.SingleInstanceLockFactory@423ae3dc),segFN=segments_5,generation=5}
   [junit4]   2> 151616 INFO  (zkCallback-162-thread-1-processing-n:127.0.0.1:35225__tg%2Fi) [n:127.0.0.1:35225__tg%2Fi c:collection1 s:shard1 r:core_node4 x:collection1] o.a.s.c.SolrDeletionPolicy newest commit generation = 5
   [junit4]   2> 151617 INFO  (zkCallback-162-thread-1-processing-n:127.0.0.1:35225__tg%2Fi) [n:127.0.0.1:35225__tg%2Fi c:collection1 s:shard1 r:core_node4 x:collection1] o.a.s.c.SolrCore [collection1] Closing main searcher on request.
   [junit4]   2> 151617 INFO  (zkCallback-162-thread-1-processing-n:127.0.0.1:35225__tg%2Fi) [n:127.0.0.1:35225__tg%2Fi c:collection1 s:shard1 r:core_node4 x:collection1] o.a.s.c.CachingDirectoryFactory Closing MockDirectoryFactory - 2 directories currently being tracked
   [junit4]   2> 151617 INFO  (zkCallback-162-thread-1-processing-n:127.0.0.1:35225__tg%2Fi) [n:127.0.0.1:35225__tg%2Fi c:collection1 s:shard1 r:core_node4 x:collection1] o.a.s.c.CachingDirectoryFactory looking to close /home/jenkins/workspace/Lucene-Solr-5.5-Linux/solr/build/solr-core/test/J1/../../../../../../../../../home/jenkins/workspace/Lucene-Solr-5.5-Linux/solr/build/solr-core/test/J1/temp/solr.cloud.DistribDocExpirationUpdateProcessorTest_6181E23CA939E6BF-001/shard-4-001/cores/collection1/data/index [CachedDir<<refCount=0;path=/home/jenkins/workspace/Lucene-Solr-5.5-Linux/solr/build/solr-core/test/J1/../../../../../../../../../home/jenkins/workspace/Lucene-Solr-5.5-Linux/solr/build/solr-core/test/J1/temp/solr.cloud.DistribDocExpirationUpdateProcessorTest_6181E23CA939E6BF-001/shard-4-001/cores/collection1/data/index;done=false>>]
   [junit4]   2> 151617 INFO  (zkCallback-162-thread-1-processing-n:127.0.0.1:35225__tg%2Fi) [n:127.0.0.1:35225__tg%2Fi c:collection1 s:shard1 r:core_node4 x:collection1] o.a.s.c.CachingDirectoryFactory Closing directory: /home/jenkins/workspace/Lucene-Solr-5.5-Linux/solr/build/solr-core/test/J1/../../../../../../../../../home/jenkins/workspace/Lucene-Solr-5.5-Linux/solr/build/solr-core/test/J1/temp/solr.cloud.DistribDocExpirationUpdateProcessorTest_6181E23CA939E6BF-001/shard-4-001/cores/collection1/data/index
   [junit4]   2> 151617 INFO  (zkCallback-162-thread-1-processing-n:127.0.0.1:35225__tg%2Fi) [n:127.0.0.1:35225__tg%2Fi c:collection1 s:shard1 r:core_node4 x:collection1] o.a.s.c.CachingDirectoryFactory looking to close /home/jenkins/workspace/Lucene-Solr-5.5-Linux/solr/build/solr-core/test/J1/../../../../../../../../../home/jenkins/workspace/Lucene-Solr-5.5-Linux/solr/build/solr-core/test/J1/temp/solr.cloud.DistribDocExpirationUpdateProcessorTest_6181E23CA939E6BF-001/shard-4-001/cores/collection1/data [CachedDir<<refCount=0;path=/home/jenkins/workspace/Lucene-Solr-5.5-Linux/solr/build/solr-core/test/J1/../../../../../../../../../home/jenkins/workspace/Lucene-Solr-5.5-Linux/solr/build/solr-core/test/J1/temp/solr.cloud.DistribDocExpirationUpdateProcessorTest_6181E23CA939E6BF-001/shard-4-001/cores/collection1/data;done=false>>]
   [junit4]   2> 151617 INFO  (zkCallback-162-thread-1-processing-n:127.0.0.1:35225__tg%2Fi) [n:127.0.0.1:35225__tg%2Fi c:collection1 s:shard1 r:core_node4 x:collection1] o.a.s.c.CachingDirectoryFactory Closing directory: /home/jenkins/workspace/Lucene-Solr-5.5-Linux/solr/build/solr-core/test/J1/../../../../../../../../../home/jenkins/workspace/Lucene-Solr-5.5-Linux/solr/build/solr-core/test/J1/temp/solr.cloud.DistribDocExpirationUpdateProcessorTest_6181E23CA939E6BF-001/shard-4-001/cores/collection1/data
   [junit4]   2> 151618 INFO  (TEST-DistribDocExpirationUpdateProcessorTest.test-seed#[6181E23CA939E6BF]) [    ] o.e.j.s.ServerConnector Stopped ServerConnector@140c814d{HTTP/1.1}{127.0.0.1:0}
   [junit4]   2> 151618 INFO  (TEST-DistribDocExpirationUpdateProcessorTest.test-seed#[6181E23CA939E6BF]) [    ] o.e.j.s.h.ContextHandler Stopped o.e.j.s.ServletContextHandler@79135af2{/_tg/i,null,UNAVAILABLE}
   [junit4]   2> 151619 INFO  (TEST-DistribDocExpirationUpdateProcessorTest.test-seed#[6181E23CA939E6BF]) [    ] o.a.s.c.ZkTestServer connecting to 127.0.0.1:58462 58462
   [junit4]   2> 151636 INFO  (Thread-502) [    ] o.a.s.c.ZkTestServer connecting to 127.0.0.1:58462 58462
   [junit4]   2> 151637 WARN  (Thread-502) [    ] o.a.s.c.ZkTestServer Watch limit violations: 
   [junit4]   2> Maximum concurrent create/delete watches above limit:
   [junit4]   2> 
   [junit4]   2> 	6	/solr/aliases.json
   [junit4]   2> 	5	/solr/security.json
   [junit4]   2> 	5	/solr/configs/conf1
   [junit4]   2> 
   [junit4]   2> Maximum concurrent data watches above limit:
   [junit4]   2> 
   [junit4]   2> 	6	/solr/clusterstate.json
   [junit4]   2> 
   [junit4]   2> Maximum concurrent children watches above limit:
   [junit4]   2> 
   [junit4]   2> 	6	/solr/live_nodes
   [junit4]   2> 	6	/solr/collections
   [junit4]   2> 	4	/solr/overseer/collection-queue-work
   [junit4]   2> 	3	/solr/overseer/queue
   [junit4]   2> 	2	/solr/overseer/queue-work
   [junit4]   2> 
   [junit4]   2> NOTE: reproduce with: ant test  -Dtestcase=DistribDocExpirationUpdateProcessorTest -Dtests.method=test -Dtests.seed=6181E23CA939E6BF -Dtests.multiplier=3 -Dtests.slow=true -Dtests.locale=ro-RO -Dtests.timezone=Africa/Mogadishu -Dtests.asserts=true -Dtests.file.encoding=ISO-8859-1
   [junit4] FAILURE 61.6s J1 | DistribDocExpirationUpdateProcessorTest.test <<<
   [junit4]    > Throwable #1: java.lang.AssertionError: Exactly one shard should have changed, instead: [shard2, shard1] nodes=([core_node4(shard1), core_node2(shard1), core_node3(shard2)]) expected:<1> but was:<2>
   [junit4]    > 	at __randomizedtesting.SeedInfo.seed([6181E23CA939E6BF:E9D5DDE607C58B47]:0)
   [junit4]    > 	at org.apache.solr.cloud.DistribDocExpirationUpdateProcessorTest.test(DistribDocExpirationUpdateProcessorTest.java:118)
   [junit4]    > 	at org.apache.solr.BaseDistributedSearchTestCase$ShardsRepeatRule$ShardsFixedStatement.callStatement(BaseDistributedSearchTestCase.java:964)
   [junit4]    > 	at org.apache.solr.BaseDistributedSearchTestCase$ShardsRepeatRule$ShardsStatement.evaluate(BaseDistributedSearchTestCase.java:939)
   [junit4]    > 	at java.lang.Thread.run(Thread.java:745)
   [junit4]   2> 151641 INFO  (SUITE-DistribDocExpirationUpdateProcessorTest-seed#[6181E23CA939E6BF]-worker) [    ] o.a.s.SolrTestCaseJ4 ###deleteCore
   [junit4]   2> NOTE: leaving temporary files on disk at: /home/jenkins/workspace/Lucene-Solr-5.5-Linux/solr/build/solr-core/test/J1/temp/solr.cloud.DistribDocExpirationUpdateProcessorTest_6181E23CA939E6BF-001
   [junit4]   2> Feb 17, 2016 6:08:18 AM com.carrotsearch.randomizedtesting.ThreadLeakControl checkThreadLeaks
   [junit4]   2> WARNING: Will linger awaiting termination of 1 leaked thread(s).
   [junit4]   2> NOTE: test params are: codec=Asserting(Lucene54): {_version_=FSTOrd50, eXpField_tdt=FSTOrd50, tTl_s=PostingsFormat(name=LuceneFixedGap), id=PostingsFormat(name=Direct)}, docValues:{}, sim=RandomSimilarity(queryNorm=true,coord=yes): {}, locale=ro-RO, timezone=Africa/Mogadishu
   [junit4]   2> NOTE: Linux 3.19.0-47-generic amd64/Oracle Corporation 1.7.0_80 (64-bit)/cpus=12,threads=1,free=354901584,total=507641856
   [junit4]   2> NOTE: All tests run in this JVM: [TestSimpleTrackingShardHandler, TestCustomSort, IndexBasedSpellCheckerTest, TestCodecSupport, DocumentBuilderTest, TestDistributedGrouping, DistributedMLTComponentTest, ConvertedLegacyTest, HdfsBasicDistributedZkTest, TestSurroundQueryParser, TestBinaryResponseWriter, RollingRestartTest, MultiTermTest, TestSolrXml, SchemaVersionSpecificBehaviorTest, BlockCacheTest, TestUseDocValuesAsStored, SpellPossibilityIteratorTest, DistribDocExpirationUpdateProcessorTest]
   [junit4] Completed [56/566 (1!)] on J1 in 62.08s, 1 test, 1 failure <<< FAILURES!

[...truncated 1611 lines...]
BUILD FAILED
/home/jenkins/workspace/Lucene-Solr-5.5-Linux/build.xml:750: The following error occurred while executing this line:
/home/jenkins/workspace/Lucene-Solr-5.5-Linux/build.xml:694: The following error occurred while executing this line:
/home/jenkins/workspace/Lucene-Solr-5.5-Linux/build.xml:59: The following error occurred while executing this line:
/home/jenkins/workspace/Lucene-Solr-5.5-Linux/solr/build.xml:233: The following error occurred while executing this line:
/home/jenkins/workspace/Lucene-Solr-5.5-Linux/solr/common-build.xml:534: The following error occurred while executing this line:
/home/jenkins/workspace/Lucene-Solr-5.5-Linux/lucene/common-build.xml:1477: The following error occurred while executing this line:
/home/jenkins/workspace/Lucene-Solr-5.5-Linux/lucene/common-build.xml:1033: There were test failures: 566 suites (7 ignored), 2275 tests, 1 failure, 84 ignored (39 assumptions) [seed: 6181E23CA939E6BF]

Total time: 52 minutes 54 seconds
Build step 'Invoke Ant' marked build as failure
Archiving artifacts
[WARNINGS] Skipping publisher since build result is FAILURE
Recording test results
Email was triggered for: Failure - Any
Sending email for trigger: Failure - Any



Mime
View raw message