lucene-dev mailing list archives

Site index · List index
Message view « Date » · « Thread »
Top « Date » · « Thread »
From Policeman Jenkins Server <jenk...@thetaphi.de>
Subject [JENKINS-EA] Lucene-Solr-trunk-Linux (64bit/jdk-9-ea+105) - Build # 15912 - Failure!
Date Wed, 17 Feb 2016 13:57:15 GMT
Build: http://jenkins.thetaphi.de/job/Lucene-Solr-trunk-Linux/15912/
Java: 64bit/jdk-9-ea+105 -XX:-UseCompressedOops -XX:+UseSerialGC -XX:-CompactStrings -XX:-UseSuperWord

3 tests failed.
FAILED:  org.apache.lucene.codecs.lucene50.TestBlockPostingsFormat.testRandom

Error Message:
Captured an uncaught exception in thread: Thread[id=1956, name=Thread-1494, state=RUNNABLE,
group=TGRP-TestBlockPostingsFormat]

Stack Trace:
com.carrotsearch.randomizedtesting.UncaughtExceptionError: Captured an uncaught exception
in thread: Thread[id=1956, name=Thread-1494, state=RUNNABLE, group=TGRP-TestBlockPostingsFormat]
Caused by: java.lang.RuntimeException: java.lang.IllegalArgumentException: source=3 is out
of bounds (maxState is 2)
	at __randomizedtesting.SeedInfo.seed([B2144C216CCF352D]:0)
	at org.apache.lucene.index.RandomPostingsTester$TestThread.run(RandomPostingsTester.java:1006)
Caused by: java.lang.IllegalArgumentException: source=3 is out of bounds (maxState is 2)
	at org.apache.lucene.util.automaton.Automaton.addTransition(Automaton.java:165)
	at org.apache.lucene.util.automaton.MinimizationOperations.minimize(MinimizationOperations.java:245)
	at org.apache.lucene.util.automaton.RegExp.toAutomatonInternal(RegExp.java:537)
	at org.apache.lucene.util.automaton.RegExp.toAutomaton(RegExp.java:495)
	at org.apache.lucene.util.automaton.RegExp.toAutomaton(RegExp.java:426)
	at org.apache.lucene.util.automaton.AutomatonTestUtil.randomSingleAutomaton(AutomatonTestUtil.java:262)
	at org.apache.lucene.util.automaton.AutomatonTestUtil.randomAutomaton(AutomatonTestUtil.java:276)
	at org.apache.lucene.index.RandomPostingsTester.testTermsOneThread(RandomPostingsTester.java:1167)
	at org.apache.lucene.index.RandomPostingsTester.access$000(RandomPostingsTester.java:61)
	at org.apache.lucene.index.RandomPostingsTester$TestThread.run(RandomPostingsTester.java:1004)


FAILED:  org.apache.lucene.util.automaton.FiniteStringsIteratorTest.testShortAccept

Error Message:
source=3 is out of bounds (maxState is 2)

Stack Trace:
java.lang.IllegalArgumentException: source=3 is out of bounds (maxState is 2)
	at __randomizedtesting.SeedInfo.seed([B2144C216CCF352D:CF27BD26A38E0643]:0)
	at org.apache.lucene.util.automaton.Automaton.addTransition(Automaton.java:165)
	at org.apache.lucene.util.automaton.MinimizationOperations.minimize(MinimizationOperations.java:245)
	at org.apache.lucene.util.automaton.FiniteStringsIteratorTest.testShortAccept(FiniteStringsIteratorTest.java:158)
	at sun.reflect.NativeMethodAccessorImpl.invoke0(Native Method)
	at sun.reflect.NativeMethodAccessorImpl.invoke(NativeMethodAccessorImpl.java:62)
	at sun.reflect.DelegatingMethodAccessorImpl.invoke(DelegatingMethodAccessorImpl.java:43)
	at java.lang.reflect.Method.invoke(Method.java:520)
	at com.carrotsearch.randomizedtesting.RandomizedRunner.invoke(RandomizedRunner.java:1764)
	at com.carrotsearch.randomizedtesting.RandomizedRunner$8.evaluate(RandomizedRunner.java:871)
	at com.carrotsearch.randomizedtesting.RandomizedRunner$9.evaluate(RandomizedRunner.java:907)
	at com.carrotsearch.randomizedtesting.RandomizedRunner$10.evaluate(RandomizedRunner.java:921)
	at org.apache.lucene.util.TestRuleSetupTeardownChained$1.evaluate(TestRuleSetupTeardownChained.java:49)
	at org.apache.lucene.util.AbstractBeforeAfterRule$1.evaluate(AbstractBeforeAfterRule.java:45)
	at org.apache.lucene.util.TestRuleThreadAndTestName$1.evaluate(TestRuleThreadAndTestName.java:48)
	at org.apache.lucene.util.TestRuleIgnoreAfterMaxFailures$1.evaluate(TestRuleIgnoreAfterMaxFailures.java:64)
	at org.apache.lucene.util.TestRuleMarkFailure$1.evaluate(TestRuleMarkFailure.java:47)
	at com.carrotsearch.randomizedtesting.rules.StatementAdapter.evaluate(StatementAdapter.java:36)
	at com.carrotsearch.randomizedtesting.ThreadLeakControl$StatementRunner.run(ThreadLeakControl.java:367)
	at com.carrotsearch.randomizedtesting.ThreadLeakControl.forkTimeoutingTask(ThreadLeakControl.java:809)
	at com.carrotsearch.randomizedtesting.ThreadLeakControl$3.evaluate(ThreadLeakControl.java:460)
	at com.carrotsearch.randomizedtesting.RandomizedRunner.runSingleTest(RandomizedRunner.java:880)
	at com.carrotsearch.randomizedtesting.RandomizedRunner$5.evaluate(RandomizedRunner.java:781)
	at com.carrotsearch.randomizedtesting.RandomizedRunner$6.evaluate(RandomizedRunner.java:816)
	at com.carrotsearch.randomizedtesting.RandomizedRunner$7.evaluate(RandomizedRunner.java:827)
	at org.apache.lucene.util.AbstractBeforeAfterRule$1.evaluate(AbstractBeforeAfterRule.java:45)
	at com.carrotsearch.randomizedtesting.rules.StatementAdapter.evaluate(StatementAdapter.java:36)
	at org.apache.lucene.util.TestRuleStoreClassName$1.evaluate(TestRuleStoreClassName.java:41)
	at com.carrotsearch.randomizedtesting.rules.NoShadowingOrOverridesOnMethodsRule$1.evaluate(NoShadowingOrOverridesOnMethodsRule.java:40)
	at com.carrotsearch.randomizedtesting.rules.NoShadowingOrOverridesOnMethodsRule$1.evaluate(NoShadowingOrOverridesOnMethodsRule.java:40)
	at com.carrotsearch.randomizedtesting.rules.StatementAdapter.evaluate(StatementAdapter.java:36)
	at com.carrotsearch.randomizedtesting.rules.StatementAdapter.evaluate(StatementAdapter.java:36)
	at com.carrotsearch.randomizedtesting.rules.StatementAdapter.evaluate(StatementAdapter.java:36)
	at org.apache.lucene.util.TestRuleAssertionsRequired$1.evaluate(TestRuleAssertionsRequired.java:53)
	at org.apache.lucene.util.TestRuleMarkFailure$1.evaluate(TestRuleMarkFailure.java:47)
	at org.apache.lucene.util.TestRuleIgnoreAfterMaxFailures$1.evaluate(TestRuleIgnoreAfterMaxFailures.java:64)
	at org.apache.lucene.util.TestRuleIgnoreTestSuites$1.evaluate(TestRuleIgnoreTestSuites.java:54)
	at com.carrotsearch.randomizedtesting.rules.StatementAdapter.evaluate(StatementAdapter.java:36)
	at com.carrotsearch.randomizedtesting.ThreadLeakControl$StatementRunner.run(ThreadLeakControl.java:367)
	at java.lang.Thread.run(Thread.java:804)


FAILED:  org.apache.lucene.util.automaton.FiniteStringsIteratorTest.testFiniteStringsBasic

Error Message:
7

Stack Trace:
java.lang.ArrayIndexOutOfBoundsException: 7
	at __randomizedtesting.SeedInfo.seed([B2144C216CCF352D:16225BAB0564833B]:0)
	at org.apache.lucene.util.automaton.MinimizationOperations.minimize(MinimizationOperations.java:235)
	at org.apache.lucene.util.automaton.FiniteStringsIteratorTest.testFiniteStringsBasic(FiniteStringsIteratorTest.java:104)
	at sun.reflect.NativeMethodAccessorImpl.invoke0(Native Method)
	at sun.reflect.NativeMethodAccessorImpl.invoke(NativeMethodAccessorImpl.java:62)
	at sun.reflect.DelegatingMethodAccessorImpl.invoke(DelegatingMethodAccessorImpl.java:43)
	at java.lang.reflect.Method.invoke(Method.java:520)
	at com.carrotsearch.randomizedtesting.RandomizedRunner.invoke(RandomizedRunner.java:1764)
	at com.carrotsearch.randomizedtesting.RandomizedRunner$8.evaluate(RandomizedRunner.java:871)
	at com.carrotsearch.randomizedtesting.RandomizedRunner$9.evaluate(RandomizedRunner.java:907)
	at com.carrotsearch.randomizedtesting.RandomizedRunner$10.evaluate(RandomizedRunner.java:921)
	at org.apache.lucene.util.TestRuleSetupTeardownChained$1.evaluate(TestRuleSetupTeardownChained.java:49)
	at org.apache.lucene.util.AbstractBeforeAfterRule$1.evaluate(AbstractBeforeAfterRule.java:45)
	at org.apache.lucene.util.TestRuleThreadAndTestName$1.evaluate(TestRuleThreadAndTestName.java:48)
	at org.apache.lucene.util.TestRuleIgnoreAfterMaxFailures$1.evaluate(TestRuleIgnoreAfterMaxFailures.java:64)
	at org.apache.lucene.util.TestRuleMarkFailure$1.evaluate(TestRuleMarkFailure.java:47)
	at com.carrotsearch.randomizedtesting.rules.StatementAdapter.evaluate(StatementAdapter.java:36)
	at com.carrotsearch.randomizedtesting.ThreadLeakControl$StatementRunner.run(ThreadLeakControl.java:367)
	at com.carrotsearch.randomizedtesting.ThreadLeakControl.forkTimeoutingTask(ThreadLeakControl.java:809)
	at com.carrotsearch.randomizedtesting.ThreadLeakControl$3.evaluate(ThreadLeakControl.java:460)
	at com.carrotsearch.randomizedtesting.RandomizedRunner.runSingleTest(RandomizedRunner.java:880)
	at com.carrotsearch.randomizedtesting.RandomizedRunner$5.evaluate(RandomizedRunner.java:781)
	at com.carrotsearch.randomizedtesting.RandomizedRunner$6.evaluate(RandomizedRunner.java:816)
	at com.carrotsearch.randomizedtesting.RandomizedRunner$7.evaluate(RandomizedRunner.java:827)
	at org.apache.lucene.util.AbstractBeforeAfterRule$1.evaluate(AbstractBeforeAfterRule.java:45)
	at com.carrotsearch.randomizedtesting.rules.StatementAdapter.evaluate(StatementAdapter.java:36)
	at org.apache.lucene.util.TestRuleStoreClassName$1.evaluate(TestRuleStoreClassName.java:41)
	at com.carrotsearch.randomizedtesting.rules.NoShadowingOrOverridesOnMethodsRule$1.evaluate(NoShadowingOrOverridesOnMethodsRule.java:40)
	at com.carrotsearch.randomizedtesting.rules.NoShadowingOrOverridesOnMethodsRule$1.evaluate(NoShadowingOrOverridesOnMethodsRule.java:40)
	at com.carrotsearch.randomizedtesting.rules.StatementAdapter.evaluate(StatementAdapter.java:36)
	at com.carrotsearch.randomizedtesting.rules.StatementAdapter.evaluate(StatementAdapter.java:36)
	at com.carrotsearch.randomizedtesting.rules.StatementAdapter.evaluate(StatementAdapter.java:36)
	at org.apache.lucene.util.TestRuleAssertionsRequired$1.evaluate(TestRuleAssertionsRequired.java:53)
	at org.apache.lucene.util.TestRuleMarkFailure$1.evaluate(TestRuleMarkFailure.java:47)
	at org.apache.lucene.util.TestRuleIgnoreAfterMaxFailures$1.evaluate(TestRuleIgnoreAfterMaxFailures.java:64)
	at org.apache.lucene.util.TestRuleIgnoreTestSuites$1.evaluate(TestRuleIgnoreTestSuites.java:54)
	at com.carrotsearch.randomizedtesting.rules.StatementAdapter.evaluate(StatementAdapter.java:36)
	at com.carrotsearch.randomizedtesting.ThreadLeakControl$StatementRunner.run(ThreadLeakControl.java:367)
	at java.lang.Thread.run(Thread.java:804)




Build Log:
[...truncated 535 lines...]
   [junit4] Suite: org.apache.lucene.util.automaton.FiniteStringsIteratorTest
   [junit4]   2> NOTE: reproduce with: ant test  -Dtestcase=FiniteStringsIteratorTest -Dtests.method=testShortAccept
-Dtests.seed=B2144C216CCF352D -Dtests.multiplier=3 -Dtests.slow=true -Dtests.locale=ha-Latn
-Dtests.timezone=Zulu -Dtests.asserts=true -Dtests.file.encoding=ISO-8859-1
   [junit4] ERROR   0.01s J0 | FiniteStringsIteratorTest.testShortAccept <<<
   [junit4]    > Throwable #1: java.lang.IllegalArgumentException: source=3 is out of bounds
(maxState is 2)
   [junit4]    > 	at __randomizedtesting.SeedInfo.seed([B2144C216CCF352D:CF27BD26A38E0643]:0)
   [junit4]    > 	at org.apache.lucene.util.automaton.Automaton.addTransition(Automaton.java:165)
   [junit4]    > 	at org.apache.lucene.util.automaton.MinimizationOperations.minimize(MinimizationOperations.java:245)
   [junit4]    > 	at org.apache.lucene.util.automaton.FiniteStringsIteratorTest.testShortAccept(FiniteStringsIteratorTest.java:158)
   [junit4]    > 	at java.lang.Thread.run(Thread.java:804)
   [junit4]   2> NOTE: reproduce with: ant test  -Dtestcase=FiniteStringsIteratorTest -Dtests.method=testFiniteStringsBasic
-Dtests.seed=B2144C216CCF352D -Dtests.multiplier=3 -Dtests.slow=true -Dtests.locale=ha-Latn
-Dtests.timezone=Zulu -Dtests.asserts=true -Dtests.file.encoding=ISO-8859-1
   [junit4] ERROR   0.00s J0 | FiniteStringsIteratorTest.testFiniteStringsBasic <<<
   [junit4]    > Throwable #1: java.lang.ArrayIndexOutOfBoundsException: 7
   [junit4]    > 	at __randomizedtesting.SeedInfo.seed([B2144C216CCF352D:16225BAB0564833B]:0)
   [junit4]    > 	at org.apache.lucene.util.automaton.MinimizationOperations.minimize(MinimizationOperations.java:235)
   [junit4]    > 	at org.apache.lucene.util.automaton.FiniteStringsIteratorTest.testFiniteStringsBasic(FiniteStringsIteratorTest.java:104)
   [junit4]    > 	at java.lang.Thread.run(Thread.java:804)
   [junit4]   2> NOTE: test params are: codec=Asserting(Lucene60): {}, docValues:{}, sim=RandomSimilarity(queryNorm=false,coord=no):
{}, locale=ha-Latn, timezone=Zulu
   [junit4]   2> NOTE: Linux 3.19.0-47-generic amd64/Oracle Corporation 9-ea (64-bit)/cpus=12,threads=1,free=228419120,total=508952576
   [junit4]   2> NOTE: All tests run in this JVM: [TestBooleanQueryVisitSubscorers, TestIndexWriterOnVMError,
TestBoostQuery, TestFilterDirectoryReader, TestReadOnlyIndex, TestTransactionRollback, TestDeterminism,
TestMinShouldMatch2, TestUTF32ToUTF8, TestMultiValuedNumericRangeQuery, TestFilterIterator,
TestSpanNearQuery, TestWeakIdentityMap, TestSpanBoostQuery, TestAutomatonQuery, TestLucene50CompoundFormat,
TestBytesRef, TestDoc, TestDeterminizeLexicon, TestBM25Similarity, TestTermVectorsWriter,
TestFilterDirectory, TestIndexWriterMergePolicy, TestIndexWriterCommit, TestNumericRangeQuery64,
TestQueryCachingPolicy, TestLockFactory, TestDocInverterPerFieldErrorInfo, TestNeverDelete,
TestBlockPostingsFormat2, TestMixedDocValuesUpdates, TestRecyclingByteBlockAllocator, TestCodecs,
TestSearcherManager, TestIndexWriterForceMerge, TestLucene50StoredFieldsFormat, TestIndexWriterLockRelease,
TestSortRescorer, TestTimeLimitingCollector, TestBinaryDocValuesUpdates, TestLSBRadixSorter,
FiniteStringsIteratorTest]
   [junit4] Completed [99/411 (1!)] on J0 in 0.29s, 7 tests, 2 errors <<< FAILURES!

[...truncated 779 lines...]
   [junit4] Suite: org.apache.lucene.codecs.lucene50.TestBlockPostingsFormat
   [junit4]   2> Feb 17, 2016 8:55:51 AM com.carrotsearch.randomizedtesting.RandomizedRunner$QueueUncaughtExceptionsHandler
uncaughtException
   [junit4]   2> WARNING: Uncaught exception in thread: Thread[Thread-1494,5,TGRP-TestBlockPostingsFormat]
   [junit4]   2> java.lang.RuntimeException: java.lang.IllegalArgumentException: source=3
is out of bounds (maxState is 2)
   [junit4]   2> 	at __randomizedtesting.SeedInfo.seed([B2144C216CCF352D]:0)
   [junit4]   2> 	at org.apache.lucene.index.RandomPostingsTester$TestThread.run(RandomPostingsTester.java:1006)
   [junit4]   2> Caused by: java.lang.IllegalArgumentException: source=3 is out of bounds
(maxState is 2)
   [junit4]   2> 	at org.apache.lucene.util.automaton.Automaton.addTransition(Automaton.java:165)
   [junit4]   2> 	at org.apache.lucene.util.automaton.MinimizationOperations.minimize(MinimizationOperations.java:245)
   [junit4]   2> 	at org.apache.lucene.util.automaton.RegExp.toAutomatonInternal(RegExp.java:537)
   [junit4]   2> 	at org.apache.lucene.util.automaton.RegExp.toAutomaton(RegExp.java:495)
   [junit4]   2> 	at org.apache.lucene.util.automaton.RegExp.toAutomaton(RegExp.java:426)
   [junit4]   2> 	at org.apache.lucene.util.automaton.AutomatonTestUtil.randomSingleAutomaton(AutomatonTestUtil.java:262)
   [junit4]   2> 	at org.apache.lucene.util.automaton.AutomatonTestUtil.randomAutomaton(AutomatonTestUtil.java:276)
   [junit4]   2> 	at org.apache.lucene.index.RandomPostingsTester.testTermsOneThread(RandomPostingsTester.java:1167)
   [junit4]   2> 	at org.apache.lucene.index.RandomPostingsTester.access$000(RandomPostingsTester.java:61)
   [junit4]   2> 	at org.apache.lucene.index.RandomPostingsTester$TestThread.run(RandomPostingsTester.java:1004)
   [junit4]   2> 
   [junit4]   2> Feb 17, 2016 8:55:51 AM com.carrotsearch.randomizedtesting.RandomizedRunner$QueueUncaughtExceptionsHandler
uncaughtException
   [junit4]   2> WARNING: Uncaught exception in thread: Thread[Thread-1495,5,TGRP-TestBlockPostingsFormat]
   [junit4]   2> java.lang.RuntimeException: java.lang.ArrayIndexOutOfBoundsException:
5
   [junit4]   2> 	at __randomizedtesting.SeedInfo.seed([B2144C216CCF352D]:0)
   [junit4]   2> 	at org.apache.lucene.index.RandomPostingsTester$TestThread.run(RandomPostingsTester.java:1006)
   [junit4]   2> Caused by: java.lang.ArrayIndexOutOfBoundsException: 5
   [junit4]   2> 	at org.apache.lucene.util.automaton.MinimizationOperations.minimize(MinimizationOperations.java:235)
   [junit4]   2> 	at org.apache.lucene.util.automaton.RegExp.toAutomatonInternal(RegExp.java:524)
   [junit4]   2> 	at org.apache.lucene.util.automaton.RegExp.toAutomaton(RegExp.java:495)
   [junit4]   2> 	at org.apache.lucene.util.automaton.RegExp.toAutomaton(RegExp.java:426)
   [junit4]   2> 	at org.apache.lucene.util.automaton.AutomatonTestUtil.randomSingleAutomaton(AutomatonTestUtil.java:262)
   [junit4]   2> 	at org.apache.lucene.util.automaton.AutomatonTestUtil.randomAutomaton(AutomatonTestUtil.java:277)
   [junit4]   2> 	at org.apache.lucene.index.RandomPostingsTester.testTermsOneThread(RandomPostingsTester.java:1167)
   [junit4]   2> 	at org.apache.lucene.index.RandomPostingsTester.access$000(RandomPostingsTester.java:61)
   [junit4]   2> 	at org.apache.lucene.index.RandomPostingsTester$TestThread.run(RandomPostingsTester.java:1004)
   [junit4]   2> 
   [junit4]   2> NOTE: reproduce with: ant test  -Dtestcase=TestBlockPostingsFormat -Dtests.method=testRandom
-Dtests.seed=B2144C216CCF352D -Dtests.multiplier=3 -Dtests.slow=true -Dtests.locale=en-KE
-Dtests.timezone=America/Nassau -Dtests.asserts=true -Dtests.file.encoding=ISO-8859-1
   [junit4] ERROR   0.36s J2 | TestBlockPostingsFormat.testRandom <<<
   [junit4]    > Throwable #1: com.carrotsearch.randomizedtesting.UncaughtExceptionError:
Captured an uncaught exception in thread: Thread[id=1956, name=Thread-1494, state=RUNNABLE,
group=TGRP-TestBlockPostingsFormat]
   [junit4]    > Caused by: java.lang.RuntimeException: java.lang.IllegalArgumentException:
source=3 is out of bounds (maxState is 2)
   [junit4]    > 	at __randomizedtesting.SeedInfo.seed([B2144C216CCF352D]:0)
   [junit4]    > 	at org.apache.lucene.index.RandomPostingsTester$TestThread.run(RandomPostingsTester.java:1006)
   [junit4]    > Caused by: java.lang.IllegalArgumentException: source=3 is out of bounds
(maxState is 2)
   [junit4]    > 	at org.apache.lucene.util.automaton.Automaton.addTransition(Automaton.java:165)
   [junit4]    > 	at org.apache.lucene.util.automaton.MinimizationOperations.minimize(MinimizationOperations.java:245)
   [junit4]    > 	at org.apache.lucene.util.automaton.RegExp.toAutomatonInternal(RegExp.java:537)
   [junit4]    > 	at org.apache.lucene.util.automaton.RegExp.toAutomaton(RegExp.java:495)
   [junit4]    > 	at org.apache.lucene.util.automaton.RegExp.toAutomaton(RegExp.java:426)
   [junit4]    > 	at org.apache.lucene.util.automaton.AutomatonTestUtil.randomSingleAutomaton(AutomatonTestUtil.java:262)
   [junit4]    > 	at org.apache.lucene.util.automaton.AutomatonTestUtil.randomAutomaton(AutomatonTestUtil.java:276)
   [junit4]    > 	at org.apache.lucene.index.RandomPostingsTester.testTermsOneThread(RandomPostingsTester.java:1167)
   [junit4]    > 	at org.apache.lucene.index.RandomPostingsTester.access$000(RandomPostingsTester.java:61)
   [junit4]    > 	at org.apache.lucene.index.RandomPostingsTester$TestThread.run(RandomPostingsTester.java:1004)Throwable
#2: com.carrotsearch.randomizedtesting.UncaughtExceptionError: Captured an uncaught exception
in thread: Thread[id=1957, name=Thread-1495, state=RUNNABLE, group=TGRP-TestBlockPostingsFormat]
   [junit4]    > Caused by: java.lang.RuntimeException: java.lang.ArrayIndexOutOfBoundsException:
5
   [junit4]    > 	at __randomizedtesting.SeedInfo.seed([B2144C216CCF352D]:0)
   [junit4]    > 	at org.apache.lucene.index.RandomPostingsTester$TestThread.run(RandomPostingsTester.java:1006)
   [junit4]    > Caused by: java.lang.ArrayIndexOutOfBoundsException: 5
   [junit4]    > 	at org.apache.lucene.util.automaton.MinimizationOperations.minimize(MinimizationOperations.java:235)
   [junit4]    > 	at org.apache.lucene.util.automaton.RegExp.toAutomatonInternal(RegExp.java:524)
   [junit4]    > 	at org.apache.lucene.util.automaton.RegExp.toAutomaton(RegExp.java:495)
   [junit4]    > 	at org.apache.lucene.util.automaton.RegExp.toAutomaton(RegExp.java:426)
   [junit4]    > 	at org.apache.lucene.util.automaton.AutomatonTestUtil.randomSingleAutomaton(AutomatonTestUtil.java:262)
   [junit4]    > 	at org.apache.lucene.util.automaton.AutomatonTestUtil.randomAutomaton(AutomatonTestUtil.java:277)
   [junit4]    > 	at org.apache.lucene.index.RandomPostingsTester.testTermsOneThread(RandomPostingsTester.java:1167)
   [junit4]    > 	at org.apache.lucene.index.RandomPostingsTester.access$000(RandomPostingsTester.java:61)
   [junit4]    > 	at org.apache.lucene.index.RandomPostingsTester$TestThread.run(RandomPostingsTester.java:1004)
   [junit4]   2> NOTE: test params are: codec=Asserting(Lucene60): {}, docValues:{}, sim=ClassicSimilarity,
locale=en-KE, timezone=America/Nassau
   [junit4]   2> NOTE: Linux 3.19.0-47-generic amd64/Oracle Corporation 9-ea (64-bit)/cpus=12,threads=1,free=203641008,total=508952576
   [junit4]   2> NOTE: All tests run in this JVM: [TestNearSpansOrdered, TestSpans, TestTimSorterWorstCase,
Test2BPagedBytes, TestLucene50TermVectorsFormat, TestTransactions, TestParallelReaderEmptyIndex,
TestFuzzyQuery, TestIndexFileDeleter, TestSleepingLockWrapper, TestIntBlockPool, TestRegexpRandom2,
TestDocValuesScoring, TestIndexWriterReader, TestConjunctions, TestLucene50SegmentInfoFormat,
TestTermVectorsReader, TestNumericRangeQuery32, TestIndexWriterConfig, TestCachingCollector,
TestCrashCausesCorruptIndex, TestMatchNoDocsQuery, TestSort, TestIndexWriterOnDiskFull, TestNRTReaderCleanup,
TestConsistentFieldNumbers, TestNoMergeScheduler, TestTotalHitCountCollector, TestFieldReuse,
TestBooleanOr, TestForUtil, TestAttributeSource, TestBufferedChecksum, TestTopDocsMerge, TestSearchWithThreads,
TestLongPostings, TestElevationComparator, TestNIOFSDirectory, TestNot, TestDirectory, TestAllFilesHaveChecksumFooter,
TestIndexWriterThreadsToSegments, TestSearchForDuplicates, TestCharsRef, TestIndexWriterMerging,
TestFastDecompressionMode, TestMergeRateLimiter, TestAtomicUpdate, TestDuelingCodecsAtNight,
Test2BSortedDocValuesOrds, TestStressIndexing2, TestPhrasePrefixQuery, TestSparseFixedBitSet,
TestMixedCodecs, TestExternalCodecs, TestDocumentWriter, TestCodecHoldsOpenFiles, TestRollingUpdates,
TestIndexWriterMaxDocs, TestPrefixQuery, TestSortedSetSelector, TestLazyProxSkipping, TestField,
TestFrequencyTrackingRingBuffer, TestFieldValueQuery, TestNRTThreads, TestCustomSearcherSort,
TestManyFields, TestBytesRefHash, TestIndexWriterWithThreads, TestAddIndexes, TestShardSearching,
TestNorms, TestDirectoryReaderReopen, TestHighCompressionMode, TestDocumentsWriterStallControl,
TestSimpleExplanations, TestDirectoryReader, TestSegmentMerger, TestPhraseQuery, TestCollectionUtil,
TestBagOfPositions, TestOmitNorms, TestFixedBitSet, TestComplexExplanations, TestSegmentReader,
TestParallelCompositeReader, TestIndexWriterNRTIsCurrent, TestPagedBytes, TestCrash, TestMultiThreadTermVectors,
TestSegmentTermDocs, TestPerFieldPostingsFormat2, TestToken, TestSimpleSearchEquivalence,
TestSimilarityBase, TestHugeRamFile, TestTermsEnum2, TestLegacyNumericUtils, TestCustomNorms,
TestPostingsOffsets, TestSpanExplanations, TestFastCompressionMode, TestRAMDirectory, TestMultiPhraseQuery,
TestDocsAndPositions, TestMergeSchedulerExternal, TestBagOfPostings, TestCharTermAttributeImpl,
TestOmitPositions, TestIndexInput, TestDisjunctionMaxQuery, TestForceMergeForever, TestOmitTf,
TestSameScoresWithThreads, TestTermRangeQuery, TestMultiTermConstantScore, TestLiveFieldValues,
TestWildcard, TestSimilarity2, TestFieldMaskingSpanQuery, TestNoDeletionPolicy, TestRegexpQuery,
TestPerSegmentDeletes, TestPrefixInBooleanQuery, TestTopDocsCollector, TestSegmentTermEnum,
TestUniqueTermCount, TestBooleanQuery, TestComplexExplanationsOfNonMatches, TestUnicodeUtil,
TestSortRandom, TestPrefixCodedTerms, TestDocument, TestMaxTermFrequency, TestTermScorer,
TestTopFieldCollector, TestSumDocFreq, TestIndexableField, TestWildcardRandom, TestRegexpRandom,
TestMultiLevelSkipList, TestCheckIndex, TestSpanMultiTermQueryWrapper, TestConstantScoreQuery,
TestBinaryTerms, TestRecyclingIntBlockAllocator, TestMultiTermQueryRewrites, TestPositionIncrement,
TestDateSort, TestSpanExplanationsOfNonMatches, TestSmallFloat, TestSimilarityProvider, TestNumericTokenStream,
TestSearch, TestCachingTokenFilter, TestDateTools, TestPriorityQueue, TestSameTokenSamePosition,
TestDocCount, TestAutomatonQueryUnicode, TestRamUsageEstimator, TestSpanFirstQuery, TestIsCurrent,
TestNoMergePolicy, TestNamedSPILoader, TestDemo, TestRollback, TestTwoPhaseCommitTool, TestCloseableThreadLocal,
TestIndexWriterOnJRECrash, Test4GBStoredFields, TestDocBoost, TestNGramPhraseQuery, TestIntsRef,
TestTermdocPerf, Test2BPositions, TestIndexCommit, TestTerm, Test2BPostingsBytes, TestPositiveScoresOnlyCollector,
TestIOUtils, TestNewestSegment, Test2BNumericDocValues, Test2BBinaryDocValues, TestReusableStringReader,
TestBytesRefAttImpl, TestPackedTokenAttributeImpl, TestBlockPostingsFormat]
   [junit4] Completed [337/411 (2!)] on J2 in 5.29s, 26 tests, 1 error <<< FAILURES!

[...truncated 260 lines...]
BUILD FAILED
/home/jenkins/workspace/Lucene-Solr-trunk-Linux/build.xml:740: The following error occurred
while executing this line:
/home/jenkins/workspace/Lucene-Solr-trunk-Linux/build.xml:684: The following error occurred
while executing this line:
/home/jenkins/workspace/Lucene-Solr-trunk-Linux/build.xml:59: The following error occurred
while executing this line:
/home/jenkins/workspace/Lucene-Solr-trunk-Linux/lucene/build.xml:50: The following error occurred
while executing this line:
/home/jenkins/workspace/Lucene-Solr-trunk-Linux/lucene/common-build.xml:1457: The following
error occurred while executing this line:
/home/jenkins/workspace/Lucene-Solr-trunk-Linux/lucene/common-build.xml:1014: There were test
failures: 411 suites (1 ignored), 3386 tests, 3 errors, 59 ignored (55 assumptions) [seed:
B2144C216CCF352D]

Total time: 6 minutes 29 seconds
Build step 'Invoke Ant' marked build as failure
Archiving artifacts
[WARNINGS] Skipping publisher since build result is FAILURE
Recording test results
Email was triggered for: Failure - Any
Sending email for trigger: Failure - Any



Mime
View raw message