lucene-dev mailing list archives

Site index · List index
Message view « Date » · « Thread »
Top « Date » · « Thread »
From Policeman Jenkins Server <jenk...@thetaphi.de>
Subject [JENKINS-EA] Lucene-Solr-trunk-Linux (64bit/jdk-9-ea+105) - Build # 15940 - Still Failing!
Date Sun, 21 Feb 2016 05:35:05 GMT
Build: http://jenkins.thetaphi.de/job/Lucene-Solr-trunk-Linux/15940/
Java: 64bit/jdk-9-ea+105 -XX:+UseCompressedOops -XX:+UseG1GC -XX:-UseSuperWord

2 tests failed.
FAILED:  org.apache.lucene.util.automaton.TestAutomaton.testReverseRandom1

Error Message:
source=3 is out of bounds (maxState is 2)

Stack Trace:
java.lang.IllegalArgumentException: source=3 is out of bounds (maxState is 2)
	at __randomizedtesting.SeedInfo.seed([C2CF3EA273AA5905:D9073F431568D3AF]:0)
	at org.apache.lucene.util.automaton.Automaton.addTransition(Automaton.java:165)
	at org.apache.lucene.util.automaton.MinimizationOperations.minimize(MinimizationOperations.java:245)
	at org.apache.lucene.util.automaton.RegExp.toAutomatonInternal(RegExp.java:515)
	at org.apache.lucene.util.automaton.RegExp.toAutomaton(RegExp.java:495)
	at org.apache.lucene.util.automaton.RegExp.toAutomaton(RegExp.java:426)
	at org.apache.lucene.util.automaton.AutomatonTestUtil.randomSingleAutomaton(AutomatonTestUtil.java:262)
	at org.apache.lucene.util.automaton.AutomatonTestUtil.randomAutomaton(AutomatonTestUtil.java:277)
	at org.apache.lucene.util.automaton.TestAutomaton.testReverseRandom1(TestAutomaton.java:259)
	at sun.reflect.NativeMethodAccessorImpl.invoke0(Native Method)
	at sun.reflect.NativeMethodAccessorImpl.invoke(NativeMethodAccessorImpl.java:62)
	at sun.reflect.DelegatingMethodAccessorImpl.invoke(DelegatingMethodAccessorImpl.java:43)
	at java.lang.reflect.Method.invoke(Method.java:520)
	at com.carrotsearch.randomizedtesting.RandomizedRunner.invoke(RandomizedRunner.java:1764)
	at com.carrotsearch.randomizedtesting.RandomizedRunner$8.evaluate(RandomizedRunner.java:871)
	at com.carrotsearch.randomizedtesting.RandomizedRunner$9.evaluate(RandomizedRunner.java:907)
	at com.carrotsearch.randomizedtesting.RandomizedRunner$10.evaluate(RandomizedRunner.java:921)
	at org.apache.lucene.util.TestRuleSetupTeardownChained$1.evaluate(TestRuleSetupTeardownChained.java:49)
	at org.apache.lucene.util.AbstractBeforeAfterRule$1.evaluate(AbstractBeforeAfterRule.java:45)
	at org.apache.lucene.util.TestRuleThreadAndTestName$1.evaluate(TestRuleThreadAndTestName.java:48)
	at org.apache.lucene.util.TestRuleIgnoreAfterMaxFailures$1.evaluate(TestRuleIgnoreAfterMaxFailures.java:64)
	at org.apache.lucene.util.TestRuleMarkFailure$1.evaluate(TestRuleMarkFailure.java:47)
	at com.carrotsearch.randomizedtesting.rules.StatementAdapter.evaluate(StatementAdapter.java:36)
	at com.carrotsearch.randomizedtesting.ThreadLeakControl$StatementRunner.run(ThreadLeakControl.java:367)
	at com.carrotsearch.randomizedtesting.ThreadLeakControl.forkTimeoutingTask(ThreadLeakControl.java:809)
	at com.carrotsearch.randomizedtesting.ThreadLeakControl$3.evaluate(ThreadLeakControl.java:460)
	at com.carrotsearch.randomizedtesting.RandomizedRunner.runSingleTest(RandomizedRunner.java:880)
	at com.carrotsearch.randomizedtesting.RandomizedRunner$5.evaluate(RandomizedRunner.java:781)
	at com.carrotsearch.randomizedtesting.RandomizedRunner$6.evaluate(RandomizedRunner.java:816)
	at com.carrotsearch.randomizedtesting.RandomizedRunner$7.evaluate(RandomizedRunner.java:827)
	at org.apache.lucene.util.AbstractBeforeAfterRule$1.evaluate(AbstractBeforeAfterRule.java:45)
	at com.carrotsearch.randomizedtesting.rules.StatementAdapter.evaluate(StatementAdapter.java:36)
	at org.apache.lucene.util.TestRuleStoreClassName$1.evaluate(TestRuleStoreClassName.java:41)
	at com.carrotsearch.randomizedtesting.rules.NoShadowingOrOverridesOnMethodsRule$1.evaluate(NoShadowingOrOverridesOnMethodsRule.java:40)
	at com.carrotsearch.randomizedtesting.rules.NoShadowingOrOverridesOnMethodsRule$1.evaluate(NoShadowingOrOverridesOnMethodsRule.java:40)
	at com.carrotsearch.randomizedtesting.rules.StatementAdapter.evaluate(StatementAdapter.java:36)
	at com.carrotsearch.randomizedtesting.rules.StatementAdapter.evaluate(StatementAdapter.java:36)
	at com.carrotsearch.randomizedtesting.rules.StatementAdapter.evaluate(StatementAdapter.java:36)
	at org.apache.lucene.util.TestRuleAssertionsRequired$1.evaluate(TestRuleAssertionsRequired.java:53)
	at org.apache.lucene.util.TestRuleMarkFailure$1.evaluate(TestRuleMarkFailure.java:47)
	at org.apache.lucene.util.TestRuleIgnoreAfterMaxFailures$1.evaluate(TestRuleIgnoreAfterMaxFailures.java:64)
	at org.apache.lucene.util.TestRuleIgnoreTestSuites$1.evaluate(TestRuleIgnoreTestSuites.java:54)
	at com.carrotsearch.randomizedtesting.rules.StatementAdapter.evaluate(StatementAdapter.java:36)
	at com.carrotsearch.randomizedtesting.ThreadLeakControl$StatementRunner.run(ThreadLeakControl.java:367)
	at java.lang.Thread.run(Thread.java:804)


FAILED:  org.apache.lucene.util.automaton.TestAutomaton.testMakeBinaryIntervalFiniteCasesBasic

Error Message:
4

Stack Trace:
java.lang.ArrayIndexOutOfBoundsException: 4
	at __randomizedtesting.SeedInfo.seed([C2CF3EA273AA5905:FA7519CFE7B36798]:0)
	at org.apache.lucene.util.automaton.MinimizationOperations.minimize(MinimizationOperations.java:235)
	at org.apache.lucene.util.automaton.TestAutomaton.makeBinaryInterval(TestAutomaton.java:1159)
	at org.apache.lucene.util.automaton.TestAutomaton.testMakeBinaryIntervalFiniteCasesBasic(TestAutomaton.java:1188)
	at sun.reflect.NativeMethodAccessorImpl.invoke0(Native Method)
	at sun.reflect.NativeMethodAccessorImpl.invoke(NativeMethodAccessorImpl.java:62)
	at sun.reflect.DelegatingMethodAccessorImpl.invoke(DelegatingMethodAccessorImpl.java:43)
	at java.lang.reflect.Method.invoke(Method.java:520)
	at com.carrotsearch.randomizedtesting.RandomizedRunner.invoke(RandomizedRunner.java:1764)
	at com.carrotsearch.randomizedtesting.RandomizedRunner$8.evaluate(RandomizedRunner.java:871)
	at com.carrotsearch.randomizedtesting.RandomizedRunner$9.evaluate(RandomizedRunner.java:907)
	at com.carrotsearch.randomizedtesting.RandomizedRunner$10.evaluate(RandomizedRunner.java:921)
	at org.apache.lucene.util.TestRuleSetupTeardownChained$1.evaluate(TestRuleSetupTeardownChained.java:49)
	at org.apache.lucene.util.AbstractBeforeAfterRule$1.evaluate(AbstractBeforeAfterRule.java:45)
	at org.apache.lucene.util.TestRuleThreadAndTestName$1.evaluate(TestRuleThreadAndTestName.java:48)
	at org.apache.lucene.util.TestRuleIgnoreAfterMaxFailures$1.evaluate(TestRuleIgnoreAfterMaxFailures.java:64)
	at org.apache.lucene.util.TestRuleMarkFailure$1.evaluate(TestRuleMarkFailure.java:47)
	at com.carrotsearch.randomizedtesting.rules.StatementAdapter.evaluate(StatementAdapter.java:36)
	at com.carrotsearch.randomizedtesting.ThreadLeakControl$StatementRunner.run(ThreadLeakControl.java:367)
	at com.carrotsearch.randomizedtesting.ThreadLeakControl.forkTimeoutingTask(ThreadLeakControl.java:809)
	at com.carrotsearch.randomizedtesting.ThreadLeakControl$3.evaluate(ThreadLeakControl.java:460)
	at com.carrotsearch.randomizedtesting.RandomizedRunner.runSingleTest(RandomizedRunner.java:880)
	at com.carrotsearch.randomizedtesting.RandomizedRunner$5.evaluate(RandomizedRunner.java:781)
	at com.carrotsearch.randomizedtesting.RandomizedRunner$6.evaluate(RandomizedRunner.java:816)
	at com.carrotsearch.randomizedtesting.RandomizedRunner$7.evaluate(RandomizedRunner.java:827)
	at org.apache.lucene.util.AbstractBeforeAfterRule$1.evaluate(AbstractBeforeAfterRule.java:45)
	at com.carrotsearch.randomizedtesting.rules.StatementAdapter.evaluate(StatementAdapter.java:36)
	at org.apache.lucene.util.TestRuleStoreClassName$1.evaluate(TestRuleStoreClassName.java:41)
	at com.carrotsearch.randomizedtesting.rules.NoShadowingOrOverridesOnMethodsRule$1.evaluate(NoShadowingOrOverridesOnMethodsRule.java:40)
	at com.carrotsearch.randomizedtesting.rules.NoShadowingOrOverridesOnMethodsRule$1.evaluate(NoShadowingOrOverridesOnMethodsRule.java:40)
	at com.carrotsearch.randomizedtesting.rules.StatementAdapter.evaluate(StatementAdapter.java:36)
	at com.carrotsearch.randomizedtesting.rules.StatementAdapter.evaluate(StatementAdapter.java:36)
	at com.carrotsearch.randomizedtesting.rules.StatementAdapter.evaluate(StatementAdapter.java:36)
	at org.apache.lucene.util.TestRuleAssertionsRequired$1.evaluate(TestRuleAssertionsRequired.java:53)
	at org.apache.lucene.util.TestRuleMarkFailure$1.evaluate(TestRuleMarkFailure.java:47)
	at org.apache.lucene.util.TestRuleIgnoreAfterMaxFailures$1.evaluate(TestRuleIgnoreAfterMaxFailures.java:64)
	at org.apache.lucene.util.TestRuleIgnoreTestSuites$1.evaluate(TestRuleIgnoreTestSuites.java:54)
	at com.carrotsearch.randomizedtesting.rules.StatementAdapter.evaluate(StatementAdapter.java:36)
	at com.carrotsearch.randomizedtesting.ThreadLeakControl$StatementRunner.run(ThreadLeakControl.java:367)
	at java.lang.Thread.run(Thread.java:804)




Build Log:
[...truncated 1549 lines...]
   [junit4] Suite: org.apache.lucene.util.automaton.TestAutomaton
   [junit4]   2> NOTE: reproduce with: ant test  -Dtestcase=TestAutomaton -Dtests.method=testReverseRandom1
-Dtests.seed=C2CF3EA273AA5905 -Dtests.multiplier=3 -Dtests.slow=true -Dtests.locale=mgo -Dtests.timezone=Europe/Dublin
-Dtests.asserts=true -Dtests.file.encoding=ISO-8859-1
   [junit4] ERROR   0.10s J0 | TestAutomaton.testReverseRandom1 <<<
   [junit4]    > Throwable #1: java.lang.IllegalArgumentException: source=3 is out of bounds
(maxState is 2)
   [junit4]    > 	at __randomizedtesting.SeedInfo.seed([C2CF3EA273AA5905:D9073F431568D3AF]:0)
   [junit4]    > 	at org.apache.lucene.util.automaton.Automaton.addTransition(Automaton.java:165)
   [junit4]    > 	at org.apache.lucene.util.automaton.MinimizationOperations.minimize(MinimizationOperations.java:245)
   [junit4]    > 	at org.apache.lucene.util.automaton.RegExp.toAutomatonInternal(RegExp.java:515)
   [junit4]    > 	at org.apache.lucene.util.automaton.RegExp.toAutomaton(RegExp.java:495)
   [junit4]    > 	at org.apache.lucene.util.automaton.RegExp.toAutomaton(RegExp.java:426)
   [junit4]    > 	at org.apache.lucene.util.automaton.AutomatonTestUtil.randomSingleAutomaton(AutomatonTestUtil.java:262)
   [junit4]    > 	at org.apache.lucene.util.automaton.AutomatonTestUtil.randomAutomaton(AutomatonTestUtil.java:277)
   [junit4]    > 	at org.apache.lucene.util.automaton.TestAutomaton.testReverseRandom1(TestAutomaton.java:259)
   [junit4]    > 	at java.lang.Thread.run(Thread.java:804)
   [junit4]   2> NOTE: reproduce with: ant test  -Dtestcase=TestAutomaton -Dtests.method=testMakeBinaryIntervalFiniteCasesBasic
-Dtests.seed=C2CF3EA273AA5905 -Dtests.multiplier=3 -Dtests.slow=true -Dtests.locale=mgo -Dtests.timezone=Europe/Dublin
-Dtests.asserts=true -Dtests.file.encoding=ISO-8859-1
   [junit4] ERROR   0.00s J0 | TestAutomaton.testMakeBinaryIntervalFiniteCasesBasic <<<
   [junit4]    > Throwable #1: java.lang.ArrayIndexOutOfBoundsException: 4
   [junit4]    > 	at __randomizedtesting.SeedInfo.seed([C2CF3EA273AA5905:FA7519CFE7B36798]:0)
   [junit4]    > 	at org.apache.lucene.util.automaton.MinimizationOperations.minimize(MinimizationOperations.java:235)
   [junit4]    > 	at org.apache.lucene.util.automaton.TestAutomaton.makeBinaryInterval(TestAutomaton.java:1159)
   [junit4]    > 	at org.apache.lucene.util.automaton.TestAutomaton.testMakeBinaryIntervalFiniteCasesBasic(TestAutomaton.java:1188)
   [junit4]    > 	at java.lang.Thread.run(Thread.java:804)
   [junit4]   2> NOTE: test params are: codec=Asserting(Lucene60): {}, docValues:{}, sim=ClassicSimilarity,
locale=mgo, timezone=Europe/Dublin
   [junit4]   2> NOTE: Linux 3.19.0-47-generic amd64/Oracle Corporation 9-ea (64-bit)/cpus=12,threads=1,free=465530032,total=536870912
   [junit4]   2> NOTE: All tests run in this JVM: [TestLucene50StoredFieldsFormat, TestMultiFields,
TestSizeBoundedForceMerge, TestMinShouldMatch2, TestFieldType, TestSumDocFreq, TestNoMergePolicy,
TestStringHelper, TestSloppyMath, TestSimilarity2, TestSpanNearQuery, TestBooleanQueryVisitSubscorers,
TestBinaryTerms, TestStressDeletes, TestDocInverterPerFieldErrorInfo, TestNumericRangeQuery64,
TestIndexWriterForceMerge, TestReaderClosed, TestSimilarityProvider, TestUTF32ToUTF8, TestInfoStream,
TestDeterminizeLexicon, TestRegexpRandom, TestRecyclingByteBlockAllocator, TestBoostQuery,
TestFilterIterator, TestIndexWriterCommit, TestTermScorer, TestMutableValues, TestDeterminism,
TestMinimize, TestCloseableThreadLocal, TestToken, TestIndexWriterWithThreads, TestNewestSegment,
TestCrash, TestHighCompressionMode, TestSimpleFSLockFactory, TestLucene53NormsFormat, TestUniqueTermCount,
TestSearcherManager, TestLSBRadixSorter, TestPersistentSnapshotDeletionPolicy, TestTermsEnum,
TestIsCurrent, TestIndexWriterUnicode, TestDocIdSetBuilder, TestIndexWriterDelete, TestTrackingDirectoryWrapper,
TestMultiTermQueryRewrites, TestCheckIndex, TestLockFactory, TestFilterDirectoryReader, TestSpanBoostQuery,
TestThreadedForceMerge, TestTransactionRollback, TestMixedDocValuesUpdates, TestDocValuesIndexing,
TestSegmentReader, TestOperations, TestCustomNorms, TestInPlaceMergeSorter, TestTimeLimitingCollector,
TestCharFilter, TestPerSegmentDeletes, TestFixedBitSet, TestSimpleAttributeImpl, TestIndexWriterMergePolicy,
TestAtomicUpdate, TestNorms, TestSearchAfter, TestConcurrentMergeScheduler, TestNeverDelete,
TestRollingUpdates, TestSnapshotDeletionPolicy, TestPerFieldPostingsFormat, TestFastDecompressionMode,
TestPagedBytes, TestMultiDocValues, TestSimpleSearchEquivalence, TestSimilarityBase, TestBooleanMinShouldMatch,
TestFastCompressionMode, TestMultiPhraseQuery, TestDocsAndPositions, TestTermVectorsWriter,
TestCodecs, TestCharTermAttributeImpl, TestIndexInput, TestSloppyPhraseQuery2, TestDocumentsWriterDeleteQueue,
TestCrashCausesCorruptIndex, TestMultiTermConstantScore, TestForTooMuchCloning, TestSpanSearchEquivalence,
TestDoc, TestFieldMaskingSpanQuery, TestExternalCodecs, TestNoDeletionPolicy, TestSimpleExplanationsOfNonMatches,
TestRegexpQuery, TestMultiValuedNumericRangeQuery, TestSortRandom, TestAutomatonQuery, TestPayloadsOnVectors,
TestParallelTermEnum, TestRecyclingIntBlockAllocator, TestField, TestSpanExplanationsOfNonMatches,
TestRollingBuffer, TestCachingTokenFilter, TestCharsRef, Test2BPostings, TestSameTokenSamePosition,
TestBinaryDocument, TestTotalHitCountCollector, TestRamUsageEstimator, TestNamedSPILoader,
TestIndexWriterLockRelease, TestPhrasePrefixQuery, TestByteBlockPool, TestBytesRef, TestVersion,
MultiCollectorTest, TestNGramPhraseQuery, TestTerm, Test2BTerms, TestReusableStringReader,
TestLucene50CompoundFormat, Test2BSortedDocValuesFixedSorted, TestAllFilesCheckIndexHeader,
TestBinaryDocValuesUpdates, TestIndexWriterMaxDocs, TestMaxPosition, TestMergePolicyWrapper,
TestMultiTermsEnum, TestNumericDocValuesUpdates, TestBlendedTermQuery, TestBooleanRewrites,
TestConjunctionDISI, TestIndexSearcher, TestMultiCollector, TestMultiset, TestNeedsScores,
TestQueryCachingPolicy, TestSortRescorer, TestBM25Similarity, TestFilterSpans, TestSpanContainQuery,
TestFilterDirectory, TestNativeFSLockFactory, LimitedFiniteStringsIteratorTest, TestAutomaton]
   [junit4] Completed [408/411 (1!)] on J0 in 3.42s, 56 tests, 2 errors <<< FAILURES!

[...truncated 29 lines...]
BUILD FAILED
/home/jenkins/workspace/Lucene-Solr-trunk-Linux/build.xml:740: The following error occurred
while executing this line:
/home/jenkins/workspace/Lucene-Solr-trunk-Linux/build.xml:684: The following error occurred
while executing this line:
/home/jenkins/workspace/Lucene-Solr-trunk-Linux/build.xml:59: The following error occurred
while executing this line:
/home/jenkins/workspace/Lucene-Solr-trunk-Linux/lucene/build.xml:50: The following error occurred
while executing this line:
/home/jenkins/workspace/Lucene-Solr-trunk-Linux/lucene/common-build.xml:1457: The following
error occurred while executing this line:
/home/jenkins/workspace/Lucene-Solr-trunk-Linux/lucene/common-build.xml:1014: There were test
failures: 411 suites (1 ignored), 3395 tests, 2 errors, 62 ignored (58 assumptions) [seed:
C2CF3EA273AA5905]

Total time: 7 minutes 11 seconds
Build step 'Invoke Ant' marked build as failure
Archiving artifacts
[WARNINGS] Skipping publisher since build result is FAILURE
Recording test results
Email was triggered for: Failure - Any
Sending email for trigger: Failure - Any



Mime
View raw message