lucene-dev mailing list archives

Site index · List index
Message view « Date » · « Thread »
Top « Date » · « Thread »
From Policeman Jenkins Server <jenk...@thetaphi.de>
Subject [JENKINS] Lucene-Solr-trunk-Windows (64bit/jdk1.8.0_72) - Build # 5618 - Still Failing!
Date Sun, 14 Feb 2016 11:52:28 GMT
Build: http://jenkins.thetaphi.de/job/Lucene-Solr-trunk-Windows/5618/
Java: 64bit/jdk1.8.0_72 -XX:-UseCompressedOops -XX:+UseParallelGC

6 tests failed.
FAILED:  org.apache.solr.handler.component.SpellCheckComponentTest.testExtendedResultsCount

Error Message:
Directory MMapDirectory@C:\Users\JenkinsSlave\workspace\Lucene-Solr-trunk-Windows\solr\build\solr-core\test\J1\temp\solr.handler.component.SpellCheckComponentTest_C8C83177370373FE-001\init-core-data-001\spellchecker1 lockFactory=org.apache.lucene.store.NativeFSLockFactory@4a50deab still has pending deleted files; cannot initialize IndexWriter

Stack Trace:
java.lang.IllegalArgumentException: Directory MMapDirectory@C:\Users\JenkinsSlave\workspace\Lucene-Solr-trunk-Windows\solr\build\solr-core\test\J1\temp\solr.handler.component.SpellCheckComponentTest_C8C83177370373FE-001\init-core-data-001\spellchecker1 lockFactory=org.apache.lucene.store.NativeFSLockFactory@4a50deab still has pending deleted files; cannot initialize IndexWriter
	at __randomizedtesting.SeedInfo.seed([C8C83177370373FE:F6FC1ECE121EE619]:0)
	at org.apache.lucene.index.IndexWriter.<init>(IndexWriter.java:767)
	at org.apache.lucene.search.spell.SpellChecker.clearIndex(SpellChecker.java:455)
	at org.apache.solr.spelling.IndexBasedSpellChecker.build(IndexBasedSpellChecker.java:87)
	at org.apache.solr.handler.component.SpellCheckComponent.prepare(SpellCheckComponent.java:131)
	at org.apache.solr.handler.component.SearchHandler.handleRequestBody(SearchHandler.java:246)
	at org.apache.solr.handler.RequestHandlerBase.handleRequest(RequestHandlerBase.java:155)
	at org.apache.solr.core.SolrCore.execute(SolrCore.java:2082)
	at org.apache.solr.util.TestHarness.query(TestHarness.java:310)
	at org.apache.solr.util.TestHarness.query(TestHarness.java:292)
	at org.apache.solr.SolrTestCaseJ4.assertJQ(SolrTestCaseJ4.java:820)
	at org.apache.solr.SolrTestCaseJ4.assertJQ(SolrTestCaseJ4.java:789)
	at org.apache.solr.handler.component.SpellCheckComponentTest.testExtendedResultsCount(SpellCheckComponentTest.java:135)
	at sun.reflect.NativeMethodAccessorImpl.invoke0(Native Method)
	at sun.reflect.NativeMethodAccessorImpl.invoke(NativeMethodAccessorImpl.java:62)
	at sun.reflect.DelegatingMethodAccessorImpl.invoke(DelegatingMethodAccessorImpl.java:43)
	at java.lang.reflect.Method.invoke(Method.java:498)
	at com.carrotsearch.randomizedtesting.RandomizedRunner.invoke(RandomizedRunner.java:1764)
	at com.carrotsearch.randomizedtesting.RandomizedRunner$8.evaluate(RandomizedRunner.java:871)
	at com.carrotsearch.randomizedtesting.RandomizedRunner$9.evaluate(RandomizedRunner.java:907)
	at com.carrotsearch.randomizedtesting.RandomizedRunner$10.evaluate(RandomizedRunner.java:921)
	at com.carrotsearch.randomizedtesting.rules.SystemPropertiesRestoreRule$1.evaluate(SystemPropertiesRestoreRule.java:57)
	at org.apache.lucene.util.TestRuleSetupTeardownChained$1.evaluate(TestRuleSetupTeardownChained.java:49)
	at org.apache.lucene.util.AbstractBeforeAfterRule$1.evaluate(AbstractBeforeAfterRule.java:45)
	at org.apache.lucene.util.TestRuleThreadAndTestName$1.evaluate(TestRuleThreadAndTestName.java:48)
	at org.apache.lucene.util.TestRuleIgnoreAfterMaxFailures$1.evaluate(TestRuleIgnoreAfterMaxFailures.java:64)
	at org.apache.lucene.util.TestRuleMarkFailure$1.evaluate(TestRuleMarkFailure.java:47)
	at com.carrotsearch.randomizedtesting.rules.StatementAdapter.evaluate(StatementAdapter.java:36)
	at com.carrotsearch.randomizedtesting.ThreadLeakControl$StatementRunner.run(ThreadLeakControl.java:367)
	at com.carrotsearch.randomizedtesting.ThreadLeakControl.forkTimeoutingTask(ThreadLeakControl.java:809)
	at com.carrotsearch.randomizedtesting.ThreadLeakControl$3.evaluate(ThreadLeakControl.java:460)
	at com.carrotsearch.randomizedtesting.RandomizedRunner.runSingleTest(RandomizedRunner.java:880)
	at com.carrotsearch.randomizedtesting.RandomizedRunner$5.evaluate(RandomizedRunner.java:781)
	at com.carrotsearch.randomizedtesting.RandomizedRunner$6.evaluate(RandomizedRunner.java:816)
	at com.carrotsearch.randomizedtesting.RandomizedRunner$7.evaluate(RandomizedRunner.java:827)
	at com.carrotsearch.randomizedtesting.rules.StatementAdapter.evaluate(StatementAdapter.java:36)
	at com.carrotsearch.randomizedtesting.rules.SystemPropertiesRestoreRule$1.evaluate(SystemPropertiesRestoreRule.java:57)
	at org.apache.lucene.util.AbstractBeforeAfterRule$1.evaluate(AbstractBeforeAfterRule.java:45)
	at com.carrotsearch.randomizedtesting.rules.StatementAdapter.evaluate(StatementAdapter.java:36)
	at org.apache.lucene.util.TestRuleStoreClassName$1.evaluate(TestRuleStoreClassName.java:41)
	at com.carrotsearch.randomizedtesting.rules.NoShadowingOrOverridesOnMethodsRule$1.evaluate(NoShadowingOrOverridesOnMethodsRule.java:40)
	at com.carrotsearch.randomizedtesting.rules.NoShadowingOrOverridesOnMethodsRule$1.evaluate(NoShadowingOrOverridesOnMethodsRule.java:40)
	at com.carrotsearch.randomizedtesting.rules.StatementAdapter.evaluate(StatementAdapter.java:36)
	at com.carrotsearch.randomizedtesting.rules.StatementAdapter.evaluate(StatementAdapter.java:36)
	at com.carrotsearch.randomizedtesting.rules.StatementAdapter.evaluate(StatementAdapter.java:36)
	at org.apache.lucene.util.TestRuleAssertionsRequired$1.evaluate(TestRuleAssertionsRequired.java:53)
	at org.apache.lucene.util.TestRuleMarkFailure$1.evaluate(TestRuleMarkFailure.java:47)
	at org.apache.lucene.util.TestRuleIgnoreAfterMaxFailures$1.evaluate(TestRuleIgnoreAfterMaxFailures.java:64)
	at org.apache.lucene.util.TestRuleIgnoreTestSuites$1.evaluate(TestRuleIgnoreTestSuites.java:54)
	at com.carrotsearch.randomizedtesting.rules.StatementAdapter.evaluate(StatementAdapter.java:36)
	at com.carrotsearch.randomizedtesting.ThreadLeakControl$StatementRunner.run(ThreadLeakControl.java:367)
	at java.lang.Thread.run(Thread.java:745)


FAILED:  org.apache.solr.handler.component.SpellCheckComponentTest.testNumericQuery

Error Message:
List size mismatch @ spellcheck/suggestions

Stack Trace:
java.lang.RuntimeException: List size mismatch @ spellcheck/suggestions
	at __randomizedtesting.SeedInfo.seed([C8C83177370373FE:C3E466B7A8CACF51]:0)
	at org.apache.solr.SolrTestCaseJ4.assertJQ(SolrTestCaseJ4.java:842)
	at org.apache.solr.SolrTestCaseJ4.assertJQ(SolrTestCaseJ4.java:789)
	at org.apache.solr.handler.component.SpellCheckComponentTest.testNumericQuery(SpellCheckComponentTest.java:154)
	at sun.reflect.NativeMethodAccessorImpl.invoke0(Native Method)
	at sun.reflect.NativeMethodAccessorImpl.invoke(NativeMethodAccessorImpl.java:62)
	at sun.reflect.DelegatingMethodAccessorImpl.invoke(DelegatingMethodAccessorImpl.java:43)
	at java.lang.reflect.Method.invoke(Method.java:498)
	at com.carrotsearch.randomizedtesting.RandomizedRunner.invoke(RandomizedRunner.java:1764)
	at com.carrotsearch.randomizedtesting.RandomizedRunner$8.evaluate(RandomizedRunner.java:871)
	at com.carrotsearch.randomizedtesting.RandomizedRunner$9.evaluate(RandomizedRunner.java:907)
	at com.carrotsearch.randomizedtesting.RandomizedRunner$10.evaluate(RandomizedRunner.java:921)
	at com.carrotsearch.randomizedtesting.rules.SystemPropertiesRestoreRule$1.evaluate(SystemPropertiesRestoreRule.java:57)
	at org.apache.lucene.util.TestRuleSetupTeardownChained$1.evaluate(TestRuleSetupTeardownChained.java:49)
	at org.apache.lucene.util.AbstractBeforeAfterRule$1.evaluate(AbstractBeforeAfterRule.java:45)
	at org.apache.lucene.util.TestRuleThreadAndTestName$1.evaluate(TestRuleThreadAndTestName.java:48)
	at org.apache.lucene.util.TestRuleIgnoreAfterMaxFailures$1.evaluate(TestRuleIgnoreAfterMaxFailures.java:64)
	at org.apache.lucene.util.TestRuleMarkFailure$1.evaluate(TestRuleMarkFailure.java:47)
	at com.carrotsearch.randomizedtesting.rules.StatementAdapter.evaluate(StatementAdapter.java:36)
	at com.carrotsearch.randomizedtesting.ThreadLeakControl$StatementRunner.run(ThreadLeakControl.java:367)
	at com.carrotsearch.randomizedtesting.ThreadLeakControl.forkTimeoutingTask(ThreadLeakControl.java:809)
	at com.carrotsearch.randomizedtesting.ThreadLeakControl$3.evaluate(ThreadLeakControl.java:460)
	at com.carrotsearch.randomizedtesting.RandomizedRunner.runSingleTest(RandomizedRunner.java:880)
	at com.carrotsearch.randomizedtesting.RandomizedRunner$5.evaluate(RandomizedRunner.java:781)
	at com.carrotsearch.randomizedtesting.RandomizedRunner$6.evaluate(RandomizedRunner.java:816)
	at com.carrotsearch.randomizedtesting.RandomizedRunner$7.evaluate(RandomizedRunner.java:827)
	at com.carrotsearch.randomizedtesting.rules.StatementAdapter.evaluate(StatementAdapter.java:36)
	at com.carrotsearch.randomizedtesting.rules.SystemPropertiesRestoreRule$1.evaluate(SystemPropertiesRestoreRule.java:57)
	at org.apache.lucene.util.AbstractBeforeAfterRule$1.evaluate(AbstractBeforeAfterRule.java:45)
	at com.carrotsearch.randomizedtesting.rules.StatementAdapter.evaluate(StatementAdapter.java:36)
	at org.apache.lucene.util.TestRuleStoreClassName$1.evaluate(TestRuleStoreClassName.java:41)
	at com.carrotsearch.randomizedtesting.rules.NoShadowingOrOverridesOnMethodsRule$1.evaluate(NoShadowingOrOverridesOnMethodsRule.java:40)
	at com.carrotsearch.randomizedtesting.rules.NoShadowingOrOverridesOnMethodsRule$1.evaluate(NoShadowingOrOverridesOnMethodsRule.java:40)
	at com.carrotsearch.randomizedtesting.rules.StatementAdapter.evaluate(StatementAdapter.java:36)
	at com.carrotsearch.randomizedtesting.rules.StatementAdapter.evaluate(StatementAdapter.java:36)
	at com.carrotsearch.randomizedtesting.rules.StatementAdapter.evaluate(StatementAdapter.java:36)
	at org.apache.lucene.util.TestRuleAssertionsRequired$1.evaluate(TestRuleAssertionsRequired.java:53)
	at org.apache.lucene.util.TestRuleMarkFailure$1.evaluate(TestRuleMarkFailure.java:47)
	at org.apache.lucene.util.TestRuleIgnoreAfterMaxFailures$1.evaluate(TestRuleIgnoreAfterMaxFailures.java:64)
	at org.apache.lucene.util.TestRuleIgnoreTestSuites$1.evaluate(TestRuleIgnoreTestSuites.java:54)
	at com.carrotsearch.randomizedtesting.rules.StatementAdapter.evaluate(StatementAdapter.java:36)
	at com.carrotsearch.randomizedtesting.ThreadLeakControl$StatementRunner.run(ThreadLeakControl.java:367)
	at java.lang.Thread.run(Thread.java:745)


FAILED:  org.apache.solr.handler.component.SpellCheckComponentTest.testCollate

Error Message:
Directory MMapDirectory@C:\Users\JenkinsSlave\workspace\Lucene-Solr-trunk-Windows\solr\build\solr-core\test\J1\temp\solr.handler.component.SpellCheckComponentTest_C8C83177370373FE-001\init-core-data-001\spellchecker1 lockFactory=org.apache.lucene.store.NativeFSLockFactory@4a50deab still has pending deleted files; cannot initialize IndexWriter

Stack Trace:
java.lang.IllegalArgumentException: Directory MMapDirectory@C:\Users\JenkinsSlave\workspace\Lucene-Solr-trunk-Windows\solr\build\solr-core\test\J1\temp\solr.handler.component.SpellCheckComponentTest_C8C83177370373FE-001\init-core-data-001\spellchecker1 lockFactory=org.apache.lucene.store.NativeFSLockFactory@4a50deab still has pending deleted files; cannot initialize IndexWriter
	at __randomizedtesting.SeedInfo.seed([C8C83177370373FE:2E968439DFB4E95]:0)
	at org.apache.lucene.index.IndexWriter.<init>(IndexWriter.java:767)
	at org.apache.lucene.search.spell.SpellChecker.clearIndex(SpellChecker.java:455)
	at org.apache.solr.spelling.IndexBasedSpellChecker.build(IndexBasedSpellChecker.java:87)
	at org.apache.solr.handler.component.SpellCheckComponent.prepare(SpellCheckComponent.java:131)
	at org.apache.solr.handler.component.SearchHandler.handleRequestBody(SearchHandler.java:246)
	at org.apache.solr.handler.RequestHandlerBase.handleRequest(RequestHandlerBase.java:155)
	at org.apache.solr.core.SolrCore.execute(SolrCore.java:2082)
	at org.apache.solr.util.TestHarness.query(TestHarness.java:310)
	at org.apache.solr.util.TestHarness.query(TestHarness.java:292)
	at org.apache.solr.SolrTestCaseJ4.assertJQ(SolrTestCaseJ4.java:820)
	at org.apache.solr.SolrTestCaseJ4.assertJQ(SolrTestCaseJ4.java:789)
	at org.apache.solr.handler.component.SpellCheckComponentTest.testCollate(SpellCheckComponentTest.java:171)
	at sun.reflect.NativeMethodAccessorImpl.invoke0(Native Method)
	at sun.reflect.NativeMethodAccessorImpl.invoke(NativeMethodAccessorImpl.java:62)
	at sun.reflect.DelegatingMethodAccessorImpl.invoke(DelegatingMethodAccessorImpl.java:43)
	at java.lang.reflect.Method.invoke(Method.java:498)
	at com.carrotsearch.randomizedtesting.RandomizedRunner.invoke(RandomizedRunner.java:1764)
	at com.carrotsearch.randomizedtesting.RandomizedRunner$8.evaluate(RandomizedRunner.java:871)
	at com.carrotsearch.randomizedtesting.RandomizedRunner$9.evaluate(RandomizedRunner.java:907)
	at com.carrotsearch.randomizedtesting.RandomizedRunner$10.evaluate(RandomizedRunner.java:921)
	at com.carrotsearch.randomizedtesting.rules.SystemPropertiesRestoreRule$1.evaluate(SystemPropertiesRestoreRule.java:57)
	at org.apache.lucene.util.TestRuleSetupTeardownChained$1.evaluate(TestRuleSetupTeardownChained.java:49)
	at org.apache.lucene.util.AbstractBeforeAfterRule$1.evaluate(AbstractBeforeAfterRule.java:45)
	at org.apache.lucene.util.TestRuleThreadAndTestName$1.evaluate(TestRuleThreadAndTestName.java:48)
	at org.apache.lucene.util.TestRuleIgnoreAfterMaxFailures$1.evaluate(TestRuleIgnoreAfterMaxFailures.java:64)
	at org.apache.lucene.util.TestRuleMarkFailure$1.evaluate(TestRuleMarkFailure.java:47)
	at com.carrotsearch.randomizedtesting.rules.StatementAdapter.evaluate(StatementAdapter.java:36)
	at com.carrotsearch.randomizedtesting.ThreadLeakControl$StatementRunner.run(ThreadLeakControl.java:367)
	at com.carrotsearch.randomizedtesting.ThreadLeakControl.forkTimeoutingTask(ThreadLeakControl.java:809)
	at com.carrotsearch.randomizedtesting.ThreadLeakControl$3.evaluate(ThreadLeakControl.java:460)
	at com.carrotsearch.randomizedtesting.RandomizedRunner.runSingleTest(RandomizedRunner.java:880)
	at com.carrotsearch.randomizedtesting.RandomizedRunner$5.evaluate(RandomizedRunner.java:781)
	at com.carrotsearch.randomizedtesting.RandomizedRunner$6.evaluate(RandomizedRunner.java:816)
	at com.carrotsearch.randomizedtesting.RandomizedRunner$7.evaluate(RandomizedRunner.java:827)
	at com.carrotsearch.randomizedtesting.rules.StatementAdapter.evaluate(StatementAdapter.java:36)
	at com.carrotsearch.randomizedtesting.rules.SystemPropertiesRestoreRule$1.evaluate(SystemPropertiesRestoreRule.java:57)
	at org.apache.lucene.util.AbstractBeforeAfterRule$1.evaluate(AbstractBeforeAfterRule.java:45)
	at com.carrotsearch.randomizedtesting.rules.StatementAdapter.evaluate(StatementAdapter.java:36)
	at org.apache.lucene.util.TestRuleStoreClassName$1.evaluate(TestRuleStoreClassName.java:41)
	at com.carrotsearch.randomizedtesting.rules.NoShadowingOrOverridesOnMethodsRule$1.evaluate(NoShadowingOrOverridesOnMethodsRule.java:40)
	at com.carrotsearch.randomizedtesting.rules.NoShadowingOrOverridesOnMethodsRule$1.evaluate(NoShadowingOrOverridesOnMethodsRule.java:40)
	at com.carrotsearch.randomizedtesting.rules.StatementAdapter.evaluate(StatementAdapter.java:36)
	at com.carrotsearch.randomizedtesting.rules.StatementAdapter.evaluate(StatementAdapter.java:36)
	at com.carrotsearch.randomizedtesting.rules.StatementAdapter.evaluate(StatementAdapter.java:36)
	at org.apache.lucene.util.TestRuleAssertionsRequired$1.evaluate(TestRuleAssertionsRequired.java:53)
	at org.apache.lucene.util.TestRuleMarkFailure$1.evaluate(TestRuleMarkFailure.java:47)
	at org.apache.lucene.util.TestRuleIgnoreAfterMaxFailures$1.evaluate(TestRuleIgnoreAfterMaxFailures.java:64)
	at org.apache.lucene.util.TestRuleIgnoreTestSuites$1.evaluate(TestRuleIgnoreTestSuites.java:54)
	at com.carrotsearch.randomizedtesting.rules.StatementAdapter.evaluate(StatementAdapter.java:36)
	at com.carrotsearch.randomizedtesting.ThreadLeakControl$StatementRunner.run(ThreadLeakControl.java:367)
	at java.lang.Thread.run(Thread.java:745)


FAILED:  org.apache.solr.handler.component.SpellCheckComponentTest.test

Error Message:
List size mismatch @ spellcheck/suggestions

Stack Trace:
java.lang.RuntimeException: List size mismatch @ spellcheck/suggestions
	at __randomizedtesting.SeedInfo.seed([C8C83177370373FE:409C0EAD99FF1E06]:0)
	at org.apache.solr.SolrTestCaseJ4.assertJQ(SolrTestCaseJ4.java:842)
	at org.apache.solr.SolrTestCaseJ4.assertJQ(SolrTestCaseJ4.java:789)
	at org.apache.solr.handler.component.SpellCheckComponentTest.test(SpellCheckComponentTest.java:147)
	at sun.reflect.NativeMethodAccessorImpl.invoke0(Native Method)
	at sun.reflect.NativeMethodAccessorImpl.invoke(NativeMethodAccessorImpl.java:62)
	at sun.reflect.DelegatingMethodAccessorImpl.invoke(DelegatingMethodAccessorImpl.java:43)
	at java.lang.reflect.Method.invoke(Method.java:498)
	at com.carrotsearch.randomizedtesting.RandomizedRunner.invoke(RandomizedRunner.java:1764)
	at com.carrotsearch.randomizedtesting.RandomizedRunner$8.evaluate(RandomizedRunner.java:871)
	at com.carrotsearch.randomizedtesting.RandomizedRunner$9.evaluate(RandomizedRunner.java:907)
	at com.carrotsearch.randomizedtesting.RandomizedRunner$10.evaluate(RandomizedRunner.java:921)
	at com.carrotsearch.randomizedtesting.rules.SystemPropertiesRestoreRule$1.evaluate(SystemPropertiesRestoreRule.java:57)
	at org.apache.lucene.util.TestRuleSetupTeardownChained$1.evaluate(TestRuleSetupTeardownChained.java:49)
	at org.apache.lucene.util.AbstractBeforeAfterRule$1.evaluate(AbstractBeforeAfterRule.java:45)
	at org.apache.lucene.util.TestRuleThreadAndTestName$1.evaluate(TestRuleThreadAndTestName.java:48)
	at org.apache.lucene.util.TestRuleIgnoreAfterMaxFailures$1.evaluate(TestRuleIgnoreAfterMaxFailures.java:64)
	at org.apache.lucene.util.TestRuleMarkFailure$1.evaluate(TestRuleMarkFailure.java:47)
	at com.carrotsearch.randomizedtesting.rules.StatementAdapter.evaluate(StatementAdapter.java:36)
	at com.carrotsearch.randomizedtesting.ThreadLeakControl$StatementRunner.run(ThreadLeakControl.java:367)
	at com.carrotsearch.randomizedtesting.ThreadLeakControl.forkTimeoutingTask(ThreadLeakControl.java:809)
	at com.carrotsearch.randomizedtesting.ThreadLeakControl$3.evaluate(ThreadLeakControl.java:460)
	at com.carrotsearch.randomizedtesting.RandomizedRunner.runSingleTest(RandomizedRunner.java:880)
	at com.carrotsearch.randomizedtesting.RandomizedRunner$5.evaluate(RandomizedRunner.java:781)
	at com.carrotsearch.randomizedtesting.RandomizedRunner$6.evaluate(RandomizedRunner.java:816)
	at com.carrotsearch.randomizedtesting.RandomizedRunner$7.evaluate(RandomizedRunner.java:827)
	at com.carrotsearch.randomizedtesting.rules.StatementAdapter.evaluate(StatementAdapter.java:36)
	at com.carrotsearch.randomizedtesting.rules.SystemPropertiesRestoreRule$1.evaluate(SystemPropertiesRestoreRule.java:57)
	at org.apache.lucene.util.AbstractBeforeAfterRule$1.evaluate(AbstractBeforeAfterRule.java:45)
	at com.carrotsearch.randomizedtesting.rules.StatementAdapter.evaluate(StatementAdapter.java:36)
	at org.apache.lucene.util.TestRuleStoreClassName$1.evaluate(TestRuleStoreClassName.java:41)
	at com.carrotsearch.randomizedtesting.rules.NoShadowingOrOverridesOnMethodsRule$1.evaluate(NoShadowingOrOverridesOnMethodsRule.java:40)
	at com.carrotsearch.randomizedtesting.rules.NoShadowingOrOverridesOnMethodsRule$1.evaluate(NoShadowingOrOverridesOnMethodsRule.java:40)
	at com.carrotsearch.randomizedtesting.rules.StatementAdapter.evaluate(StatementAdapter.java:36)
	at com.carrotsearch.randomizedtesting.rules.StatementAdapter.evaluate(StatementAdapter.java:36)
	at com.carrotsearch.randomizedtesting.rules.StatementAdapter.evaluate(StatementAdapter.java:36)
	at org.apache.lucene.util.TestRuleAssertionsRequired$1.evaluate(TestRuleAssertionsRequired.java:53)
	at org.apache.lucene.util.TestRuleMarkFailure$1.evaluate(TestRuleMarkFailure.java:47)
	at org.apache.lucene.util.TestRuleIgnoreAfterMaxFailures$1.evaluate(TestRuleIgnoreAfterMaxFailures.java:64)
	at org.apache.lucene.util.TestRuleIgnoreTestSuites$1.evaluate(TestRuleIgnoreTestSuites.java:54)
	at com.carrotsearch.randomizedtesting.rules.StatementAdapter.evaluate(StatementAdapter.java:36)
	at com.carrotsearch.randomizedtesting.ThreadLeakControl$StatementRunner.run(ThreadLeakControl.java:367)
	at java.lang.Thread.run(Thread.java:745)


FAILED:  org.apache.solr.handler.component.SpellCheckComponentTest.testRebuildOnCommit

Error Message:
Exception during query

Stack Trace:
java.lang.RuntimeException: Exception during query
	at __randomizedtesting.SeedInfo.seed([C8C83177370373FE:82C44C1A640FD09D]:0)
	at org.apache.solr.SolrTestCaseJ4.assertQ(SolrTestCaseJ4.java:754)
	at org.apache.solr.SolrTestCaseJ4.assertQ(SolrTestCaseJ4.java:721)
	at org.apache.solr.handler.component.SpellCheckComponentTest.testRebuildOnCommit(SpellCheckComponentTest.java:267)
	at sun.reflect.NativeMethodAccessorImpl.invoke0(Native Method)
	at sun.reflect.NativeMethodAccessorImpl.invoke(NativeMethodAccessorImpl.java:62)
	at sun.reflect.DelegatingMethodAccessorImpl.invoke(DelegatingMethodAccessorImpl.java:43)
	at java.lang.reflect.Method.invoke(Method.java:498)
	at com.carrotsearch.randomizedtesting.RandomizedRunner.invoke(RandomizedRunner.java:1764)
	at com.carrotsearch.randomizedtesting.RandomizedRunner$8.evaluate(RandomizedRunner.java:871)
	at com.carrotsearch.randomizedtesting.RandomizedRunner$9.evaluate(RandomizedRunner.java:907)
	at com.carrotsearch.randomizedtesting.RandomizedRunner$10.evaluate(RandomizedRunner.java:921)
	at com.carrotsearch.randomizedtesting.rules.SystemPropertiesRestoreRule$1.evaluate(SystemPropertiesRestoreRule.java:57)
	at org.apache.lucene.util.TestRuleSetupTeardownChained$1.evaluate(TestRuleSetupTeardownChained.java:49)
	at org.apache.lucene.util.AbstractBeforeAfterRule$1.evaluate(AbstractBeforeAfterRule.java:45)
	at org.apache.lucene.util.TestRuleThreadAndTestName$1.evaluate(TestRuleThreadAndTestName.java:48)
	at org.apache.lucene.util.TestRuleIgnoreAfterMaxFailures$1.evaluate(TestRuleIgnoreAfterMaxFailures.java:64)
	at org.apache.lucene.util.TestRuleMarkFailure$1.evaluate(TestRuleMarkFailure.java:47)
	at com.carrotsearch.randomizedtesting.rules.StatementAdapter.evaluate(StatementAdapter.java:36)
	at com.carrotsearch.randomizedtesting.ThreadLeakControl$StatementRunner.run(ThreadLeakControl.java:367)
	at com.carrotsearch.randomizedtesting.ThreadLeakControl.forkTimeoutingTask(ThreadLeakControl.java:809)
	at com.carrotsearch.randomizedtesting.ThreadLeakControl$3.evaluate(ThreadLeakControl.java:460)
	at com.carrotsearch.randomizedtesting.RandomizedRunner.runSingleTest(RandomizedRunner.java:880)
	at com.carrotsearch.randomizedtesting.RandomizedRunner$5.evaluate(RandomizedRunner.java:781)
	at com.carrotsearch.randomizedtesting.RandomizedRunner$6.evaluate(RandomizedRunner.java:816)
	at com.carrotsearch.randomizedtesting.RandomizedRunner$7.evaluate(RandomizedRunner.java:827)
	at com.carrotsearch.randomizedtesting.rules.StatementAdapter.evaluate(StatementAdapter.java:36)
	at com.carrotsearch.randomizedtesting.rules.SystemPropertiesRestoreRule$1.evaluate(SystemPropertiesRestoreRule.java:57)
	at org.apache.lucene.util.AbstractBeforeAfterRule$1.evaluate(AbstractBeforeAfterRule.java:45)
	at com.carrotsearch.randomizedtesting.rules.StatementAdapter.evaluate(StatementAdapter.java:36)
	at org.apache.lucene.util.TestRuleStoreClassName$1.evaluate(TestRuleStoreClassName.java:41)
	at com.carrotsearch.randomizedtesting.rules.NoShadowingOrOverridesOnMethodsRule$1.evaluate(NoShadowingOrOverridesOnMethodsRule.java:40)
	at com.carrotsearch.randomizedtesting.rules.NoShadowingOrOverridesOnMethodsRule$1.evaluate(NoShadowingOrOverridesOnMethodsRule.java:40)
	at com.carrotsearch.randomizedtesting.rules.StatementAdapter.evaluate(StatementAdapter.java:36)
	at com.carrotsearch.randomizedtesting.rules.StatementAdapter.evaluate(StatementAdapter.java:36)
	at com.carrotsearch.randomizedtesting.rules.StatementAdapter.evaluate(StatementAdapter.java:36)
	at org.apache.lucene.util.TestRuleAssertionsRequired$1.evaluate(TestRuleAssertionsRequired.java:53)
	at org.apache.lucene.util.TestRuleMarkFailure$1.evaluate(TestRuleMarkFailure.java:47)
	at org.apache.lucene.util.TestRuleIgnoreAfterMaxFailures$1.evaluate(TestRuleIgnoreAfterMaxFailures.java:64)
	at org.apache.lucene.util.TestRuleIgnoreTestSuites$1.evaluate(TestRuleIgnoreTestSuites.java:54)
	at com.carrotsearch.randomizedtesting.rules.StatementAdapter.evaluate(StatementAdapter.java:36)
	at com.carrotsearch.randomizedtesting.ThreadLeakControl$StatementRunner.run(ThreadLeakControl.java:367)
	at java.lang.Thread.run(Thread.java:745)
Caused by: java.lang.RuntimeException: REQUEST FAILED: xpath=//arr[@name='suggestion'][.='lucenejava']
	xml response was: <?xml version="1.0" encoding="UTF-8"?>
<response>
<lst name="responseHeader"><int name="status">0</int><int name="QTime">304</int></lst><result name="response" numFound="0" start="0"></result><lst name="spellcheck"><lst name="suggestions"/></lst>
</response>

	request was:q=lowerfilt:lucenejavt&qt=spellCheckCompRH&spellcheck=true&wt=xml
	at org.apache.solr.SolrTestCaseJ4.assertQ(SolrTestCaseJ4.java:747)
	... 41 more


FAILED:  org.apache.solr.handler.component.DistributedSpellCheckComponentTest.test

Error Message:
Error from server at http://127.0.0.1:51445/_/collection1: Directory MMapDirectory@C:\Users\JenkinsSlave\workspace\Lucene-Solr-trunk-Windows\solr\build\solr-core\test\J0\temp\solr.handler.component.DistributedSpellCheckComponentTest_C8C83177370373FE-001\tempDir-001\control\cores\collection1\data\spellchecker1 lockFactory=org.apache.lucene.store.NativeFSLockFactory@5fa42c7e still has pending deleted files; cannot initialize IndexWriter

Stack Trace:
org.apache.solr.client.solrj.impl.HttpSolrClient$RemoteSolrException: Error from server at http://127.0.0.1:51445/_/collection1: Directory MMapDirectory@C:\Users\JenkinsSlave\workspace\Lucene-Solr-trunk-Windows\solr\build\solr-core\test\J0\temp\solr.handler.component.DistributedSpellCheckComponentTest_C8C83177370373FE-001\tempDir-001\control\cores\collection1\data\spellchecker1 lockFactory=org.apache.lucene.store.NativeFSLockFactory@5fa42c7e still has pending deleted files; cannot initialize IndexWriter
	at __randomizedtesting.SeedInfo.seed([C8C83177370373FE:409C0EAD99FF1E06]:0)
	at org.apache.solr.client.solrj.impl.HttpSolrClient.executeMethod(HttpSolrClient.java:577)
	at org.apache.solr.client.solrj.impl.HttpSolrClient.request(HttpSolrClient.java:241)
	at org.apache.solr.client.solrj.impl.HttpSolrClient.request(HttpSolrClient.java:230)
	at org.apache.solr.client.solrj.SolrRequest.process(SolrRequest.java:149)
	at org.apache.solr.client.solrj.SolrClient.query(SolrClient.java:942)
	at org.apache.solr.client.solrj.SolrClient.query(SolrClient.java:957)
	at org.apache.solr.handler.component.DistributedSpellCheckComponentTest.q(DistributedSpellCheckComponentTest.java:67)
	at org.apache.solr.handler.component.DistributedSpellCheckComponentTest.test(DistributedSpellCheckComponentTest.java:146)
	at sun.reflect.NativeMethodAccessorImpl.invoke0(Native Method)
	at sun.reflect.NativeMethodAccessorImpl.invoke(NativeMethodAccessorImpl.java:62)
	at sun.reflect.DelegatingMethodAccessorImpl.invoke(DelegatingMethodAccessorImpl.java:43)
	at java.lang.reflect.Method.invoke(Method.java:498)
	at com.carrotsearch.randomizedtesting.RandomizedRunner.invoke(RandomizedRunner.java:1764)
	at com.carrotsearch.randomizedtesting.RandomizedRunner$8.evaluate(RandomizedRunner.java:871)
	at com.carrotsearch.randomizedtesting.RandomizedRunner$9.evaluate(RandomizedRunner.java:907)
	at com.carrotsearch.randomizedtesting.RandomizedRunner$10.evaluate(RandomizedRunner.java:921)
	at org.apache.solr.BaseDistributedSearchTestCase$ShardsRepeatRule$ShardsRepeatStatement.callStatement(BaseDistributedSearchTestCase.java:990)
	at org.apache.solr.BaseDistributedSearchTestCase$ShardsRepeatRule$ShardsStatement.evaluate(BaseDistributedSearchTestCase.java:939)
	at com.carrotsearch.randomizedtesting.rules.SystemPropertiesRestoreRule$1.evaluate(SystemPropertiesRestoreRule.java:57)
	at org.apache.lucene.util.TestRuleSetupTeardownChained$1.evaluate(TestRuleSetupTeardownChained.java:49)
	at org.apache.lucene.util.AbstractBeforeAfterRule$1.evaluate(AbstractBeforeAfterRule.java:45)
	at org.apache.lucene.util.TestRuleThreadAndTestName$1.evaluate(TestRuleThreadAndTestName.java:48)
	at org.apache.lucene.util.TestRuleIgnoreAfterMaxFailures$1.evaluate(TestRuleIgnoreAfterMaxFailures.java:64)
	at org.apache.lucene.util.TestRuleMarkFailure$1.evaluate(TestRuleMarkFailure.java:47)
	at com.carrotsearch.randomizedtesting.rules.StatementAdapter.evaluate(StatementAdapter.java:36)
	at com.carrotsearch.randomizedtesting.ThreadLeakControl$StatementRunner.run(ThreadLeakControl.java:367)
	at com.carrotsearch.randomizedtesting.ThreadLeakControl.forkTimeoutingTask(ThreadLeakControl.java:809)
	at com.carrotsearch.randomizedtesting.ThreadLeakControl$3.evaluate(ThreadLeakControl.java:460)
	at com.carrotsearch.randomizedtesting.RandomizedRunner.runSingleTest(RandomizedRunner.java:880)
	at com.carrotsearch.randomizedtesting.RandomizedRunner$5.evaluate(RandomizedRunner.java:781)
	at com.carrotsearch.randomizedtesting.RandomizedRunner$6.evaluate(RandomizedRunner.java:816)
	at com.carrotsearch.randomizedtesting.RandomizedRunner$7.evaluate(RandomizedRunner.java:827)
	at com.carrotsearch.randomizedtesting.rules.StatementAdapter.evaluate(StatementAdapter.java:36)
	at com.carrotsearch.randomizedtesting.rules.SystemPropertiesRestoreRule$1.evaluate(SystemPropertiesRestoreRule.java:57)
	at org.apache.lucene.util.AbstractBeforeAfterRule$1.evaluate(AbstractBeforeAfterRule.java:45)
	at com.carrotsearch.randomizedtesting.rules.StatementAdapter.evaluate(StatementAdapter.java:36)
	at org.apache.lucene.util.TestRuleStoreClassName$1.evaluate(TestRuleStoreClassName.java:41)
	at com.carrotsearch.randomizedtesting.rules.NoShadowingOrOverridesOnMethodsRule$1.evaluate(NoShadowingOrOverridesOnMethodsRule.java:40)
	at com.carrotsearch.randomizedtesting.rules.NoShadowingOrOverridesOnMethodsRule$1.evaluate(NoShadowingOrOverridesOnMethodsRule.java:40)
	at com.carrotsearch.randomizedtesting.rules.StatementAdapter.evaluate(StatementAdapter.java:36)
	at com.carrotsearch.randomizedtesting.rules.StatementAdapter.evaluate(StatementAdapter.java:36)
	at com.carrotsearch.randomizedtesting.rules.StatementAdapter.evaluate(StatementAdapter.java:36)
	at org.apache.lucene.util.TestRuleAssertionsRequired$1.evaluate(TestRuleAssertionsRequired.java:53)
	at org.apache.lucene.util.TestRuleMarkFailure$1.evaluate(TestRuleMarkFailure.java:47)
	at org.apache.lucene.util.TestRuleIgnoreAfterMaxFailures$1.evaluate(TestRuleIgnoreAfterMaxFailures.java:64)
	at org.apache.lucene.util.TestRuleIgnoreTestSuites$1.evaluate(TestRuleIgnoreTestSuites.java:54)
	at com.carrotsearch.randomizedtesting.rules.StatementAdapter.evaluate(StatementAdapter.java:36)
	at com.carrotsearch.randomizedtesting.ThreadLeakControl$StatementRunner.run(ThreadLeakControl.java:367)
	at java.lang.Thread.run(Thread.java:745)




Build Log:
[...truncated 10705 lines...]
   [junit4] Suite: org.apache.solr.handler.component.SpellCheckComponentTest
   [junit4]   2> Creating dataDir: C:\Users\JenkinsSlave\workspace\Lucene-Solr-trunk-Windows\solr\build\solr-core\test\J1\temp\solr.handler.component.SpellCheckComponentTest_C8C83177370373FE-001\init-core-data-001
   [junit4]   2> 467523 INFO  (SUITE-SpellCheckComponentTest-seed#[C8C83177370373FE]-worker) [    ] o.a.s.SolrTestCaseJ4 Randomized ssl (true) and clientAuth (false)
   [junit4]   2> 467525 INFO  (SUITE-SpellCheckComponentTest-seed#[C8C83177370373FE]-worker) [    ] o.a.s.SolrTestCaseJ4 ####initCore
   [junit4]   2> 467525 INFO  (SUITE-SpellCheckComponentTest-seed#[C8C83177370373FE]-worker) [    ] o.a.s.c.SolrResourceLoader new SolrResourceLoader for directory: 'C:\Users\JenkinsSlave\workspace\Lucene-Solr-trunk-Windows\solr\core\src\test-files\solr\collection1'
   [junit4]   2> 467525 INFO  (SUITE-SpellCheckComponentTest-seed#[C8C83177370373FE]-worker) [    ] o.a.s.c.SolrResourceLoader JNDI not configured for solr (NoInitialContextEx)
   [junit4]   2> 467525 INFO  (SUITE-SpellCheckComponentTest-seed#[C8C83177370373FE]-worker) [    ] o.a.s.c.SolrResourceLoader using system property solr.solr.home: C:\Users\JenkinsSlave\workspace\Lucene-Solr-trunk-Windows\solr\core\src\test-files\solr
   [junit4]   2> 467525 INFO  (SUITE-SpellCheckComponentTest-seed#[C8C83177370373FE]-worker) [    ] o.a.s.c.SolrResourceLoader Adding 'file:/C:/Users/JenkinsSlave/workspace/Lucene-Solr-trunk-Windows/solr/core/src/test-files/solr/collection1/lib/classes/' to classloader
   [junit4]   2> 467525 INFO  (SUITE-SpellCheckComponentTest-seed#[C8C83177370373FE]-worker) [    ] o.a.s.c.SolrResourceLoader Adding 'file:/C:/Users/JenkinsSlave/workspace/Lucene-Solr-trunk-Windows/solr/core/src/test-files/solr/collection1/lib/README' to classloader
   [junit4]   2> 467554 INFO  (SUITE-SpellCheckComponentTest-seed#[C8C83177370373FE]-worker) [    ] o.a.s.c.SolrConfig current version of requestparams : -1
   [junit4]   2> 467556 WARN  (SUITE-SpellCheckComponentTest-seed#[C8C83177370373FE]-worker) [    ] o.a.s.c.Config Beginning with Solr 5.5, <mergePolicy> is deprecated, use <mergePolicyFactory> instead.
   [junit4]   2> 467556 WARN  (SUITE-SpellCheckComponentTest-seed#[C8C83177370373FE]-worker) [    ] o.a.s.c.Config Beginning with Solr 5.5, <maxMergeDocs> is deprecated, configure it on the relevant <mergePolicyFactory> instead.
   [junit4]   2> 467556 WARN  (SUITE-SpellCheckComponentTest-seed#[C8C83177370373FE]-worker) [    ] o.a.s.c.Config Beginning with Solr 5.5, <mergeFactor> is deprecated, configure it on the relevant <mergePolicyFactory> instead.
   [junit4]   2> 467557 INFO  (SUITE-SpellCheckComponentTest-seed#[C8C83177370373FE]-worker) [    ] o.a.s.c.SolrConfig Using Lucene MatchVersion: 6.0.0
   [junit4]   2> 467562 INFO  (SUITE-SpellCheckComponentTest-seed#[C8C83177370373FE]-worker) [    ] o.a.s.c.SolrConfig Loaded SolrConfig: solrconfig-spellcheckcomponent.xml
   [junit4]   2> 467566 INFO  (SUITE-SpellCheckComponentTest-seed#[C8C83177370373FE]-worker) [    ] o.a.s.s.IndexSchema [null] Schema name=test
   [junit4]   2> 467609 INFO  (SUITE-SpellCheckComponentTest-seed#[C8C83177370373FE]-worker) [    ] o.a.s.s.OpenExchangeRatesOrgProvider Initialized with rates=open-exchange-rates.json, refreshInterval=1440.
   [junit4]   2> 467614 INFO  (SUITE-SpellCheckComponentTest-seed#[C8C83177370373FE]-worker) [    ] o.a.s.s.IndexSchema default search field in schema is text
   [junit4]   2> 467614 INFO  (SUITE-SpellCheckComponentTest-seed#[C8C83177370373FE]-worker) [    ] o.a.s.s.IndexSchema unique key field: id
   [junit4]   2> 467617 INFO  (SUITE-SpellCheckComponentTest-seed#[C8C83177370373FE]-worker) [    ] o.a.s.s.FileExchangeRateProvider Reloading exchange rates from file currency.xml
   [junit4]   2> 467618 INFO  (SUITE-SpellCheckComponentTest-seed#[C8C83177370373FE]-worker) [    ] o.a.s.s.FileExchangeRateProvider Reloading exchange rates from file currency.xml
   [junit4]   2> 467619 INFO  (SUITE-SpellCheckComponentTest-seed#[C8C83177370373FE]-worker) [    ] o.a.s.s.OpenExchangeRatesOrgProvider Reloading exchange rates from open-exchange-rates.json
   [junit4]   2> 467619 INFO  (SUITE-SpellCheckComponentTest-seed#[C8C83177370373FE]-worker) [    ] o.a.s.s.OpenExchangeRatesOrgProvider Reloading exchange rates from open-exchange-rates.json
   [junit4]   2> 467620 INFO  (SUITE-SpellCheckComponentTest-seed#[C8C83177370373FE]-worker) [    ] o.a.s.c.SolrResourceLoader JNDI not configured for solr (NoInitialContextEx)
   [junit4]   2> 467620 INFO  (SUITE-SpellCheckComponentTest-seed#[C8C83177370373FE]-worker) [    ] o.a.s.c.SolrResourceLoader using system property solr.solr.home: C:\Users\JenkinsSlave\workspace\Lucene-Solr-trunk-Windows\solr\core\src\test-files\solr
   [junit4]   2> 467620 INFO  (SUITE-SpellCheckComponentTest-seed#[C8C83177370373FE]-worker) [    ] o.a.s.c.SolrResourceLoader new SolrResourceLoader for directory: 'C:\Users\JenkinsSlave\workspace\Lucene-Solr-trunk-Windows\solr\core\src\test-files\solr'
   [junit4]   2> 467620 INFO  (SUITE-SpellCheckComponentTest-seed#[C8C83177370373FE]-worker) [    ] o.a.s.c.SolrResourceLoader JNDI not configured for solr (NoInitialContextEx)
   [junit4]   2> 467620 INFO  (SUITE-SpellCheckComponentTest-seed#[C8C83177370373FE]-worker) [    ] o.a.s.c.SolrResourceLoader using system property solr.solr.home: C:\Users\JenkinsSlave\workspace\Lucene-Solr-trunk-Windows\solr\core\src\test-files\solr
   [junit4]   2> 467620 INFO  (SUITE-SpellCheckComponentTest-seed#[C8C83177370373FE]-worker) [    ] o.a.s.c.CoreContainer New CoreContainer 1011570352
   [junit4]   2> 467620 INFO  (SUITE-SpellCheckComponentTest-seed#[C8C83177370373FE]-worker) [    ] o.a.s.c.CoreContainer Loading cores into CoreContainer [instanceDir=C:\Users\JenkinsSlave\workspace\Lucene-Solr-trunk-Windows\solr\core\src\test-files\solr]
   [junit4]   2> 467620 WARN  (SUITE-SpellCheckComponentTest-seed#[C8C83177370373FE]-worker) [    ] o.a.s.c.CoreContainer Couldn't add files from C:\Users\JenkinsSlave\workspace\Lucene-Solr-trunk-Windows\solr\core\src\test-files\solr\lib to classpath: C:\Users\JenkinsSlave\workspace\Lucene-Solr-trunk-Windows\solr\core\src\test-files\solr\lib
   [junit4]   2> 467620 INFO  (SUITE-SpellCheckComponentTest-seed#[C8C83177370373FE]-worker) [    ] o.a.s.h.c.HttpShardHandlerFactory created with socketTimeout : 600000,connTimeout : 60000,maxConnectionsPerHost : 20,maxConnections : 10000,corePoolSize : 0,maximumPoolSize : 2147483647,maxThreadIdleTime : 5,sizeOfQueue : -1,fairnessPolicy : false,useRetries : false,
   [junit4]   2> 467627 INFO  (SUITE-SpellCheckComponentTest-seed#[C8C83177370373FE]-worker) [    ] o.a.s.u.UpdateShardHandler Creating UpdateShardHandler HTTP client with params: socketTimeout=30000&connTimeout=30000&retry=true
   [junit4]   2> 467628 INFO  (SUITE-SpellCheckComponentTest-seed#[C8C83177370373FE]-worker) [    ] o.a.s.l.LogWatcher SLF4J impl is org.slf4j.impl.Log4jLoggerFactory
   [junit4]   2> 467628 INFO  (SUITE-SpellCheckComponentTest-seed#[C8C83177370373FE]-worker) [    ] o.a.s.l.LogWatcher Registering Log Listener [Log4j (org.slf4j.impl.Log4jLoggerFactory)]
   [junit4]   2> 467629 INFO  (SUITE-SpellCheckComponentTest-seed#[C8C83177370373FE]-worker) [    ] o.a.s.c.CoreContainer Security conf doesn't exist. Skipping setup for authorization module.
   [junit4]   2> 467629 INFO  (SUITE-SpellCheckComponentTest-seed#[C8C83177370373FE]-worker) [    ] o.a.s.c.CoreContainer No authentication plugin used.
   [junit4]   2> 467629 INFO  (SUITE-SpellCheckComponentTest-seed#[C8C83177370373FE]-worker) [    ] o.a.s.c.CoreDescriptor Created CoreDescriptor: {name=collection1, config=solrconfig-spellcheckcomponent.xml, transient=false, schema=schema.xml, loadOnStartup=true, configSetProperties=configsetprops.json, collection=collection1, dataDir=C:\Users\JenkinsSlave\workspace\Lucene-Solr-trunk-Windows\solr\build\solr-core\test\J1\temp\solr.handler.component.SpellCheckComponentTest_C8C83177370373FE-001\init-core-data-001, shard=shard1}
   [junit4]   2> 467630 INFO  (coreLoadExecutor-1234-thread-1) [    ] o.a.s.c.SolrResourceLoader new SolrResourceLoader for directory: 'C:\Users\JenkinsSlave\workspace\Lucene-Solr-trunk-Windows\solr\core\src\test-files\solr\collection1'
   [junit4]   2> 467631 INFO  (coreLoadExecutor-1234-thread-1) [    ] o.a.s.c.SolrResourceLoader JNDI not configured for solr (NoInitialContextEx)
   [junit4]   2> 467631 INFO  (coreLoadExecutor-1234-thread-1) [    ] o.a.s.c.SolrResourceLoader using system property solr.solr.home: C:\Users\JenkinsSlave\workspace\Lucene-Solr-trunk-Windows\solr\core\src\test-files\solr
   [junit4]   2> 467631 INFO  (coreLoadExecutor-1234-thread-1) [    ] o.a.s.c.SolrResourceLoader Adding 'file:/C:/Users/JenkinsSlave/workspace/Lucene-Solr-trunk-Windows/solr/core/src/test-files/solr/collection1/lib/classes/' to classloader
   [junit4]   2> 467631 INFO  (coreLoadExecutor-1234-thread-1) [    ] o.a.s.c.SolrResourceLoader Adding 'file:/C:/Users/JenkinsSlave/workspace/Lucene-Solr-trunk-Windows/solr/core/src/test-files/solr/collection1/lib/README' to classloader
   [junit4]   2> 467645 INFO  (coreLoadExecutor-1234-thread-1) [    ] o.a.s.c.SolrConfig current version of requestparams : -1
   [junit4]   2> 467648 WARN  (coreLoadExecutor-1234-thread-1) [    ] o.a.s.c.Config Beginning with Solr 5.5, <mergePolicy> is deprecated, use <mergePolicyFactory> instead.
   [junit4]   2> 467648 WARN  (coreLoadExecutor-1234-thread-1) [    ] o.a.s.c.Config Beginning with Solr 5.5, <maxMergeDocs> is deprecated, configure it on the relevant <mergePolicyFactory> instead.
   [junit4]   2> 467648 WARN  (coreLoadExecutor-1234-thread-1) [    ] o.a.s.c.Config Beginning with Solr 5.5, <mergeFactor> is deprecated, configure it on the relevant <mergePolicyFactory> instead.
   [junit4]   2> 467648 INFO  (coreLoadExecutor-1234-thread-1) [    ] o.a.s.c.SolrConfig Using Lucene MatchVersion: 6.0.0
   [junit4]   2> 467657 INFO  (coreLoadExecutor-1234-thread-1) [    ] o.a.s.c.SolrConfig Loaded SolrConfig: solrconfig-spellcheckcomponent.xml
   [junit4]   2> 467661 INFO  (coreLoadExecutor-1234-thread-1) [    ] o.a.s.s.IndexSchema [collection1] Schema name=test
   [junit4]   2> 467704 INFO  (coreLoadExecutor-1234-thread-1) [    ] o.a.s.s.OpenExchangeRatesOrgProvider Initialized with rates=open-exchange-rates.json, refreshInterval=1440.
   [junit4]   2> 467709 INFO  (coreLoadExecutor-1234-thread-1) [    ] o.a.s.s.IndexSchema default search field in schema is text
   [junit4]   2> 467710 INFO  (coreLoadExecutor-1234-thread-1) [    ] o.a.s.s.IndexSchema unique key field: id
   [junit4]   2> 467712 INFO  (coreLoadExecutor-1234-thread-1) [    ] o.a.s.s.FileExchangeRateProvider Reloading exchange rates from file currency.xml
   [junit4]   2> 467713 INFO  (coreLoadExecutor-1234-thread-1) [    ] o.a.s.s.FileExchangeRateProvider Reloading exchange rates from file currency.xml
   [junit4]   2> 467714 INFO  (coreLoadExecutor-1234-thread-1) [    ] o.a.s.s.OpenExchangeRatesOrgProvider Reloading exchange rates from open-exchange-rates.json
   [junit4]   2> 467714 INFO  (coreLoadExecutor-1234-thread-1) [    ] o.a.s.s.OpenExchangeRatesOrgProvider Reloading exchange rates from open-exchange-rates.json
   [junit4]   2> 467719 INFO  (coreLoadExecutor-1234-thread-1) [    ] o.a.s.c.ConfigSetProperties Did not find ConfigSet properties, assuming default properties: Can't find resource 'configsetprops.json' in classpath or 'C:\Users\JenkinsSlave\workspace\Lucene-Solr-trunk-Windows\solr\core\src\test-files\solr\collection1'
   [junit4]   2> 467719 INFO  (coreLoadExecutor-1234-thread-1) [    ] o.a.s.c.CoreContainer Creating SolrCore 'collection1' using configuration from instancedir C:\Users\JenkinsSlave\workspace\Lucene-Solr-trunk-Windows\solr\core\src\test-files\solr\collection1
   [junit4]   2> 467719 INFO  (coreLoadExecutor-1234-thread-1) [    x:collection1] o.a.s.c.SolrCore org.apache.solr.core.MockDirectoryFactory
   [junit4]   2> 467719 INFO  (coreLoadExecutor-1234-thread-1) [    x:collection1] o.a.s.c.SolrCore [[collection1] ] Opening new SolrCore at [C:\Users\JenkinsSlave\workspace\Lucene-Solr-trunk-Windows\solr\core\src\test-files\solr\collection1], dataDir=[C:\Users\JenkinsSlave\workspace\Lucene-Solr-trunk-Windows\solr\build\solr-core\test\J1\temp\solr.handler.component.SpellCheckComponentTest_C8C83177370373FE-001\init-core-data-001\]
   [junit4]   2> 467719 INFO  (coreLoadExecutor-1234-thread-1) [    x:collection1] o.a.s.c.SolrCore JMX monitoring not detected for core: collection1
   [junit4]   2> 467719 INFO  (coreLoadExecutor-1234-thread-1) [    x:collection1] o.a.s.c.CachingDirectoryFactory return new directory for C:\Users\JenkinsSlave\workspace\Lucene-Solr-trunk-Windows\solr\build\solr-core\test\J1\temp\solr.handler.component.SpellCheckComponentTest_C8C83177370373FE-001\init-core-data-001\
   [junit4]   2> 467719 INFO  (coreLoadExecutor-1234-thread-1) [    x:collection1] o.a.s.c.SolrCore New index directory detected: old=null new=C:\Users\JenkinsSlave\workspace\Lucene-Solr-trunk-Windows\solr\build\solr-core\test\J1\temp\solr.handler.component.SpellCheckComponentTest_C8C83177370373FE-001\init-core-data-001\index/
   [junit4]   2> 467719 WARN  (coreLoadExecutor-1234-thread-1) [    x:collection1] o.a.s.c.SolrCore [collection1] Solr index directory 'C:\Users\JenkinsSlave\workspace\Lucene-Solr-trunk-Windows\solr\build\solr-core\test\J1\temp\solr.handler.component.SpellCheckComponentTest_C8C83177370373FE-001\init-core-data-001\index' doesn't exist. Creating new index...
   [junit4]   2> 467719 INFO  (coreLoadExecutor-1234-thread-1) [    x:collection1] o.a.s.c.CachingDirectoryFactory return new directory for C:\Users\JenkinsSlave\workspace\Lucene-Solr-trunk-Windows\solr\build\solr-core\test\J1\temp\solr.handler.component.SpellCheckComponentTest_C8C83177370373FE-001\init-core-data-001\index
   [junit4]   2> 467719 INFO  (coreLoadExecutor-1234-thread-1) [    x:collection1] o.a.s.u.RandomMergePolicy RandomMergePolicy wrapping class org.apache.lucene.index.TieredMergePolicy: [TieredMergePolicy: maxMergeAtOnce=24, maxMergeAtOnceExplicit=37, maxMergedSegmentMB=44.5888671875, floorSegmentMB=1.751953125, forceMergeDeletesPctAllowed=18.1768139230966, segmentsPerTier=11.0, maxCFSSegmentSizeMB=8.796093022207999E12, noCFSRatio=0.7611598884692828
   [junit4]   2> 467719 INFO  (coreLoadExecutor-1234-thread-1) [    x:collection1] o.a.s.c.SolrDeletionPolicy SolrDeletionPolicy.onCommit: commits: num=1
   [junit4]   2> 	commit{dir=MockDirectoryWrapper(RAMDirectory@c40e984 lockFactory=org.apache.lucene.store.SingleInstanceLockFactory@2b983ee3),segFN=segments_1,generation=1}
   [junit4]   2> 467720 INFO  (coreLoadExecutor-1234-thread-1) [    x:collection1] o.a.s.c.SolrDeletionPolicy newest commit generation = 1
   [junit4]   2> 467721 INFO  (OldIndexDirectoryCleanupThreadForCore-collection1) [    x:collection1] o.a.s.c.SolrCore Looking for old index directories to cleanup for core collection1 in C:\Users\JenkinsSlave\workspace\Lucene-Solr-trunk-Windows\solr\build\solr-core\test\J1\temp\solr.handler.component.SpellCheckComponentTest_C8C83177370373FE-001\init-core-data-001\
   [junit4]   2> 467721 INFO  (coreLoadExecutor-1234-thread-1) [    x:collection1] o.a.s.c.SolrCore no updateRequestProcessorChain defined as default, creating implicit default
   [junit4]   2> 467723 INFO  (coreLoadExecutor-1234-thread-1) [    x:collection1] o.a.s.h.l.XMLLoader xsltCacheLifetimeSeconds=60
   [junit4]   2> 467724 INFO  (coreLoadExecutor-1234-thread-1) [    x:collection1] o.a.s.h.l.XMLLoader xsltCacheLifetimeSeconds=60
   [junit4]   2> 467726 INFO  (coreLoadExecutor-1234-thread-1) [    x:collection1] o.a.s.h.l.XMLLoader xsltCacheLifetimeSeconds=60
   [junit4]   2> 467726 INFO  (coreLoadExecutor-1234-thread-1) [    x:collection1] o.a.s.h.l.XMLLoader xsltCacheLifetimeSeconds=60
   [junit4]   2> 467727 INFO  (coreLoadExecutor-1234-thread-1) [    x:collection1] o.a.s.c.RequestHandlers Registered paths: /admin/mbeans,standard,spellCheckCompRH,/update/json/docs,/admin/luke,/export,/get,/admin/properties,/update/json,/admin/threads,/update/csv,/sql,/admin/segments,spellCheckCompRH1,/admin/system,/replication,/config,/stream,/schema,/admin/plugins,/admin/logging,spellCheckWithWordbreak,/admin/ping,/update,/admin/file
   [junit4]   2> 467727 INFO  (coreLoadExecutor-1234-thread-1) [    x:collection1] o.a.s.c.SolrCore Using default statsCache cache: org.apache.solr.search.stats.LocalStatsCache
   [junit4]   2> 467728 INFO  (coreLoadExecutor-1234-thread-1) [    x:collection1] o.a.s.u.CommitTracker Hard AutoCommit: disabled
   [junit4]   2> 467728 INFO  (coreLoadExecutor-1234-thread-1) [    x:collection1] o.a.s.u.CommitTracker Soft AutoCommit: disabled
   [junit4]   2> 467728 INFO  (coreLoadExecutor-1234-thread-1) [    x:collection1] o.a.s.u.RandomMergePolicy RandomMergePolicy wrapping class org.apache.lucene.index.LogByteSizeMergePolicy: [LogByteSizeMergePolicy: minMergeSize=1677721, mergeFactor=47, maxMergeSize=2147483648, maxMergeSizeForForcedMerge=9223372036854775807, calibrateSizeByDeletes=false, maxMergeDocs=2147483647, maxCFSSegmentSizeMB=8.796093022207999E12, noCFSRatio=0.8405905834251521]
   [junit4]   2> 467728 INFO  (coreLoadExecutor-1234-thread-1) [    x:collection1] o.a.s.c.SolrDeletionPolicy SolrDeletionPolicy.onInit: commits: num=1
   [junit4]   2> 	commit{dir=MockDirectoryWrapper(RAMDirectory@c40e984 lockFactory=org.apache.lucene.store.SingleInstanceLockFactory@2b983ee3),segFN=segments_1,generation=1}
   [junit4]   2> 467728 INFO  (coreLoadExecutor-1234-thread-1) [    x:collection1] o.a.s.c.SolrDeletionPolicy newest commit generation = 1
   [junit4]   2> 467728 INFO  (coreLoadExecutor-1234-thread-1) [    x:collection1] o.a.s.s.SolrIndexSearcher Opening [Searcher@5154ddbb[collection1] main]
   [junit4]   2> 467728 WARN  (coreLoadExecutor-1234-thread-1) [    x:collection1] o.a.s.r.ManagedResourceStorage Cannot write to config directory C:\Users\JenkinsSlave\workspace\Lucene-Solr-trunk-Windows\solr\core\src\test-files\solr\collection1\conf; switching to use InMemory storage instead.
   [junit4]   2> 467728 INFO  (coreLoadExecutor-1234-thread-1) [    x:collection1] o.a.s.r.RestManager Initializing RestManager with initArgs: {}
   [junit4]   2> 467728 INFO  (coreLoadExecutor-1234-thread-1) [    x:collection1] o.a.s.r.ManagedResourceStorage Reading _rest_managed.json using InMemoryStorage
   [junit4]   2> 467728 INFO  (coreLoadExecutor-1234-thread-1) [    x:collection1] o.a.s.r.RestManager Initializing 0 registered ManagedResources
   [junit4]   2> 467729 INFO  (coreLoadExecutor-1234-thread-1) [    x:collection1] o.a.s.h.c.SpellCheckComponent Initializing spell checkers
   [junit4]   2> 467743 INFO  (coreLoadExecutor-1234-thread-1) [    x:collection1] o.a.s.h.c.SpellCheckComponent Registering newSearcher listener for spellchecker: default
   [junit4]   2> 467758 INFO  (coreLoadExecutor-1234-thread-1) [    x:collection1] o.a.s.h.c.SpellCheckComponent Registering newSearcher listener for spellchecker: default_teststop
   [junit4]   2> 467758 INFO  (coreLoadExecutor-1234-thread-1) [    x:collection1] o.a.s.s.DirectSolrSpellChecker init: {name=direct,classname=solr.DirectSolrSpellChecker,minQueryLength=3,maxQueryFrequency=100.0,field=teststop}
   [junit4]   2> 467758 INFO  (coreLoadExecutor-1234-thread-1) [    x:collection1] o.a.s.s.DirectSolrSpellChecker init: {name=direct_lowerfilt,classname=solr.DirectSolrSpellChecker,minQueryLength=3,maxQueryFrequency=100.0,field=lowerfilt}
   [junit4]   2> 467772 INFO  (coreLoadExecutor-1234-thread-1) [    x:collection1] o.a.s.h.c.SpellCheckComponent Registering newSearcher listener for spellchecker: threshold
   [junit4]   2> 467772 INFO  (coreLoadExecutor-1234-thread-1) [    x:collection1] o.a.s.s.DirectSolrSpellChecker init: {name=threshold_direct,classname=solr.DirectSolrSpellChecker,field=lowerfilt,spellcheckIndexDir=spellcheckerThreshold,buildOnCommit=true,thresholdTokenFrequency=0.29}
   [junit4]   2> 467772 INFO  (coreLoadExecutor-1234-thread-1) [    x:collection1] o.a.s.h.c.SpellCheckComponent Registering newSearcher listener for spellchecker: threshold_direct
   [junit4]   2> 467789 INFO  (coreLoadExecutor-1234-thread-1) [    x:collection1] o.a.s.h.c.SpellCheckComponent Registering newSearcher listener for spellchecker: multipleFields
   [junit4]   2> 467820 INFO  (coreLoadExecutor-1234-thread-1) [    x:collection1] o.a.s.h.c.SpellCheckComponent Registering newSearcher listener for spellchecker: freq
   [junit4]   2> 467829 INFO  (coreLoadExecutor-1234-thread-1) [    x:collection1] o.a.s.h.c.SpellCheckComponent Registering newSearcher listener for spellchecker: fqcn
   [junit4]   2> 467829 INFO  (coreLoadExecutor-1234-thread-1) [    x:collection1] o.a.s.h.ReplicationHandler Commits will be reserved for  10000
   [junit4]   2> 467829 INFO  (searcherExecutor-1235-thread-1-processing-x:collection1) [    x:collection1] o.a.s.h.c.SpellCheckComponent Loading spell index for spellchecker: default
   [junit4]   2> 467829 INFO  (coreLoadExecutor-1234-thread-1) [    x:collection1] o.a.s.c.CoreContainer registering core: collection1
   [junit4]   2> 467830 INFO  (searcherExecutor-1235-thread-1-processing-x:collection1) [    x:collection1] o.a.s.h.c.SpellCheckComponent Loading spell index for spellchecker: default_teststop
   [junit4]   2> 467830 INFO  (searcherExecutor-1235-thread-1-processing-x:collection1) [    x:collection1] o.a.s.h.c.SpellCheckComponent Loading spell index for spellchecker: direct
   [junit4]   2> 467830 INFO  (SUITE-SpellCheckComponentTest-seed#[C8C83177370373FE]-worker) [    ] o.a.s.SolrTestCaseJ4 ####initCore end
   [junit4]   2> 467830 INFO  (searcherExecutor-1235-thread-1-processing-x:collection1) [    x:collection1] o.a.s.h.c.SpellCheckComponent Loading spell index for spellchecker: direct_lowerfilt
   [junit4]   2> 467830 INFO  (searcherExecutor-1235-thread-1-processing-x:collection1) [    x:collection1] o.a.s.h.c.SpellCheckComponent Loading spell index for spellchecker: wordbreak
   [junit4]   2> 467830 INFO  (searcherExecutor-1235-thread-1-processing-x:collection1) [    x:collection1] o.a.s.h.c.SpellCheckComponent Loading spell index for spellchecker: threshold
   [junit4]   2> 467831 INFO  (searcherExecutor-1235-thread-1-processing-x:collection1) [    x:collection1] o.a.s.h.c.SpellCheckComponent Loading spell index for spellchecker: threshold_direct
   [junit4]   2> 467831 INFO  (searcherExecutor-1235-thread-1-processing-x:collection1) [    x:collection1] o.a.s.h.c.SpellCheckComponent Loading spell index for spellchecker: multipleFields
   [junit4]   2> 467831 INFO  (searcherExecutor-1235-thread-1-processing-x:collection1) [    x:collection1] o.a.s.h.c.SpellCheckComponent Loading spell index for spellchecker: jarowinkler
   [junit4]   2> 467831 INFO  (TEST-SpellCheckComponentTest.testRelativeIndexDirLocation-seed#[C8C83177370373FE]) [    ] o.a.s.SolrTestCaseJ4 ###Starting testRelativeIndexDirLocation
   [junit4]   2> 467831 INFO  (searcherExecutor-1235-thread-1-processing-x:collection1) [    x:collection1] o.a.s.h.c.SpellCheckComponent Loading spell index for spellchecker: external
   [junit4]   2> 467832 INFO  (searcherExecutor-1235-thread-1-processing-x:collection1) [    x:collection1] o.a.s.h.c.SpellCheckComponent Loading spell index for spellchecker: freq
   [junit4]   2> 467832 INFO  (searcherExecutor-1235-thread-1-processing-x:collection1) [    x:collection1] o.a.s.h.c.SpellCheckComponent Loading spell index for spellchecker: fqcn
   [junit4]   2> 467833 INFO  (searcherExecutor-1235-thread-1-processing-x:collection1) [    x:collection1] o.a.s.h.c.SpellCheckComponent Loading spell index for spellchecker: perDict
   [junit4]   2> 467833 INFO  (searcherExecutor-1235-thread-1-processing-x:collection1) [    x:collection1] o.a.s.c.SolrCore [collection1] Registered new searcher Searcher@5154ddbb[collection1] main{ExitableDirectoryReader(UninvertingDirectoryReader())}
   [junit4]   2> 467833 INFO  (TEST-SpellCheckComponentTest.testRelativeIndexDirLocation-seed#[C8C83177370373FE]) [    ] o.a.s.u.p.LogUpdateProcessorFactory [collection1]  webapp=null path=null params={}{add=[0]} 0 2
   [junit4]   2> 467834 INFO  (TEST-SpellCheckComponentTest.testRelativeIndexDirLocation-seed#[C8C83177370373FE]) [    ] o.a.s.u.p.LogUpdateProcessorFactory [collection1]  webapp=null path=null params={}{add=[1]} 0 0
   [junit4]   2> 467834 INFO  (TEST-SpellCheckComponentTest.testRelativeIndexDirLocation-seed#[C8C83177370373FE]) [    ] o.a.s.u.p.LogUpdateProcessorFactory [collection1]  webapp=null path=null params={}{add=[2]} 0 0
   [junit4]   2> 467836 INFO  (TEST-SpellCheckComponentTest.testRelativeIndexDirLocation-seed#[C8C83177370373FE]) [    ] o.a.s.u.p.LogUpdateProcessorFactory [collection1]  webapp=null path=null params={}{add=[3]} 0 0
   [junit4]   2> 467836 INFO  (TEST-SpellCheckComponentTest.testRelativeIndexDirLocation-seed#[C8C83177370373FE]) [    ] o.a.s.u.p.LogUpdateProcessorFactory [collection1]  webapp=null path=null params={}{add=[4]} 0 0
   [junit4]   2> 467836 INFO  (TEST-SpellCheckComponentTest.testRelativeIndexDirLocation-seed#[C8C83177370373FE]) [    ] o.a.s.u.p.LogUpdateProcessorFactory [collection1]  webapp=null path=null params={}{add=[5]} 0 0
   [junit4]   2> 467836 INFO  (TEST-SpellCheckComponentTest.testRelativeIndexDirLocation-seed#[C8C83177370373FE]) [    ] o.a.s.u.p.LogUpdateProcessorFactory [collection1]  webapp=null path=null params={}{add=[6]} 0 0
   [junit4]   2> 467836 INFO  (TEST-SpellCheckComponentTest.testRelativeIndexDirLocation-seed#[C8C83177370373FE]) [    ] o.a.s.u.p.LogUpdateProcessorFactory [collection1]  webapp=null path=null params={}{add=[7]} 0 0
   [junit4]   2> 467836 INFO  (TEST-SpellCheckComponentTest.testRelativeIndexDirLocation-seed#[C8C83177370373FE]) [    ] o.a.s.u.p.LogUpdateProcessorFactory [collection1]  webapp=null path=null params={}{add=[8]} 0 0
   [junit4]   2> 467837 INFO  (TEST-SpellCheckComponentTest.testRelativeIndexDirLocation-seed#[C8C83177370373FE]) [    ] o.a.s.u.p.LogUpdateProcessorFactory [collection1]  webapp=null path=null params={}{add=[9]} 0 0
   [junit4]   2> 467837 INFO  (TEST-SpellCheckComponentTest.testRelativeIndexDirLocation-seed#[C8C83177370373FE]) [    ] o.a.s.u.DirectUpdateHandler2 start commit{,optimize=false,openSearcher=true,waitSearcher=true,expungeDeletes=false,softCommit=false,prepareCommit=false}
   [junit4]   2> 467841 INFO  (TEST-SpellCheckComponentTest.testRelativeIndexDirLocation-seed#[C8C83177370373FE]) [    ] o.a.s.c.SolrDeletionPolicy SolrDeletionPolicy.onCommit: commits: num=2
   [junit4]   2> 	commit{dir=MockDirectoryWrapper(RAMDirectory@c40e984 lockFactory=org.apache.lucene.store.SingleInstanceLockFactory@2b983ee3),segFN=segments_1,generation=1}
   [junit4]   2> 	commit{dir=MockDirectoryWrapper(RAMDirectory@c40e984 lockFactory=org.apache.lucene.store.SingleInstanceLockFactory@2b983ee3),segFN=segments_2,generation=2}
   [junit4]   2> 467842 INFO  (TEST-SpellCheckComponentTest.testRelativeIndexDirLocation-seed#[C8C83177370373FE]) [    ] o.a.s.c.SolrDeletionPolicy newest commit generation = 2
   [junit4]   2> 467844 INFO  (TEST-SpellCheckComponentTest.testRelativeIndexDirLocation-seed#[C8C83177370373FE]) [    ] o.a.s.s.SolrIndexSearcher Opening [Searcher@bc93247[collection1] main]
   [junit4]   2> 467844 INFO  (TEST-SpellCheckComponentTest.testRelativeIndexDirLocation-seed#[C8C83177370373FE]) [    ] o.a.s.u.DirectUpdateHandler2 end_commit_flush
   [junit4]   2> 467844 INFO  (searcherExecutor-1235-thread-1) [    ] o.a.s.h.c.SpellCheckComponent Building spell index for spell checker: default
   [junit4]   2> 467893 INFO  (searcherExecutor-1235-thread-1) [    ] o.a.s.h.c.SpellCheckComponent Building spell index for spell checker: default_teststop
   [junit4]   2> 467905 INFO  (searcherExecutor-1235-thread-1) [    ] o.a.s.h.c.SpellCheckComponent Building spell index for spell checker: threshold
   [junit4]   2> 467957 INFO  (searcherExecutor-1235-thread-1) [    ] o.a.s.h.c.SpellCheckComponent Building spell index for spell checker: threshold_direct
   [junit4]   2> 467957 INFO  (searcherExecutor-1235-thread-1) [    ] o.a.s.h.c.SpellCheckComponent Building spell index for spell checker: multipleFields
   [junit4]   2> 468159 INFO  (searcherExecutor-1235-thread-1) [    ] o.a.s.h.c.SpellCheckComponent Building spell index for spell checker: freq
   [junit4]   2> 468241 INFO  (searcherExecutor-1235-thread-1) [    ] o.a.s.h.c.SpellCheckComponent Building spell index for spell checker: fqcn
   [junit4]   2> 468333 INFO  (searcherExecutor-1235-thread-1) [    ] o.a.s.c.SolrCore [collection1] Registered new searcher Searcher@bc93247[collection1] main{ExitableDirectoryReader(UninvertingDirectoryReader(Uninverting(_0(6.0.0):C10)))}
   [junit4]   2> 468333 INFO  (TEST-SpellCheckComponentTest.testRelativeIndexDirLocation-seed#[C8C83177370373FE]) [    ] o.a.s.u.p.LogUpdateProcessorFactory [collection1]  webapp=null path=null params={}{commit=} 0 752
   [junit4]   2> 468333 INFO  (TEST-SpellCheckComponentTest.testRelativeIndexDirLocation-seed#[C8C83177370373FE]) [    ] o.a.s.SolrTestCaseJ4 ###Ending testRelativeIndexDirLocation
   [junit4]   2> 468334 INFO  (TEST-SpellCheckComponentTest.testRelativeIndexDirLocation-seed#[C8C83177370373FE]) [    ] o.a.s.u.DirectUpdateHandler2 [collection1] REMOVING ALL DOCUMENTS FROM INDEX
   [junit4]   2> 468334 INFO  (TEST-SpellCheckComponentTest.testRelativeIndexDirLocation-seed#[C8C83177370373FE]) [    ] o.a.s.u.p.LogUpdateProcessorFactory [collection1]  webapp=null path=null params={}{deleteByQuery=*:*} 0 0
   [junit4]   2> 468334 INFO  (TEST-SpellCheckComponentTest.testRelativeIndexDirLocation-seed#[C8C83177370373FE]) [    ] o.a.s.u.DirectUpdateHandler2 start commit{,optimize=false,openSearcher=true,waitSearcher=true,expungeDeletes=false,softCommit=false,prepareCommit=false}
   [junit4]   2> 468334 INFO  (TEST-SpellCheckComponentTest.testRelativeIndexDirLocation-seed#[C8C83177370373FE]) [    ] o.a.s.c.SolrDeletionPolicy SolrDeletionPolicy.onCommit: commits: num=2
   [junit4]   2> 	commit{dir=MockDirectoryWrapper(RAMDirectory@c40e984 lockFactory=org.apache.lucene.store.SingleInstanceLockFactory@2b983ee3),segFN=segments_2,generation=2}
   [junit4]   2> 	commit{dir=MockDirectoryWrapper(RAMDirectory@c40e984 lockFactory=org.apache.lucene.store.SingleInstanceLockFactory@2b983ee3),segFN=segments_3,generation=3}
   [junit4]   2> 468334 INFO  (TEST-SpellCheckComponentTest.testRelativeIndexDirLocation-seed#[C8C83177370373FE]) [    ] o.a.s.c.SolrDeletionPolicy newest commit generation = 3
   [junit4]   2> 468335 INFO  (TEST-SpellCheckComponentTest.testRelativeIndexDirLocation-seed#[C8C83177370373FE]) [    ] o.a.s.s.SolrIndexSearcher Opening [Searcher@4aebbcd4[collection1] main]
   [junit4]   2> 468335 INFO  (TEST-SpellCheckComponentTest.testRelativeIndexDirLocation-seed#[C8C83177370373FE]) [    ] o.a.s.u.DirectUpdateHandler2 end_commit_flush
   [junit4]   2> 468335 INFO  (searcherExecutor-1235-thread-1) [    ] o.a.s.h.c.SpellCheckComponent Building spell index for spell checker: default
   [junit4]   2> 468360 INFO  (searcherExecutor-1235-thread-1) [    ] o.a.s.h.c.SpellCheckComponent Building spell index for spell checker: default_teststop
   [junit4]   2> 468383 INFO  (searcherExecutor-1235-thread-1) [    ] o.a.s.h.c.SpellCheckComponent Building spell index for spell checker: threshold
   [junit4]   2> 468406 INFO  (searcherExecutor-1235-thread-1) [    ] o.a.s.h.c.SpellCheckComponent Building spell index for spell checker: threshold_direct
   [junit4]   2> 468406 INFO  (searcherExecutor-1235-thread-1) [    ] o.a.s.h.c.SpellCheckComponent Building spell index for spell checker: multipleFields
   [junit4]   2> 468433 INFO  (searcherExecutor-1235-thread-1) [    ] o.a.s.h.c.SpellCheckComponent Building spell index for spell checker: freq
   [junit4]   2> 468453 INFO  (searcherExecutor-1235-thread-1) [    ] o.a.s.h.c.SpellCheckComponent Building spell index for spell checker: fqcn
   [junit4]   2> 468478 INFO  (searcherExecutor-1235-thread-1) [    ] o.a.s.c.SolrCore [collection1] Registered new searcher Searcher@4aebbcd4[collection1] main{ExitableDirectoryReader(UninvertingDirectoryReader())}
   [junit4]   2> 468478 INFO  (TEST-SpellCheckComponentTest.testRelativeIndexDirLocation-seed#[C8C83177370373FE]) [    ] o.a.s.u.p.LogUpdateProcessorFactory [collection1]  webapp=null path=null params={}{commit=} 0 217
   [junit4]   2> 468481 INFO  (TEST-SpellCheckComponentTest.testPerDictionary-seed#[C8C83177370373FE]) [    ] o.a.s.SolrTestCaseJ4 ###Starting testPerDictionary
   [junit4]   2> 468481 INFO  (TEST-SpellCheckComponentTest.testPerDictionary-seed#[C8C83177370373FE]) [    ] o.a.s.u.p.LogUpdateProcessorFactory [collection1]  webapp=null path=null params={}{add=[0]} 0 0
   [junit4]   2> 468481 INFO  (TEST-SpellCheckComponentTest.testPerDictionary-seed#[C8C83177370373FE]) [    ] o.a.s.u.p.LogUpdateProcessorFactory [collection1]  webapp=null path=null params={}{add=[1]} 0 0
   [junit4]   2> 468481 INFO  (TEST-SpellCheckComponentTest.testPerDictionary-seed#[C8C83177370373FE]) [    ] o.a.s.u.p.LogUpdateProcessorFactory [collection1]  webapp=null path=null params={}{add=[2]} 0 0
   [junit4]   2> 468482 INFO  (TEST-SpellCheckComponentTest.testPerDictionary-seed#[C8C83177370373FE]) [    ] o.a.s.u.p.LogUpdateProcessorFactory [collection1]  webapp=null path=null params={}{add=[3]} 0 0
   [junit4]   2> 468482 INFO  (TEST-SpellCheckComponentTest.testPerDictionary-seed#[C8C83177370373FE]) [    ] o.a.s.u.p.LogUpdateProcessorFactory [collection1]  webapp=null path=null params={}{add=[4]} 0 0
   [junit4]   2> 468482 INFO  (TEST-SpellCheckComponentTest.testPerDictionary-seed#[C8C83177370373FE]) [    ] o.a.s.u.p.LogUpdateProcessorFactory [collection1]  webapp=null path=null params={}{add=[5]} 0 0
   [junit4]   2> 468483 INFO  (TEST-SpellCheckComponentTest.testPerDictionary-seed#[C8C83177370373FE]) [    ] o.a.s.u.p.LogUpdateProcessorFactory [collection1]  webapp=null path=null params={}{add=[6]} 0 0
   [junit4]   2> 468483 INFO  (TEST-SpellCheckComponentTest.testPerDictionary-seed#[C8C83177370373FE]) [    ] o.a.s.u.p.LogUpdateProcessorFactory [collection1]  webapp=null path=null params={}{add=[7]} 0 0
   [junit4]   2> 468483 INFO  (TEST-SpellCheckComponentTest.testPerDictionary-seed#[C8C83177370373FE]) [    ] o.a.s.u.p.LogUpdateProcessorFactory [collection1]  webapp=null path=null params={}{add=[8]} 0 0
   [junit4]   2> 468483 INFO  (TEST-SpellCheckComponentTest.testPerDictionary-seed#[C8C83177370373FE]) [    ] o.a.s.u.p.LogUpdateProcessorFactory [collection1]  webapp=null path=null params={}{add=[9]} 0 0
   [junit4]   2> 468483 INFO  (TEST-SpellCheckComponentTest.testPerDictionary-seed#[C8C83177370373FE]) [    ] o.a.s.u.DirectUpdateHandler2 start commit{,optimize=false,openSearcher=true,waitSearcher=true,expungeDeletes=false,softCommit=false,prepareCommit=false}
   [junit4]   2> 468487 INFO  (TEST-SpellCheckComponentTest.testPerDictionary-seed#[C8C83177370373FE]) [    ] o.a.s.c.SolrDeletionPolicy SolrDeletionPolicy.onCommit: commits: num=2
   [junit4]   2> 	commit{dir=MockDirectoryWrapper(RAMDirectory@c40e984 lockFactory=org.apache.lucene.store.SingleInstanceLockFactory@2b983ee3),segFN=segments_3,generation=3}
   [junit4]   2> 	commit{dir=MockDirectoryWrapper(RAMDirectory@c40e984 lockFactory=org.apache.lucene.store.SingleInstanceLockFactory@2b983ee3),segFN=segments_4,generation=4}
   [junit4]   2> 468487 INFO  (TEST-SpellCheckComponentTest.testPerDictionary-seed#[C8C83177370373FE]) [    ] o.a.s.c.SolrDeletionPolicy newest commit generation = 4
   [junit4]   2> 468488 INFO  (TEST-SpellCheckComponentTest.testPerDictionary-seed#[C8C83177370373FE]) [    ] o.a.s.s.SolrIndexSearcher Opening [Searcher@4e131bee[collection1] main]
   [junit4]   2> 468488 INFO  (searcherExecutor-1235-thread-1) [    ] o.a.s.h.c.SpellCheckComponent Building spell index for spell checker: default
   [junit4]   2> 468488 INFO  (TEST-SpellCheckComponentTest.testPerDictionary-seed#[C8C83177370373FE]) [    ] o.a.s.u.DirectUpdateHandler2 end_commit_flush
   [junit4]   2> 468570 INFO  (searcherExecutor-1235-thread-1) [    ] o.a.s.h.c.SpellCheckComponent Building spell index for spell checker: default_teststop
   [junit4]   2> 468598 INFO  (searcherExecutor-1235-thread-1) [    ] o.a.s.h.c.SpellCheckComponent Building spell index for spell checker: threshold
   [junit4]   2> 468670 INFO  (searcherExecutor-1235-thread-1) [    ] o.a.s.h.c.SpellCheckComponent Building spell index for spell checker: threshold_direct
   [junit4]   2> 468670 INFO  (searcherExecutor-1235-thread-1) [    ] o.a.s.h.c.SpellCheckComponent Building spell index for spell checker: multipleFields
   [junit4]   2> 468726 INFO  (searcherExecutor-1235-thread-1) [    ] o.a.s.h.c.SpellCheckComponent Building spell index for spell checker: freq
   [junit4]   2> 468788 INFO  (searcherExecutor-1235-thread-1) [    ] o.a.s.h.c.SpellCheckComponent Building spell index for spell checker: fqcn
   [junit4]   2> 468830 INFO  (searcherExecutor-1235-thread-1) [    ] o.a.s.c.SolrCore [collection1] Registered new searcher Searcher@4e131bee[collection1] main{ExitableDirectoryReader(UninvertingDirectoryReader(Uninverting(_1(6.0.0):C10)))}
   [junit4]   2> 468831 INFO  (TEST-SpellCheckComponentTest.testPerDictionary-seed#[C8C83177370373FE]) [    ] o.a.s.u.p.LogUpdateProcessorFactory [collection1]  webapp=null path=null params={}{commit=} 0 528
   [junit4]   2> 468832 INFO  (TEST-SpellCheckComponentTest.testPerDictionary-seed#[C8C83177370373FE]) [    ] o.a.s.c.S.Request [collection1]  webapp=null path=null params={q=documemt&qt=spellCheckCompRH&spellcheck.dictionary=perDict&json.nl=map&spellcheck..perDict.foo=bar&spellcheck=true&spellcheck..perDict.bar=foo&wt=xml&spellcheck.build=true} hits=0 status=0 QTime=1
   [junit4]   2> 468832 INFO  (TEST-SpellCheckComponentTest.testPerDictionary-seed#[C8C83177370373FE]) [    ] o.a.s.SolrTestCaseJ4 ###Ending testPerDictionary
   [junit4]   2> 468832 INFO  (TEST-SpellCheckComponentTest.testPerDictionary-seed#[C8C83177370373FE]) [    ] o.a.s.u.DirectUpdateHandler2 [collection1] REMOVING ALL DOCUMENTS FROM INDEX
   [junit4]   2> 468833 INFO  (TEST-SpellCheckComponentTest.testPerDictionary-seed#[C8C83177370373FE]) [    ] o.a.s.u.p.LogUpdateProcessorFactory [collection1]  webapp=null path=null params={}{deleteByQuery=*:*} 0 0
   [junit4]   2> 468833 INFO  (TEST-SpellCheckComponentTest.testPerDictionary-seed#[C8C83177370373FE]) [    ] o.a.s.u.DirectUpdateHandler2 start commit{,optimize=false,openSearcher=true,waitSearcher=true,expungeDeletes=false,softCommit=false,prepareCommit=false}
   [junit4]   2> 468833 INFO  (TEST-SpellCheckComponentTest.testPerDictionary-seed#[C8C83177370373FE]) [    ] o.a.s.c.SolrDeletionPolicy SolrDeletionPolicy.onCommit: commits: num=2
   [junit4]   2> 	commit{dir=MockDirectoryWrapper(RAMDirectory@c40e984 lockFactory=org.apache.lucene.store.SingleInstanceLockFactory@2b983ee3),segFN=segments_4,generation=4}
   [junit4]   2> 	commit{dir=MockDirectoryWrapper(RAMDirectory@c40e984 lockFactory=org.apache.lucene.store.SingleInstanceLockFactory@2b983ee3),segFN=segments_5,generation=5}
   [junit4]   2> 468833 INFO  (TEST-SpellCheckComponentTest.testPerDictionary-seed#[C8C83177370373FE]) [    ] o.a.s.c.SolrDeletionPolicy newest commit generation = 5
   [junit4]   2> 468833 INFO  (TEST-SpellCheckComponentTest.testPerDictionary-seed#[C8C83177370373FE]) [    ] o.a.s.s.SolrIndexSearcher Opening [Searcher@5597905a[collection1] main]
   [junit4]   2> 468833 INFO  (searcherExecutor-1235-thread-1) [    ] o.a.s.h.c.SpellCheckComponent Building spell index for spell checker: default
   [junit4]   2> 468833 INFO  (TEST-SpellCheckComponentTest.testPerDictionary-seed#[C8C83177370373FE]) [    ] o.a.s.u.DirectUpdateHandler2 end_commit_flush
   [junit4]   2> 468846 INFO  (searcherExecutor-1235-thread-1) [    ] o.a.s.h.c.SpellCheckComponent Building spell index for spell checker: default_teststop
   [junit4]   2> 468857 INFO  (searcherExecutor-1235-thread-1) [    ] o.a.s.h.c.SpellCheckComponent Building spell index for spell checker: threshold
   [junit4]   2> 468868 INFO  (searcherExecutor-1235-thread-1) [    ] o.a.s.h.c.SpellCheckComponent Building spell index for spell checker: threshold_direct
   [junit4]   2> 468868 INFO  (searcherExecutor-1235-thread-1) [    ] o.a.s.h.c.SpellCheckComponent Building spell index for spell checker: multipleFields
   [junit4]   2> 468880 INFO  (searcherExecutor-1235-thread-1) [    ] o.a.s.h.c.SpellCheckComponent Building spell index for spell checker: freq
   [junit4]   2> 468896 INFO  (searcherExecutor-1235-thread-1) [    ] o.a.s.h.c.SpellCheckComponent Building spell index for spell checker: fqcn
   [junit4]   2> 468908 INFO  (searcherExecutor-1235-thread-1) [    ] o.a.s.c.SolrCore [collection1] Registered new searcher Searcher@5597905a[collection1] main{ExitableDirectoryReader(UninvertingDirectoryReader())}
   [junit4]   2> 468909 INFO  (TEST-SpellCheckComponentTest.testPerDictionary-seed#[C8C83177370373FE]) [    ] o.a.s.u.p.LogUpdateProcessorFactory [collection1]  webapp=null path=null params={}{commit=} 0 113
   [junit4]   2> 468909 INFO  (TEST-SpellCheckComponentTest.testMaximumResultsForSuggest-seed#[C8C83177370373FE]) [    ] o.a.s.SolrTestCaseJ4 ###Starting testMaximumResultsForSuggest
   [junit4]   2> 468910 INFO  (TEST-SpellCheckComponentTest.testMaximumResultsForSuggest-seed#[C8C83177370373FE]) [    ] o.a.s.u.p.LogUpdateProcessorFactory [collection1]  webapp=null path=null params={}{add=[0]} 0 0
   [junit4]   2> 468910 INFO  (TEST-SpellCheckComponentTest.testMaximumResultsForSuggest-seed#[C8C83177370373FE]) [    ] o.a.s.u.p.LogUpdateProcessorFactory [collection1]  webapp=null path=null params={}{add=[1]} 0 0
   [junit4]   2> 468910 INFO  (TEST-SpellCheckComponentTest.testMaximumResultsForSuggest-seed#[C8C83177370373FE]) [    ] o.a.s.u.p.LogUpdateProcessorFactory [collection1]  webapp=null path=null params={}{add=[2]} 0 0
   [junit4]   2> 468910 INFO  (TEST-SpellCheckComponentTest.testMaximumResultsForSuggest-seed#[C8C83177370373FE]) [    ] o.a.s.u.p.LogUpdateProcessorFactory [collection1]  webapp=null path=null params={}{add=[3]} 0 0
   [junit4]   2> 468911 INFO  (TEST-SpellCheckComponentTest.testMaximumResultsForSuggest-seed#[C8C83177370373FE]) [    ] o.a.s.u.p.LogUpdateProcessorFactory [collection1]  webapp=null path=null params={}{add=[4]} 0 0
   [junit4]   2> 468911 INFO  (TEST-SpellCheckComponentTest.testMaximumResultsForSuggest-seed#[C8C83177370373FE]) [    ] o.a.s.u.p.LogUpdateProcessorFactory [collection1]  webapp=null path=null params={}{add=[5]} 0 0
   [junit4]   2> 468911 INFO  (TEST-SpellCheckComponentTest.testMaximumResultsForSuggest-seed#[C8C83177370373FE]) [    ] o.a.s.u.p.LogUpdateProcessorFactory [collection1]  webapp=null path=null params={}{add=[6]} 0 0
   [junit4]   2> 468912 INFO  (TEST-SpellCheckComponentTest.testMaximumResultsForSuggest-seed#[C8C83177370373FE]) [    ] o.a.s.u.p.LogUpdateProcessorFactory [collection1]  webapp=null path=null params={}{add=[7]} 0 0
   [junit4]   2> 468912 INFO  (TEST-SpellCheckComponentTest.testMaximumResultsForSuggest-seed#[C8C83177370373FE]) [    ] o.a.s.u.p.LogUpdateProcessorFactory [collection1]  webapp=null path=null params={}{add=[8]} 0 0
   [junit4]   2> 468912 INFO  (TEST-SpellCheckComponentTest.testMaximumResultsForSuggest-seed#[C8C83177370373FE]) [    ] o.a.s.u.p.LogUpdateProcessorFactory [collection1]  webapp=null path=null params={}{add=[9]} 0 0
   [junit4]   2> 468912 INFO  (TEST-SpellCheckComponentTest.testMaximumResultsForSuggest-seed#[C8C83177370373FE]) [    ] o.a.s.u.DirectUpdateHandler2 start commit{,optimize=false,openSearcher=true,waitSearcher=true,expungeDeletes=false,softCommit=false,prepareCommit=false}
   [junit4]   2> 468915 INFO  (TEST-SpellCheckComponentTest.testMaximumResultsForSuggest-seed#[C8C83177370373FE]) [    ] o.a.s.c.SolrDeletionPolicy SolrDeletionPolicy.onCommit: commits: num=2
   [junit4]   2> 	commit{dir=MockDirectoryWrapper(RAMDirectory@c40e984 lockFactory=org.apache.lucene.store.SingleInstanceLockFactory@2b983ee3),segFN=segments_5,generation=5}
   [junit4]   2> 	commit{dir=MockDirectoryWrapper(RAMDirectory@c40e984 lockFactory=org.apache.lucene.store.SingleInstanceLockFactory@2b983ee3),segFN=segments_6,generation=6}
   [junit4]   2> 468915 INFO  (TEST-SpellCheckComponentTest.testMaximumResultsForSuggest-seed#[C8C83177370373FE]) [    ] o.a.s.c.SolrDeletionPolicy newest commit generation = 6
   [junit4]   2> 468916 INFO  (TEST-SpellCheckComponentTest.testMaximumResultsForSuggest-seed#[C8C83177370373FE]) [    ] o.a.s.s.SolrIndexSearcher Opening [Searcher@688bc6a1[collection1] main]
   [junit4]   2> 468916 INFO  (TEST-SpellCheckComponentTest.testMaximumResultsForSuggest-seed#[C8C83177370373FE]) [    ] o.a.s.u.DirectUpdateHandler2 end_commit_flush
   [junit4]   2> 468916 INFO  (searcherExecutor-1235-thread-1) [    ] o.a.s.h.c.SpellCheckComponent Building spell index for spell checker: default
   [junit4]   2> 468973 INFO  (searcherExecutor-1235-thread-1) [    ] o.a.s.h.c.SpellCheckComponent Building spell index for spell checker: default_teststop
   [junit4]   2> 468994 INFO  (searcherExecutor-1235-thread-1) [    ] o.a.s.h.c.SpellCheckComponent Building spell index for spell checker: threshold
   [junit4]   2> 469046 INFO  (searcherExecutor-1235-thread-1) [    ] o.a.s.h.c.SpellCheckComponent Building spell index for spell checker: threshold_direct
   [junit4]   2> 469046 INFO  (searcherExecutor-1235-thread-1) [    ] o.a.s.h.c.SpellCheckComponent Building spell index for spell checker: multipleFields
   [junit4]   2> 469086 INFO  (searcherExecutor-1235-thread-1) [    ] o.a.s.h.c.SpellCheckComponent Building spell index for spell checker: freq
   [junit4]   2> 469118 INFO  (searcherExecutor-1235-thread-1) [    ] o.a.s.h.c.SpellCheckComponent Building spell index for spell checker: fqcn
   [junit4]   2> 469172 INFO  (searcherExecutor-1235-thread-1) [    ] o.a.s.c.SolrCore [collection1] Registered new searcher Searcher@688bc6a1[collection1] main{ExitableDirectoryReader(UninvertingDirectoryReader(Uninverting(_2(6.0.0):C10)))}
   [junit4]   2> 469172 INFO  (TEST-SpellCheckComponentTest.testMaximumResultsForSuggest-seed#[C8C83177370373FE]) [    ] o.a.s.u.p.LogUpdateProcessorFactory [collection1]  webapp=null path=null params={}{commit=} 0 399
   [junit4]   2> 469246 INFO  (TEST-SpellCheckComponentTest.testMaximumResultsForSuggest-seed#[C8C83177370373FE]) [    ] o.a.s.c.S.Request [collection1]  webapp=null path=null params={q=lowerfilt:(this+OR+brwn)&spellcheck.maxResultsForSuggest=7&qt=spellCheckCompRH&spellcheck=true&spellcheck.count=5&wt=xml&spellcheck.build=true&spellcheck.extendedResults=false} hits=7 status=0 QTime=110
   [junit4]   2> 469311 INFO  (TEST-SpellCheckComponentTest.testMaximumResultsForSuggest-seed#[C8C83177370373FE]) [    ] o.a.s.c.S.Request [collection1]  webapp=null path=null params={q=lowerfilt:(this+OR+brwn)&spellcheck.maxResultsForSuggest=6&qt=spellCheckCompRH&spellcheck=true&spellcheck.count=5&wt=xml&spellcheck.build=true&spellcheck.extendedResults=false} hits=7 status=0 QTime=96
   [junit4]   2> 469312 ERROR (TEST-SpellCheckComponentTest.testMaximumResultsForSuggest-seed#[C8C83177370373FE]) [    ] o.a.s.SolrTestCaseJ4 query failed JSON validation. error=Path not found: /spellcheck/suggestions/[1]/numFound
   [junit4]   2>  expected =/spellcheck/suggestions/[1]/numFound==1
   [junit4]   2>  response = {
   [junit4]   2>   "responseHeader":{
   [junit4]   2>     "status":0,
   [junit4]   2>     "QTime":96},
   [junit4]   2>   "command":"build",
   [junit4]   2>   "response":{"numFound":7,"start":0,"docs":[
   [junit4]   2>       {
   [junit4]   2>         "id":4,
   [junit4]   2>         "range_facet_l":[4],
   [junit4]   2>         "range_facet_l_dv":[4],
   [junit4]   2>         "range_facet_i_dv":[4],
   [junit4]   2>         "lowerfilt":["this blue"],
   [junit4]   2>         "lowerfilt1and2":["this blue"],
   [junit4]   2>         "multiDefault":["muLti-Default"],
   [junit4]   2>         "intDefault":42,
   [junit4]   2>         "timestamp":"2016-02-14T11:08:16.055Z"},
   [junit4]   2>       {
   [junit4]   2>         "id":5,
   [junit4]   2>         "range_facet_l":[5],
   [junit4]   2>         "range_facet_l_dv":[5],
   [junit4]   2>         "range_facet_i_dv":[5],
   [junit4]   2>         "lowerfilt":["this blud"],
   [junit4]   2>         "lowerfilt1and2":["this blud"],
   [junit4]   2>         "multiDefault":["muLti-Default"],
   [junit4]   2>         "intDefault":42,
   [junit4]   2>         "timestamp":"2016-02-14T11:08:16.055Z"},
   [junit4]   2>       {
   [junit4]   2>         "id":6,
   [junit4]   2>         "range_facet_l":[6],
   [junit4]   2>         "range_facet_l_dv":[6],
   [junit4]   2>         "range_facet_i_dv":[6],
   [junit4]   2>         "lowerfilt":["this boue"],
   [junit4]   2>         "lowerfilt1and2":["this boue"],
   [junit4]   2>         "multiDefault":["muLti-Default"],
   [junit4]   2>         "intDefault":42,
   [junit4]   2>         "timestamp":"2016-02-14T11:08:16.055Z"},
   [junit4]   2>       {
   [junit4]   2>         "id":7,
   [junit4]   2>         "range_facet_l":[7],
   [junit4]   2>         "range_facet_l_dv":[7],
   [junit4]   2>         "range_facet_i_dv":[7],
   [junit4]   2>         "lowerfilt":["this glue"],
   [junit4]   2>         "lowerfilt1and2":["this glue"],
   [junit4]   2>         "multiDefault":["muLti-Default"],
   [junit4]   2>         "intDefault":42,
   [junit4]   2>         "timestamp":"2016-02-14T11:08:16.056Z"},
   [junit4]   2>       {
   [junit4]   2>         "id":8,
   [junit4]   2>         "range_facet_l":[8],
   [junit4]   2>         "range_facet_l_dv":[8],
   [junit4]   2>         "range_facet_i_dv":[8],
   [junit4]   2>         "lowerfilt":["this blee"],
   [junit4]   2>         "lowerfilt1and2":["this blee"],
   [junit4]   2>         "multiDefault":["muLti-Default"],
   [junit4]   2>         "intDefault":42,
   [junit4]   2>         "timestamp":"2016-02-14T11:08:16.056Z"},
   [junit4]   2>       {
   [junit4]   2>         "id":0,
   [junit4]   2>         "range_facet_l":[0],
   [junit4]   2>         "range_facet_l_dv":[0],
   [junit4]   2>         "range_facet_i_dv":[0],
   [junit4]   2>         "lowerfilt":["This is a title"],
   [junit4]   2>         "lowerfilt1and2":["This is a title"],
   [junit4]   2>         "multiDefault":["muLti-Default"],
   [junit4]   2>         "intDefault":42,
   [junit4]   2>         "timestamp":"2016-02-14T11:08:16.053Z"},
   [junit4]   2>       {
   [junit4]   2>         "id":2,
   [junit4]   2>         "range_facet_l":[2],
   [junit4]   2>         "range_facet_l_dv":[2],
   [junit4]   2>         "range_facet_i_dv":[2],
   [junit4]   2>         "lowerfilt":["This is a document"],
   [junit4]   2>         "lowerfilt1and2":["This is a document"],
   [junit4]   2>         "multiDefault":["muLti-Default"],
   [junit4]   2>         "intDefault":42,
   [junit4]   2>         "timestamp":"2016-02-14T11:08:16.054Z"}]
   [junit4]   2>   },
   [junit4]   2>   "spellcheck":{
   [junit4]   2>     "suggestions":[]}}
   [junit4]   2> 
   [junit4]   2>  request = q=lowerfilt:(this+OR+brwn)&spellcheck.maxResultsForSuggest=6&qt=spellCheckCompRH&spellcheck=true&spellcheck.count=5&wt=xml&spellcheck.build=true&spellcheck.extendedResults=false
   [junit4]   2> 469395 INFO  (TEST-SpellCheckComponentTest.testMaximumResultsForSuggest-seed#[C8C83177370373FE]) [    ] o.a.s.c.S.Request [collection1]  webapp=null path=null params={q=lowerfilt:(this+OR+brwn)&spellcheck.maxResultsForSuggest=.90&qt=spellCheckCompRH&spellcheck=true&fq=id:[0+TO+9]&fq=lowerfilt:th*&spellcheck.count=5&wt=xml&spellcheck.build=true&spellcheck.extendedResults=false} hits=7 status=0 QTime=124
   [junit4]   2> 469486 INFO  (TEST-SpellCheckComponentTest.testMaximumResultsForSuggest-seed#[C8C83177370373FE]) [    ] o.a.s.c.S.Request [collection1]  webapp=null path=null params={q=lowerfilt:(this+OR+brwn)&spellcheck.maxResultsForSuggest=.80&qt=spellCheckCompRH&spellcheck=true&fq=id:[0+TO+9]&fq=lowerfilt:th*&spellcheck.count=5&wt=xml&spellcheck.build=true&spellcheck.extendedResults=false} hits=7 status=0 QTime=136
   [junit4]   2> 469486 ERROR (TEST-SpellCheckComponentTest.testMaximumResultsForSuggest-seed#[C8C83177370373FE]) [    ] o.a.s.SolrTestCaseJ4 query failed JSON validation. error=Path not found: /spellcheck/suggestions/[1]/numFound
   [junit4]   2>  expected =/spellcheck/suggestions/[1]/numFound==1
   [junit4]   2>  response = {
   [junit4]   2>   "responseHeader":{
   [junit4]   2>     "status":0,
   [junit4]   2>     "QTime":136},
   [junit4]   2>   "command":"build",
   [junit4]   2>   "response":{"numFound":7,"start":0,"docs":[
   [junit4]   2>       {
   [junit4]   2>         "id":4,
   [junit4]   2>         "range_facet_l":[4],
   [junit4]   2>         "range_facet_l_dv":[4],
   [junit4]   2>         "range_facet_i_dv":[4],
   [junit4]   2>         "lowerfilt":["this blue"],
   [junit4]   2>         "lowerfilt1and2":["this blue"],
   [junit4]   2>         "multiDefault":["muLti-Default"],
   [junit4]   2>         "intDefault":42,
   [junit4]   2>         "timestamp":"2016-02-14T11:08:16.055Z"},
   [junit4]   2>       {
   [junit4]   2>         "id":5,
   [junit4]   2>         "range_facet_l":[5],
   [junit4]   2>         "range_facet_l_dv":[5],
   [junit4]   2>         "range_facet_i_dv":[5],
   [junit4]   2>         "lowerfilt":["this blud"],
   [junit4]   2>         "lowerfilt1and2":["this blud"],
   [junit4]   2>         "multiDefault":["muLti-Default"],
   [junit4]   2>         "intDefault":42,
   [junit4]   2>         "timestamp":"2016-02-14T11:08:16.055Z"},
   [junit4]   2>       {
   [junit4]   2>         "id":6,
   [junit4]   2>         "range_facet_l":[6],
   [junit4]   2>         "range_facet_l_dv":[6],
   [junit4]   2>         "range_facet_i_dv":[6],
   [junit4]   2>         "lowerfilt":["this boue"],
   [junit4]   2>         "lowerfilt1and2":["this boue"],
   [junit4]   2>         "multiDefault":["muLti-Default"],
   [junit4]   2>         "intDefault":42,
   [junit4]   2>         "timestamp":"2016-02-14T11:08:16.055Z"},
   [junit4]   2>       {
   [junit4]   2>         "id":7,
   [junit4]   2>         "range_facet_l":[7],
   [junit4]   2>         "range_facet_l_dv":[7],
   [junit4]   2>         "range_facet_i_dv":[7],
   [junit4]   2>         "lowerfilt":["this glue"],
   [junit4]   2>         "lowerfilt1and2":["this glue"],
   [junit4]   2>         "multiDefault":["muLti-Default"],
   [junit4]   2>         "intDefault":42,
   [junit4]   2>         "timestamp":"2016-02-14T11:08:16.056Z"},
   [junit4]   2>       {
   [junit4]   2>         "id":8,
   [junit4]   2>         "range_facet_l":[8],
   [junit4]   2>         "range_facet_l_dv":[8],
   [junit4]   2>         "range_facet_i_dv":[8],
   [junit4]   2>         "lowerfilt":["this blee"],
   [junit4]   2>         "lowerfilt1and2":["this blee"],
   [junit4]   2>         "multiDefault":["muLti-Default"],
   [junit4]   2>         "intDefault":42,
   [junit4]   2>         "timestamp":"2016-02-14T11:08:16.056Z"},
   [junit4]   2>       {
   [junit4]   2>         "id":0,
   [junit4]   2>         "range_facet_l":[0],
   [junit4]   2>         "range_facet_l_dv":[0],
   [junit4]   2>         "range_facet_i_dv":[0],
   [junit4]   2>         "lowerfilt":["This is a title"],
   [junit4]   2>         "lowerfilt1and2":["This is a title"],
   [junit4]   2>         "multiDefault":["muLti-Default"],
   [junit4]   2>         "intDefault":42,
   [junit4]   2>         "timestamp":"2016-02-14T11:08:16.053Z"},
   [junit4]   2>       {
   [junit4]   2>         "id":2,
   [junit4]   2>         "range_facet_l":[2],
   [junit4]   2>         "range_facet_l_dv":[2],
   [junit4]   2>         "range_facet_i_dv":[2],
   [junit4]   2>         "lowerfilt":["This is a document"],
   [junit4]   2>         "lowerfilt1and2":["This is a document"],
   [junit4]   2>         "multiDefault":["muLti-Default"],
   [junit4]   2>         "intDefault":42,
   [junit4]   2>         "timestamp":"2016-02-14T11:08:16.054Z"}]
   [junit4]   2>   },
   [junit4]   2>   "spellcheck":{
   [junit4]   2>     "suggestions":[]}}
   [junit4]   2> 
   [junit4]   2>  request = q=lowerfilt:(this+OR+brwn)&spellcheck.maxResultsForSuggest=.80&qt=spellCheckCompRH&spellcheck=true&fq=id:[0+TO+9]&fq=lowerfilt:th*&spellcheck.count=5&wt=xml&spellcheck.build=true&spellcheck.extendedResults=false
   [junit4]   2> 469539 INFO  (TEST-SpellCheckComponentTest.testMaximumResultsForSuggest-seed#[C8C83177370373FE]) [    ] o.a.s.c.S.Request [collection1]  webapp=null path=null params={q=lowerfilt:(this+OR+brwn)&spellcheck.maxResultsForSuggest=.70&qt=spellCheckCompRH&spellcheck=true&fq=id:[0+TO+9]&spellcheck.count=5&wt=xml&spellcheck.build=true&spellcheck.maxResultsForSuggest.fq=id:[0+TO+9]&spellcheck.extendedResults=false} hits=7 status=0 QTime=79
   [junit4]   2> 469585 INFO  (TEST-SpellCheckComponentTest.testMaximumResultsForSuggest-seed#[C8C83177370373FE]) [    ] o.a.s.c.S.Request [collection1]  webapp=null path=null params={q=lowerfilt:(this+OR+brwn)&spellcheck.maxResultsForSuggest=.64&qt=spellCheckCompRH&spellcheck=true&fq=id:[0+TO+9]&spellcheck.count=5&wt=xml&spellcheck.build=true&spellcheck.maxResultsForSuggest.fq=lowerfilt:th*&spellcheck.extendedResults=false} hits=7 status=0 QTime=69
   [junit4]   2> 469585 ERROR (TEST-SpellCheckComponentTest.testMaximumResultsForSuggest-seed#[C8C83177370373FE]) [    ] o.a.s.SolrTestCaseJ4 query failed JSON validation. error=Path not found: /spellcheck/suggestions/[1]/numFound
   [junit4]   2>  expected =/spellcheck/suggestions/[1]/numFound==1
   [junit4]   2>  response = {
   [junit4]   2>   "responseHeader":{
   [junit4]   2>     "status":0,
   [junit4]   2>     "QTime":69},
   [junit4]   2>   "command":"build",
   [junit4]   2>   "response":{"numFound":7,"start":0,"docs":[
   [junit4]   2>       {
   [junit4]   2>         "id":4,
   [junit4]   2>         "range_facet_l":[4],
   [junit4]   2>         "range_facet_l_dv":[4],
   [junit4]   2>         "range_facet_i_dv":[4],
   [junit4]   2>         "lowerfilt":["this blue"],
   [junit4]   2>         "lowerfilt1and2":["this blue"],
   [junit4]   2>         "multiDefault":["muLti-Default"],
   [junit4]   2>         "intDefault":42,
   [junit4]   2>         "timestamp":"2016-02-14T11:08:16.055Z"},
   [junit4]   2>       {
   [junit4]   2>         "id":5,
   [junit4]   2>         "range_facet_l":[5],
   [junit4]   2>         "range_facet_l_dv":[5],
   [junit4]   2>         "range_facet_i_dv":[5],

[...truncated too long message...]

tor-5850-thread-1) [    x:collection1] o.a.s.c.CachingDirectoryFactory looking to close C:\Users\JenkinsSlave\workspace\Lucene-Solr-trunk-Windows\solr\build\solr-core\test\J0\temp\solr.handler.component.DistributedSpellCheckComponentTest_C8C83177370373FE-001\tempDir-001\shard1\cores\collection1\data [CachedDir<<refCount=0;path=C:\Users\JenkinsSlave\workspace\Lucene-Solr-trunk-Windows\solr\build\solr-core\test\J0\temp\solr.handler.component.DistributedSpellCheckComponentTest_C8C83177370373FE-001\tempDir-001\shard1\cores\collection1\data;done=false>>]
   [junit4]   2> 1954444 INFO  (coreCloseExecutor-5850-thread-1) [    x:collection1] o.a.s.c.CachingDirectoryFactory Closing directory: C:\Users\JenkinsSlave\workspace\Lucene-Solr-trunk-Windows\solr\build\solr-core\test\J0\temp\solr.handler.component.DistributedSpellCheckComponentTest_C8C83177370373FE-001\tempDir-001\shard1\cores\collection1\data
   [junit4]   2> 1954445 INFO  (TEST-DistributedSpellCheckComponentTest.test-seed#[C8C83177370373FE]) [    ] o.e.j.s.h.ContextHandler Stopped o.e.j.s.ServletContextHandler@252b83f5{/_,null,UNAVAILABLE}
   [junit4]   2> NOTE: reproduce with: ant test  -Dtestcase=DistributedSpellCheckComponentTest -Dtests.method=test -Dtests.seed=C8C83177370373FE -Dtests.slow=true -Dtests.locale=he -Dtests.timezone=Europe/Malta -Dtests.asserts=true -Dtests.file.encoding=US-ASCII
   [junit4] ERROR   6.35s J0 | DistributedSpellCheckComponentTest.test <<<
   [junit4]    > Throwable #1: org.apache.solr.client.solrj.impl.HttpSolrClient$RemoteSolrException: Error from server at http://127.0.0.1:51445/_/collection1: Directory MMapDirectory@C:\Users\JenkinsSlave\workspace\Lucene-Solr-trunk-Windows\solr\build\solr-core\test\J0\temp\solr.handler.component.DistributedSpellCheckComponentTest_C8C83177370373FE-001\tempDir-001\control\cores\collection1\data\spellchecker1 lockFactory=org.apache.lucene.store.NativeFSLockFactory@5fa42c7e still has pending deleted files; cannot initialize IndexWriter
   [junit4]    > 	at __randomizedtesting.SeedInfo.seed([C8C83177370373FE:409C0EAD99FF1E06]:0)
   [junit4]    > 	at org.apache.solr.client.solrj.impl.HttpSolrClient.executeMethod(HttpSolrClient.java:577)
   [junit4]    > 	at org.apache.solr.client.solrj.impl.HttpSolrClient.request(HttpSolrClient.java:241)
   [junit4]    > 	at org.apache.solr.client.solrj.impl.HttpSolrClient.request(HttpSolrClient.java:230)
   [junit4]    > 	at org.apache.solr.client.solrj.SolrRequest.process(SolrRequest.java:149)
   [junit4]    > 	at org.apache.solr.client.solrj.SolrClient.query(SolrClient.java:942)
   [junit4]    > 	at org.apache.solr.client.solrj.SolrClient.query(SolrClient.java:957)
   [junit4]    > 	at org.apache.solr.handler.component.DistributedSpellCheckComponentTest.q(DistributedSpellCheckComponentTest.java:67)
   [junit4]    > 	at org.apache.solr.handler.component.DistributedSpellCheckComponentTest.test(DistributedSpellCheckComponentTest.java:146)
   [junit4]    > 	at org.apache.solr.BaseDistributedSearchTestCase$ShardsRepeatRule$ShardsRepeatStatement.callStatement(BaseDistributedSearchTestCase.java:990)
   [junit4]    > 	at org.apache.solr.BaseDistributedSearchTestCase$ShardsRepeatRule$ShardsStatement.evaluate(BaseDistributedSearchTestCase.java:939)
   [junit4]    > 	at java.lang.Thread.run(Thread.java:745)
   [junit4]   2> 1954450 INFO  (SUITE-DistributedSpellCheckComponentTest-seed#[C8C83177370373FE]-worker) [    ] o.a.s.SolrTestCaseJ4 ###deleteCore
   [junit4]   2> NOTE: leaving temporary files on disk at: C:\Users\JenkinsSlave\workspace\Lucene-Solr-trunk-Windows\solr\build\solr-core\test\J0\temp\solr.handler.component.DistributedSpellCheckComponentTest_C8C83177370373FE-001
   [junit4]   2> NOTE: test params are: codec=Asserting(Lucene60): {start1=PostingsFormat(name=LuceneVarGapDocFreqInterval), range_facet_l_dv=PostingsFormat(name=MockRandom), multiDefault=Lucene50(blocksize=128), intDefault=PostingsFormat(name=Direct), range_facet_l=PostingsFormat(name=Direct), _version_=PostingsFormat(name=Direct), lowerfilt1and2=Lucene50(blocksize=128), end4=PostingsFormat(name=LuceneVarGapDocFreqInterval), end3=Lucene50(blocksize=128), end2=PostingsFormat(name=MockRandom), end1=PostingsFormat(name=Direct), lowerfilt=Lucene50(blocksize=128), gram1=PostingsFormat(name=Direct), id=PostingsFormat(name=MockRandom), range_facet_i_dv=PostingsFormat(name=Direct), gram2=PostingsFormat(name=MockRandom), gram3=Lucene50(blocksize=128), start3=PostingsFormat(name=MockRandom), gram4=PostingsFormat(name=LuceneVarGapDocFreqInterval), start2=Lucene50(blocksize=128), word=PostingsFormat(name=Direct), timestamp=PostingsFormat(name=Direct), start4=PostingsFormat(name=Direct)}, docValues:{range_facet_l_dv=DocValuesFormat(name=Memory), range_facet_i_dv=DocValuesFormat(name=Asserting), timestamp=DocValuesFormat(name=Asserting)}, sim=RandomSimilarity(queryNorm=false,coord=crazy): {}, locale=he, timezone=Europe/Malta
   [junit4]   2> NOTE: Windows 7 6.1 amd64/Oracle Corporation 1.8.0_72 (64-bit)/cpus=3,threads=1,free=139138360,total=490733568
   [junit4]   2> NOTE: All tests run in this JVM: [XmlUpdateRequestHandlerTest, DirectSolrSpellCheckerTest, RequiredFieldsTest, SolrIndexConfigTest, TestSimpleQParserPlugin, SolrTestCaseJ4Test, DisMaxRequestHandlerTest, PrimUtilsTest, CloneFieldUpdateProcessorFactoryTest, TestDynamicFieldResource, TestDistribIDF, TestSearchPerf, DeleteLastCustomShardedReplicaTest, TestLazyCores, TestCloudInspectUtil, TestConfigSetImmutable, TestElisionMultitermQuery, FastVectorHighlighterTest, TestHdfsUpdateLog, SampleTest, TestManagedSchema, DocValuesMultiTest, TestWordDelimiterFilterFactory, IndexSchemaTest, TestReplicaProperties, AssignTest, DocValuesMissingTest, DocValuesTest, CurrencyFieldXmlFileTest, SolrXmlInZkTest, TermsComponentTest, TestSweetSpotSimilarityFactory, TestPivotHelperCode, CustomCollectionTest, AnalyticsMergeStrategyTest, CursorPagingTest, TestSolrCloudWithKerberosAlt, HdfsThreadLeakTest, BlockJoinFacetSimpleTest, IndexBasedSpellCheckerTest, DocumentBuilderTest, CdcrReplicationDistributedZkTest, CoreMergeIndexesAdminHandlerTest, TestManagedSynonymFilterFactory, TestUniqueKeyFieldResource, DistributedFacetPivotWhiteBoxTest, TestLRUCache, JsonLoaderTest, TestReplicationHandler, StandardRequestHandlerTest, TestRemoveLastDynamicCopyField, TestSchemaResource, TimeZoneUtilsTest, TestDownShardTolerantSearch, TestRestoreCore, DOMUtilTest, TestRandomRequestDistribution, TestObjectReleaseTracker, MigrateRouteKeyTest, DistribCursorPagingTest, TestMiniSolrCloudCluster, SimpleCollectionCreateDeleteTest, OverseerTest, TestEmbeddedSolrServerConstructors, UUIDUpdateProcessorFallbackTest, TestRestManager, TestBlobHandler, TestAddFieldRealTimeGet, TestIntervalFaceting, CircularListTest, TestQuerySenderNoQuery, WrapperMergePolicyFactoryTest, TestPhraseSuggestions, BadComponentTest, HttpPartitionTest, ReplicationFactorTest, TestReloadAndDeleteDocs, PolyFieldTest, OverseerStatusTest, TestManagedResource, ShardRoutingTest, DistribJoinFromCollectionTest, AddBlockUpdateTest, TestSolrQueryResponse, PreAnalyzedFieldTest, ClusterStateUpdateTest, SpatialFilterTest, SaslZkACLProviderTest, TestLMDirichletSimilarityFactory, SimpleMLTQParserTest, TestDistributedStatsComponentCardinality, TestOverriddenPrefixQueryForCustomFieldType, TestRemoteStreaming, SimplePostToolTest, TestFunctionQuery, TestUseDocValuesAsStored, AsyncMigrateRouteKeyTest, TestHashPartitioner, HdfsBasicDistributedZk2Test, ChaosMonkeyNothingIsSafeTest, SoftAutoCommitTest, TestMergePolicyConfig, TestSortByMinMaxFunction, TestChildDocTransformer, TestCodecSupport, HardAutoCommitTest, TestAnalyzeInfixSuggestions, CachingDirectoryFactoryTest, TestConfigSets, PreAnalyzedUpdateProcessorTest, TestRuleBasedAuthorizationPlugin, TestMissingGroups, IgnoreCommitOptimizeUpdateProcessorFactoryTest, ReturnFieldsTest, ChangedSchemaMergeTest, OverseerCollectionConfigSetProcessorTest, HLLUtilTest, TestCursorMarkWithoutUniqueKey, LeaderElectionTest, TestReplicationHandlerBackup, TestDFRSimilarityFactory, TestComponentsName, SuggestComponentContextFilterQueryTest, UnloadDistributedZkTest, SimpleFacetsTest, TestJmxMonitoredMap, TestFilteredDocIdSet, TestFaceting, TestDefaultSearchFieldResource, TestFieldResource, SecurityConfHandlerTest, JavabinLoaderTest, HighlighterTest, TestCloudManagedSchema, HdfsRecoverLeaseTest, BlockDirectoryTest, TestSort, HdfsDirectoryTest, ChaosMonkeySafeLeaderTest, CollectionsAPIDistributedZkTest, BasicZkTest, RecoveryZkTest, TestZkChroot, ZkCLITest, TestRecovery, DistributedSpellCheckComponentTest]
   [junit4] Completed [305/579 (2!)] on J0 in 6.37s, 1 test, 1 error <<< FAILURES!

[...truncated 921 lines...]
BUILD FAILED
C:\Users\JenkinsSlave\workspace\Lucene-Solr-trunk-Windows\build.xml:740: The following error occurred while executing this line:
C:\Users\JenkinsSlave\workspace\Lucene-Solr-trunk-Windows\build.xml:684: The following error occurred while executing this line:
C:\Users\JenkinsSlave\workspace\Lucene-Solr-trunk-Windows\build.xml:59: The following error occurred while executing this line:
C:\Users\JenkinsSlave\workspace\Lucene-Solr-trunk-Windows\solr\build.xml:233: The following error occurred while executing this line:
C:\Users\JenkinsSlave\workspace\Lucene-Solr-trunk-Windows\solr\common-build.xml:524: The following error occurred while executing this line:
C:\Users\JenkinsSlave\workspace\Lucene-Solr-trunk-Windows\lucene\common-build.xml:1457: The following error occurred while executing this line:
C:\Users\JenkinsSlave\workspace\Lucene-Solr-trunk-Windows\lucene\common-build.xml:1014: There were test failures: 579 suites (8 ignored), 2331 tests, 6 errors, 127 ignored (82 assumptions) [seed: C8C83177370373FE]

Total time: 71 minutes 28 seconds
Build step 'Invoke Ant' marked build as failure
Archiving artifacts
[WARNINGS] Skipping publisher since build result is FAILURE
Recording test results
Email was triggered for: Failure - Any
Sending email for trigger: Failure - Any



Mime
View raw message