lucene-dev mailing list archives

Site index · List index
Message view « Date » · « Thread »
Top « Date » · « Thread »
From Apache Jenkins Server <jenk...@builds.apache.org>
Subject [JENKINS] Lucene-Solr-NightlyTests-5.x - Build # 1103 - Still Failing
Date Sun, 21 Feb 2016 10:32:01 GMT
Build: https://builds.apache.org/job/Lucene-Solr-NightlyTests-5.x/1103/

3 tests failed.
FAILED:  org.apache.solr.cloud.BasicDistributedZk2Test.test

Error Message:
No live SolrServers available to handle this request:[http://127.0.0.1:57092/collection1]

Stack Trace:
org.apache.solr.client.solrj.SolrServerException: No live SolrServers available to handle this request:[http://127.0.0.1:57092/collection1]
	at __randomizedtesting.SeedInfo.seed([F181951231137BA6:79D5AAC89FEF165E]:0)
	at org.apache.solr.client.solrj.impl.LBHttpSolrClient.request(LBHttpSolrClient.java:352)
	at org.apache.solr.client.solrj.impl.CloudSolrClient.sendRequest(CloudSolrClient.java:1099)
	at org.apache.solr.client.solrj.impl.CloudSolrClient.requestWithRetryOnStaleState(CloudSolrClient.java:870)
	at org.apache.solr.client.solrj.impl.CloudSolrClient.request(CloudSolrClient.java:806)
	at org.apache.solr.client.solrj.SolrRequest.process(SolrRequest.java:149)
	at org.apache.solr.client.solrj.SolrClient.query(SolrClient.java:942)
	at org.apache.solr.client.solrj.SolrClient.query(SolrClient.java:957)
	at org.apache.solr.cloud.AbstractFullDistribZkTestBase.queryServer(AbstractFullDistribZkTestBase.java:1377)
	at org.apache.solr.BaseDistributedSearchTestCase.query(BaseDistributedSearchTestCase.java:609)
	at org.apache.solr.BaseDistributedSearchTestCase.query(BaseDistributedSearchTestCase.java:591)
	at org.apache.solr.BaseDistributedSearchTestCase.query(BaseDistributedSearchTestCase.java:570)
	at org.apache.solr.cloud.BasicDistributedZk2Test.brindDownShardIndexSomeDocsAndRecover(BasicDistributedZk2Test.java:279)
	at org.apache.solr.cloud.BasicDistributedZk2Test.test(BasicDistributedZk2Test.java:97)
	at sun.reflect.NativeMethodAccessorImpl.invoke0(Native Method)
	at sun.reflect.NativeMethodAccessorImpl.invoke(NativeMethodAccessorImpl.java:57)
	at sun.reflect.DelegatingMethodAccessorImpl.invoke(DelegatingMethodAccessorImpl.java:43)
	at java.lang.reflect.Method.invoke(Method.java:606)
	at com.carrotsearch.randomizedtesting.RandomizedRunner.invoke(RandomizedRunner.java:1764)
	at com.carrotsearch.randomizedtesting.RandomizedRunner$8.evaluate(RandomizedRunner.java:871)
	at com.carrotsearch.randomizedtesting.RandomizedRunner$9.evaluate(RandomizedRunner.java:907)
	at com.carrotsearch.randomizedtesting.RandomizedRunner$10.evaluate(RandomizedRunner.java:921)
	at org.apache.solr.BaseDistributedSearchTestCase$ShardsRepeatRule$ShardsFixedStatement.callStatement(BaseDistributedSearchTestCase.java:964)
	at org.apache.solr.BaseDistributedSearchTestCase$ShardsRepeatRule$ShardsStatement.evaluate(BaseDistributedSearchTestCase.java:939)
	at com.carrotsearch.randomizedtesting.rules.SystemPropertiesRestoreRule$1.evaluate(SystemPropertiesRestoreRule.java:57)
	at org.apache.lucene.util.TestRuleSetupTeardownChained$1.evaluate(TestRuleSetupTeardownChained.java:49)
	at org.apache.lucene.util.AbstractBeforeAfterRule$1.evaluate(AbstractBeforeAfterRule.java:45)
	at org.apache.lucene.util.TestRuleThreadAndTestName$1.evaluate(TestRuleThreadAndTestName.java:48)
	at org.apache.lucene.util.TestRuleIgnoreAfterMaxFailures$1.evaluate(TestRuleIgnoreAfterMaxFailures.java:64)
	at org.apache.lucene.util.TestRuleMarkFailure$1.evaluate(TestRuleMarkFailure.java:47)
	at com.carrotsearch.randomizedtesting.rules.StatementAdapter.evaluate(StatementAdapter.java:36)
	at com.carrotsearch.randomizedtesting.ThreadLeakControl$StatementRunner.run(ThreadLeakControl.java:367)
	at com.carrotsearch.randomizedtesting.ThreadLeakControl.forkTimeoutingTask(ThreadLeakControl.java:809)
	at com.carrotsearch.randomizedtesting.ThreadLeakControl$3.evaluate(ThreadLeakControl.java:460)
	at com.carrotsearch.randomizedtesting.RandomizedRunner.runSingleTest(RandomizedRunner.java:880)
	at com.carrotsearch.randomizedtesting.RandomizedRunner$5.evaluate(RandomizedRunner.java:781)
	at com.carrotsearch.randomizedtesting.RandomizedRunner$6.evaluate(RandomizedRunner.java:816)
	at com.carrotsearch.randomizedtesting.RandomizedRunner$7.evaluate(RandomizedRunner.java:827)
	at com.carrotsearch.randomizedtesting.rules.StatementAdapter.evaluate(StatementAdapter.java:36)
	at com.carrotsearch.randomizedtesting.rules.SystemPropertiesRestoreRule$1.evaluate(SystemPropertiesRestoreRule.java:57)
	at org.apache.lucene.util.AbstractBeforeAfterRule$1.evaluate(AbstractBeforeAfterRule.java:45)
	at com.carrotsearch.randomizedtesting.rules.StatementAdapter.evaluate(StatementAdapter.java:36)
	at org.apache.lucene.util.TestRuleStoreClassName$1.evaluate(TestRuleStoreClassName.java:41)
	at com.carrotsearch.randomizedtesting.rules.NoShadowingOrOverridesOnMethodsRule$1.evaluate(NoShadowingOrOverridesOnMethodsRule.java:40)
	at com.carrotsearch.randomizedtesting.rules.NoShadowingOrOverridesOnMethodsRule$1.evaluate(NoShadowingOrOverridesOnMethodsRule.java:40)
	at com.carrotsearch.randomizedtesting.rules.StatementAdapter.evaluate(StatementAdapter.java:36)
	at com.carrotsearch.randomizedtesting.rules.StatementAdapter.evaluate(StatementAdapter.java:36)
	at com.carrotsearch.randomizedtesting.rules.StatementAdapter.evaluate(StatementAdapter.java:36)
	at org.apache.lucene.util.TestRuleAssertionsRequired$1.evaluate(TestRuleAssertionsRequired.java:53)
	at org.apache.lucene.util.TestRuleMarkFailure$1.evaluate(TestRuleMarkFailure.java:47)
	at org.apache.lucene.util.TestRuleIgnoreAfterMaxFailures$1.evaluate(TestRuleIgnoreAfterMaxFailures.java:64)
	at org.apache.lucene.util.TestRuleIgnoreTestSuites$1.evaluate(TestRuleIgnoreTestSuites.java:54)
	at com.carrotsearch.randomizedtesting.rules.StatementAdapter.evaluate(StatementAdapter.java:36)
	at com.carrotsearch.randomizedtesting.ThreadLeakControl$StatementRunner.run(ThreadLeakControl.java:367)
	at java.lang.Thread.run(Thread.java:745)
Caused by: org.apache.solr.client.solrj.impl.HttpSolrClient$RemoteSolrException: Error from server at http://127.0.0.1:57092/collection1: no servers hosting shard: shard1
	at org.apache.solr.client.solrj.impl.HttpSolrClient.executeMethod(HttpSolrClient.java:576)
	at org.apache.solr.client.solrj.impl.HttpSolrClient.request(HttpSolrClient.java:240)
	at org.apache.solr.client.solrj.impl.HttpSolrClient.request(HttpSolrClient.java:229)
	at org.apache.solr.client.solrj.impl.LBHttpSolrClient.doRequest(LBHttpSolrClient.java:372)
	at org.apache.solr.client.solrj.impl.LBHttpSolrClient.request(LBHttpSolrClient.java:325)
	... 53 more


FAILED:  org.apache.solr.cloud.CollectionsAPIDistributedZkTest.test

Error Message:
Captured an uncaught exception in thread: Thread[id=25631, name=collection1, state=RUNNABLE, group=TGRP-CollectionsAPIDistributedZkTest]

Stack Trace:
com.carrotsearch.randomizedtesting.UncaughtExceptionError: Captured an uncaught exception in thread: Thread[id=25631, name=collection1, state=RUNNABLE, group=TGRP-CollectionsAPIDistributedZkTest]
Caused by: org.apache.solr.client.solrj.impl.HttpSolrClient$RemoteSolrException: Error from server at http://127.0.0.1:55723: collection already exists: awholynewstresscollection_collection1_2
	at __randomizedtesting.SeedInfo.seed([F181951231137BA6]:0)
	at org.apache.solr.client.solrj.impl.HttpSolrClient.executeMethod(HttpSolrClient.java:576)
	at org.apache.solr.client.solrj.impl.HttpSolrClient.request(HttpSolrClient.java:240)
	at org.apache.solr.client.solrj.impl.HttpSolrClient.request(HttpSolrClient.java:229)
	at org.apache.solr.client.solrj.impl.LBHttpSolrClient.doRequest(LBHttpSolrClient.java:372)
	at org.apache.solr.client.solrj.impl.LBHttpSolrClient.request(LBHttpSolrClient.java:325)
	at org.apache.solr.client.solrj.impl.CloudSolrClient.sendRequest(CloudSolrClient.java:1099)
	at org.apache.solr.client.solrj.impl.CloudSolrClient.requestWithRetryOnStaleState(CloudSolrClient.java:870)
	at org.apache.solr.client.solrj.impl.CloudSolrClient.request(CloudSolrClient.java:806)
	at org.apache.solr.client.solrj.SolrClient.request(SolrClient.java:1219)
	at org.apache.solr.cloud.AbstractFullDistribZkTestBase.createCollection(AbstractFullDistribZkTestBase.java:1573)
	at org.apache.solr.cloud.AbstractFullDistribZkTestBase.createCollection(AbstractFullDistribZkTestBase.java:1594)
	at org.apache.solr.cloud.CollectionsAPIDistributedZkTest$1CollectionThread.run(CollectionsAPIDistributedZkTest.java:960)


FAILED:  org.apache.solr.handler.TestReplicationHandler.doTestIndexAndConfigAliasReplication

Error Message:
Index: 0, Size: 0

Stack Trace:
java.lang.IndexOutOfBoundsException: Index: 0, Size: 0
	at __randomizedtesting.SeedInfo.seed([F181951231137BA6:6F27B4AF7FBD440]:0)
	at java.util.ArrayList.rangeCheck(ArrayList.java:635)
	at java.util.ArrayList.get(ArrayList.java:411)
	at org.apache.solr.handler.TestReplicationHandler.doTestIndexAndConfigAliasReplication(TestReplicationHandler.java:1241)
	at sun.reflect.NativeMethodAccessorImpl.invoke0(Native Method)
	at sun.reflect.NativeMethodAccessorImpl.invoke(NativeMethodAccessorImpl.java:57)
	at sun.reflect.DelegatingMethodAccessorImpl.invoke(DelegatingMethodAccessorImpl.java:43)
	at java.lang.reflect.Method.invoke(Method.java:606)
	at com.carrotsearch.randomizedtesting.RandomizedRunner.invoke(RandomizedRunner.java:1764)
	at com.carrotsearch.randomizedtesting.RandomizedRunner$8.evaluate(RandomizedRunner.java:871)
	at com.carrotsearch.randomizedtesting.RandomizedRunner$9.evaluate(RandomizedRunner.java:907)
	at com.carrotsearch.randomizedtesting.RandomizedRunner$10.evaluate(RandomizedRunner.java:921)
	at com.carrotsearch.randomizedtesting.rules.SystemPropertiesRestoreRule$1.evaluate(SystemPropertiesRestoreRule.java:57)
	at org.apache.lucene.util.TestRuleSetupTeardownChained$1.evaluate(TestRuleSetupTeardownChained.java:49)
	at org.apache.lucene.util.AbstractBeforeAfterRule$1.evaluate(AbstractBeforeAfterRule.java:45)
	at org.apache.lucene.util.TestRuleThreadAndTestName$1.evaluate(TestRuleThreadAndTestName.java:48)
	at org.apache.lucene.util.TestRuleIgnoreAfterMaxFailures$1.evaluate(TestRuleIgnoreAfterMaxFailures.java:64)
	at org.apache.lucene.util.TestRuleMarkFailure$1.evaluate(TestRuleMarkFailure.java:47)
	at com.carrotsearch.randomizedtesting.rules.StatementAdapter.evaluate(StatementAdapter.java:36)
	at com.carrotsearch.randomizedtesting.ThreadLeakControl$StatementRunner.run(ThreadLeakControl.java:367)
	at com.carrotsearch.randomizedtesting.ThreadLeakControl.forkTimeoutingTask(ThreadLeakControl.java:809)
	at com.carrotsearch.randomizedtesting.ThreadLeakControl$3.evaluate(ThreadLeakControl.java:460)
	at com.carrotsearch.randomizedtesting.RandomizedRunner.runSingleTest(RandomizedRunner.java:880)
	at com.carrotsearch.randomizedtesting.RandomizedRunner$5.evaluate(RandomizedRunner.java:781)
	at com.carrotsearch.randomizedtesting.RandomizedRunner$6.evaluate(RandomizedRunner.java:816)
	at com.carrotsearch.randomizedtesting.RandomizedRunner$7.evaluate(RandomizedRunner.java:827)
	at com.carrotsearch.randomizedtesting.rules.StatementAdapter.evaluate(StatementAdapter.java:36)
	at com.carrotsearch.randomizedtesting.rules.SystemPropertiesRestoreRule$1.evaluate(SystemPropertiesRestoreRule.java:57)
	at org.apache.lucene.util.AbstractBeforeAfterRule$1.evaluate(AbstractBeforeAfterRule.java:45)
	at com.carrotsearch.randomizedtesting.rules.StatementAdapter.evaluate(StatementAdapter.java:36)
	at org.apache.lucene.util.TestRuleStoreClassName$1.evaluate(TestRuleStoreClassName.java:41)
	at com.carrotsearch.randomizedtesting.rules.NoShadowingOrOverridesOnMethodsRule$1.evaluate(NoShadowingOrOverridesOnMethodsRule.java:40)
	at com.carrotsearch.randomizedtesting.rules.NoShadowingOrOverridesOnMethodsRule$1.evaluate(NoShadowingOrOverridesOnMethodsRule.java:40)
	at com.carrotsearch.randomizedtesting.rules.StatementAdapter.evaluate(StatementAdapter.java:36)
	at com.carrotsearch.randomizedtesting.rules.StatementAdapter.evaluate(StatementAdapter.java:36)
	at com.carrotsearch.randomizedtesting.rules.StatementAdapter.evaluate(StatementAdapter.java:36)
	at org.apache.lucene.util.TestRuleAssertionsRequired$1.evaluate(TestRuleAssertionsRequired.java:53)
	at org.apache.lucene.util.TestRuleMarkFailure$1.evaluate(TestRuleMarkFailure.java:47)
	at org.apache.lucene.util.TestRuleIgnoreAfterMaxFailures$1.evaluate(TestRuleIgnoreAfterMaxFailures.java:64)
	at org.apache.lucene.util.TestRuleIgnoreTestSuites$1.evaluate(TestRuleIgnoreTestSuites.java:54)
	at com.carrotsearch.randomizedtesting.rules.StatementAdapter.evaluate(StatementAdapter.java:36)
	at com.carrotsearch.randomizedtesting.ThreadLeakControl$StatementRunner.run(ThreadLeakControl.java:367)
	at java.lang.Thread.run(Thread.java:745)




Build Log:
[...truncated 14 lines...]
ERROR: Error fetching remote repo 'origin'
hudson.plugins.git.GitException: Failed to fetch from git://git.apache.org/lucene-solr.git
	at hudson.plugins.git.GitSCM.fetchFrom(GitSCM.java:766)
	at hudson.plugins.git.GitSCM.retrieveChanges(GitSCM.java:1022)
	at hudson.plugins.git.GitSCM.checkout(GitSCM.java:1053)
	at hudson.scm.SCM.checkout(SCM.java:484)
	at hudson.model.AbstractProject.checkout(AbstractProject.java:1274)
	at hudson.model.AbstractBuild$AbstractBuildExecution.defaultCheckout(AbstractBuild.java:609)
	at jenkins.scm.SCMCheckoutStrategy.checkout(SCMCheckoutStrategy.java:86)
	at hudson.model.AbstractBuild$AbstractBuildExecution.run(AbstractBuild.java:531)
	at hudson.model.Run.execute(Run.java:1738)
	at hudson.model.FreeStyleBuild.run(FreeStyleBuild.java:43)
	at hudson.model.ResourceController.execute(ResourceController.java:98)
	at hudson.model.Executor.run(Executor.java:381)
Caused by: hudson.plugins.git.GitException: Command "git -c core.askpass=true fetch --tags --progress git://git.apache.org/lucene-solr.git +refs/heads/*:refs/remotes/origin/*" returned status code 128:
stdout: 
stderr: fatal: read error: Connection reset by peer

	at org.jenkinsci.plugins.gitclient.CliGitAPIImpl.launchCommandIn(CliGitAPIImpl.java:1693)
	at org.jenkinsci.plugins.gitclient.CliGitAPIImpl.launchCommandWithCredentials(CliGitAPIImpl.java:1441)
	at org.jenkinsci.plugins.gitclient.CliGitAPIImpl.access$300(CliGitAPIImpl.java:62)
	at org.jenkinsci.plugins.gitclient.CliGitAPIImpl$1.execute(CliGitAPIImpl.java:313)
	at org.jenkinsci.plugins.gitclient.RemoteGitImpl$CommandInvocationHandler$1.call(RemoteGitImpl.java:152)
	at org.jenkinsci.plugins.gitclient.RemoteGitImpl$CommandInvocationHandler$1.call(RemoteGitImpl.java:145)
	at hudson.remoting.UserRequest.perform(UserRequest.java:121)
	at hudson.remoting.UserRequest.perform(UserRequest.java:49)
	at hudson.remoting.Request$2.run(Request.java:326)
	at hudson.remoting.InterceptingExecutorService$1.call(InterceptingExecutorService.java:68)
	at java.util.concurrent.FutureTask.run(FutureTask.java:262)
	at java.util.concurrent.ThreadPoolExecutor.runWorker(ThreadPoolExecutor.java:1145)
	at java.util.concurrent.ThreadPoolExecutor$Worker.run(ThreadPoolExecutor.java:615)
	at java.lang.Thread.run(Thread.java:745)
	at ......remote call to lucene(Native Method)
	at hudson.remoting.Channel.attachCallSiteStackTrace(Channel.java:1413)
	at hudson.remoting.UserResponse.retrieve(UserRequest.java:221)
	at hudson.remoting.Channel.call(Channel.java:778)
	at org.jenkinsci.plugins.gitclient.RemoteGitImpl$CommandInvocationHandler.execute(RemoteGitImpl.java:145)
	at sun.reflect.GeneratedMethodAccessor533.invoke(Unknown Source)
	at sun.reflect.DelegatingMethodAccessorImpl.invoke(DelegatingMethodAccessorImpl.java:43)
	at java.lang.reflect.Method.invoke(Method.java:606)
	at org.jenkinsci.plugins.gitclient.RemoteGitImpl$CommandInvocationHandler.invoke(RemoteGitImpl.java:131)
	at com.sun.proxy.$Proxy74.execute(Unknown Source)
	at hudson.plugins.git.GitSCM.fetchFrom(GitSCM.java:764)
	... 11 more
ERROR: null
Retrying after 10 seconds
 > git rev-parse --is-inside-work-tree # timeout=10
Fetching changes from the remote Git repository
 > git config remote.origin.url git://git.apache.org/lucene-solr.git # timeout=10
Cleaning workspace
 > git rev-parse --verify HEAD # timeout=10
Resetting working tree
 > git reset --hard # timeout=10
 > git clean -fdx # timeout=10
Fetching upstream changes from git://git.apache.org/lucene-solr.git
 > git --version # timeout=10
 > git -c core.askpass=true fetch --tags --progress git://git.apache.org/lucene-solr.git +refs/heads/*:refs/remotes/origin/*
ERROR: Error fetching remote repo 'origin'
hudson.plugins.git.GitException: Failed to fetch from git://git.apache.org/lucene-solr.git
	at hudson.plugins.git.GitSCM.fetchFrom(GitSCM.java:766)
	at hudson.plugins.git.GitSCM.retrieveChanges(GitSCM.java:1022)
	at hudson.plugins.git.GitSCM.checkout(GitSCM.java:1053)
	at hudson.scm.SCM.checkout(SCM.java:484)
	at hudson.model.AbstractProject.checkout(AbstractProject.java:1274)
	at hudson.model.AbstractBuild$AbstractBuildExecution.defaultCheckout(AbstractBuild.java:609)
	at jenkins.scm.SCMCheckoutStrategy.checkout(SCMCheckoutStrategy.java:86)
	at hudson.model.AbstractBuild$AbstractBuildExecution.run(AbstractBuild.java:531)
	at hudson.model.Run.execute(Run.java:1738)
	at hudson.model.FreeStyleBuild.run(FreeStyleBuild.java:43)
	at hudson.model.ResourceController.execute(ResourceController.java:98)
	at hudson.model.Executor.run(Executor.java:381)
Caused by: hudson.plugins.git.GitException: Command "git -c core.askpass=true fetch --tags --progress git://git.apache.org/lucene-solr.git +refs/heads/*:refs/remotes/origin/*" returned status code 128:
stdout: 
stderr: fatal: read error: Connection reset by peer

	at org.jenkinsci.plugins.gitclient.CliGitAPIImpl.launchCommandIn(CliGitAPIImpl.java:1693)
	at org.jenkinsci.plugins.gitclient.CliGitAPIImpl.launchCommandWithCredentials(CliGitAPIImpl.java:1441)
	at org.jenkinsci.plugins.gitclient.CliGitAPIImpl.access$300(CliGitAPIImpl.java:62)
	at org.jenkinsci.plugins.gitclient.CliGitAPIImpl$1.execute(CliGitAPIImpl.java:313)
	at org.jenkinsci.plugins.gitclient.RemoteGitImpl$CommandInvocationHandler$1.call(RemoteGitImpl.java:152)
	at org.jenkinsci.plugins.gitclient.RemoteGitImpl$CommandInvocationHandler$1.call(RemoteGitImpl.java:145)
	at hudson.remoting.UserRequest.perform(UserRequest.java:121)
	at hudson.remoting.UserRequest.perform(UserRequest.java:49)
	at hudson.remoting.Request$2.run(Request.java:326)
	at hudson.remoting.InterceptingExecutorService$1.call(InterceptingExecutorService.java:68)
	at java.util.concurrent.FutureTask.run(FutureTask.java:262)
	at java.util.concurrent.ThreadPoolExecutor.runWorker(ThreadPoolExecutor.java:1145)
	at java.util.concurrent.ThreadPoolExecutor$Worker.run(ThreadPoolExecutor.java:615)
	at java.lang.Thread.run(Thread.java:745)
	at ......remote call to lucene(Native Method)
	at hudson.remoting.Channel.attachCallSiteStackTrace(Channel.java:1413)
	at hudson.remoting.UserResponse.retrieve(UserRequest.java:221)
	at hudson.remoting.Channel.call(Channel.java:778)
	at org.jenkinsci.plugins.gitclient.RemoteGitImpl$CommandInvocationHandler.execute(RemoteGitImpl.java:145)
	at sun.reflect.GeneratedMethodAccessor533.invoke(Unknown Source)
	at sun.reflect.DelegatingMethodAccessorImpl.invoke(DelegatingMethodAccessorImpl.java:43)
	at java.lang.reflect.Method.invoke(Method.java:606)
	at org.jenkinsci.plugins.gitclient.RemoteGitImpl$CommandInvocationHandler.invoke(RemoteGitImpl.java:131)
	at com.sun.proxy.$Proxy74.execute(Unknown Source)
	at hudson.plugins.git.GitSCM.fetchFrom(GitSCM.java:764)
	... 11 more
ERROR: null
Retrying after 10 seconds
 > git rev-parse --is-inside-work-tree # timeout=10
Fetching changes from the remote Git repository
 > git config remote.origin.url git://git.apache.org/lucene-solr.git # timeout=10
Cleaning workspace
 > git rev-parse --verify HEAD # timeout=10
Resetting working tree
 > git reset --hard # timeout=10
 > git clean -fdx # timeout=10
Fetching upstream changes from git://git.apache.org/lucene-solr.git
 > git --version # timeout=10
 > git -c core.askpass=true fetch --tags --progress git://git.apache.org/lucene-solr.git +refs/heads/*:refs/remotes/origin/*
 > git rev-parse refs/remotes/origin/branch_5x^{commit} # timeout=10
 > git rev-parse refs/remotes/origin/origin/branch_5x^{commit} # timeout=10
Checking out Revision e8acc04c68ac74ca5757285581c42457100c990c (refs/remotes/origin/branch_5x)
 > git config core.sparsecheckout # timeout=10
 > git checkout -f e8acc04c68ac74ca5757285581c42457100c990c
 > git rev-list e8acc04c68ac74ca5757285581c42457100c990c # timeout=10
No emails were triggered.
[Lucene-Solr-NightlyTests-5.x] $ /home/jenkins/jenkins-slave/tools/hudson.tasks.Ant_AntInstallation/ant-1.8.2/bin/ant -Dtests.multiplier=2 -Dtests.linedocsfile=/x1/jenkins/lucene-data/enwiki.random.lines.txt jenkins-nightly
Buildfile: /x1/jenkins/jenkins-slave/workspace/Lucene-Solr-NightlyTests-5.x/build.xml

jenkins-nightly:

-print-java-info:
[java-info] java version "1.7.0_80"
[java-info] Java(TM) SE Runtime Environment (1.7.0_80-b15, Oracle Corporation)
[java-info] Java HotSpot(TM) 64-Bit Server VM (24.80-b11, Oracle Corporation)
[java-info] Test args: []

clean:

clean:

clean:

ivy-availability-check:

ivy-fail:

ivy-configure:
[ivy:configure] :: Apache Ivy 2.3.0 - 20130110142753 :: http://ant.apache.org/ivy/ ::
[ivy:configure] :: loading settings :: file = /x1/jenkins/jenkins-slave/workspace/Lucene-Solr-NightlyTests-5.x/lucene/ivy-settings.xml

resolve-groovy:
[ivy:cachepath] :: resolving dependencies :: org.codehaus.groovy#groovy-all-caller;working
[ivy:cachepath] 	confs: [default]
[ivy:cachepath] 	found org.codehaus.groovy#groovy-all;2.4.4 in public
[ivy:cachepath] :: resolution report :: resolve 193ms :: artifacts dl 3ms
	---------------------------------------------------------------------
	|                  |            modules            ||   artifacts   |
	|       conf       | number| search|dwnlded|evicted|| number|dwnlded|
	---------------------------------------------------------------------
	|      default     |   1   |   0   |   0   |   0   ||   1   |   0   |
	---------------------------------------------------------------------

-test-with-heapdumps-enabled:
     [echo] Java HotSpot(TM) 64-Bit Server VM: Enabling heap dumps on OutOfMemoryError to dir '/x1/jenkins/jenkins-slave/workspace/Lucene-Solr-NightlyTests-5.x/heapdumps'.
    [mkdir] Created dir: /x1/jenkins/jenkins-slave/workspace/Lucene-Solr-NightlyTests-5.x/heapdumps

ivy-availability-check:

ivy-fail:

ivy-configure:
[ivy:configure] :: loading settings :: file = /x1/jenkins/jenkins-slave/workspace/Lucene-Solr-NightlyTests-5.x/lucene/ivy-settings.xml

resolve-groovy:

test:

ivy-availability-check:

ivy-fail:

ivy-configure:
[ivy:configure] :: loading settings :: file = /x1/jenkins/jenkins-slave/workspace/Lucene-Solr-NightlyTests-5.x/lucene/ivy-settings.xml

-clover.load:

resolve-groovy:

-init-totals:

test-core:

-clover.disable:

ivy-availability-check:

ivy-fail:

ivy-configure:
[ivy:configure] :: loading settings :: file = /x1/jenkins/jenkins-slave/workspace/Lucene-Solr-NightlyTests-5.x/lucene/ivy-settings.xml

-clover.load:

-clover.classpath:

-clover.setup:

clover:

-check-git-state:

-git-cleanroot:

-copy-git-state:
     [copy] Copying 1 file to /x1/jenkins/jenkins-slave/workspace/Lucene-Solr-NightlyTests-5.x/lucene/build

git-autoclean:

resolve:

init:

compile-core:
    [mkdir] Created dir: /x1/jenkins/jenkins-slave/workspace/Lucene-Solr-NightlyTests-5.x/lucene/build/core/classes/java
    [javac] Compiling 739 source files to /x1/jenkins/jenkins-slave/workspace/Lucene-Solr-NightlyTests-5.x/lucene/build/core/classes/java
    [javac] Note: Some input files use or override a deprecated API.
    [javac] Note: Recompile with -Xlint:deprecation for details.
    [javac] Creating empty /x1/jenkins/jenkins-slave/workspace/Lucene-Solr-NightlyTests-5.x/lucene/build/core/classes/java/org/apache/lucene/codecs/blocktree/package-info.class
    [javac] Creating empty /x1/jenkins/jenkins-slave/workspace/Lucene-Solr-NightlyTests-5.x/lucene/build/core/classes/java/org/apache/lucene/codecs/lucene54/package-info.class
    [javac] Creating empty /x1/jenkins/jenkins-slave/workspace/Lucene-Solr-NightlyTests-5.x/lucene/build/core/classes/java/org/apache/lucene/util/packed/package-info.class
    [javac] Creating empty /x1/jenkins/jenkins-slave/workspace/Lucene-Solr-NightlyTests-5.x/lucene/build/core/classes/java/org/apache/lucene/analysis/package-info.class
    [javac] Creating empty /x1/jenkins/jenkins-slave/workspace/Lucene-Solr-NightlyTests-5.x/lucene/build/core/classes/java/org/apache/lucene/document/package-info.class
    [javac] Creating empty /x1/jenkins/jenkins-slave/workspace/Lucene-Solr-NightlyTests-5.x/lucene/build/core/classes/java/org/apache/lucene/util/package-info.class
    [javac] Creating empty /x1/jenkins/jenkins-slave/workspace/Lucene-Solr-NightlyTests-5.x/lucene/build/core/classes/java/org/apache/lucene/analysis/tokenattributes/package-info.class
    [javac] Creating empty /x1/jenkins/jenkins-slave/workspace/Lucene-Solr-NightlyTests-5.x/lucene/build/core/classes/java/org/apache/lucene/codecs/lucene50/package-info.class
    [javac] Creating empty /x1/jenkins/jenkins-slave/workspace/Lucene-Solr-NightlyTests-5.x/lucene/build/core/classes/java/org/apache/lucene/index/package-info.class
    [javac] Creating empty /x1/jenkins/jenkins-slave/workspace/Lucene-Solr-NightlyTests-5.x/lucene/build/core/classes/java/org/apache/lucene/codecs/compressing/package-info.class
    [javac] Creating empty /x1/jenkins/jenkins-slave/workspace/Lucene-Solr-NightlyTests-5.x/lucene/build/core/classes/java/org/apache/lucene/codecs/lucene53/package-info.class
    [javac] Creating empty /x1/jenkins/jenkins-slave/workspace/Lucene-Solr-NightlyTests-5.x/lucene/build/core/classes/java/org/apache/lucene/util/automaton/package-info.class
    [javac] Creating empty /x1/jenkins/jenkins-slave/workspace/Lucene-Solr-NightlyTests-5.x/lucene/build/core/classes/java/org/apache/lucene/util/fst/package-info.class
    [javac] Creating empty /x1/jenkins/jenkins-slave/workspace/Lucene-Solr-NightlyTests-5.x/lucene/build/core/classes/java/org/apache/lucene/util/mutable/package-info.class
    [javac] Creating empty /x1/jenkins/jenkins-slave/workspace/Lucene-Solr-NightlyTests-5.x/lucene/build/core/classes/java/org/apache/lucene/search/similarities/package-info.class
    [javac] Creating empty /x1/jenkins/jenkins-slave/workspace/Lucene-Solr-NightlyTests-5.x/lucene/build/core/classes/java/org/apache/lucene/codecs/perfield/package-info.class
    [javac] Creating empty /x1/jenkins/jenkins-slave/workspace/Lucene-Solr-NightlyTests-5.x/lucene/build/core/classes/java/org/apache/lucene/store/package-info.class
    [javac] Creating empty /x1/jenkins/jenkins-slave/workspace/Lucene-Solr-NightlyTests-5.x/lucene/build/core/classes/java/org/apache/lucene/package-info.class
    [javac] Creating empty /x1/jenkins/jenkins-slave/workspace/Lucene-Solr-NightlyTests-5.x/lucene/build/core/classes/java/org/apache/lucene/search/package-info.class
    [javac] Creating empty /x1/jenkins/jenkins-slave/workspace/Lucene-Solr-NightlyTests-5.x/lucene/build/core/classes/java/org/apache/lucene/codecs/package-info.class
    [javac] Creating empty /x1/jenkins/jenkins-slave/workspace/Lucene-Solr-NightlyTests-5.x/lucene/build/core/classes/java/org/apache/lucene/search/spans/package-info.class
     [copy] Copying 3 files to /x1/jenkins/jenkins-slave/workspace/Lucene-Solr-NightlyTests-5.x/lucene/build/core/classes/java

compile-test-framework:

-check-git-state:

-git-cleanroot:

-copy-git-state:

git-autoclean:

ivy-availability-check:

ivy-fail:

ivy-configure:
[ivy:configure] :: loading settings :: file = /x1/jenkins/jenkins-slave/workspace/Lucene-Solr-NightlyTests-5.x/lucene/ivy-settings.xml

resolve:

init:

compile-lucene-core:

-check-git-state:

-git-cleanroot:

-copy-git-state:

git-autoclean:

ivy-availability-check:

ivy-fail:

ivy-configure:
[ivy:configure] :: loading settings :: file = /x1/jenkins/jenkins-slave/workspace/Lucene-Solr-NightlyTests-5.x/lucene/ivy-settings.xml

resolve:

init:

-clover.disable:

-clover.load:

-clover.classpath:

-clover.setup:

clover:

compile-core:

compile-codecs:

-check-git-state:

-git-cleanroot:

-copy-git-state:

git-autoclean:

ivy-availability-check:

ivy-fail:

ivy-configure:
[ivy:configure] :: loading settings :: file = /x1/jenkins/jenkins-slave/workspace/Lucene-Solr-NightlyTests-5.x/lucene/ivy-settings.xml

resolve:

common.init:

compile-lucene-core:

init:

-clover.disable:

-clover.load:

-clover.classpath:

-clover.setup:

clover:

compile-core:
    [mkdir] Created dir: /x1/jenkins/jenkins-slave/workspace/Lucene-Solr-NightlyTests-5.x/lucene/build/codecs/classes/java
    [javac] Compiling 64 source files to /x1/jenkins/jenkins-slave/workspace/Lucene-Solr-NightlyTests-5.x/lucene/build/codecs/classes/java
    [javac] Note: Some input files use or override a deprecated API.
    [javac] Note: Recompile with -Xlint:deprecation for details.
    [javac] Creating empty /x1/jenkins/jenkins-slave/workspace/Lucene-Solr-NightlyTests-5.x/lucene/build/codecs/classes/java/org/apache/lucene/codecs/blocktreeords/package-info.class
    [javac] Creating empty /x1/jenkins/jenkins-slave/workspace/Lucene-Solr-NightlyTests-5.x/lucene/build/codecs/classes/java/org/apache/lucene/codecs/memory/package-info.class
    [javac] Creating empty /x1/jenkins/jenkins-slave/workspace/Lucene-Solr-NightlyTests-5.x/lucene/build/codecs/classes/java/org/apache/lucene/codecs/simpletext/package-info.class
    [javac] Creating empty /x1/jenkins/jenkins-slave/workspace/Lucene-Solr-NightlyTests-5.x/lucene/build/codecs/classes/java/org/apache/lucene/codecs/blockterms/package-info.class
    [javac] Creating empty /x1/jenkins/jenkins-slave/workspace/Lucene-Solr-NightlyTests-5.x/lucene/build/codecs/classes/java/org/apache/lucene/codecs/bloom/package-info.class
    [javac] Creating empty /x1/jenkins/jenkins-slave/workspace/Lucene-Solr-NightlyTests-5.x/lucene/build/codecs/classes/java/org/apache/lucene/codecs/autoprefix/package-info.class
     [copy] Copying 3 files to /x1/jenkins/jenkins-slave/workspace/Lucene-Solr-NightlyTests-5.x/lucene/build/codecs/classes/java

-clover.disable:

-clover.load:

-clover.classpath:

-clover.setup:

clover:

common.compile-core:
    [mkdir] Created dir: /x1/jenkins/jenkins-slave/workspace/Lucene-Solr-NightlyTests-5.x/lucene/build/test-framework/classes/java
    [javac] Compiling 174 source files to /x1/jenkins/jenkins-slave/workspace/Lucene-Solr-NightlyTests-5.x/lucene/build/test-framework/classes/java
    [javac] Note: Some input files use or override a deprecated API.
    [javac] Note: Recompile with -Xlint:deprecation for details.
    [javac] Creating empty /x1/jenkins/jenkins-slave/workspace/Lucene-Solr-NightlyTests-5.x/lucene/build/test-framework/classes/java/org/apache/lucene/mockfile/package-info.class
    [javac] Creating empty /x1/jenkins/jenkins-slave/workspace/Lucene-Solr-NightlyTests-5.x/lucene/build/test-framework/classes/java/org/apache/lucene/codecs/cranky/package-info.class
    [javac] Creating empty /x1/jenkins/jenkins-slave/workspace/Lucene-Solr-NightlyTests-5.x/lucene/build/test-framework/classes/java/org/apache/lucene/codecs/compressing/dummy/package-info.class
    [javac] Creating empty /x1/jenkins/jenkins-slave/workspace/Lucene-Solr-NightlyTests-5.x/lucene/build/test-framework/classes/java/org/apache/lucene/codecs/asserting/package-info.class
    [javac] Creating empty /x1/jenkins/jenkins-slave/workspace/Lucene-Solr-NightlyTests-5.x/lucene/build/test-framework/classes/java/org/apache/lucene/codecs/ramonly/package-info.class
    [javac] Creating empty /x1/jenkins/jenkins-slave/workspace/Lucene-Solr-NightlyTests-5.x/lucene/build/test-framework/classes/java/org/apache/lucene/codecs/cheapbastard/package-info.class
    [javac] Creating empty /x1/jenkins/jenkins-slave/workspace/Lucene-Solr-NightlyTests-5.x/lucene/build/test-framework/classes/java/org/apache/lucene/codecs/mockrandom/package-info.class
     [copy] Copying 4 files to /x1/jenkins/jenkins-slave/workspace/Lucene-Solr-NightlyTests-5.x/lucene/build/test-framework/classes/java

compile-core:

compile-test:
    [mkdir] Created dir: /x1/jenkins/jenkins-slave/workspace/Lucene-Solr-NightlyTests-5.x/lucene/build/core/classes/test
    [javac] Compiling 429 source files to /x1/jenkins/jenkins-slave/workspace/Lucene-Solr-NightlyTests-5.x/lucene/build/core/classes/test
    [javac] Note: Some input files use or override a deprecated API.
    [javac] Note: Recompile with -Xlint:deprecation for details.
     [copy] Copying 3 files to /x1/jenkins/jenkins-slave/workspace/Lucene-Solr-NightlyTests-5.x/lucene/build/core/classes/test

install-junit4-taskdef:

validate:

resolve-groovy:

-init-totals:

-test:
    [mkdir] Created dir: /x1/jenkins/jenkins-slave/workspace/Lucene-Solr-NightlyTests-5.x/lucene/build/core/test
[loadresource] Do not set property tests.explicitclass as its length is 0.
    [mkdir] Created dir: /x1/jenkins/jenkins-slave/workspace/Lucene-Solr-NightlyTests-5.x/lucene/build/core/test/temp
    [mkdir] Created dir: /x1/jenkins/jenkins-slave/workspace/Lucene-Solr-NightlyTests-5.x/.caches/test-stats/core
   [junit4] <JUnit4> says नमस्ते! Master seed: AE8149EA276CA1C6
   [junit4] Executing 421 suites with 3 JVMs.
   [junit4] 
   [junit4] Started J1 PID(1140@localhost).
   [junit4] Started J0 PID(1142@localhost).
   [junit4] Started J2 PID(1141@localhost).
   [junit4] Suite: org.apache.lucene.search.TestBooleanCoord
   [junit4] Completed [1/421] on J2 in 2.01s, 76 tests
   [junit4] 
   [junit4] Suite: org.apache.lucene.index.TestTerms
   [junit4] Completed [2/421] on J1 in 6.75s, 8 tests
   [junit4] 
   [junit4] Suite: org.apache.lucene.index.TestOmitNorms
   [junit4] Completed [3/421] on J2 in 4.73s, 5 tests
   [junit4] 
   [junit4] Suite: org.apache.lucene.search.TestMinShouldMatch2
   [junit4] Completed [4/421] on J0 in 13.93s, 6 tests
   [junit4] 
   [junit4] Suite: org.apache.lucene.util.TestVersion
   [junit4] Completed [5/421] on J0 in 0.15s, 11 tests
   [junit4] 
   [junit4] Suite: org.apache.lucene.index.TestManyFields
   [junit4] Completed [6/421] on J1 in 14.15s, 3 tests
   [junit4] 
   [junit4] Suite: org.apache.lucene.search.similarities.TestBM25Similarity
   [junit4] Completed [7/421] on J1 in 0.12s, 3 tests
   [junit4] 
   [junit4] Suite: org.apache.lucene.index.TestUniqueTermCount
   [junit4] Completed [8/421] on J1 in 0.35s, 1 test
   [junit4] 
   [junit4] Suite: org.apache.lucene.store.TestLockFactory
   [junit4] Completed [9/421] on J1 in 0.19s, 2 tests
   [junit4] 
   [junit4] Suite: org.apache.lucene.index.TestIntBlockPool
   [junit4] Completed [10/421] on J1 in 0.75s, 2 tests
   [junit4] 
   [junit4] Suite: org.apache.lucene.document.TestDocument
   [junit4] Completed [11/421] on J1 in 0.16s, 11 tests
   [junit4] 
   [junit4] Suite: org.apache.lucene.util.TestSPIClassIterator
   [junit4] Completed [12/421] on J1 in 0.09s, 1 test
   [junit4] 
   [junit4] Suite: org.apache.lucene.store.TestTrackingDirectoryWrapper
   [junit4] IGNOR/A 0.02s J1 | TestTrackingDirectoryWrapper.testFsyncDoesntCreateNewFiles
   [junit4]    > Assumption #1: test only works for FSDirectory subclasses
   [junit4] Completed [13/421] on J1 in 1.91s, 47 tests, 1 skipped
   [junit4] 
   [junit4] Suite: org.apache.lucene.util.TestIntroSorter
   [junit4] Completed [14/421] on J1 in 0.66s, 9 tests
   [junit4] 
   [junit4] Suite: org.apache.lucene.search.TestBoostQuery
   [junit4] Completed [15/421] on J1 in 0.11s, 4 tests
   [junit4] 
   [junit4] Suite: org.apache.lucene.search.TestTopDocsMerge
   [junit4] Completed [16/421] on J2 in 26.01s, 2 tests
   [junit4] 
   [junit4] Suite: org.apache.lucene.search.TestApproximationSearchEquivalence
   [junit4] Completed [17/421] on J0 in 20.82s, 10 tests
   [junit4] 
   [junit4] Suite: org.apache.lucene.search.TestCachingWrapperFilter
   [junit4] Completed [18/421] on J2 in 4.70s, 11 tests
   [junit4] 
   [junit4] Suite: org.apache.lucene.search.spans.TestSpans
   [junit4] Completed [19/421] on J2 in 1.97s, 26 tests
   [junit4] 
   [junit4] Suite: org.apache.lucene.index.TestNorms
   [junit4] Completed [20/421] on J2 in 19.19s, 2 tests
   [junit4] 
   [junit4] Suite: org.apache.lucene.document.TestFieldType
   [junit4] Completed [21/421] on J2 in 0.07s, 2 tests
   [junit4] 
   [junit4] Suite: org.apache.lucene.util.TestQueryBuilder
   [junit4] Completed [22/421] on J2 in 0.15s, 20 tests
   [junit4] 
   [junit4] Suite: org.apache.lucene.store.TestMmapDirectory
   [junit4] Completed [23/421] on J2 in 3.58s, 42 tests
   [junit4] 
   [junit4] Suite: org.apache.lucene.util.TestCharsRef
   [junit4] Completed [24/421] on J2 in 0.15s, 5 tests
   [junit4] 
   [junit4] Suite: org.apache.lucene.search.TestDocIdSet
   [junit4] Completed [25/421] on J2 in 0.08s, 3 tests
   [junit4] 
   [junit4] Suite: org.apache.lucene.index.TestDocumentWriter
   [junit4] Completed [26/421] on J2 in 1.36s, 6 tests
   [junit4] 
   [junit4] Suite: org.apache.lucene.index.TestDocCount
   [junit4] Completed [27/421] on J2 in 0.69s, 1 test
   [junit4] 
   [junit4] Suite: org.apache.lucene.codecs.compressing.TestFastCompressionMode
   [junit4] Completed [28/421] on J2 in 2.07s, 11 tests
   [junit4] 
   [junit4] Suite: org.apache.lucene.util.TestRecyclingByteBlockAllocator
   [junit4] Completed [29/421] on J2 in 0.07s, 3 tests
   [junit4] 
   [junit4] Suite: org.apache.lucene.index.TestBagOfPostings
   [junit4] Completed [30/421] on J2 in 5.58s, 1 test
   [junit4] 
   [junit4] Suite: org.apache.lucene.search.TestWildcardRandom
   [junit4] Completed [31/421] on J2 in 0.90s, 1 test
   [junit4] 
   [junit4] Suite: org.apache.lucene.analysis.TestNumericTokenStream
   [junit4] Completed [32/421] on J2 in 0.05s, 6 tests
   [junit4] 
   [junit4] Suite: org.apache.lucene.search.TestQueryWrapperFilter
   [junit4] Completed [33/421] on J2 in 0.97s, 6 tests
   [junit4] 
   [junit4] Suite: org.apache.lucene.search.spans.TestSpanCollection
   [junit4] Completed [34/421] on J2 in 0.06s, 3 tests
   [junit4] 
   [junit4] Suite: org.apache.lucene.search.TestIndexSearcher
   [junit4] Completed [35/421] on J2 in 0.59s, 5 tests
   [junit4] 
   [junit4] Suite: org.apache.lucene.search.TestRegexpRandom
   [junit4] Completed [36/421] on J2 in 1.31s, 1 test
   [junit4] 
   [junit4] Suite: org.apache.lucene.util.automaton.TestDeterminizeLexicon
   [junit4] Completed [37/421] on J2 in 7.07s, 1 test
   [junit4] 
   [junit4] Suite: org.apache.lucene.analysis.tokenattributes.TestPackedTokenAttributeImpl
   [junit4] Completed [38/421] on J2 in 0.04s, 4 tests
   [junit4] 
   [junit4] Suite: org.apache.lucene.search.TestWildcard
   [junit4] Completed [39/421] on J2 in 0.27s, 8 tests
   [junit4] 
   [junit4] Suite: org.apache.lucene.search.TestFilteredQuery
   [junit4] Completed [40/421] on J2 in 3.68s, 11 tests
   [junit4] 
   [junit4] Suite: org.apache.lucene.index.TestReaderWrapperDVTypeCheck
   [junit4] Completed [41/421] on J2 in 0.13s, 1 test
   [junit4] 
   [junit4] HEARTBEAT J1 PID(1140@localhost): 2016-02-21T07:00:09, stalled for 69.7s at: TestDemoParallelLeafReader.testRandom
   [junit4] Suite: org.apache.lucene.util.fst.TestBytesStore
   [junit4] Completed [42/421] on J2 in 14.58s, 1 test
   [junit4] 
   [junit4] Suite: org.apache.lucene.codecs.lucene50.TestLucene50SegmentInfoFormat
   [junit4] Completed [43/421] on J2 in 1.17s, 15 tests
   [junit4] 
   [junit4] Suite: org.apache.lucene.search.TestAutomatonQuery
   [junit4] Completed [44/421] on J2 in 2.45s, 8 tests
   [junit4] 
   [junit4] Suite: org.apache.lucene.search.TestTopFieldCollector
   [junit4] Completed [45/421] on J2 in 0.60s, 7 tests
   [junit4] 
   [junit4] Suite: org.apache.lucene.store.TestRateLimiter
   [junit4] Completed [46/421] on J2 in 0.34s, 2 tests
   [junit4] 
   [junit4] Suite: org.apache.lucene.search.TestFuzzyQuery
   [junit4] Completed [47/421] on J2 in 0.15s, 10 tests
   [junit4] 
   [junit4] Suite: org.apache.lucene.search.TestLiveFieldValues
   [junit4] Completed [48/421] on J2 in 4.60s, 1 test
   [junit4] 
   [junit4] Suite: org.apache.lucene.TestExternalCodecs
   [junit4] Completed [49/421] on J2 in 2.68s, 1 test
   [junit4] 
   [junit4] Suite: org.apache.lucene.search.TestAutomatonQueryUnicode
   [junit4] Completed [50/421] on J2 in 0.05s, 1 test
   [junit4] 
   [junit4] Suite: org.apache.lucene.index.TestParallelCompositeReader
   [junit4] Completed [51/421] on J2 in 1.39s, 16 tests
   [junit4] 
   [junit4] Suite: org.apache.lucene.search.TestQueryCachingPolicy
   [junit4] Completed [52/421] on J2 in 0.04s, 1 test
   [junit4] 
   [junit4] HEARTBEAT J1 PID(1140@localhost): 2016-02-21T07:01:45, stalled for 60.3s at: TestDemoParallelLeafReader.testRandomMultipleSchemaGens
   [junit4] HEARTBEAT J2 PID(1141@localhost): 2016-02-21T07:01:57, stalled for 66.0s at: TestNumericDocValuesUpdates.testTonsOfUpdates
   [junit4] HEARTBEAT J0 PID(1142@localhost): 2016-02-21T07:02:33, stalled for 61.7s at: TestLucene53NormsFormat.testNCommonBig
   [junit4] HEARTBEAT J2 PID(1141@localhost): 2016-02-21T07:02:57, stalled for  126s at: TestNumericDocValuesUpdates.testTonsOfUpdates
   [junit4] HEARTBEAT J0 PID(1142@localhost): 2016-02-21T07:03:33, stalled for  122s at: TestLucene53NormsFormat.testNCommonBig
   [junit4] HEARTBEAT J1 PID(1140@localhost): 2016-02-21T07:03:45, stalled for 67.8s at: TestDemoParallelLeafReader.testRandomMultipleSchemaGensSameField
   [junit4] HEARTBEAT J2 PID(1141@localhost): 2016-02-21T07:03:57, stalled for  186s at: TestNumericDocValuesUpdates.testTonsOfUpdates
   [junit4] Suite: org.apache.lucene.codecs.lucene53.TestLucene53NormsFormat
   [junit4] IGNOR/A 0.01s J0 | TestLucene53NormsFormat.testMergeStability
   [junit4]    > Assumption #1: The MockRandom PF randomizes content on the fly, so we can't check it
   [junit4] Completed [53/421] on J0 in 307.34s, 17 tests, 1 skipped
   [junit4] 
   [junit4] Suite: org.apache.lucene.util.TestCollectionUtil
   [junit4] Completed [54/421] on J0 in 12.37s, 4 tests
   [junit4] 
   [junit4] Suite: org.apache.lucene.search.TestTimeLimitingCollector
   [junit4] Completed [55/421] on J0 in 5.23s, 7 tests
   [junit4] 
   [junit4] Suite: org.apache.lucene.index.TestNoMergeScheduler
   [junit4] Completed [56/421] on J0 in 0.07s, 3 tests
   [junit4] 
   [junit4] Suite: org.apache.lucene.search.TestTotalHitCountCollector
   [junit4] Completed [57/421] on J0 in 0.04s, 1 test
   [junit4] 
   [junit4] Suite: org.apache.lucene.search.spans.TestSpansAdvanced
   [junit4] Completed [58/421] on J0 in 0.14s, 1 test
   [junit4] 
   [junit4] Suite: org.apache.lucene.search.TestBooleanScorer
   [junit4] Completed [59/421] on J0 in 3.72s, 5 tests
   [junit4] 
   [junit4] Suite: org.apache.lucene.search.TestDateSort
   [junit4] Completed [60/421] on J0 in 0.09s, 1 test
   [junit4] 
   [junit4] Suite: org.apache.lucene.util.TestNumericUtils
   [junit4] Completed [61/421] on J0 in 2.17s, 12 tests
   [junit4] 
   [junit4] Suite: org.apache.lucene.search.TestEarlyTermination
   [junit4] Completed [62/421] on J0 in 0.65s, 1 test
   [junit4] 
   [junit4] HEARTBEAT J1 PID(1140@localhost): 2016-02-21T07:04:45, stalled for  128s at: TestDemoParallelLeafReader.testRandomMultipleSchemaGensSameField
   [junit4] Suite: org.apache.lucene.util.automaton.TestMinimize
   [junit4] Completed [63/421] on J0 in 6.79s, 3 tests
   [junit4] 
   [junit4] Suite: org.apache.lucene.index.TestPerSegmentDeletes
   [junit4] Completed [64/421] on J0 in 0.13s, 1 test
   [junit4] 
   [junit4] Suite: org.apache.lucene.store.TestNIOFSDirectory
   [junit4] Completed [65/421] on J0 in 1.64s, 42 tests
   [junit4] 
   [junit4] Suite: org.apache.lucene.index.TestDemoParallelLeafReader
   [junit4] Completed [66/421] on J1 in 357.45s, 5 tests
   [junit4] 
   [junit4] HEARTBEAT J2 PID(1141@localhost): 2016-02-21T07:04:57, stalled for  246s at: TestNumericDocValuesUpdates.testTonsOfUpdates
   [junit4] Suite: org.apache.lucene.index.TestCodecs
   [junit4] Completed [67/421] on J1 in 0.67s, 3 tests
   [junit4] 
   [junit4] Suite: org.apache.lucene.index.TestTieredMergePolicy
   [junit4] Completed [68/421] on J0 in 13.33s, 6 tests
   [junit4] 
   [junit4] Suite: org.apache.lucene.index.TestMultiLevelSkipList
   [junit4] Completed [69/421] on J0 in 0.48s, 1 test
   [junit4] 
   [junit4] Suite: org.apache.lucene.search.TestMultiThreadTermVectors
   [junit4] Completed [70/421] on J0 in 3.01s, 1 test
   [junit4] 
   [junit4] Suite: org.apache.lucene.index.TestDocsAndPositions
   [junit4] Completed [71/421] on J0 in 1.87s, 6 tests
   [junit4] 
   [junit4] Suite: org.apache.lucene.store.TestBufferedChecksum
   [junit4] Completed [72/421] on J0 in 0.22s, 2 tests
   [junit4] 
   [junit4] Suite: org.apache.lucene.TestDemo
   [junit4] Completed [73/421] on J0 in 0.09s, 1 test
   [junit4] 
   [junit4] Suite: org.apache.lucene.analysis.tokenattributes.TestCharTermAttributeImpl
   [junit4] Completed [74/421] on J0 in 1.14s, 12 tests
   [junit4] 
   [junit4] Suite: org.apache.lucene.search.TestMultiTermConstantScore
   [junit4] Completed [75/421] on J0 in 6.28s, 8 tests
   [junit4] 
   [junit4] Suite: org.apache.lucene.index.TestIndexReaderClose
   [junit4] Completed [76/421] on J0 in 0.18s, 3 tests
   [junit4] 
   [junit4] Suite: org.apache.lucene.search.TestRegexpRandom2
   [junit4] Completed [77/421] on J0 in 9.62s, 1 test
   [junit4] 
   [junit4] Suite: org.apache.lucene.index.TestMixedCodecs
   [junit4] Completed [78/421] on J0 in 4.08s, 1 test
   [junit4] 
   [junit4] Suite: org.apache.lucene.util.Test2BPagedBytes
   [junit4] IGNOR/A 0.00s J0 | Test2BPagedBytes.test
   [junit4]    > Assumption #1: 'monster' test group is disabled (@Monster(value=You must increase heap to > 2 G to run this))
   [junit4] Completed [79/421] on J0 in 0.04s, 1 test, 1 skipped
   [junit4] 
   [junit4] Suite: org.apache.lucene.index.TestIndexWriterFromReader
   [junit4] Completed [80/421] on J0 in 4.01s, 12 tests
   [junit4] 
   [junit4] Suite: org.apache.lucene.index.TestIndexWriter
   [junit4] Completed [81/421] on J0 in 12.31s, 70 tests
   [junit4] 
   [junit4] HEARTBEAT J2 PID(1141@localhost): 2016-02-21T07:05:57, stalled for  306s at: TestNumericDocValuesUpdates.testTonsOfUpdates
   [junit4] HEARTBEAT J1 PID(1140@localhost): 2016-02-21T07:06:09, stalled for 71.6s at: TestGrowableByteArrayDataOutput.testWriteLargeStrings
   [junit4] Suite: org.apache.lucene.index.TestIndexWriterNRTIsCurrent
   [junit4] Completed [82/421] on J0 in 41.28s, 1 test
   [junit4] 
   [junit4] Suite: org.apache.lucene.search.spans.TestSpanOrQuery
   [junit4] Completed [83/421] on J0 in 0.03s, 3 tests
   [junit4] 
   [junit4] Suite: org.apache.lucene.util.TestBytesRefHash
   [junit4] Completed [84/421] on J0 in 2.23s, 8 tests
   [junit4] 
   [junit4] Suite: org.apache.lucene.search.TestCustomSearcherSort
   [junit4] Completed [85/421] on J0 in 2.27s, 2 tests
   [junit4] 
   [junit4] Suite: org.apache.lucene.search.spans.TestNearSpansOrdered
   [junit4] Completed [86/421] on J0 in 0.45s, 18 tests
   [junit4] 
   [junit4] Suite: org.apache.lucene.util.automaton.TestLevenshteinAutomata
   [junit4] Completed [87/421] on J0 in 1.47s, 4 tests
   [junit4] 
   [junit4] Suite: org.apache.lucene.index.TestNumericDocValuesUpdates
   [junit4] Completed [88/421] on J2 in 371.78s, 29 tests
   [junit4] 
   [junit4] Suite: org.apache.lucene.util.TestBitDocIdSetBuilder
   [junit4] Completed [89/421] on J2 in 0.16s, 6 tests
   [junit4] 
   [junit4] Suite: org.apache.lucene.util.automaton.FiniteStringsIteratorTest
   [junit4] Completed [90/421] on J2 in 0.40s, 7 tests
   [junit4] 
   [junit4] Suite: org.apache.lucene.search.TestSortRescorer
   [junit4] Completed [91/421] on J2 in 0.94s, 2 tests
   [junit4] 
   [junit4] Suite: org.apache.lucene.search.FuzzyTermOnShortTermsTest
   [junit4] Completed [92/421] on J2 in 0.26s, 1 test
   [junit4] 
   [junit4] Suite: org.apache.lucene.index.TestThreadedForceMerge
   [junit4] Completed [93/421] on J2 in 0.39s, 1 test
   [junit4] 
   [junit4] Suite: org.apache.lucene.index.TestDocInverterPerFieldErrorInfo
   [junit4] Completed [94/421] on J2 in 0.07s, 2 tests
   [junit4] 
   [junit4] Suite: org.apache.lucene.index.TestCustomNorms
   [junit4] Completed [95/421] on J0 in 12.48s, 1 test
   [junit4] 
   [junit4] Suite: org.apache.lucene.index.TestDoc
   [junit4] Completed [96/421] on J0 in 0.19s, 1 test
   [junit4] 
   [junit4] Suite: org.apache.lucene.codecs.compressing.TestGrowableByteArrayDataOutput
   [junit4] Completed [97/421] on J1 in 115.81s, 2 tests
   [junit4] 
   [junit4] Suite: org.apache.lucene.util.TestSetOnce
   [junit4] Completed [98/421] on J1 in 0.07s, 4 tests
   [junit4] 
   [junit4] Suite: org.apache.lucene.index.TestAddIndexes
   [junit4] Completed [99/421] on J1 in 7.68s, 23 tests
   [junit4] 
   [junit4] Suite: org.apache.lucene.search.spans.TestSpanBoostQuery
   [junit4] Completed [100/421] on J1 in 0.03s, 2 tests
   [junit4] 
   [junit4] Suite: org.apache.lucene.analysis.tokenattributes.TestSimpleAttributeImpl
   [junit4] Completed [101/421] on J1 in 0.03s, 1 test
   [junit4] 
   [junit4] Suite: org.apache.lucene.search.TestSloppyPhraseQuery2
   [junit4] Completed [102/421] on J0 in 18.71s, 9 tests
   [junit4] 
   [junit4] Suite: org.apache.lucene.search.TestPrefixInBooleanQuery
   [junit4] Completed [103/421] on J0 in 1.45s, 4 tests
   [junit4] 
   [junit4] Suite: org.apache.lucene.search.TestSortRandom
   [junit4] Completed [104/421] on J0 in 1.63s, 2 tests
   [junit4] 
   [junit4] Suite: org.apache.lucene.util.TestArrayUtil
   [junit4] Completed [105/421] on J0 in 3.83s, 13 tests
   [junit4] 
   [junit4] Suite: org.apache.lucene.util.TestIOUtils
   [junit4] Completed [106/421] on J0 in 0.11s, 18 tests
   [junit4] 
   [junit4] Suite: org.apache.lucene.search.spans.TestFilterSpans
   [junit4] Completed [107/421] on J0 in 0.02s, 1 test
   [junit4] 
   [junit4] Suite: org.apache.lucene.index.TestOrdinalMap
   [junit4] Completed [108/421] on J0 in 0.14s, 1 test
   [junit4] 
   [junit4] Suite: org.apache.lucene.index.TestStressNRT
   [junit4] Completed [109/421] on J0 in 2.13s, 1 test
   [junit4] 
   [junit4] Suite: org.apache.lucene.index.TestMultiTermsEnum
   [junit4] Completed [110/421] on J0 in 0.02s, 1 test
   [junit4] 
   [junit4] Suite: org.apache.lucene.util.TestVirtualMethod
   [junit4] Completed [111/421] on J0 in 0.04s, 2 tests
   [junit4] 
   [junit4] Suite: org.apache.lucene.search.TestPrefixQuery
   [junit4] Completed [112/421] on J1 in 18.16s, 3 tests
   [junit4] 
   [junit4] Suite: org.apache.lucene.index.TestDeletionPolicy
   [junit4] Completed [113/421] on J0 in 6.02s, 6 tests
   [junit4] 
   [junit4] Suite: org.apache.lucene.store.TestSleepingLockWrapper
   [junit4] Completed [114/421] on J0 in 6.30s, 6 tests
   [junit4] 
   [junit4] Suite: org.apache.lucene.index.TestMixedDocValuesUpdates
   [junit4] Completed [115/421] on J2 in 58.26s, 4 tests
   [junit4] 
   [junit4] Suite: org.apache.lucene.index.TestTermdocPerf
   [junit4] Completed [116/421] on J2 in 0.02s, 1 test
   [junit4] 
   [junit4] Suite: org.apache.lucene.index.TestConsistentFieldNumbers
   [junit4] Completed [117/421] on J2 in 5.08s, 4 tests
   [junit4] 
   [junit4] Suite: org.apache.lucene.util.automaton.TestOperations
   [junit4] Completed [118/421] on J2 in 1.23s, 5 tests
   [junit4] 
   [junit4] Suite: org.apache.lucene.index.TestSegmentTermEnum
   [junit4] Completed [119/421] on J2 in 0.07s, 2 tests
   [junit4] 
   [junit4] Suite: org.apache.lucene.search.spans.TestSpanSearchEquivalence
   [junit4] Completed [120/421] on J1 in 46.46s, 33 tests
   [junit4] 
   [junit4] Suite: org.apache.lucene.search.TestFieldCacheRewriteMethod
   [junit4] Completed [121/421] on J1 in 7.98s, 2 tests
   [junit4] 
   [junit4] Suite: org.apache.lucene.search.TestPrefixRandom
   [junit4] Completed [122/421] on J1 in 0.83s, 1 test
   [junit4] 
   [junit4] Suite: org.apache.lucene.util.automaton.TestAutomaton
   [junit4] Completed [123/421] on J1 in 6.38s, 56 tests
   [junit4] 
   [junit4] Suite: org.apache.lucene.codecs.compressing.TestFastDecompressionMode
   [junit4] Completed [124/421] on J1 in 3.77s, 11 tests
   [junit4] 
   [junit4] Suite: org.apache.lucene.search.spans.TestFieldMaskingSpanQuery
   [junit4] Completed [125/421] on J1 in 1.10s, 11 tests
   [junit4] 
   [junit4] Suite: org.apache.lucene.search.TestDisjunctionMaxQuery
   [junit4] Completed [126/421] on J1 in 1.26s, 12 tests
   [junit4] 
   [junit4] Suite: org.apache.lucene.index.TestNoMergePolicy
   [junit4] Completed [127/421] on J1 in 0.10s, 4 tests
   [junit4] 
   [junit4] Suite: org.apache.lucene.util.mutable.TestMutableValues
   [junit4] Completed [128/421] on J1 in 0.05s, 6 tests
   [junit4] 
   [junit4] HEARTBEAT J0 PID(1142@localhost): 2016-02-21T07:08:33, stalled for 65.8s at: Test2BPostings.test
   [junit4] Suite: org.apache.lucene.index.TestBinaryDocValuesUpdates
   [junit4] Completed [129/421] on J2 in 68.16s, 28 tests
   [junit4] 
   [junit4] Suite: org.apache.lucene.index.TestMaxPosition
   [junit4] Completed [130/421] on J2 in 0.04s, 2 tests
   [junit4] 
   [junit4] Suite: org.apache.lucene.index.TestSwappedIndexFiles
   [junit4] Completed [131/421] on J2 in 0.37s, 1 test
   [junit4] 
   [junit4] Suite: org.apache.lucene.search.TestMatchNoDocsQuery
   [junit4] Completed [132/421] on J2 in 0.03s, 2 tests
   [junit4] 
   [junit4] Suite: org.apache.lucene.search.spans.TestSpansEnum
   [junit4] Completed [133/421] on J2 in 0.17s, 7 tests
   [junit4] 
   [junit4] Suite: org.apache.lucene.util.TestMergedIterator
   [junit4] Completed [134/421] on J2 in 0.40s, 25 tests
   [junit4] 
   [junit4] Suite: org.apache.lucene.document.TestField
   [junit4] Completed [135/421] on J2 in 0.08s, 19 tests
   [junit4] 
   [junit4] Suite: org.apache.lucene.index.TestAllFilesCheckIndexHeader
   [junit4] Completed [136/421] on J2 in 1.81s, 1 test
   [junit4] 
   [junit4] Suite: org.apache.lucene.util.TestLSBRadixSorter
   [junit4] Completed [137/421] on J2 in 0.28s, 6 tests
   [junit4] 
   [junit4] Suite: org.apache.lucene.search.TestPhraseQuery
   [junit4] Completed [138/421] on J2 in 4.01s, 23 tests
   [junit4] 
   [junit4] Suite: org.apache.lucene.codecs.lucene50.TestLucene50StoredFieldsFormatHighCompression
   [junit4] Completed [139/421] on J1 in 37.77s, 19 tests
   [junit4] 
   [junit4] Suite: org.apache.lucene.index.TestTerm
   [junit4] Completed [140/421] on J1 in 0.03s, 1 test
   [junit4] 
   [junit4] Suite: org.apache.lucene.search.spans.TestBasics
   [junit4] Completed [141/421] on J1 in 4.64s, 25 tests
   [junit4] 
   [junit4] Suite: org.apache.lucene.util.TestByteBlockPool
   [junit4] Completed [142/421] on J1 in 0.08s, 1 test
   [junit4] 
   [junit4] Suite: org.apache.lucene.search.TestDocValuesScoring
   [junit4] Completed [143/421] on J1 in 0.07s, 1 test
   [junit4] 
   [junit4] Suite: org.apache.lucene.search.TestFieldValueQuery
   [junit4] Completed [144/421] on J1 in 7.00s, 6 tests
   [junit4] 
   [junit4] Suite: org.apache.lucene.TestAssertions
   [junit4] Completed [145/421] on J1 in 0.02s, 1 test
   [junit4] 
   [junit4] Suite: org.apache.lucene.index.TestTermVectorsReader
   [junit4] Completed [146/421] on J1 in 0.28s, 6 tests
   [junit4] 
   [junit4] Suite: org.apache.lucene.index.TestNRTReaderCleanup
   [junit4] Completed [147/421] on J1 in 0.11s, 1 test
   [junit4] 
   [junit4] Suite: org.apache.lucene.search.TestPrefixFilter
   [junit4] Completed [148/421] on J1 in 0.07s, 1 test
   [junit4] 
   [junit4] Suite: org.apache.lucene.index.TestLazyProxSkipping
   [junit4] Completed [149/421] on J1 in 0.64s, 2 tests
   [junit4] 
   [junit4] Suite: org.apache.lucene.index.TestConcurrentMergeScheduler
   [junit4] Completed [150/421] on J2 in 15.29s, 16 tests
   [junit4] 
   [junit4] Suite: org.apache.lucene.codecs.perfield.TestPerFieldPostingsFormat2
   [junit4] Completed [151/421] on J2 in 1.40s, 5 tests
   [junit4] 
   [junit4] Suite: org.apache.lucene.util.TestFilterIterator
   [junit4] Completed [152/421] on J2 in 0.04s, 8 tests
   [junit4] 
   [junit4] Suite: org.apache.lucene.store.TestMultiMMap
   [junit4] Completed [153/421] on J2 in 10.72s, 54 tests
   [junit4] 
   [junit4] Suite: org.apache.lucene.index.TestExceedMaxTermLength
   [junit4] Completed [154/421] on J2 in 0.03s, 1 test
   [junit4] 
   [junit4] HEARTBEAT J0 PID(1142@localhost): 2016-02-21T07:09:33, stalled for  126s at: Test2BPostings.test
   [junit4] Suite: org.apache.lucene.index.TestTransactions
   [junit4] Completed [155/421] on J2 in 2.23s, 1 test
   [junit4] 
   [junit4] Suite: org.apache.lucene.util.TestFixedBitSet
   [junit4] Completed [156/421] on J1 in 27.11s, 25 tests
   [junit4] 
   [junit4] Suite: org.apache.lucene.index.TestRollingUpdates
   [junit4] Completed [157/421] on J2 in 11.59s, 2 tests
   [junit4] 
   [junit4] Suite: org.apache.lucene.search.spans.TestSpanExplanations
   [junit4] Completed [158/421] on J2 in 0.93s, 30 tests
   [junit4] 
   [junit4] Suite: org.apache.lucene.search.TestFilteredSearch
   [junit4] Completed [159/421] on J2 in 0.02s, 1 test
   [junit4] 
   [junit4] Suite: org.apache.lucene.search.MultiCollectorTest
   [junit4] Completed [160/421] on J2 in 0.04s, 4 tests
   [junit4] 
   [junit4] Suite: org.apache.lucene.util.TestTimSorterWorstCase
   [junit4] Completed [161/421] on J1 in 43.36s, 1 test
   [junit4] 
   [junit4] HEARTBEAT J0 PID(1142@localhost): 2016-02-21T07:10:33, stalled for  186s at: Test2BPostings.test
   [junit4] Suite: org.apache.lucene.search.TestTermRangeFilter
   [junit4] Completed [162/421] on J1 in 8.32s, 3 tests
   [junit4] 
   [junit4] Suite: org.apache.lucene.index.TestStressIndexing
   [junit4] Completed [163/421] on J1 in 5.00s, 1 test
   [junit4] 
   [junit4] Suite: org.apache.lucene.index.TestSegmentTermDocs
   [junit4] Completed [164/421] on J1 in 0.42s, 4 tests
   [junit4] 
   [junit4] Suite: org.apache.lucene.index.TestCrash
   [junit4] Completed [165/421] on J1 in 1.73s, 5 tests
   [junit4] 
   [junit4] Suite: org.apache.lucene.index.TestIndexWriterMaxDocs
   [junit4] IGNOR/A 0.00s J1 | TestIndexWriterMaxDocs.testExactlyAtTrueLimit
   [junit4]    > Assumption #1: 'monster' test group is disabled (@Monster(value=takes over two hours))
   [junit4] Completed [166/421] on J1 in 11.24s, 21 tests, 1 skipped
   [junit4] 
   [junit4] Suite: org.apache.lucene.index.TestSegmentMerger
   [junit4] Completed [167/421] on J1 in 0.57s, 3 tests
   [junit4] 
   [junit4] Suite: org.apache.lucene.index.TestByteSlices
   [junit4] Completed [168/421] on J1 in 6.36s, 1 test
   [junit4] 
   [junit4] HEARTBEAT J0 PID(1142@localhost): 2016-02-21T07:11:33, stalled for  246s at: Test2BPostings.test
   [junit4] Suite: org.apache.lucene.util.fst.TestFSTs
   [junit4] Completed [169/421] on J1 in 70.35s, 20 tests
   [junit4] 
   [junit4] Suite: org.apache.lucene.index.TestReadOnlyIndex
   [junit4] Completed [170/421] on J1 in 0.13s, 1 test
   [junit4] 
   [junit4] Suite: org.apache.lucene.index.TestAllFilesHaveChecksumFooter
   [junit4] Completed [171/421] on J1 in 1.57s, 1 test
   [junit4] 
   [junit4] HEARTBEAT J0 PID(1142@localhost): 2016-02-21T07:12:33, stalled for  306s at: Test2BPostings.test
   [junit4] Suite: org.apache.lucene.codecs.perfield.TestPerFieldDocValuesFormat
   [junit4] Completed [172/421] on J2 in 185.38s, 96 tests
   [junit4] 
   [junit4] HEARTBEAT J1 PID(1140@localhost): 2016-02-21T07:13:33, stalled for 70.9s at: TestIndexWriterExceptions.testTooManyTokens
   [junit4] HEARTBEAT J0 PID(1142@localhost): 2016-02-21T07:13:33, stalled for  366s at: Test2BPostings.test
   [junit4] Suite: org.apache.lucene.index.TestIndexWriterReader
   [junit4] Completed [173/421] on J2 in 71.68s, 23 tests
   [junit4] 
   [junit4] Suite: org.apache.lucene.index.TestIndexWriterMerging
   [junit4] Completed [174/421] on J2 in 14.92s, 6 tests
   [junit4] 
   [junit4] Suite: org.apache.lucene.search.TestNumericRangeQuery64
   [junit4] Completed [175/421] on J2 in 8.14s, 29 tests
   [junit4] 
   [junit4] HEARTBEAT J1 PID(1140@localhost): 2016-02-21T07:14:33, stalled for  131s at: TestIndexWriterExceptions.testTooManyTokens
   [junit4] HEARTBEAT J0 PID(1142@localhost): 2016-02-21T07:14:33, stalled for  426s at: Test2BPostings.test
   [junit4] HEARTBEAT J1 PID(1140@localhost): 2016-02-21T07:15:33, stalled for  191s at: TestIndexWriterExceptions.testTooManyTokens
   [junit4] HEARTBEAT J0 PID(1142@localhost): 2016-02-21T07:15:33, stalled for  486s at: Test2BPostings.test
   [junit4] HEARTBEAT J2 PID(1141@localhost): 2016-02-21T07:15:57, stalled for 69.1s at: TestPackedInts.testPackedLongValues
   [junit4] HEARTBEAT J0 PID(1142@localhost): 2016-02-21T07:16:33, stalled for  546s at: Test2BPostings.test
   [junit4] HEARTBEAT J2 PID(1141@localhost): 2016-02-21T07:16:57, stalled for  129s at: TestPackedInts.testPackedLongValues
   [junit4] Suite: org.apache.lucene.index.TestIndexWriterExceptions
   [junit4] Completed [176/421] on J1 in 294.59s, 36 tests
   [junit4] 
   [junit4] Suite: org.apache.lucene.index.TestReaderClosed
   [junit4] Completed [177/421] on J1 in 0.05s, 2 tests
   [junit4] 
   [junit4] Suite: org.apache.lucene.index.Test2BPostings
   [junit4] Completed [178/421] on J0 in 590.07s, 1 test
   [junit4] 
   [junit4] Suite: org.apache.lucene.codecs.lucene50.TestBlockPostingsFormat2
   [junit4] Completed [179/421] on J0 in 4.80s, 4 tests
   [junit4] 
   [junit4] Suite: org.apache.lucene.index.TestIsCurrent
   [junit4] Completed [180/421] on J0 in 0.09s, 2 tests
   [junit4] 
   [junit4] Suite: org.apache.lucene.index.Test2BBinaryDocValues
   [junit4] IGNOR/A 0.00s J0 | Test2BBinaryDocValues.testFixedBinary
   [junit4]    > Assumption #1: 'monster' test group is disabled (@Monster(value=takes ~ 6 hours if the heap is 5gb))
   [junit4] IGNOR/A 0.00s J0 | Test2BBinaryDocValues.testVariableBinary
   [junit4]    > Assumption #1: 'monster' test group is disabled (@Monster(value=takes ~ 6 hours if the heap is 5gb))
   [junit4] Completed [181/421] on J0 in 0.00s, 2 tests, 2 skipped
   [junit4] 
   [junit4] Suite: org.apache.lucene.index.TestParallelTermEnum
   [junit4] Completed [182/421] on J0 in 0.02s, 1 test
   [junit4] 
   [junit4] Suite: org.apache.lucene.util.TestLongBitSet
   [junit4] Completed [183/421] on J0 in 12.50s, 9 tests
   [junit4] 
   [junit4] Suite: org.apache.lucene.search.TestRegexpQuery
   [junit4] Completed [184/421] on J0 in 0.12s, 7 tests
   [junit4] 
   [junit4] Suite: org.apache.lucene.search.TestShardSearching
   [junit4] Completed [185/421] on J0 in 16.34s, 1 test
   [junit4] 
   [junit4] HEARTBEAT J2 PID(1141@localhost): 2016-02-21T07:17:57, stalled for  189s at: TestPackedInts.testPackedLongValues
   [junit4] Suite: org.apache.lucene.index.TestIndexWriterCommit
   [junit4] Completed [186/421] on J0 in 9.65s, 13 tests
   [junit4] 
   [junit4] Suite: org.apache.lucene.index.TestForTooMuchCloning
   [junit4] Completed [187/421] on J0 in 0.13s, 1 test
   [junit4] 
   [junit4] Suite: org.apache.lucene.index.TestDirectoryReader
   [junit4] Completed [188/421] on J0 in 3.05s, 24 tests
   [junit4] 
   [junit4] Suite: org.apache.lucene.index.TestPrefixCodedTerms
   [junit4] Completed [189/421] on J0 in 0.53s, 5 tests
   [junit4] 
   [junit4] Suite: org.apache.lucene.index.TestBagOfPositions
   [junit4] Completed [190/421] on J0 in 6.64s, 1 test
   [junit4] 
   [junit4] Suite: org.apache.lucene.index.TestSnapshotDeletionPolicy
   [junit4] Completed [191/421] on J0 in 2.83s, 7 tests
   [junit4] 
   [junit4] Suite: org.apache.lucene.codecs.TestCodecLoadingDeadlock
   [junit4] Completed [192/421] on J0 in 0.35s, 1 test
   [junit4] 
   [junit4] HEARTBEAT J1 PID(1140@localhost): 2016-02-21T07:18:21, stalled for 71.6s at: TestLRUQueryCache.testRandom
   [junit4] HEARTBEAT J2 PID(1141@localhost): 2016-02-21T07:18:57, stalled for  249s at: TestPackedInts.testPackedLongValues
   [junit4] HEARTBEAT J0 PID(1142@localhost): 2016-02-21T07:19:21, stalled for 66.5s at: TestSearcherManager.testSearcherManager
   [junit4] Suite: org.apache.lucene.search.TestLRUQueryCache
   [junit4] Completed [193/421] on J1 in 140.57s, 17 tests
   [junit4] 
   [junit4] Suite: org.apache.lucene.store.TestNRTCachingDirectory
   [junit4] IGNOR/A 0.01s J1 | TestNRTCachingDirectory.testFsyncDoesntCreateNewFiles
   [junit4]    > Assumption #1: test only works for FSDirectory subclasses
   [junit4] Completed [194/421] on J1 in 9.56s, 43 tests, 1 skipped
   [junit4] 
   [junit4] Suite: org.apache.lucene.util.TestRecyclingIntBlockAllocator
   [junit4] Completed [195/421] on J1 in 0.17s, 3 tests
   [junit4] 
   [junit4] Suite: org.apache.lucene.document.TestDateTools
   [junit4] Completed [196/421] on J1 in 0.16s, 5 tests
   [junit4] 
   [junit4] Suite: org.apache.lucene.index.Test2BTerms
   [junit4] IGNOR/A 0.00s J1 | Test2BTerms.test2BTerms
   [junit4]    > Assumption #1: 'monster' test group is disabled (@Monster(value=very slow, use 5g minimum heap))
   [junit4] Completed [197/421] on J1 in 0.01s, 1 test, 1 skipped
   [junit4] 
   [junit4] Suite: org.apache.lucene.util.TestRamUsageEstimator
   [junit4] IGNOR/A 0.00s J1 | TestRamUsageEstimator.testPrintValues
   [junit4]    > Assumption #1: Specify -Dtests.verbose=true to print constants of RamUsageEstimator.
   [junit4] Completed [198/421] on J1 in 0.03s, 5 tests, 1 skipped
   [junit4] 
   [junit4] Suite: org.apache.lucene.search.TestNeedsScores
   [junit4] Completed [199/421] on J1 in 0.06s, 5 tests
   [junit4] 
   [junit4] Suite: org.apache.lucene.index.TestBinaryTerms
   [junit4] Completed [200/421] on J1 in 0.10s, 2 tests
   [junit4] 
   [junit4] Suite: org.apache.lucene.document.TestBinaryDocument
   [junit4] Completed [201/421] on J1 in 0.02s, 2 tests
   [junit4] 
   [junit4] HEARTBEAT J2 PID(1141@localhost): 2016-02-21T07:19:57, stalled for  309s at: TestPackedInts.testPackedLongValues
   [junit4] HEARTBEAT J0 PID(1142@localhost): 2016-02-21T07:20:21, stalled for  127s at: TestSearcherManager.testSearcherManager
   [junit4] HEARTBEAT J1 PID(1140@localhost): 2016-02-21T07:20:45, stalled for 65.1s at: TestOfflineSorter.testThreadSafety
   [junit4] HEARTBEAT J2 PID(1141@localhost): 2016-02-21T07:20:57, stalled for  369s at: TestPackedInts.testPackedLongValues
   [junit4] HEARTBEAT J0 PID(1142@localhost): 2016-02-21T07:21:21, stalled for  187s at: TestSearcherManager.testSearcherManager
   [junit4] Suite: org.apache.lucene.util.TestOfflineSorter
   [junit4] Completed [202/421] on J1 in 112.77s, 7 tests
   [junit4] 
   [junit4] Suite: org.apache.lucene.util.TestAttributeSource
   [junit4] Completed [203/421] on J1 in 0.06s, 8 tests
   [junit4] 
   [junit4] Suite: org.apache.lucene.index.TestDirectoryReaderReopen
   [junit4] Completed [204/421] on J1 in 4.08s, 9 tests
   [junit4] 
   [junit4] Suite: org.apache.lucene.index.TestStressAdvance
   [junit4] Completed [205/421] on J1 in 5.82s, 1 test
   [junit4] 
   [junit4] Suite: org.apache.lucene.index.TestOmitPositions
   [junit4] Completed [206/421] on J1 in 0.92s, 4 tests
   [junit4] 
   [junit4] Suite: org.apache.lucene.search.spans.TestSpanTermQuery
   [junit4] Completed [207/421] on J1 in 0.05s, 2 tests
   [junit4] 
   [junit4] Suite: org.apache.lucene.search.TestDocTermOrdsRewriteMethod
   [junit4] Completed [208/421] on J1 in 10.09s, 2 tests
   [junit4] 
   [junit4] Suite: org.apache.lucene.index.TestStressIndexing2
   [junit4] Completed [209/421] on J1 in 2.74s, 3 tests
   [junit4] 
   [junit4] HEARTBEAT J2 PID(1141@localhost): 2016-02-21T07:21:57, stalled for  429s at: TestPackedInts.testPackedLongValues
   [junit4] Suite: org.apache.lucene.index.TestIndexWriterWithThreads
   [junit4] IGNOR/A 0.04s J1 | TestIndexWriterWithThreads.testOpenTwoIndexWritersOnDifferentThreads
   [junit4]    > Assumption #1: aborting test: timeout obtaining lock
   [junit4] Completed [210/421] on J1 in 15.89s, 12 tests, 1 skipped
   [junit4] 
   [junit4] HEARTBEAT J0 PID(1142@localhost): 2016-02-21T07:22:21, stalled for  247s at: TestSearcherManager.testSearcherManager
   [junit4] Suite: org.apache.lucene.search.TestNumericRangeQuery32
   [junit4] Completed [211/421] on J1 in 16.32s, 23 tests
   [junit4] 
   [junit4] HEARTBEAT J2 PID(1141@localhost): 2016-02-21T07:22:57, stalled for  489s at: TestPackedInts.testPackedLongValues
   [junit4] Suite: org.apache.lucene.search.TestBooleanOr
   [junit4] Completed [212/421] on J1 in 47.63s, 7 tests
   [junit4] 
   [junit4] Suite: org.apache.lucene.index.TestFlushByRamOrCountsPolicy
   [junit4] Completed [213/421] on J1 in 3.57s, 5 tests
   [junit4] 
   [junit4] HEARTBEAT J0 PID(1142@localhost): 2016-02-21T07:23:21, stalled for  307s at: TestSearcherManager.testSearcherManager
   [junit4] Suite: org.apache.lucene.search.TestSloppyPhraseQuery
   [junit4] Completed [214/421] on J1 in 2.53s, 9 tests
   [junit4] 
   [junit4] Suite: org.apache.lucene.util.packed.TestPackedInts
   [junit4] Completed [215/421] on J2 in 551.11s, 28 tests, 2 skipped
   [junit4] 
   [junit4] Suite: org.apache.lucene.index.TestIndexWriterMergePolicy
   [junit4] Completed [216/421] on J2 in 4.76s, 7 tests
   [junit4] 
   [junit4] HEARTBEAT J0 PID(1142@localhost): 2016-02-21T07:24:21, stalled for  367s at: TestSearcherManager.testSearcherManager
   [junit4] Suite: org.apache.lucene.search.TestSearcherManager
   [junit4] Completed [217/421] on J0 in 368.06s, 10 tests
   [junit4] 
   [junit4] Suite: org.apache.lucene.index.Test2BPositions
   [junit4] IGNOR/A 0.00s J0 | Test2BPositions.test
   [junit4]    > Assumption #1: 'monster' test group is disabled (@Monster(value=uses lots of space and takes a few minutes))
   [junit4] Completed [218/421] on J0 in 0.00s, 1 test, 1 skipped
   [junit4] 
   [junit4] Suite: org.apache.lucene.search.TestSort
   [junit4] Completed [219/421] on J0 in 0.55s, 25 tests
   [junit4] 
   [junit4] Suite: org.apache.lucene.index.TestIndexFileDeleter
   [junit4] Completed [220/421] on J0 in 0.34s, 9 tests
   [junit4] 
   [junit4] Suite: org.apache.lucene.search.similarities.TestSimilarity2
   [junit4] Completed [221/421] on J0 in 0.23s, 7 tests
   [junit4] 
   [junit4] Suite: org.apache.lucene.util.TestSentinelIntSet
   [junit4] Completed [222/421] on J0 in 0.24s, 2 tests
   [junit4] 
   [junit4] Suite: org.apache.lucene.index.TestIndexWriterDelete
   [junit4] IGNOR/A 0.00s J1 | TestIndexWriterDelete.testIndexingThenDeleting
   [junit4]    > Assumption #1: This test cannot run with Memory codec
   [junit4] Completed [223/421] on J1 in 62.15s, 27 tests, 1 skipped
   [junit4] 
   [junit4] HEARTBEAT J2 PID(1141@localhost): 2016-02-21T07:24:45, stalled for 61.5s at: TestNRTThreads.testNRTThreads
   [junit4] Suite: org.apache.lucene.search.TestLRUFilterCache
   [junit4] Completed [224/421] on J0 in 47.11s, 10 tests
   [junit4] 
   [junit4] Suite: org.apache.lucene.search.TestBoolean2
   [junit4] Completed [225/421] on J0 in 13.17s, 11 tests
   [junit4] 
   [junit4] Suite: org.apache.lucene.index.TestPersistentSnapshotDeletionPolicy
   [junit4] Completed [226/421] on J0 in 2.37s, 13 tests
   [junit4] 
   [junit4] Suite: org.apache.lucene.index.TestAtomicUpdate
   [junit4] Completed [227/421] on J0 in 7.04s, 1 test
   [junit4] 
   [junit4] Suite: org.apache.lucene.search.TestSearchWithThreads
   [junit4] Completed [228/421] on J0 in 9.73s, 1 test
   [junit4] 
   [junit4] HEARTBEAT J2 PID(1141@localhost): 2016-02-21T07:25:45, stalled for  122s at: TestNRTThreads.testNRTThreads
   [junit4] Suite: org.apache.lucene.index.TestDuelingCodecs
   [junit4] Completed [229/421] on J1 in 79.96s, 2 tests
   [junit4] 
   [junit4] Suite: org.apache.lucene.search.TestSearchAfter
   [junit4] Completed [230/421] on J0 in 1.63s, 1 test
   [junit4] 
   [junit4] Suite: org.apache.lucene.codecs.compressing.TestHighCompressionMode
   [junit4] Completed [231/421] on J1 in 3.01s, 7 tests
   [junit4] 
   [junit4] Suite: org.apache.lucene.index.TestNeverDelete
   [junit4] Completed [232/421] on J1 in 6.54s, 1 test
   [junit4] 
   [junit4] Suite: org.apache.lucene.index.TestLongPostings
   [junit4] Completed [233/421] on J1 in 7.79s, 2 tests
   [junit4] 
   [junit4] Suite: org.apache.lucene.index.TestIndexWriterUnicode
   [junit4] Completed [234/421] on J1 in 9.60s, 5 tests
   [junit4] 
   [junit4] Suite: org.apache.lucene.index.TestNRTReaderWithThreads
   [junit4] Completed [235/421] on J1 in 2.16s, 1 test
   [junit4] 
   [junit4] Suite: org.apache.lucene.index.TestIndexWriterForceMerge
   [junit4] Completed [236/421] on J1 in 6.07s, 4 tests
   [junit4] 
   [junit4] HEARTBEAT J2 PID(1141@localhost): 2016-02-21T07:26:45, stalled for  182s at: TestNRTThreads.testNRTThreads
   [junit4] HEARTBEAT J0 PID(1142@localhost): 2016-02-21T07:26:57, stalled for 71.1s at: TestDocumentsWriterStallControl.testAccquireReleaseRace
   [junit4] HEARTBEAT J1 PID(1140@localhost): 2016-02-21T07:27:33, stalled for 68.4s at: TestPerFieldPostingsFormat.testRamBytesUsed
   [junit4] HEARTBEAT J2 PID(1141@localhost): 2016-02-21T07:27:45, stalled for  242s at: TestNRTThreads.testNRTThreads
   [junit4] HEARTBEAT J0 PID(1142@localhost): 2016-02-21T07:27:57, stalled for  131s at: TestDocumentsWriterStallControl.testAccquireReleaseRace
   [junit4] Suite: org.apache.lucene.codecs.perfield.TestPerFieldPostingsFormat
   [junit4] IGNOR/A 0.00s J1 | TestPerFieldPostingsFormat.testPostingsEnumReuse
   [junit4]    > Assumption #1: The MockRandom PF randomizes content on the fly, so we can't check it
   [junit4] IGNOR/A 0.00s J1 | TestPerFieldPostingsFormat.testMergeStability
   [junit4]    > Assumption #1: The MockRandom PF randomizes content on the fly, so we can't check it
   [junit4] Completed [237/421] on J1 in 116.12s, 30 tests, 2 skipped
   [junit4] 
   [junit4] Suite: org.apache.lucene.store.TestBufferedIndexInput
   [junit4] Completed [238/421] on J1 in 0.59s, 4 tests
   [junit4] 
   [junit4] HEARTBEAT J2 PID(1141@localhost): 2016-02-21T07:28:45, stalled for  302s at: TestNRTThreads.testNRTThreads
   [junit4] HEARTBEAT J0 PID(1142@localhost): 2016-02-21T07:28:57, stalled for  191s at: TestDocumentsWriterStallControl.testAccquireReleaseRace
   [junit4] Suite: org.apache.lucene.index.TestNRTThreads
   [junit4] Completed [239/421] on J2 in 348.41s, 1 test
   [junit4] 
   [junit4] HEARTBEAT J1 PID(1140@localhost): 2016-02-21T07:29:33, stalled for 66.5s at: TestTermsEnum.testVaryingTermsPerSegment
   [junit4] Suite: org.apache.lucene.util.TestWeakIdentityMap
   [junit4] Completed [240/421] on J2 in 17.34s, 2 tests
   [junit4] 
   [junit4] Suite: org.apache.lucene.search.TestSimpleExplanations
   [junit4] Completed [241/421] on J2 in 2.88s, 72 tests
   [junit4] 
   [junit4] Suite: org.apache.lucene.search.TestComplexExplanations
   [junit4] Completed [242/421] on J2 in 1.63s, 21 tests
   [junit4] 
   [junit4] Suite: org.apache.lucene.index.TestSegmentReader
   [junit4] Completed [243/421] on J2 in 0.68s, 7 tests
   [junit4] 
   [junit4] HEARTBEAT J0 PID(1142@localhost): 2016-02-21T07:29:57, stalled for  251s at: TestDocumentsWriterStallControl.testAccquireReleaseRace
   [junit4] Suite: org.apache.lucene.util.TestPagedBytes
   [junit4] Completed [244/421] on J2 in 4.66s, 4 tests, 1 skipped
   [junit4] 
   [junit4] Suite: org.apache.lucene.index.TestMultiDocValues
   [junit4] Completed [245/421] on J2 in 19.95s, 8 tests
   [junit4] 
   [junit4] Suite: org.apache.lucene.analysis.TestToken
   [junit4] Completed [246/421] on J2 in 0.03s, 5 tests
   [junit4] 
   [junit4] Suite: org.apache.lucene.index.TestFieldsReader
   [junit4] Completed [247/421] on J2 in 0.30s, 2 tests
   [junit4] 
   [junit4] Suite: org.apache.lucene.search.TestSimpleSearchEquivalence
   [junit4] Completed [248/421] on J2 in 9.77s, 16 tests
   [junit4] 
   [junit4] Suite: org.apache.lucene.index.TestDocValuesIndexing
   [junit4] Completed [249/421] on J2 in 0.53s, 34 tests
   [junit4] 
   [junit4] HEARTBEAT J1 PID(1140@localhost): 2016-02-21T07:30:33, stalled for  126s at: TestTermsEnum.testVaryingTermsPerSegment
   [junit4] Suite: org.apache.lucene.search.similarities.TestSimilarityBase
   [junit4] Completed [250/421] on J2 in 2.28s, 32 tests
   [junit4] 
   [junit4] Suite: org.apache.lucene.store.TestHugeRamFile
   [junit4] Completed [251/421] on J2 in 7.87s, 1 test
   [junit4] 
   [junit4] Suite: org.apache.lucene.search.TestBooleanMinShouldMatch
   [junit4] Completed [252/421] on J2 in 8.47s, 17 tests
   [junit4] 
   [junit4] Suite: org.apache.lucene.index.TestTermsEnum2
   [junit4] Completed [253/421] on J2 in 2.17s, 4 tests
   [junit4] 
   [junit4] HEARTBEAT J0 PID(1142@localhost): 2016-02-21T07:30:57, stalled for  311s at: TestDocumentsWriterStallControl.testAccquireReleaseRace
   [junit4] Suite: org.apache.lucene.index.TestIndexWriterOnDiskFull
   [junit4] Completed [254/421] on J2 in 40.11s, 4 tests
   [junit4] 
   [junit4] HEARTBEAT J1 PID(1140@localhost): 2016-02-21T07:31:33, stalled for  186s at: TestTermsEnum.testVaryingTermsPerSegment
   [junit4] Suite: org.apache.lucene.index.TestPostingsOffsets
   [junit4] Completed [255/421] on J2 in 1.60s, 13 tests
   [junit4] 
   [junit4] Suite: org.apache.lucene.index.TestTransactionRollback
   [junit4] Completed [256/421] on J2 in 0.41s, 2 tests
   [junit4] 
   [junit4] Suite: org.apache.lucene.index.TestFlex
   [junit4] Completed [257/421] on J2 in 0.49s, 2 tests
   [junit4] 
   [junit4] Suite: org.apache.lucene.util.automaton.TestUTF32ToUTF8
   [junit4] Completed [258/421] on J2 in 6.32s, 6 tests
   [junit4] 
   [junit4] Suite: org.apache.lucene.store.TestRAMDirectory
   [junit4] IGNOR/A 0.01s J2 | TestRAMDirectory.testFsyncDoesntCreateNewFiles
   [junit4]    > Assumption #1: test only works for FSDirectory subclasses
   [junit4] Completed [259/421] on J2 in 1.17s, 46 tests, 1 skipped
   [junit4] 
   [junit4] Suite: org.apache.lucene.search.TestMultiPhraseQuery
   [junit4] Completed [260/421] on J2 in 0.24s, 17 tests, 1 skipped
   [junit4] 
   [junit4] Suite: org.apache.lucene.util.automaton.TestDeterminism
   [junit4] Completed [261/421] on J2 in 1.03s, 2 tests
   [junit4] 
   [junit4] Suite: org.apache.lucene.TestMergeSchedulerExternal
   [junit4] Completed [262/421] on J2 in 0.40s, 2 tests
   [junit4] 
   [junit4] Suite: org.apache.lucene.index.TestTermVectorsWriter
   [junit4] Completed [263/421] on J2 in 0.39s, 15 tests
   [junit4] 
   [junit4] Suite: org.apache.lucene.index.TestParallelLeafReader
   [junit4] Completed [264/421] on J2 in 0.19s, 7 tests
   [junit4] 
   [junit4] Suite: org.apache.lucene.index.TestIndexInput
   [junit4] Completed [265/421] on J2 in 0.91s, 2 tests
   [junit4] 
   [junit4] Suite: org.apache.lucene.index.TestForceMergeForever
   [junit4] Completed [266/421] on J2 in 0.61s, 1 test
   [junit4] 
   [junit4] Suite: org.apache.lucene.index.TestOmitTf
   [junit4] Completed [267/421] on J2 in 0.82s, 6 tests
   [junit4] 
   [junit4] Suite: org.apache.lucene.search.TestSameScoresWithThreads
   [junit4] Completed [268/421] on J2 in 1.60s, 1 test
   [junit4] 
   [junit4] HEARTBEAT J0 PID(1142@localhost): 2016-02-21T07:31:57, stalled for  371s at: TestDocumentsWriterStallControl.testAccquireReleaseRace
   [junit4] Suite: org.apache.lucene.index.TestMultiFields
   [junit4] Completed [269/421] on J2 in 10.51s, 3 tests
   [junit4] 
   [junit4] Suite: org.apache.lucene.search.TestTermRangeQuery
   [junit4] Completed [270/421] on J2 in 0.29s, 7 tests
   [junit4] 
   [junit4] Suite: org.apache.lucene.index.TestDocumentsWriterDeleteQueue
   [junit4] Completed [271/421] on J2 in 0.21s, 5 tests
   [junit4] 
   [junit4] Suite: org.apache.lucene.index.TestCrashCausesCorruptIndex
   [junit4] Completed [272/421] on J2 in 0.05s, 1 test
   [junit4] 
   [junit4] Suite: org.apache.lucene.index.TestTermsEnum
   [junit4] Completed [273/421] on J1 in 247.15s, 11 tests
   [junit4] 
   [junit4] Suite: org.apache.lucene.index.TestPayloads
   [junit4] Completed [274/421] on J1 in 0.26s, 7 tests
   [junit4] 
   [junit4] Suite: org.apache.lucene.index.TestNoDeletionPolicy
   [junit4] Completed [275/421] on J1 in 0.16s, 4 tests
   [junit4] 
   [junit4] Suite: org.apache.lucene.search.TestSimpleExplanationsOfNonMatches
   [junit4] Completed [276/421] on J1 in 0.24s, 72 tests
   [junit4] 
   [junit4] Suite: org.apache.lucene.search.spans.TestSpansAdvanced2
   [junit4] Completed [277/421] on J1 in 0.33s, 4 tests
   [junit4] 
   [junit4] Suite: org.apache.lucene.search.TestMultiValuedNumericRangeQuery
   [junit4] Completed [278/421] on J1 in 2.14s, 1 test
   [junit4] 
   [junit4] Suite: org.apache.lucene.search.TestTopDocsCollector
   [junit4] Completed [279/421] on J1 in 0.09s, 8 tests
   [junit4] 
   [junit4] Suite: org.apache.lucene.search.TestBooleanQuery
   [junit4] Completed [280/421] on J1 in 0.40s, 25 tests
   [junit4] 
   [junit4] Suite: org.apache.lucene.search.TestComplexExplanationsOfNonMatches
   [junit4] Completed [281/421] on J1 in 0.18s, 21 tests
   [junit4] 
   [junit4] Suite: org.apache.lucene.util.TestUnicodeUtil
   [junit4] Completed [282/421] on J1 in 0.99s, 5 tests
   [junit4] 
   [junit4] Suite: org.apache.lucene.search.TestScorerPerf
   [junit4] Completed [283/421] on J2 in 30.24s, 1 test
   [junit4] 
   [junit4] Suite: org.apache.lucene.index.TestParallelReaderEmptyIndex
   [junit4] Completed [284/421] on J2 in 0.09s, 2 tests
   [junit4] 
   [junit4] Suite: org.apache.lucene.index.TestAllFilesHaveCodecHeader
   [junit4] Completed [285/421] on J1 in 1.39s, 1 test
   [junit4] 
   [junit4] Suite: org.apache.lucene.search.TestTermScorer
   [junit4] Completed [286/421] on J1 in 0.13s, 4 tests
   [junit4] 
   [junit4] Suite: org.apache.lucene.index.TestMaxTermFrequency
   [junit4] Completed [287/421] on J2 in 1.85s, 1 test
   [junit4] 
   [junit4] Suite: org.apache.lucene.store.TestFileSwitchDirectory
   [junit4] IGNOR/A 0.01s J1 | TestFileSwitchDirectory.testFsyncDoesntCreateNewFiles
   [junit4]    > Assumption #1: test only works for FSDirectory subclasses
   [junit4] Completed [288/421] on J1 in 1.31s, 43 tests, 1 skipped
   [junit4] 
   [junit4] Suite: org.apache.lucene.index.TestSumDocFreq
   [junit4] Completed [289/421] on J2 in 1.04s, 1 test
   [junit4] 
   [junit4] Suite: org.apache.lucene.store.TestDirectory
   [junit4] Completed [290/421] on J2 in 0.12s, 3 tests
   [junit4] 
   [junit4] Suite: org.apache.lucene.index.TestIndexableField
   [junit4] Completed [291/421] on J1 in 1.18s, 2 tests
   [junit4] 
   [junit4] Suite: org.apache.lucene.index.TestPayloadsOnVectors
   [junit4] Completed [292/421] on J1 in 0.05s, 3 tests
   [junit4] 
   [junit4] Suite: org.apache.lucene.index.TestCheckIndex
   [junit4] Completed [293/421] on J2 in 0.53s, 5 tests
   [junit4] 
   [junit4] Suite: org.apache.lucene.search.TestFieldValueFilter
   [junit4] Completed [294/421] on J1 in 0.31s, 3 tests
   [junit4] 
   [junit4] Suite: org.apache.lucene.search.spans.TestSpanMultiTermQueryWrapper
   [junit4] Completed [295/421] on J2 in 0.17s, 9 tests
   [junit4] 
   [junit4] Suite: org.apache.lucene.search.TestBooleanQueryVisitSubscorers
   [junit4] Completed [296/421] on J1 in 0.11s, 5 tests
   [junit4] 
   [junit4] Suite: org.apache.lucene.TestSearchForDuplicates
   [junit4] Completed [297/421] on J2 in 0.24s, 1 test
   [junit4] 
   [junit4] Suite: org.apache.lucene.index.TestSizeBoundedForceMerge
   [junit4] Completed [298/421] on J1 in 0.12s, 11 tests
   [junit4] 
   [junit4] Suite: org.apache.lucene.util.automaton.TestCompiledAutomaton
   [junit4] Completed [299/421] on J2 in 0.22s, 6 tests
   [junit4] 
   [junit4] Suite: org.apache.lucene.search.TestConstantScoreQuery
   [junit4] Completed [300/421] on J1 in 0.07s, 6 tests
   [junit4] 
   [junit4] Suite: org.apache.lucene.search.TestMatchAllDocsQuery
   [junit4] Completed [301/421] on J2 in 0.02s, 2 tests
   [junit4] 
   [junit4] Suite: org.apache.lucene.search.TestElevationComparator
   [junit4] Completed [302/421] on J1 in 0.08s, 1 test
   [junit4] 
   [junit4] Suite: org.apache.lucene.search.TestSubScorerFreqs
   [junit4] Completed [303/421] on J2 in 0.05s, 3 tests
   [junit4] 
   [junit4] Suite: org.apache.lucene.index.TestIndexWriterConfig
   [junit4] Completed [304/421] on J1 in 0.12s, 8 tests
   [junit4] 
   [junit4] Suite: org.apache.lucene.search.TestConjunctions
   [junit4] Completed [305/421] on J2 in 0.03s, 1 test
   [junit4] 
   [junit4] Suite: org.apache.lucene.search.TestMultiTermQueryRewrites
   [junit4] Completed [306/421] on J1 in 0.05s, 3 tests
   [junit4] 
   [junit4] Suite: org.apache.lucene.search.TestPositionIncrement
   [junit4] Completed [307/421] on J2 in 0.08s, 2 tests
   [junit4] 
   [junit4] Suite: org.apache.lucene.search.TestSimilarity
   [junit4] Completed [308/421] on J1 in 0.02s, 1 test
   [junit4] 
   [junit4] Suite: org.apache.lucene.search.spans.TestSpanExplanationsOfNonMatches
   [junit4] Completed [309/421] on J2 in 0.10s, 30 tests
   [junit4] 
   [junit4] Suite: org.apache.lucene.util.TestRollingBuffer
   [junit4] Completed [310/421] on J1 in 0.21s, 1 test
   [junit4] 
   [junit4] Suite: org.apache.lucene.util.TestSmallFloat
   [junit4] Completed [311/421] on J2 in 0.19s, 2 tests
   [junit4] 
   [junit4] Suite: org.apache.lucene.search.TestSimilarityProvider
   [junit4] Completed [312/421] on J1 in 0.02s, 1 test
   [junit4] 
   [junit4] Suite: org.apache.lucene.index.TestFilterLeafReader
   [junit4] Completed [313/421] on J2 in 0.04s, 3 tests
   [junit4] 
   [junit4] Suite: org.apache.lucene.TestSearch
   [junit4] Completed [314/421] on J1 in 0.15s, 2 tests
   [junit4] 
   [junit4] Suite: org.apache.lucene.analysis.TestCachingTokenFilter
   [junit4] Completed [315/421] on J2 in 0.03s, 2 tests
   [junit4] 
   [junit4] Suite: org.apache.lucene.search.TestDateFilter
   [junit4] Completed [316/421] on J1 in 0.04s, 2 tests
   [junit4] 
   [junit4] Suite: org.apache.lucene.index.TestSameTokenSamePosition
   [junit4] Completed [317/421] on J1 in 0.04s, 2 tests
   [junit4] 
   [junit4] Suite: org.apache.lucene.search.TestCachingCollector
   [junit4] Completed [318/421] on J1 in 0.05s, 4 tests
   [junit4] 
   [junit4] Suite: org.apache.lucene.util.TestPriorityQueue
   [junit4] Completed [319/421] on J2 in 0.57s, 7 tests
   [junit4] 
   [junit4] Suite: org.apache.lucene.search.spans.TestSpanFirstQuery
   [junit4] Completed [320/421] on J1 in 0.01s, 1 test
   [junit4] 
   [junit4] Suite: org.apache.lucene.util.TestNamedSPILoader
   [junit4] Completed [321/421] on J2 in 0.02s, 3 tests
   [junit4] 
   [junit4] Suite: org.apache.lucene.index.TestIndexWriterLockRelease
   [junit4] Completed [322/421] on J1 in 0.06s, 1 test
   [junit4] 
   [junit4] Suite: org.apache.lucene.search.TestPhrasePrefixQuery
   [junit4] Completed [323/421] on J2 in 0.02s, 1 test
   [junit4] 
   [junit4] Suite: org.apache.lucene.util.TestBytesRef
   [junit4] Completed [324/421] on J1 in 0.02s, 3 tests
   [junit4] 
   [junit4] Suite: org.apache.lucene.analysis.TestCharFilter
   [junit4] Completed [325/421] on J2 in 0.09s, 4 tests
   [junit4] 
   [junit4] Suite: org.apache.lucene.index.TestRollback
   [junit4] Completed [326/421] on J1 in 0.02s, 1 test
   [junit4] 
   [junit4] Suite: org.apache.lucene.index.TestTwoPhaseCommitTool
   [junit4] Completed [327/421] on J2 in 0.04s, 3 tests
   [junit4] 
   [junit4] Suite: org.apache.lucene.search.TestNot
   [junit4] Completed [328/421] on J1 in 0.02s, 1 test
   [junit4] 
   [junit4] Suite: org.apache.lucene.util.TestCloseableThreadLocal
   [junit4] Completed [329/421] on J2 in 0.02s, 3 tests
   [junit4] 
   [junit4] Suite: org.apache.lucene.index.TestIndexWriterOnJRECrash
   [junit4] Completed [330/421] on J1 in 5.06s, 1 test
   [junit4] 
   [junit4] Suite: org.apache.lucene.index.TestCodecHoldsOpenFiles
   [junit4] Completed [331/421] on J1 in 0.36s, 1 test
   [junit4] 
   [junit4] Suite: org.apache.lucene.search.TestDocBoost
   [junit4] Completed [332/421] on J1 in 0.02s, 1 test
   [junit4] 
   [junit4] Suite: org.apache.lucene.search.TestNGramPhraseQuery
   [junit4] Completed [333/421] on J1 in 0.03s, 1 test
   [junit4] 
   [junit4] Suite: org.apache.lucene.search.TestScoreCachingWrappingScorer
   [junit4] Completed [334/421] on J1 in 0.01s, 1 test
   [junit4] 
   [junit4] Suite: org.apache.lucene.util.TestIntsRef
   [junit4] Completed [335/421] on J1 in 0.04s, 2 tests
   [junit4] 
   [junit4] Suite: org.apache.lucene.index.TestIndexCommit
   [junit4] Completed [336/421] on J1 in 0.01s, 1 test
   [junit4] 
   [junit4] Suite: org.apache.lucene.index.Test2BPostingsBytes
   [junit4] IGNOR/A 0.00s J1 | Test2BPostingsBytes.test
   [junit4]    > Assumption #1: 'monster' test group is disabled (@Monster(value=takes ~20GB-30GB of space and 10 minutes))
   [junit4] Completed [337/421] on J1 in 0.00s, 1 test, 1 skipped
   [junit4] 
   [junit4] Suite: org.apache.lucene.search.TestPositiveScoresOnlyCollector
   [junit4] Completed [338/421] on J1 in 0.02s, 1 test
   [junit4] 
   [junit4] Suite: org.apache.lucene.index.TestNewestSegment
   [junit4] Completed [339/421] on J1 in 0.03s, 1 test
   [junit4] 
   [junit4] Suite: org.apache.lucene.store.TestByteArrayDataInput
   [junit4] Completed [340/421] on J1 in 0.01s, 1 test
   [junit4] 
   [junit4] Suite: org.apache.lucene.index.Test2BNumericDocValues
   [junit4] IGNOR/A 0.00s J1 | Test2BNumericDocValues.testNumerics
   [junit4]    > Assumption #1: 'monster' test group is disabled (@Monster(value=takes ~ 2 hours if the heap is 5gb))
   [junit4] Completed [341/421] on J1 in 0.00s, 1 test, 1 skipped
   [junit4] 
   [junit4] Suite: org.apache.lucene.analysis.TestReusableStringReader
   [junit4] Completed [343/421] on J1 in 0.01s, 1 test
   [junit4] 
   [junit4] Suite: org.apache.lucene.analysis.tokenattributes.TestBytesRefAttImpl
   [junit4] Completed [344/421] on J1 in 0.01s, 1 test
   [junit4] 
   [junit4] HEARTBEAT J0 PID(1142@localhost): 2016-02-21T07:32:57, stalled for  431s at: TestDocumentsWriterStallControl.testAccquireReleaseRace
   [junit4] Suite: org.apache.lucene.codecs.lucene50.TestBlockPostingsFormat
   [junit4] Completed [345/421] on J1 in 20.53s, 32 tests
   [junit4] 
   [junit4] Suite: org.apache.lucene.codecs.lucene50.TestBlockPostingsFormat3
   [junit4] Completed [346/421] on J1 in 8.99s, 1 test
   [junit4] 
   [junit4] Suite: org.apache.lucene.codecs.lucene50.TestForUtil
   [junit4] Completed [347/421] on J1 in 0.05s, 1 test
   [junit4] 
   [junit4] Suite: org.apache.lucene.codecs.lucene50.TestLucene50CompoundFormat
   [junit4] C

[...truncated too long message...]


   [junit4] 
   [junit4] Suite: org.apache.solr.search.RankQueryTest
   [junit4] Completed [520/566 (3!)] on J1 in 1.37s, 1 test
   [junit4] 
   [junit4] Suite: org.apache.solr.search.TestCollapseQParserPlugin
   [junit4] Completed [522/566 (3!)] on J1 in 6.28s, 9 tests
   [junit4] 
   [junit4] Suite: org.apache.solr.search.TestCustomSort
   [junit4] Completed [523/566 (3!)] on J1 in 0.96s, 1 test
   [junit4] 
   [junit4] Suite: org.apache.solr.search.TestFieldSortValues
   [junit4] Completed [524/566 (3!)] on J1 in 0.36s, 1 test
   [junit4] 
   [junit4] Suite: org.apache.solr.search.TestNoOpRegenerator
   [junit4] Completed [525/566 (3!)] on J1 in 0.44s, 1 test
   [junit4] 
   [junit4] Suite: org.apache.solr.search.TestOverriddenPrefixQueryForCustomFieldType
   [junit4] Completed [526/566 (3!)] on J1 in 0.57s, 2 tests
   [junit4] 
   [junit4] Suite: org.apache.solr.search.TestSearcherReuse
   [junit4] Completed [527/566 (3!)] on J1 in 0.67s, 1 test
   [junit4] 
   [junit4] Suite: org.apache.solr.search.TestSimpleQParserPlugin
   [junit4] Completed [528/566 (3!)] on J1 in 0.84s, 17 tests
   [junit4] 
   [junit4] Suite: org.apache.solr.search.TestSmileRequest
   [junit4] Completed [529/566 (3!)] on J1 in 4.80s, 1 test
   [junit4] 
   [junit4] Suite: org.apache.solr.search.TestSolr4Spatial2
   [junit4] Completed [530/566 (3!)] on J1 in 0.75s, 4 tests
   [junit4] 
   [junit4] Suite: org.apache.solr.search.TestStandardQParsers
   [junit4] Completed [531/566 (3!)] on J1 in 0.03s, 1 test
   [junit4] 
   [junit4] Suite: org.apache.solr.search.TestTrieFacet
   [junit4] Completed [532/566 (3!)] on J1 in 5.23s, 12 tests
   [junit4] 
   [junit4] Suite: org.apache.solr.search.function.TestSortByMinMaxFunction
   [junit4] Completed [533/566 (3!)] on J1 in 2.37s, 3 tests
   [junit4] 
   [junit4] Suite: org.apache.solr.search.join.BlockJoinFacetDistribTest
   [junit4] Completed [534/566 (3!)] on J1 in 4.92s, 1 test
   [junit4] 
   [junit4] Suite: org.apache.solr.search.join.BlockJoinFacetSimpleTest
   [junit4] Completed [535/566 (3!)] on J1 in 0.65s, 1 test
   [junit4] 
   [junit4] HEARTBEAT J2 PID(3410@lucene1-us-west): 2016-02-21T10:23:12, stalled for  549s at: HdfsBasicDistributedZkTest.test
   [junit4] HEARTBEAT J0 PID(3416@lucene1-us-west): 2016-02-21T10:23:24, stalled for  184s at: TestCloudManagedSchemaConcurrent.test
   [junit4] Suite: org.apache.solr.search.join.TestScoreJoinQPNoScore
   [junit4] Completed [536/566 (3!)] on J1 in 17.64s, 3 tests
   [junit4] 
   [junit4] Suite: org.apache.solr.search.mlt.CloudMLTQParserTest
   [junit4] Completed [537/566 (3!)] on J1 in 38.73s, 2 tests
   [junit4] 
   [junit4] HEARTBEAT J2 PID(3410@lucene1-us-west): 2016-02-21T10:24:12, stalled for  609s at: HdfsBasicDistributedZkTest.test
   [junit4] Suite: org.apache.solr.search.stats.TestDefaultStatsCache
   [junit4] Completed [539/566 (3!)] on J1 in 14.76s, 1 test
   [junit4] 
   [junit4] HEARTBEAT J0 PID(3416@lucene1-us-west): 2016-02-21T10:24:24, stalled for  244s at: TestCloudManagedSchemaConcurrent.test
   [junit4] Suite: org.apache.solr.search.stats.TestExactSharedStatsCache
   [junit4] Completed [540/566 (3!)] on J1 in 12.87s, 1 test
   [junit4] 
   [junit4] Suite: org.apache.solr.security.PKIAuthenticationIntegrationTest
   [junit4] Completed [541/566 (3!)] on J1 in 30.07s, 1 test
   [junit4] 
   [junit4] Suite: org.apache.solr.security.TestPKIAuthenticationPlugin
   [junit4] Completed [542/566 (3!)] on J1 in 0.21s, 1 test
   [junit4] 
   [junit4] Suite: org.apache.solr.spelling.ConjunctionSolrSpellCheckerTest
   [junit4] Completed [543/566 (3!)] on J1 in 0.02s, 1 test
   [junit4] 
   [junit4] Suite: org.apache.solr.spelling.suggest.TestAnalyzeInfixSuggestions
   [junit4] Completed [544/566 (3!)] on J1 in 2.47s, 4 tests
   [junit4] 
   [junit4] Suite: org.apache.solr.spelling.suggest.TestBlendedInfixSuggestions
   [junit4] Completed [545/566 (3!)] on J1 in 0.81s, 6 tests
   [junit4] 
   [junit4] Suite: org.apache.solr.spelling.suggest.TestHighFrequencyDictionaryFactory
   [junit4] Completed [546/566 (3!)] on J1 in 0.60s, 1 test
   [junit4] 
   [junit4] Suite: org.apache.solr.store.blockcache.BlockCacheTest
   [junit4] Completed [547/566 (3!)] on J1 in 0.41s, 2 tests
   [junit4] 
   [junit4] Suite: org.apache.solr.schema.TestCloudManagedSchemaConcurrent
   [junit4] Completed [548/566 (3!)] on J0 in 289.39s, 1 test
   [junit4] 
   [junit4] HEARTBEAT J2 PID(3410@lucene1-us-west): 2016-02-21T10:25:12, stalled for  669s at: HdfsBasicDistributedZkTest.test
   [junit4] Suite: org.apache.solr.update.TestDocBasedVersionConstraints
   [junit4] Completed [549/566 (3!)] on J1 in 12.54s, 6 tests
   [junit4] 
   [junit4] Suite: org.apache.solr.update.VersionInfoTest
   [junit4] Completed [550/566 (3!)] on J1 in 0.96s, 2 tests
   [junit4] 
   [junit4] Suite: org.apache.solr.update.processor.CloneFieldUpdateProcessorFactoryTest
   [junit4] Completed [551/566 (3!)] on J1 in 1.11s, 9 tests
   [junit4] 
   [junit4] Suite: org.apache.solr.update.TestHdfsUpdateLog
   [junit4] Completed [552/566 (3!)] on J0 in 21.40s, 1 test
   [junit4] 
   [junit4] Suite: org.apache.solr.update.processor.DocExpirationUpdateProcessorFactoryTest
   [junit4] Completed [553/566 (3!)] on J1 in 9.72s, 5 tests
   [junit4] 
   [junit4] Suite: org.apache.solr.update.processor.IgnoreCommitOptimizeUpdateProcessorFactoryTest
   [junit4] Completed [554/566 (3!)] on J0 in 1.07s, 1 test
   [junit4] 
   [junit4] Suite: org.apache.solr.update.processor.PreAnalyzedUpdateProcessorTest
   [junit4] Completed [555/566 (3!)] on J1 in 0.89s, 2 tests
   [junit4] 
   [junit4] Suite: org.apache.solr.update.processor.UUIDUpdateProcessorFallbackTest
   [junit4] Completed [556/566 (3!)] on J1 in 0.87s, 1 test
   [junit4] 
   [junit4] Suite: org.apache.solr.util.TestRTimerTree
   [junit4] Completed [557/566 (3!)] on J1 in 0.02s, 1 test
   [junit4] 
   [junit4] Suite: org.apache.solr.util.TestSolrCLIRunExample
   [junit4] Completed [558/566 (3!)] on J1 in 20.45s, 3 tests, 1 skipped
   [junit4] 
   [junit4] Suite: org.apache.solr.util.hll.BigEndianAscendingWordDeserializerTest
   [junit4] Completed [559/566 (3!)] on J1 in 1.44s, 4 tests
   [junit4] 
   [junit4] Suite: org.apache.solr.util.hll.BigEndianAscendingWordSerializerTest
   [junit4] Completed [560/566 (3!)] on J1 in 0.04s, 5 tests
   [junit4] 
   [junit4] Suite: org.apache.solr.util.hll.BitVectorTest
   [junit4] Completed [561/566 (3!)] on J1 in 0.04s, 4 tests
   [junit4] 
   [junit4] Suite: org.apache.solr.util.hll.HLLSerializationTest
   [junit4] IGNOR/A 0.00s J1 | HLLSerializationTest.manyValuesHLLSerializationTest
   [junit4]    > Assumption #1: 'monster' test group is disabled (@Monster(value=may require as much as -Dtests.heapsize=4g depending on random values picked))
   [junit4] IGNOR/A 0.00s J1 | HLLSerializationTest.monsterHLLSerializationTest
   [junit4]    > Assumption #1: 'monster' test group is disabled (@Monster(value=needs roughly -Dtests.heapsize=8g because of the (multiple) massive data structs))
   [junit4] IGNOR/A 0.00s J1 | HLLSerializationTest.manyValuesMonsterHLLSerializationTest
   [junit4]    > Assumption #1: 'monster' test group is disabled (@Monster(value=can require as much as -Dtests.heapsize=4g because of the massive data structs))
   [junit4] Completed [562/566 (3!)] on J1 in 10.90s, 4 tests, 3 skipped
   [junit4] 
   [junit4] Suite: org.apache.solr.util.hll.HLLUtilTest
   [junit4] Completed [563/566 (3!)] on J1 in 0.02s, 1 test
   [junit4] 
   [junit4] Suite: org.apache.solr.util.hll.SparseHLLTest
   [junit4] Completed [564/566 (3!)] on J1 in 0.11s, 8 tests
   [junit4] 
   [junit4] Suite: org.apache.solr.update.processor.TestNamedUpdateProcessors
   [junit4] Completed [565/566 (3!)] on J0 in 36.81s, 1 test
   [junit4] 
   [junit4] HEARTBEAT J2 PID(3410@lucene1-us-west): 2016-02-21T10:26:12, stalled for  729s at: HdfsBasicDistributedZkTest.test
   [junit4] Suite: org.apache.solr.cloud.hdfs.HdfsBasicDistributedZkTest
   [junit4] Completed [566/566 (3!)] on J2 in 768.87s, 1 test
   [junit4] 
   [junit4] 
   [junit4] Tests with failures [seed: F181951231137BA6]:
   [junit4]   - org.apache.solr.cloud.BasicDistributedZk2Test.test
   [junit4]   - org.apache.solr.handler.TestReplicationHandler.doTestIndexAndConfigAliasReplication
   [junit4]   - org.apache.solr.cloud.CollectionsAPIDistributedZkTest.test
   [junit4] 
   [junit4] 
   [junit4] JVM J0:     0.62 ..  4233.96 =  4233.34s
   [junit4] JVM J1:     0.63 ..  4232.35 =  4231.71s
   [junit4] JVM J2:     0.64 ..  4274.76 =  4274.12s
   [junit4] Execution time total: 1 hour 11 minutes 15 seconds
   [junit4] Tests summary: 566 suites (7 ignored), 2279 tests, 3 errors, 34 ignored (18 assumptions)

BUILD FAILED
/x1/jenkins/jenkins-slave/workspace/Lucene-Solr-NightlyTests-5.x/build.xml:757: The following error occurred while executing this line:
/x1/jenkins/jenkins-slave/workspace/Lucene-Solr-NightlyTests-5.x/build.xml:694: The following error occurred while executing this line:
/x1/jenkins/jenkins-slave/workspace/Lucene-Solr-NightlyTests-5.x/build.xml:59: The following error occurred while executing this line:
/x1/jenkins/jenkins-slave/workspace/Lucene-Solr-NightlyTests-5.x/solr/build.xml:233: The following error occurred while executing this line:
/x1/jenkins/jenkins-slave/workspace/Lucene-Solr-NightlyTests-5.x/solr/common-build.xml:534: The following error occurred while executing this line:
/x1/jenkins/jenkins-slave/workspace/Lucene-Solr-NightlyTests-5.x/lucene/common-build.xml:1477: The following error occurred while executing this line:
/x1/jenkins/jenkins-slave/workspace/Lucene-Solr-NightlyTests-5.x/lucene/common-build.xml:1033: There were test failures: 566 suites (7 ignored), 2279 tests, 3 errors, 34 ignored (18 assumptions) [seed: F181951231137BA6]

Total time: 208 minutes 39 seconds
Build step 'Invoke Ant' marked build as failure
Archiving artifacts
Recording test results
Email was triggered for: Failure - Any
Sending email for trigger: Failure - Any



Mime
View raw message