lucene-dev mailing list archives

Site index · List index
Message view « Date » · « Thread »
Top « Date » · « Thread »
From Policeman Jenkins Server <jenk...@thetaphi.de>
Subject [JENKINS] Lucene-Solr-trunk-Solaris (64bit/jdk1.8.0) - Build # 414 - Still Failing!
Date Sat, 20 Feb 2016 07:52:48 GMT
Build: http://jenkins.thetaphi.de/job/Lucene-Solr-trunk-Solaris/414/
Java: 64bit/jdk1.8.0 -XX:-UseCompressedOops -XX:+UseG1GC

3 tests failed.
FAILED:  junit.framework.TestSuite.org.apache.solr.core.TestLazyCores

Error Message:
ObjectTracker found 4 object(s) that were not released!!! [MockDirectoryWrapper, MockDirectoryWrapper, MDCAwareThreadPoolExecutor, SolrCore]

Stack Trace:
java.lang.AssertionError: ObjectTracker found 4 object(s) that were not released!!! [MockDirectoryWrapper, MockDirectoryWrapper, MDCAwareThreadPoolExecutor, SolrCore]
	at __randomizedtesting.SeedInfo.seed([9F2E10F307F84B33]:0)
	at org.junit.Assert.fail(Assert.java:93)
	at org.junit.Assert.assertTrue(Assert.java:43)
	at org.junit.Assert.assertNull(Assert.java:551)
	at org.apache.solr.SolrTestCaseJ4.afterClass(SolrTestCaseJ4.java:228)
	at sun.reflect.GeneratedMethodAccessor19.invoke(Unknown Source)
	at sun.reflect.DelegatingMethodAccessorImpl.invoke(DelegatingMethodAccessorImpl.java:43)
	at java.lang.reflect.Method.invoke(Method.java:498)
	at com.carrotsearch.randomizedtesting.RandomizedRunner.invoke(RandomizedRunner.java:1764)
	at com.carrotsearch.randomizedtesting.RandomizedRunner$7.evaluate(RandomizedRunner.java:834)
	at com.carrotsearch.randomizedtesting.rules.StatementAdapter.evaluate(StatementAdapter.java:36)
	at com.carrotsearch.randomizedtesting.rules.SystemPropertiesRestoreRule$1.evaluate(SystemPropertiesRestoreRule.java:57)
	at org.apache.lucene.util.AbstractBeforeAfterRule$1.evaluate(AbstractBeforeAfterRule.java:45)
	at com.carrotsearch.randomizedtesting.rules.StatementAdapter.evaluate(StatementAdapter.java:36)
	at org.apache.lucene.util.TestRuleStoreClassName$1.evaluate(TestRuleStoreClassName.java:41)
	at com.carrotsearch.randomizedtesting.rules.NoShadowingOrOverridesOnMethodsRule$1.evaluate(NoShadowingOrOverridesOnMethodsRule.java:40)
	at com.carrotsearch.randomizedtesting.rules.NoShadowingOrOverridesOnMethodsRule$1.evaluate(NoShadowingOrOverridesOnMethodsRule.java:40)
	at com.carrotsearch.randomizedtesting.rules.StatementAdapter.evaluate(StatementAdapter.java:36)
	at com.carrotsearch.randomizedtesting.rules.StatementAdapter.evaluate(StatementAdapter.java:36)
	at com.carrotsearch.randomizedtesting.rules.StatementAdapter.evaluate(StatementAdapter.java:36)
	at org.apache.lucene.util.TestRuleAssertionsRequired$1.evaluate(TestRuleAssertionsRequired.java:53)
	at org.apache.lucene.util.TestRuleMarkFailure$1.evaluate(TestRuleMarkFailure.java:47)
	at org.apache.lucene.util.TestRuleIgnoreAfterMaxFailures$1.evaluate(TestRuleIgnoreAfterMaxFailures.java:64)
	at org.apache.lucene.util.TestRuleIgnoreTestSuites$1.evaluate(TestRuleIgnoreTestSuites.java:54)
	at com.carrotsearch.randomizedtesting.rules.StatementAdapter.evaluate(StatementAdapter.java:36)
	at com.carrotsearch.randomizedtesting.ThreadLeakControl$StatementRunner.run(ThreadLeakControl.java:367)
	at java.lang.Thread.run(Thread.java:745)


FAILED:  junit.framework.TestSuite.org.apache.solr.core.TestLazyCores

Error Message:
1 thread leaked from SUITE scope at org.apache.solr.core.TestLazyCores:     1) Thread[id=15811, name=searcherExecutor-6343-thread-1, state=WAITING, group=TGRP-TestLazyCores]         at sun.misc.Unsafe.park(Native Method)         at java.util.concurrent.locks.LockSupport.park(LockSupport.java:175)         at java.util.concurrent.locks.AbstractQueuedSynchronizer$ConditionObject.await(AbstractQueuedSynchronizer.java:2039)         at java.util.concurrent.LinkedBlockingQueue.take(LinkedBlockingQueue.java:442)         at java.util.concurrent.ThreadPoolExecutor.getTask(ThreadPoolExecutor.java:1067)         at java.util.concurrent.ThreadPoolExecutor.runWorker(ThreadPoolExecutor.java:1127)         at java.util.concurrent.ThreadPoolExecutor$Worker.run(ThreadPoolExecutor.java:617)         at java.lang.Thread.run(Thread.java:745)

Stack Trace:
com.carrotsearch.randomizedtesting.ThreadLeakError: 1 thread leaked from SUITE scope at org.apache.solr.core.TestLazyCores: 
   1) Thread[id=15811, name=searcherExecutor-6343-thread-1, state=WAITING, group=TGRP-TestLazyCores]
        at sun.misc.Unsafe.park(Native Method)
        at java.util.concurrent.locks.LockSupport.park(LockSupport.java:175)
        at java.util.concurrent.locks.AbstractQueuedSynchronizer$ConditionObject.await(AbstractQueuedSynchronizer.java:2039)
        at java.util.concurrent.LinkedBlockingQueue.take(LinkedBlockingQueue.java:442)
        at java.util.concurrent.ThreadPoolExecutor.getTask(ThreadPoolExecutor.java:1067)
        at java.util.concurrent.ThreadPoolExecutor.runWorker(ThreadPoolExecutor.java:1127)
        at java.util.concurrent.ThreadPoolExecutor$Worker.run(ThreadPoolExecutor.java:617)
        at java.lang.Thread.run(Thread.java:745)
	at __randomizedtesting.SeedInfo.seed([9F2E10F307F84B33]:0)


FAILED:  junit.framework.TestSuite.org.apache.solr.core.TestLazyCores

Error Message:
There are still zombie threads that couldn't be terminated:    1) Thread[id=15811, name=searcherExecutor-6343-thread-1, state=WAITING, group=TGRP-TestLazyCores]         at sun.misc.Unsafe.park(Native Method)         at java.util.concurrent.locks.LockSupport.park(LockSupport.java:175)         at java.util.concurrent.locks.AbstractQueuedSynchronizer$ConditionObject.await(AbstractQueuedSynchronizer.java:2039)         at java.util.concurrent.LinkedBlockingQueue.take(LinkedBlockingQueue.java:442)         at java.util.concurrent.ThreadPoolExecutor.getTask(ThreadPoolExecutor.java:1067)         at java.util.concurrent.ThreadPoolExecutor.runWorker(ThreadPoolExecutor.java:1127)         at java.util.concurrent.ThreadPoolExecutor$Worker.run(ThreadPoolExecutor.java:617)         at java.lang.Thread.run(Thread.java:745)

Stack Trace:
com.carrotsearch.randomizedtesting.ThreadLeakError: There are still zombie threads that couldn't be terminated:
   1) Thread[id=15811, name=searcherExecutor-6343-thread-1, state=WAITING, group=TGRP-TestLazyCores]
        at sun.misc.Unsafe.park(Native Method)
        at java.util.concurrent.locks.LockSupport.park(LockSupport.java:175)
        at java.util.concurrent.locks.AbstractQueuedSynchronizer$ConditionObject.await(AbstractQueuedSynchronizer.java:2039)
        at java.util.concurrent.LinkedBlockingQueue.take(LinkedBlockingQueue.java:442)
        at java.util.concurrent.ThreadPoolExecutor.getTask(ThreadPoolExecutor.java:1067)
        at java.util.concurrent.ThreadPoolExecutor.runWorker(ThreadPoolExecutor.java:1127)
        at java.util.concurrent.ThreadPoolExecutor$Worker.run(ThreadPoolExecutor.java:617)
        at java.lang.Thread.run(Thread.java:745)
	at __randomizedtesting.SeedInfo.seed([9F2E10F307F84B33]:0)




Build Log:
[...truncated 11544 lines...]
   [junit4] Suite: org.apache.solr.core.TestLazyCores
   [junit4]   2> Creating dataDir: /export/home/jenkins/workspace/Lucene-Solr-trunk-Solaris/solr/build/solr-core/test/J1/temp/solr.core.TestLazyCores_9F2E10F307F84B33-001/init-core-data-001
   [junit4]   2> 2127198 INFO  (SUITE-TestLazyCores-seed#[9F2E10F307F84B33]-worker) [    ] o.a.s.SolrTestCaseJ4 Randomized ssl (false) and clientAuth (false)
   [junit4]   2> 2127211 INFO  (TEST-TestLazyCores.testLazySearch-seed#[9F2E10F307F84B33]) [    ] o.a.s.SolrTestCaseJ4 ###Starting testLazySearch
   [junit4]   2> 2127230 INFO  (TEST-TestLazyCores.testLazySearch-seed#[9F2E10F307F84B33]) [    ] o.a.s.c.SolrResourceLoader new SolrResourceLoader for directory: '/export/home/jenkins/workspace/Lucene-Solr-trunk-Solaris/solr/build/solr-core/test/J1/temp/solr.core.TestLazyCores_9F2E10F307F84B33-001/tempDir-001'
   [junit4]   2> 2127230 INFO  (TEST-TestLazyCores.testLazySearch-seed#[9F2E10F307F84B33]) [    ] o.a.s.c.SolrResourceLoader JNDI not configured for solr (NoInitialContextEx)
   [junit4]   2> 2127230 INFO  (TEST-TestLazyCores.testLazySearch-seed#[9F2E10F307F84B33]) [    ] o.a.s.c.SolrResourceLoader solr home defaulted to 'solr/' (could not find system property or JNDI)
   [junit4]   2> 2127230 INFO  (TEST-TestLazyCores.testLazySearch-seed#[9F2E10F307F84B33]) [    ] o.a.s.c.CoreContainer New CoreContainer 1251820740
   [junit4]   2> 2127230 INFO  (TEST-TestLazyCores.testLazySearch-seed#[9F2E10F307F84B33]) [    ] o.a.s.c.CoreContainer Loading cores into CoreContainer [instanceDir=/export/home/jenkins/workspace/Lucene-Solr-trunk-Solaris/solr/build/solr-core/test/J1/temp/solr.core.TestLazyCores_9F2E10F307F84B33-001/tempDir-001]
   [junit4]   2> 2127230 WARN  (TEST-TestLazyCores.testLazySearch-seed#[9F2E10F307F84B33]) [    ] o.a.s.c.CoreContainer Couldn't add files from /export/home/jenkins/workspace/Lucene-Solr-trunk-Solaris/solr/build/solr-core/test/J1/temp/solr.core.TestLazyCores_9F2E10F307F84B33-001/tempDir-001/lib to classpath: /export/home/jenkins/workspace/Lucene-Solr-trunk-Solaris/solr/build/solr-core/test/J1/temp/solr.core.TestLazyCores_9F2E10F307F84B33-001/tempDir-001/lib
   [junit4]   2> 2127231 INFO  (TEST-TestLazyCores.testLazySearch-seed#[9F2E10F307F84B33]) [    ] o.a.s.h.c.HttpShardHandlerFactory created with socketTimeout : 600000,connTimeout : 60000,maxConnectionsPerHost : 20,maxConnections : 10000,corePoolSize : 0,maximumPoolSize : 2147483647,maxThreadIdleTime : 5,sizeOfQueue : -1,fairnessPolicy : false,useRetries : false,
   [junit4]   2> 2127231 INFO  (TEST-TestLazyCores.testLazySearch-seed#[9F2E10F307F84B33]) [    ] o.a.s.u.UpdateShardHandler Creating UpdateShardHandler HTTP client with params: socketTimeout=600000&connTimeout=60000&retry=true
   [junit4]   2> 2127232 INFO  (TEST-TestLazyCores.testLazySearch-seed#[9F2E10F307F84B33]) [    ] o.a.s.c.SolrCores Allocating transient cache for 4 transient cores
   [junit4]   2> 2127235 INFO  (TEST-TestLazyCores.testLazySearch-seed#[9F2E10F307F84B33]) [    ] o.a.s.l.LogWatcher SLF4J impl is org.slf4j.impl.Log4jLoggerFactory
   [junit4]   2> 2127235 INFO  (TEST-TestLazyCores.testLazySearch-seed#[9F2E10F307F84B33]) [    ] o.a.s.l.LogWatcher Registering Log Listener [Log4j (org.slf4j.impl.Log4jLoggerFactory)]
   [junit4]   2> 2127235 INFO  (TEST-TestLazyCores.testLazySearch-seed#[9F2E10F307F84B33]) [    ] o.a.s.c.CoreContainer Security conf doesn't exist. Skipping setup for authorization module.
   [junit4]   2> 2127236 INFO  (TEST-TestLazyCores.testLazySearch-seed#[9F2E10F307F84B33]) [    ] o.a.s.c.CoreContainer No authentication plugin used.
   [junit4]   2> 2127237 INFO  (TEST-TestLazyCores.testLazySearch-seed#[9F2E10F307F84B33]) [    ] o.a.s.c.CoreDescriptor Created CoreDescriptor: {name=collection1, config=solrconfig.xml, loadOnStartup=true, schema=schema.xml, configSetProperties=configsetprops.json, transient=false, dataDir=data/}
   [junit4]   2> 2127237 INFO  (TEST-TestLazyCores.testLazySearch-seed#[9F2E10F307F84B33]) [    ] o.a.s.c.CoreDescriptor Created CoreDescriptor: {name=collection2, config=solrconfig.xml, loadOnStartup=true, schema=schema.xml, configSetProperties=configsetprops.json, transient=true, dataDir=data/}
   [junit4]   2> 2127237 INFO  (TEST-TestLazyCores.testLazySearch-seed#[9F2E10F307F84B33]) [    ] o.a.s.c.CoreDescriptor Created CoreDescriptor: {name=collection3, config=solrconfig.xml, loadOnStartup=false, schema=schema.xml, configSetProperties=configsetprops.json, transient=on, dataDir=data/}
   [junit4]   2> 2127237 INFO  (TEST-TestLazyCores.testLazySearch-seed#[9F2E10F307F84B33]) [    ] o.a.s.c.CoreDescriptor Created CoreDescriptor: {name=collection4, config=solrconfig.xml, loadOnStartup=false, schema=schema.xml, configSetProperties=configsetprops.json, transient=false, dataDir=data/}
   [junit4]   2> 2127238 INFO  (TEST-TestLazyCores.testLazySearch-seed#[9F2E10F307F84B33]) [    ] o.a.s.c.CoreDescriptor Created CoreDescriptor: {name=collection5, config=solrconfig.xml, loadOnStartup=true, schema=schema.xml, configSetProperties=configsetprops.json, transient=false, dataDir=data/}
   [junit4]   2> 2127238 INFO  (TEST-TestLazyCores.testLazySearch-seed#[9F2E10F307F84B33]) [    ] o.a.s.c.CoreDescriptor Created CoreDescriptor: {name=collection6, config=solrconfig.xml, loadOnStartup=false, schema=schema.xml, configSetProperties=configsetprops.json, transient=true, dataDir=data/}
   [junit4]   2> 2127238 INFO  (TEST-TestLazyCores.testLazySearch-seed#[9F2E10F307F84B33]) [    ] o.a.s.c.CoreDescriptor Created CoreDescriptor: {name=collection7, config=solrconfig.xml, loadOnStartup=false, schema=schema.xml, configSetProperties=configsetprops.json, transient=true, dataDir=data/}
   [junit4]   2> 2127238 INFO  (TEST-TestLazyCores.testLazySearch-seed#[9F2E10F307F84B33]) [    ] o.a.s.c.CoreDescriptor Created CoreDescriptor: {name=collection8, config=solrconfig.xml, loadOnStartup=false, schema=schema.xml, configSetProperties=configsetprops.json, transient=true, dataDir=data/}
   [junit4]   2> 2127238 INFO  (TEST-TestLazyCores.testLazySearch-seed#[9F2E10F307F84B33]) [    ] o.a.s.c.CoreDescriptor Created CoreDescriptor: {name=collection9, config=solrconfig.xml, loadOnStartup=false, schema=schema.xml, configSetProperties=configsetprops.json, transient=true, dataDir=data/}
   [junit4]   2> 2127239 INFO  (coreLoadExecutor-6245-thread-1) [    ] o.a.s.c.SolrResourceLoader new SolrResourceLoader for directory: '/export/home/jenkins/workspace/Lucene-Solr-trunk-Solaris/solr/build/solr-core/test/J1/temp/solr.core.TestLazyCores_9F2E10F307F84B33-001/tempDir-001/collection1'
   [junit4]   2> 2127239 INFO  (coreLoadExecutor-6245-thread-1) [    ] o.a.s.c.SolrResourceLoader JNDI not configured for solr (NoInitialContextEx)
   [junit4]   2> 2127239 INFO  (coreLoadExecutor-6245-thread-1) [    ] o.a.s.c.SolrResourceLoader solr home defaulted to 'solr/' (could not find system property or JNDI)
   [junit4]   2> 2127243 INFO  (coreLoadExecutor-6245-thread-2) [    ] o.a.s.c.SolrResourceLoader new SolrResourceLoader for directory: '/export/home/jenkins/workspace/Lucene-Solr-trunk-Solaris/solr/build/solr-core/test/J1/temp/solr.core.TestLazyCores_9F2E10F307F84B33-001/tempDir-001/collection2'
   [junit4]   2> 2127243 INFO  (coreLoadExecutor-6245-thread-2) [    ] o.a.s.c.SolrResourceLoader JNDI not configured for solr (NoInitialContextEx)
   [junit4]   2> 2127243 INFO  (coreLoadExecutor-6245-thread-2) [    ] o.a.s.c.SolrResourceLoader solr home defaulted to 'solr/' (could not find system property or JNDI)
   [junit4]   2> 2127246 INFO  (coreLoadExecutor-6245-thread-1) [    ] o.a.s.c.SolrConfig current version of requestparams : -1
   [junit4]   2> 2127248 INFO  (coreLoadExecutor-6245-thread-1) [    ] o.a.s.c.SolrConfig Using Lucene MatchVersion: 6.0.0
   [junit4]   2> 2127250 INFO  (coreLoadExecutor-6245-thread-2) [    ] o.a.s.c.SolrConfig current version of requestparams : -1
   [junit4]   2> 2127251 INFO  (coreLoadExecutor-6245-thread-3) [    ] o.a.s.c.SolrResourceLoader new SolrResourceLoader for directory: '/export/home/jenkins/workspace/Lucene-Solr-trunk-Solaris/solr/build/solr-core/test/J1/temp/solr.core.TestLazyCores_9F2E10F307F84B33-001/tempDir-001/collection5'
   [junit4]   2> 2127251 INFO  (coreLoadExecutor-6245-thread-3) [    ] o.a.s.c.SolrResourceLoader JNDI not configured for solr (NoInitialContextEx)
   [junit4]   2> 2127251 INFO  (coreLoadExecutor-6245-thread-3) [    ] o.a.s.c.SolrResourceLoader solr home defaulted to 'solr/' (could not find system property or JNDI)
   [junit4]   2> 2127253 INFO  (coreLoadExecutor-6245-thread-2) [    ] o.a.s.c.SolrConfig Using Lucene MatchVersion: 6.0.0
   [junit4]   2> 2127256 INFO  (coreLoadExecutor-6245-thread-3) [    ] o.a.s.c.SolrConfig current version of requestparams : -1
   [junit4]   2> 2127258 INFO  (coreLoadExecutor-6245-thread-3) [    ] o.a.s.c.SolrConfig Using Lucene MatchVersion: 6.0.0
   [junit4]   2> 2127259 INFO  (coreLoadExecutor-6245-thread-2) [    ] o.a.s.c.SolrConfig Loaded SolrConfig: solrconfig.xml
   [junit4]   2> 2127263 INFO  (coreLoadExecutor-6245-thread-3) [    ] o.a.s.c.SolrConfig Loaded SolrConfig: solrconfig.xml
   [junit4]   2> 2127264 INFO  (coreLoadExecutor-6245-thread-2) [    ] o.a.s.s.IndexSchema [collection2] Schema name=tiny
   [junit4]   2> 2127265 INFO  (coreLoadExecutor-6245-thread-3) [    ] o.a.s.s.IndexSchema [collection5] Schema name=tiny
   [junit4]   2> 2127272 INFO  (coreLoadExecutor-6245-thread-1) [    ] o.a.s.c.SolrConfig Loaded SolrConfig: solrconfig.xml
   [junit4]   2> 2127276 INFO  (coreLoadExecutor-6245-thread-1) [    ] o.a.s.s.IndexSchema [collection1] Schema name=tiny
   [junit4]   2> 2127276 INFO  (coreLoadExecutor-6245-thread-3) [    ] o.a.s.s.IndexSchema unique key field: id
   [junit4]   2> 2127278 INFO  (coreLoadExecutor-6245-thread-3) [    ] o.a.s.c.ConfigSetProperties Did not find ConfigSet properties, assuming default properties: Can't find resource 'configsetprops.json' in classpath or '/export/home/jenkins/workspace/Lucene-Solr-trunk-Solaris/solr/build/solr-core/test/J1/temp/solr.core.TestLazyCores_9F2E10F307F84B33-001/tempDir-001/collection5'
   [junit4]   2> 2127278 INFO  (coreLoadExecutor-6245-thread-3) [    ] o.a.s.c.CoreContainer Creating SolrCore 'collection5' using configuration from instancedir /export/home/jenkins/workspace/Lucene-Solr-trunk-Solaris/solr/build/solr-core/test/J1/temp/solr.core.TestLazyCores_9F2E10F307F84B33-001/tempDir-001/collection5
   [junit4]   2> 2127278 INFO  (coreLoadExecutor-6245-thread-3) [    x:collection5] o.a.s.c.SolrCore org.apache.solr.core.MockDirectoryFactory
   [junit4]   2> 2127279 INFO  (coreLoadExecutor-6245-thread-3) [    x:collection5] o.a.s.c.SolrCore [[collection5] ] Opening new SolrCore at [/export/home/jenkins/workspace/Lucene-Solr-trunk-Solaris/solr/build/solr-core/test/J1/temp/solr.core.TestLazyCores_9F2E10F307F84B33-001/tempDir-001/collection5], dataDir=[/export/home/jenkins/workspace/Lucene-Solr-trunk-Solaris/solr/build/solr-core/test/J1/temp/solr.core.TestLazyCores_9F2E10F307F84B33-001/tempDir-001/collection5/data/]
   [junit4]   2> 2127279 INFO  (coreLoadExecutor-6245-thread-3) [    x:collection5] o.a.s.c.SolrCore JMX monitoring not detected for core: collection5
   [junit4]   2> 2127279 INFO  (coreLoadExecutor-6245-thread-3) [    x:collection5] o.a.s.c.CachingDirectoryFactory return new directory for /export/home/jenkins/workspace/Lucene-Solr-trunk-Solaris/solr/build/solr-core/test/J1/temp/solr.core.TestLazyCores_9F2E10F307F84B33-001/tempDir-001/collection5/data
   [junit4]   2> 2127279 INFO  (coreLoadExecutor-6245-thread-3) [    x:collection5] o.a.s.c.SolrCore New index directory detected: old=null new=/export/home/jenkins/workspace/Lucene-Solr-trunk-Solaris/solr/build/solr-core/test/J1/temp/solr.core.TestLazyCores_9F2E10F307F84B33-001/tempDir-001/collection5/data/index/
   [junit4]   2> 2127279 WARN  (coreLoadExecutor-6245-thread-3) [    x:collection5] o.a.s.c.SolrCore [collection5] Solr index directory '/export/home/jenkins/workspace/Lucene-Solr-trunk-Solaris/solr/build/solr-core/test/J1/temp/solr.core.TestLazyCores_9F2E10F307F84B33-001/tempDir-001/collection5/data/index' doesn't exist. Creating new index...
   [junit4]   2> 2127279 INFO  (coreLoadExecutor-6245-thread-1) [    ] o.a.s.s.IndexSchema unique key field: id
   [junit4]   2> 2127279 INFO  (coreLoadExecutor-6245-thread-3) [    x:collection5] o.a.s.c.CachingDirectoryFactory return new directory for /export/home/jenkins/workspace/Lucene-Solr-trunk-Solaris/solr/build/solr-core/test/J1/temp/solr.core.TestLazyCores_9F2E10F307F84B33-001/tempDir-001/collection5/data/index
   [junit4]   2> 2127280 INFO  (coreLoadExecutor-6245-thread-3) [    x:collection5] o.a.s.u.RandomMergePolicy RandomMergePolicy wrapping class org.apache.lucene.index.TieredMergePolicy: [TieredMergePolicy: maxMergeAtOnce=36, maxMergeAtOnceExplicit=46, maxMergedSegmentMB=40.7216796875, floorSegmentMB=1.5986328125, forceMergeDeletesPctAllowed=23.677163016538614, segmentsPerTier=29.0, maxCFSSegmentSizeMB=8.796093022207999E12, noCFSRatio=0.0
   [junit4]   2> 2127280 INFO  (coreLoadExecutor-6245-thread-3) [    x:collection5] o.a.s.c.SolrDeletionPolicy SolrDeletionPolicy.onCommit: commits: num=1
   [junit4]   2> 	commit{dir=MockDirectoryWrapper(RAMDirectory@5c0b237a lockFactory=org.apache.lucene.store.SingleInstanceLockFactory@2157382a),segFN=segments_1,generation=1}
   [junit4]   2> 2127280 INFO  (coreLoadExecutor-6245-thread-3) [    x:collection5] o.a.s.c.SolrDeletionPolicy newest commit generation = 1
   [junit4]   2> 2127281 INFO  (coreLoadExecutor-6245-thread-1) [    ] o.a.s.c.ConfigSetProperties Did not find ConfigSet properties, assuming default properties: Can't find resource 'configsetprops.json' in classpath or '/export/home/jenkins/workspace/Lucene-Solr-trunk-Solaris/solr/build/solr-core/test/J1/temp/solr.core.TestLazyCores_9F2E10F307F84B33-001/tempDir-001/collection1'
   [junit4]   2> 2127281 INFO  (coreLoadExecutor-6245-thread-1) [    ] o.a.s.c.CoreContainer Creating SolrCore 'collection1' using configuration from instancedir /export/home/jenkins/workspace/Lucene-Solr-trunk-Solaris/solr/build/solr-core/test/J1/temp/solr.core.TestLazyCores_9F2E10F307F84B33-001/tempDir-001/collection1
   [junit4]   2> 2127281 INFO  (coreLoadExecutor-6245-thread-1) [    x:collection1] o.a.s.c.SolrCore org.apache.solr.core.MockDirectoryFactory
   [junit4]   2> 2127282 INFO  (coreLoadExecutor-6245-thread-1) [    x:collection1] o.a.s.c.SolrCore [[collection1] ] Opening new SolrCore at [/export/home/jenkins/workspace/Lucene-Solr-trunk-Solaris/solr/build/solr-core/test/J1/temp/solr.core.TestLazyCores_9F2E10F307F84B33-001/tempDir-001/collection1], dataDir=[/export/home/jenkins/workspace/Lucene-Solr-trunk-Solaris/solr/build/solr-core/test/J1/temp/solr.core.TestLazyCores_9F2E10F307F84B33-001/tempDir-001/collection1/data/]
   [junit4]   2> 2127282 INFO  (coreLoadExecutor-6245-thread-1) [    x:collection1] o.a.s.c.SolrCore JMX monitoring not detected for core: collection1
   [junit4]   2> 2127282 INFO  (coreLoadExecutor-6245-thread-3) [    x:collection5] o.a.s.c.SolrCore no updateRequestProcessorChain defined as default, creating implicit default
   [junit4]   2> 2127282 INFO  (coreLoadExecutor-6245-thread-1) [    x:collection1] o.a.s.c.CachingDirectoryFactory return new directory for /export/home/jenkins/workspace/Lucene-Solr-trunk-Solaris/solr/build/solr-core/test/J1/temp/solr.core.TestLazyCores_9F2E10F307F84B33-001/tempDir-001/collection1/data
   [junit4]   2> 2127282 INFO  (coreLoadExecutor-6245-thread-1) [    x:collection1] o.a.s.c.SolrCore New index directory detected: old=null new=/export/home/jenkins/workspace/Lucene-Solr-trunk-Solaris/solr/build/solr-core/test/J1/temp/solr.core.TestLazyCores_9F2E10F307F84B33-001/tempDir-001/collection1/data/index/
   [junit4]   2> 2127282 WARN  (coreLoadExecutor-6245-thread-1) [    x:collection1] o.a.s.c.SolrCore [collection1] Solr index directory '/export/home/jenkins/workspace/Lucene-Solr-trunk-Solaris/solr/build/solr-core/test/J1/temp/solr.core.TestLazyCores_9F2E10F307F84B33-001/tempDir-001/collection1/data/index' doesn't exist. Creating new index...
   [junit4]   2> 2127282 INFO  (coreLoadExecutor-6245-thread-1) [    x:collection1] o.a.s.c.CachingDirectoryFactory return new directory for /export/home/jenkins/workspace/Lucene-Solr-trunk-Solaris/solr/build/solr-core/test/J1/temp/solr.core.TestLazyCores_9F2E10F307F84B33-001/tempDir-001/collection1/data/index
   [junit4]   2> 2127283 INFO  (coreLoadExecutor-6245-thread-1) [    x:collection1] o.a.s.u.RandomMergePolicy RandomMergePolicy wrapping class org.apache.lucene.index.TieredMergePolicy: [TieredMergePolicy: maxMergeAtOnce=36, maxMergeAtOnceExplicit=46, maxMergedSegmentMB=40.7216796875, floorSegmentMB=1.5986328125, forceMergeDeletesPctAllowed=23.677163016538614, segmentsPerTier=29.0, maxCFSSegmentSizeMB=8.796093022207999E12, noCFSRatio=0.0
   [junit4]   2> 2127283 INFO  (coreLoadExecutor-6245-thread-1) [    x:collection1] o.a.s.c.SolrDeletionPolicy SolrDeletionPolicy.onCommit: commits: num=1
   [junit4]   2> 	commit{dir=MockDirectoryWrapper(RAMDirectory@859c8e8 lockFactory=org.apache.lucene.store.SingleInstanceLockFactory@6a4aac45),segFN=segments_1,generation=1}
   [junit4]   2> 2127283 INFO  (coreLoadExecutor-6245-thread-1) [    x:collection1] o.a.s.c.SolrDeletionPolicy newest commit generation = 1
   [junit4]   2> 2127284 INFO  (coreLoadExecutor-6245-thread-3) [    x:collection5] o.a.s.h.l.XMLLoader xsltCacheLifetimeSeconds=60
   [junit4]   2> 2127285 INFO  (coreLoadExecutor-6245-thread-3) [    x:collection5] o.a.s.h.l.XMLLoader xsltCacheLifetimeSeconds=60
   [junit4]   2> 2127285 INFO  (coreLoadExecutor-6245-thread-3) [    x:collection5] o.a.s.h.l.XMLLoader xsltCacheLifetimeSeconds=60
   [junit4]   2> 2127285 INFO  (coreLoadExecutor-6245-thread-1) [    x:collection1] o.a.s.c.SolrCore no updateRequestProcessorChain defined as default, creating implicit default
   [junit4]   2> 2127286 INFO  (coreLoadExecutor-6245-thread-3) [    x:collection5] o.a.s.h.l.XMLLoader xsltCacheLifetimeSeconds=60
   [junit4]   2> 2127287 INFO  (coreLoadExecutor-6245-thread-1) [    x:collection1] o.a.s.h.l.XMLLoader xsltCacheLifetimeSeconds=60
   [junit4]   2> 2127287 INFO  (coreLoadExecutor-6245-thread-3) [    x:collection5] o.a.s.c.RequestHandlers Registered paths: /admin/mbeans,/update/csv,/sql,/update/json/docs,/admin/luke,/export,/select,/admin/segments,/get,/admin/system,/replication,/admin/properties,/config,/stream,/schema,/admin/plugins,/admin/logging,/update/json,/admin/threads,/admin/ping,/update,/admin/file
   [junit4]   2> 2127288 INFO  (coreLoadExecutor-6245-thread-3) [    x:collection5] o.a.s.c.SolrCore Using default statsCache cache: org.apache.solr.search.stats.LocalStatsCache
   [junit4]   2> 2127288 INFO  (coreLoadExecutor-6245-thread-3) [    x:collection5] o.a.s.u.CommitTracker Hard AutoCommit: disabled
   [junit4]   2> 2127288 INFO  (coreLoadExecutor-6245-thread-3) [    x:collection5] o.a.s.u.CommitTracker Soft AutoCommit: disabled
   [junit4]   2> 2127288 INFO  (coreLoadExecutor-6245-thread-3) [    x:collection5] o.a.s.u.RandomMergePolicy RandomMergePolicy wrapping class org.apache.lucene.index.LogByteSizeMergePolicy: [LogByteSizeMergePolicy: minMergeSize=1677721, mergeFactor=28, maxMergeSize=2147483648, maxMergeSizeForForcedMerge=9223372036854775807, calibrateSizeByDeletes=false, maxMergeDocs=2147483647, maxCFSSegmentSizeMB=8.796093022207999E12, noCFSRatio=0.7240318838304586]
   [junit4]   2> 2127288 INFO  (coreLoadExecutor-6245-thread-3) [    x:collection5] o.a.s.c.SolrDeletionPolicy SolrDeletionPolicy.onInit: commits: num=1
   [junit4]   2> 	commit{dir=MockDirectoryWrapper(RAMDirectory@5c0b237a lockFactory=org.apache.lucene.store.SingleInstanceLockFactory@2157382a),segFN=segments_1,generation=1}
   [junit4]   2> 2127288 INFO  (coreLoadExecutor-6245-thread-3) [    x:collection5] o.a.s.c.SolrDeletionPolicy newest commit generation = 1
   [junit4]   2> 2127288 INFO  (coreLoadExecutor-6245-thread-3) [    x:collection5] o.a.s.s.SolrIndexSearcher Opening [Searcher@6577d1af[collection5] main]
   [junit4]   2> 2127289 INFO  (coreLoadExecutor-6245-thread-1) [    x:collection1] o.a.s.h.l.XMLLoader xsltCacheLifetimeSeconds=60
   [junit4]   2> 2127289 INFO  (coreLoadExecutor-6245-thread-3) [    x:collection5] o.a.s.r.ManagedResourceStorage File-based storage initialized to use dir: /export/home/jenkins/workspace/Lucene-Solr-trunk-Solaris/solr/build/solr-core/test/J1/temp/solr.core.TestLazyCores_9F2E10F307F84B33-001/tempDir-001/collection5/conf
   [junit4]   2> 2127289 INFO  (coreLoadExecutor-6245-thread-3) [    x:collection5] o.a.s.r.RestManager Initializing RestManager with initArgs: {storageDir=/export/home/jenkins/workspace/Lucene-Solr-trunk-Solaris/solr/build/solr-core/test/J1/temp/solr.core.TestLazyCores_9F2E10F307F84B33-001/tempDir-001/collection5/conf}
   [junit4]   2> 2127289 INFO  (coreLoadExecutor-6245-thread-3) [    x:collection5] o.a.s.r.ManagedResourceStorage Reading _rest_managed.json using file:dir=/export/home/jenkins/workspace/Lucene-Solr-trunk-Solaris/solr/build/solr-core/test/J1/temp/solr.core.TestLazyCores_9F2E10F307F84B33-001/tempDir-001/collection5/conf
   [junit4]   2> 2127289 INFO  (coreLoadExecutor-6245-thread-3) [    x:collection5] o.a.s.r.RestManager Initializing 0 registered ManagedResources
   [junit4]   2> 2127289 INFO  (coreLoadExecutor-6245-thread-3) [    x:collection5] o.a.s.h.ReplicationHandler Commits will be reserved for  10000
   [junit4]   2> 2127289 INFO  (coreLoadExecutor-6245-thread-3) [    x:collection5] o.a.s.c.CoreContainer registering core: collection5
   [junit4]   2> 2127289 INFO  (OldIndexDirectoryCleanupThreadForCore-collection5) [    x:collection5] o.a.s.c.SolrCore Looking for old index directories to cleanup for core collection5 in /export/home/jenkins/workspace/Lucene-Solr-trunk-Solaris/solr/build/solr-core/test/J1/temp/solr.core.TestLazyCores_9F2E10F307F84B33-001/tempDir-001/collection5/data/
   [junit4]   2> 2127290 WARN  (OldIndexDirectoryCleanupThreadForCore-collection5) [    x:collection5] o.a.s.c.DirectoryFactory /export/home/jenkins/workspace/Lucene-Solr-trunk-Solaris/solr/build/solr-core/test/J1/temp/solr.core.TestLazyCores_9F2E10F307F84B33-001/tempDir-001/collection5/data/ does not point to a valid data directory; skipping clean-up of old index directories.
   [junit4]   2> 2127290 INFO  (coreLoadExecutor-6245-thread-1) [    x:collection1] o.a.s.h.l.XMLLoader xsltCacheLifetimeSeconds=60
   [junit4]   2> 2127290 INFO  (searcherExecutor-6246-thread-1-processing-x:collection5) [    x:collection5] o.a.s.c.SolrCore [collection5] Registered new searcher Searcher@6577d1af[collection5] main{ExitableDirectoryReader(UninvertingDirectoryReader())}
   [junit4]   2> 2127291 INFO  (coreLoadExecutor-6245-thread-1) [    x:collection1] o.a.s.h.l.XMLLoader xsltCacheLifetimeSeconds=60
   [junit4]   2> 2127292 INFO  (coreLoadExecutor-6245-thread-2) [    ] o.a.s.s.IndexSchema unique key field: id
   [junit4]   2> 2127293 INFO  (coreLoadExecutor-6245-thread-1) [    x:collection1] o.a.s.c.RequestHandlers Registered paths: /admin/mbeans,/update/csv,/sql,/update/json/docs,/admin/luke,/export,/select,/admin/segments,/get,/admin/system,/replication,/admin/properties,/config,/stream,/schema,/admin/plugins,/admin/logging,/update/json,/admin/threads,/admin/ping,/update,/admin/file
   [junit4]   2> 2127293 INFO  (OldIndexDirectoryCleanupThreadForCore-collection1) [    x:collection1] o.a.s.c.SolrCore Looking for old index directories to cleanup for core collection1 in /export/home/jenkins/workspace/Lucene-Solr-trunk-Solaris/solr/build/solr-core/test/J1/temp/solr.core.TestLazyCores_9F2E10F307F84B33-001/tempDir-001/collection1/data/
   [junit4]   2> 2127294 WARN  (OldIndexDirectoryCleanupThreadForCore-collection1) [    x:collection1] o.a.s.c.DirectoryFactory /export/home/jenkins/workspace/Lucene-Solr-trunk-Solaris/solr/build/solr-core/test/J1/temp/solr.core.TestLazyCores_9F2E10F307F84B33-001/tempDir-001/collection1/data/ does not point to a valid data directory; skipping clean-up of old index directories.
   [junit4]   2> 2127294 INFO  (coreLoadExecutor-6245-thread-1) [    x:collection1] o.a.s.c.SolrCore Using default statsCache cache: org.apache.solr.search.stats.LocalStatsCache
   [junit4]   2> 2127293 INFO  (coreLoadExecutor-6245-thread-2) [    ] o.a.s.c.ConfigSetProperties Did not find ConfigSet properties, assuming default properties: Can't find resource 'configsetprops.json' in classpath or '/export/home/jenkins/workspace/Lucene-Solr-trunk-Solaris/solr/build/solr-core/test/J1/temp/solr.core.TestLazyCores_9F2E10F307F84B33-001/tempDir-001/collection2'
   [junit4]   2> 2127294 INFO  (coreLoadExecutor-6245-thread-2) [    ] o.a.s.c.CoreContainer Creating SolrCore 'collection2' using configuration from instancedir /export/home/jenkins/workspace/Lucene-Solr-trunk-Solaris/solr/build/solr-core/test/J1/temp/solr.core.TestLazyCores_9F2E10F307F84B33-001/tempDir-001/collection2
   [junit4]   2> 2127294 INFO  (coreLoadExecutor-6245-thread-1) [    x:collection1] o.a.s.u.CommitTracker Hard AutoCommit: disabled
   [junit4]   2> 2127294 INFO  (coreLoadExecutor-6245-thread-1) [    x:collection1] o.a.s.u.CommitTracker Soft AutoCommit: disabled
   [junit4]   2> 2127294 INFO  (coreLoadExecutor-6245-thread-2) [    x:collection2] o.a.s.c.SolrCore org.apache.solr.core.MockDirectoryFactory
   [junit4]   2> 2127294 INFO  (coreLoadExecutor-6245-thread-2) [    x:collection2] o.a.s.c.SolrCore [[collection2] ] Opening new SolrCore at [/export/home/jenkins/workspace/Lucene-Solr-trunk-Solaris/solr/build/solr-core/test/J1/temp/solr.core.TestLazyCores_9F2E10F307F84B33-001/tempDir-001/collection2], dataDir=[/export/home/jenkins/workspace/Lucene-Solr-trunk-Solaris/solr/build/solr-core/test/J1/temp/solr.core.TestLazyCores_9F2E10F307F84B33-001/tempDir-001/collection2/data/]
   [junit4]   2> 2127294 INFO  (coreLoadExecutor-6245-thread-1) [    x:collection1] o.a.s.u.RandomMergePolicy RandomMergePolicy wrapping class org.apache.lucene.index.LogByteSizeMergePolicy: [LogByteSizeMergePolicy: minMergeSize=1677721, mergeFactor=28, maxMergeSize=2147483648, maxMergeSizeForForcedMerge=9223372036854775807, calibrateSizeByDeletes=false, maxMergeDocs=2147483647, maxCFSSegmentSizeMB=8.796093022207999E12, noCFSRatio=0.7240318838304586]
   [junit4]   2> 2127294 INFO  (coreLoadExecutor-6245-thread-2) [    x:collection2] o.a.s.c.SolrCore JMX monitoring not detected for core: collection2
   [junit4]   2> 2127294 INFO  (coreLoadExecutor-6245-thread-1) [    x:collection1] o.a.s.c.SolrDeletionPolicy SolrDeletionPolicy.onInit: commits: num=1
   [junit4]   2> 	commit{dir=MockDirectoryWrapper(RAMDirectory@859c8e8 lockFactory=org.apache.lucene.store.SingleInstanceLockFactory@6a4aac45),segFN=segments_1,generation=1}
   [junit4]   2> 2127295 INFO  (coreLoadExecutor-6245-thread-1) [    x:collection1] o.a.s.c.SolrDeletionPolicy newest commit generation = 1
   [junit4]   2> 2127295 INFO  (coreLoadExecutor-6245-thread-2) [    x:collection2] o.a.s.c.CachingDirectoryFactory return new directory for /export/home/jenkins/workspace/Lucene-Solr-trunk-Solaris/solr/build/solr-core/test/J1/temp/solr.core.TestLazyCores_9F2E10F307F84B33-001/tempDir-001/collection2/data
   [junit4]   2> 2127295 INFO  (coreLoadExecutor-6245-thread-2) [    x:collection2] o.a.s.c.SolrCore New index directory detected: old=null new=/export/home/jenkins/workspace/Lucene-Solr-trunk-Solaris/solr/build/solr-core/test/J1/temp/solr.core.TestLazyCores_9F2E10F307F84B33-001/tempDir-001/collection2/data/index/
   [junit4]   2> 2127295 INFO  (coreLoadExecutor-6245-thread-1) [    x:collection1] o.a.s.s.SolrIndexSearcher Opening [Searcher@61a9d37c[collection1] main]
   [junit4]   2> 2127295 WARN  (coreLoadExecutor-6245-thread-2) [    x:collection2] o.a.s.c.SolrCore [collection2] Solr index directory '/export/home/jenkins/workspace/Lucene-Solr-trunk-Solaris/solr/build/solr-core/test/J1/temp/solr.core.TestLazyCores_9F2E10F307F84B33-001/tempDir-001/collection2/data/index' doesn't exist. Creating new index...
   [junit4]   2> 2127295 INFO  (coreLoadExecutor-6245-thread-2) [    x:collection2] o.a.s.c.CachingDirectoryFactory return new directory for /export/home/jenkins/workspace/Lucene-Solr-trunk-Solaris/solr/build/solr-core/test/J1/temp/solr.core.TestLazyCores_9F2E10F307F84B33-001/tempDir-001/collection2/data/index
   [junit4]   2> 2127295 INFO  (coreLoadExecutor-6245-thread-1) [    x:collection1] o.a.s.r.ManagedResourceStorage File-based storage initialized to use dir: /export/home/jenkins/workspace/Lucene-Solr-trunk-Solaris/solr/build/solr-core/test/J1/temp/solr.core.TestLazyCores_9F2E10F307F84B33-001/tempDir-001/collection1/conf
   [junit4]   2> 2127295 INFO  (coreLoadExecutor-6245-thread-1) [    x:collection1] o.a.s.r.RestManager Initializing RestManager with initArgs: {storageDir=/export/home/jenkins/workspace/Lucene-Solr-trunk-Solaris/solr/build/solr-core/test/J1/temp/solr.core.TestLazyCores_9F2E10F307F84B33-001/tempDir-001/collection1/conf}
   [junit4]   2> 2127295 INFO  (coreLoadExecutor-6245-thread-2) [    x:collection2] o.a.s.u.RandomMergePolicy RandomMergePolicy wrapping class org.apache.lucene.index.TieredMergePolicy: [TieredMergePolicy: maxMergeAtOnce=36, maxMergeAtOnceExplicit=46, maxMergedSegmentMB=40.7216796875, floorSegmentMB=1.5986328125, forceMergeDeletesPctAllowed=23.677163016538614, segmentsPerTier=29.0, maxCFSSegmentSizeMB=8.796093022207999E12, noCFSRatio=0.0
   [junit4]   2> 2127295 INFO  (coreLoadExecutor-6245-thread-1) [    x:collection1] o.a.s.r.ManagedResourceStorage Reading _rest_managed.json using file:dir=/export/home/jenkins/workspace/Lucene-Solr-trunk-Solaris/solr/build/solr-core/test/J1/temp/solr.core.TestLazyCores_9F2E10F307F84B33-001/tempDir-001/collection1/conf
   [junit4]   2> 2127295 INFO  (coreLoadExecutor-6245-thread-2) [    x:collection2] o.a.s.c.SolrDeletionPolicy SolrDeletionPolicy.onCommit: commits: num=1
   [junit4]   2> 	commit{dir=MockDirectoryWrapper(RAMDirectory@3d749790 lockFactory=org.apache.lucene.store.SingleInstanceLockFactory@b775a57),segFN=segments_1,generation=1}
   [junit4]   2> 2127295 INFO  (coreLoadExecutor-6245-thread-1) [    x:collection1] o.a.s.r.RestManager Initializing 0 registered ManagedResources
   [junit4]   2> 2127296 INFO  (coreLoadExecutor-6245-thread-2) [    x:collection2] o.a.s.c.SolrDeletionPolicy newest commit generation = 1
   [junit4]   2> 2127296 INFO  (coreLoadExecutor-6245-thread-1) [    x:collection1] o.a.s.h.ReplicationHandler Commits will be reserved for  10000
   [junit4]   2> 2127296 INFO  (OldIndexDirectoryCleanupThreadForCore-collection2) [    x:collection2] o.a.s.c.SolrCore Looking for old index directories to cleanup for core collection2 in /export/home/jenkins/workspace/Lucene-Solr-trunk-Solaris/solr/build/solr-core/test/J1/temp/solr.core.TestLazyCores_9F2E10F307F84B33-001/tempDir-001/collection2/data/
   [junit4]   2> 2127296 WARN  (OldIndexDirectoryCleanupThreadForCore-collection2) [    x:collection2] o.a.s.c.DirectoryFactory /export/home/jenkins/workspace/Lucene-Solr-trunk-Solaris/solr/build/solr-core/test/J1/temp/solr.core.TestLazyCores_9F2E10F307F84B33-001/tempDir-001/collection2/data/ does not point to a valid data directory; skipping clean-up of old index directories.
   [junit4]   2> 2127297 INFO  (coreLoadExecutor-6245-thread-1) [    x:collection1] o.a.s.c.CoreContainer registering core: collection1
   [junit4]   2> 2127297 INFO  (coreLoadExecutor-6245-thread-2) [    x:collection2] o.a.s.c.SolrCore no updateRequestProcessorChain defined as default, creating implicit default
   [junit4]   2> 2127298 INFO  (coreLoadExecutor-6245-thread-2) [    x:collection2] o.a.s.h.l.XMLLoader xsltCacheLifetimeSeconds=60
   [junit4]   2> 2127299 INFO  (coreLoadExecutor-6245-thread-2) [    x:collection2] o.a.s.h.l.XMLLoader xsltCacheLifetimeSeconds=60
   [junit4]   2> 2127300 INFO  (coreLoadExecutor-6245-thread-2) [    x:collection2] o.a.s.h.l.XMLLoader xsltCacheLifetimeSeconds=60
   [junit4]   2> 2127301 INFO  (coreLoadExecutor-6245-thread-2) [    x:collection2] o.a.s.h.l.XMLLoader xsltCacheLifetimeSeconds=60
   [junit4]   2> 2127302 INFO  (coreLoadExecutor-6245-thread-2) [    x:collection2] o.a.s.c.RequestHandlers Registered paths: /admin/mbeans,/update/csv,/sql,/update/json/docs,/admin/luke,/export,/select,/admin/segments,/get,/admin/system,/replication,/admin/properties,/config,/stream,/schema,/admin/plugins,/admin/logging,/update/json,/admin/threads,/admin/ping,/update,/admin/file
   [junit4]   2> 2127303 INFO  (coreLoadExecutor-6245-thread-2) [    x:collection2] o.a.s.c.SolrCore Using default statsCache cache: org.apache.solr.search.stats.LocalStatsCache
   [junit4]   2> 2127303 INFO  (coreLoadExecutor-6245-thread-2) [    x:collection2] o.a.s.u.CommitTracker Hard AutoCommit: disabled
   [junit4]   2> 2127303 INFO  (coreLoadExecutor-6245-thread-2) [    x:collection2] o.a.s.u.CommitTracker Soft AutoCommit: disabled
   [junit4]   2> 2127303 INFO  (coreLoadExecutor-6245-thread-2) [    x:collection2] o.a.s.u.RandomMergePolicy RandomMergePolicy wrapping class org.apache.lucene.index.LogByteSizeMergePolicy: [LogByteSizeMergePolicy: minMergeSize=1677721, mergeFactor=28, maxMergeSize=2147483648, maxMergeSizeForForcedMerge=9223372036854775807, calibrateSizeByDeletes=false, maxMergeDocs=2147483647, maxCFSSegmentSizeMB=8.796093022207999E12, noCFSRatio=0.7240318838304586]
   [junit4]   2> 2127303 INFO  (coreLoadExecutor-6245-thread-2) [    x:collection2] o.a.s.c.SolrDeletionPolicy SolrDeletionPolicy.onInit: commits: num=1
   [junit4]   2> 	commit{dir=MockDirectoryWrapper(RAMDirectory@3d749790 lockFactory=org.apache.lucene.store.SingleInstanceLockFactory@b775a57),segFN=segments_1,generation=1}
   [junit4]   2> 2127303 INFO  (coreLoadExecutor-6245-thread-2) [    x:collection2] o.a.s.c.SolrDeletionPolicy newest commit generation = 1
   [junit4]   2> 2127303 INFO  (coreLoadExecutor-6245-thread-2) [    x:collection2] o.a.s.s.SolrIndexSearcher Opening [Searcher@622c4419[collection2] main]
   [junit4]   2> 2127304 INFO  (coreLoadExecutor-6245-thread-2) [    x:collection2] o.a.s.r.ManagedResourceStorage File-based storage initialized to use dir: /export/home/jenkins/workspace/Lucene-Solr-trunk-Solaris/solr/build/solr-core/test/J1/temp/solr.core.TestLazyCores_9F2E10F307F84B33-001/tempDir-001/collection2/conf
   [junit4]   2> 2127304 INFO  (coreLoadExecutor-6245-thread-2) [    x:collection2] o.a.s.r.RestManager Initializing RestManager with initArgs: {storageDir=/export/home/jenkins/workspace/Lucene-Solr-trunk-Solaris/solr/build/solr-core/test/J1/temp/solr.core.TestLazyCores_9F2E10F307F84B33-001/tempDir-001/collection2/conf}
   [junit4]   2> 2127304 INFO  (coreLoadExecutor-6245-thread-2) [    x:collection2] o.a.s.r.ManagedResourceStorage Reading _rest_managed.json using file:dir=/export/home/jenkins/workspace/Lucene-Solr-trunk-Solaris/solr/build/solr-core/test/J1/temp/solr.core.TestLazyCores_9F2E10F307F84B33-001/tempDir-001/collection2/conf
   [junit4]   2> 2127304 INFO  (coreLoadExecutor-6245-thread-2) [    x:collection2] o.a.s.r.RestManager Initializing 0 registered ManagedResources
   [junit4]   2> 2127304 INFO  (coreLoadExecutor-6245-thread-2) [    x:collection2] o.a.s.h.ReplicationHandler Commits will be reserved for  10000
   [junit4]   2> 2127304 INFO  (searcherExecutor-6252-thread-1-processing-x:collection2) [    x:collection2] o.a.s.c.SolrCore [collection2] Registered new searcher Searcher@622c4419[collection2] main{ExitableDirectoryReader(UninvertingDirectoryReader())}
   [junit4]   2> 2127304 INFO  (coreLoadExecutor-6245-thread-2) [    x:collection2] o.a.s.c.SolrCores Opening transient core collection2
   [junit4]   2> 2127305 INFO  (coreLoadExecutor-6245-thread-2) [    x:collection2] o.a.s.c.CoreContainer registering core: collection2
   [junit4]   2> 2127305 INFO  (searcherExecutor-6247-thread-1-processing-x:collection1) [    x:collection1] o.a.s.c.SolrCore [collection1] Registered new searcher Searcher@61a9d37c[collection1] main{ExitableDirectoryReader(UninvertingDirectoryReader())}
   [junit4]   2> 2127306 INFO  (TEST-TestLazyCores.testLazySearch-seed#[9F2E10F307F84B33]) [    ] o.a.s.c.SolrResourceLoader new SolrResourceLoader for directory: '/export/home/jenkins/workspace/Lucene-Solr-trunk-Solaris/solr/build/solr-core/test/J1/temp/solr.core.TestLazyCores_9F2E10F307F84B33-001/tempDir-001/collection4'
   [junit4]   2> 2127306 INFO  (TEST-TestLazyCores.testLazySearch-seed#[9F2E10F307F84B33]) [    ] o.a.s.c.SolrResourceLoader JNDI not configured for solr (NoInitialContextEx)
   [junit4]   2> 2127307 INFO  (TEST-TestLazyCores.testLazySearch-seed#[9F2E10F307F84B33]) [    ] o.a.s.c.SolrResourceLoader solr home defaulted to 'solr/' (could not find system property or JNDI)
   [junit4]   2> 2127315 INFO  (TEST-TestLazyCores.testLazySearch-seed#[9F2E10F307F84B33]) [    ] o.a.s.c.SolrConfig current version of requestparams : -1
   [junit4]   2> 2127318 INFO  (TEST-TestLazyCores.testLazySearch-seed#[9F2E10F307F84B33]) [    ] o.a.s.c.SolrConfig Using Lucene MatchVersion: 6.0.0
   [junit4]   2> 2127324 INFO  (TEST-TestLazyCores.testLazySearch-seed#[9F2E10F307F84B33]) [    ] o.a.s.c.SolrConfig Loaded SolrConfig: solrconfig.xml
   [junit4]   2> 2127327 INFO  (TEST-TestLazyCores.testLazySearch-seed#[9F2E10F307F84B33]) [    ] o.a.s.s.IndexSchema [collection4] Schema name=tiny
   [junit4]   2> 2127330 INFO  (TEST-TestLazyCores.testLazySearch-seed#[9F2E10F307F84B33]) [    ] o.a.s.s.IndexSchema unique key field: id
   [junit4]   2> 2127332 INFO  (TEST-TestLazyCores.testLazySearch-seed#[9F2E10F307F84B33]) [    ] o.a.s.c.ConfigSetProperties Did not find ConfigSet properties, assuming default properties: Can't find resource 'configsetprops.json' in classpath or '/export/home/jenkins/workspace/Lucene-Solr-trunk-Solaris/solr/build/solr-core/test/J1/temp/solr.core.TestLazyCores_9F2E10F307F84B33-001/tempDir-001/collection4'
   [junit4]   2> 2127332 INFO  (TEST-TestLazyCores.testLazySearch-seed#[9F2E10F307F84B33]) [    ] o.a.s.c.CoreContainer Creating SolrCore 'collection4' using configuration from instancedir /export/home/jenkins/workspace/Lucene-Solr-trunk-Solaris/solr/build/solr-core/test/J1/temp/solr.core.TestLazyCores_9F2E10F307F84B33-001/tempDir-001/collection4
   [junit4]   2> 2127333 INFO  (TEST-TestLazyCores.testLazySearch-seed#[9F2E10F307F84B33]) [    x:collection4] o.a.s.c.SolrCore org.apache.solr.core.MockDirectoryFactory
   [junit4]   2> 2127333 INFO  (TEST-TestLazyCores.testLazySearch-seed#[9F2E10F307F84B33]) [    x:collection4] o.a.s.c.SolrCore [[collection4] ] Opening new SolrCore at [/export/home/jenkins/workspace/Lucene-Solr-trunk-Solaris/solr/build/solr-core/test/J1/temp/solr.core.TestLazyCores_9F2E10F307F84B33-001/tempDir-001/collection4], dataDir=[/export/home/jenkins/workspace/Lucene-Solr-trunk-Solaris/solr/build/solr-core/test/J1/temp/solr.core.TestLazyCores_9F2E10F307F84B33-001/tempDir-001/collection4/data/]
   [junit4]   2> 2127333 INFO  (TEST-TestLazyCores.testLazySearch-seed#[9F2E10F307F84B33]) [    x:collection4] o.a.s.c.SolrCore JMX monitoring not detected for core: collection4
   [junit4]   2> 2127333 INFO  (TEST-TestLazyCores.testLazySearch-seed#[9F2E10F307F84B33]) [    x:collection4] o.a.s.c.CachingDirectoryFactory return new directory for /export/home/jenkins/workspace/Lucene-Solr-trunk-Solaris/solr/build/solr-core/test/J1/temp/solr.core.TestLazyCores_9F2E10F307F84B33-001/tempDir-001/collection4/data
   [junit4]   2> 2127333 INFO  (TEST-TestLazyCores.testLazySearch-seed#[9F2E10F307F84B33]) [    x:collection4] o.a.s.c.SolrCore New index directory detected: old=null new=/export/home/jenkins/workspace/Lucene-Solr-trunk-Solaris/solr/build/solr-core/test/J1/temp/solr.core.TestLazyCores_9F2E10F307F84B33-001/tempDir-001/collection4/data/index/
   [junit4]   2> 2127333 WARN  (TEST-TestLazyCores.testLazySearch-seed#[9F2E10F307F84B33]) [    x:collection4] o.a.s.c.SolrCore [collection4] Solr index directory '/export/home/jenkins/workspace/Lucene-Solr-trunk-Solaris/solr/build/solr-core/test/J1/temp/solr.core.TestLazyCores_9F2E10F307F84B33-001/tempDir-001/collection4/data/index' doesn't exist. Creating new index...
   [junit4]   2> 2127334 INFO  (TEST-TestLazyCores.testLazySearch-seed#[9F2E10F307F84B33]) [    x:collection4] o.a.s.c.CachingDirectoryFactory return new directory for /export/home/jenkins/workspace/Lucene-Solr-trunk-Solaris/solr/build/solr-core/test/J1/temp/solr.core.TestLazyCores_9F2E10F307F84B33-001/tempDir-001/collection4/data/index
   [junit4]   2> 2127334 INFO  (TEST-TestLazyCores.testLazySearch-seed#[9F2E10F307F84B33]) [    x:collection4] o.a.s.u.RandomMergePolicy RandomMergePolicy wrapping class org.apache.lucene.index.TieredMergePolicy: [TieredMergePolicy: maxMergeAtOnce=27, maxMergeAtOnceExplicit=22, maxMergedSegmentMB=5.5302734375, floorSegmentMB=2.0732421875, forceMergeDeletesPctAllowed=0.10669773172615749, segmentsPerTier=38.0, maxCFSSegmentSizeMB=8.796093022207999E12, noCFSRatio=0.19641513510216405
   [junit4]   2> 2127334 INFO  (TEST-TestLazyCores.testLazySearch-seed#[9F2E10F307F84B33]) [    x:collection4] o.a.s.c.SolrDeletionPolicy SolrDeletionPolicy.onCommit: commits: num=1
   [junit4]   2> 	commit{dir=MockDirectoryWrapper(RAMDirectory@3fe87642 lockFactory=org.apache.lucene.store.SingleInstanceLockFactory@1390e4f8),segFN=segments_1,generation=1}
   [junit4]   2> 2127335 INFO  (TEST-TestLazyCores.testLazySearch-seed#[9F2E10F307F84B33]) [    x:collection4] o.a.s.c.SolrDeletionPolicy newest commit generation = 1
   [junit4]   2> 2127335 INFO  (OldIndexDirectoryCleanupThreadForCore-collection4) [    x:collection4] o.a.s.c.SolrCore Looking for old index directories to cleanup for core collection4 in /export/home/jenkins/workspace/Lucene-Solr-trunk-Solaris/solr/build/solr-core/test/J1/temp/solr.core.TestLazyCores_9F2E10F307F84B33-001/tempDir-001/collection4/data/
   [junit4]   2> 2127335 WARN  (OldIndexDirectoryCleanupThreadForCore-collection4) [    x:collection4] o.a.s.c.DirectoryFactory /export/home/jenkins/workspace/Lucene-Solr-trunk-Solaris/solr/build/solr-core/test/J1/temp/solr.core.TestLazyCores_9F2E10F307F84B33-001/tempDir-001/collection4/data/ does not point to a valid data directory; skipping clean-up of old index directories.
   [junit4]   2> 2127337 INFO  (TEST-TestLazyCores.testLazySearch-seed#[9F2E10F307F84B33]) [    x:collection4] o.a.s.c.SolrCore no updateRequestProcessorChain defined as default, creating implicit default
   [junit4]   2> 2127339 INFO  (TEST-TestLazyCores.testLazySearch-seed#[9F2E10F307F84B33]) [    x:collection4] o.a.s.h.l.XMLLoader xsltCacheLifetimeSeconds=60
   [junit4]   2> 2127340 INFO  (TEST-TestLazyCores.testLazySearch-seed#[9F2E10F307F84B33]) [    x:collection4] o.a.s.h.l.XMLLoader xsltCacheLifetimeSeconds=60
   [junit4]   2> 2127341 INFO  (TEST-TestLazyCores.testLazySearch-seed#[9F2E10F307F84B33]) [    x:collection4] o.a.s.h.l.XMLLoader xsltCacheLifetimeSeconds=60
   [junit4]   2> 2127343 INFO  (TEST-TestLazyCores.testLazySearch-seed#[9F2E10F307F84B33]) [    x:collection4] o.a.s.h.l.XMLLoader xsltCacheLifetimeSeconds=60
   [junit4]   2> 2127345 INFO  (TEST-TestLazyCores.testLazySearch-seed#[9F2E10F307F84B33]) [    x:collection4] o.a.s.c.RequestHandlers Registered paths: /admin/mbeans,/update/csv,/sql,/update/json/docs,/admin/luke,/export,/select,/admin/segments,/get,/admin/system,/replication,/admin/properties,/config,/stream,/schema,/admin/plugins,/admin/logging,/update/json,/admin/threads,/admin/ping,/update,/admin/file
   [junit4]   2> 2127345 INFO  (TEST-TestLazyCores.testLazySearch-seed#[9F2E10F307F84B33]) [    x:collection4] o.a.s.c.SolrCore Using default statsCache cache: org.apache.solr.search.stats.LocalStatsCache
   [junit4]   2> 2127346 INFO  (TEST-TestLazyCores.testLazySearch-seed#[9F2E10F307F84B33]) [    x:collection4] o.a.s.u.CommitTracker Hard AutoCommit: disabled
   [junit4]   2> 2127346 INFO  (TEST-TestLazyCores.testLazySearch-seed#[9F2E10F307F84B33]) [    x:collection4] o.a.s.u.CommitTracker Soft AutoCommit: disabled
   [junit4]   2> 2127346 INFO  (TEST-TestLazyCores.testLazySearch-seed#[9F2E10F307F84B33]) [    x:collection4] o.a.s.u.RandomMergePolicy RandomMergePolicy wrapping class org.apache.lucene.index.LogByteSizeMergePolicy: [LogByteSizeMergePolicy: minMergeSize=1677721, mergeFactor=38, maxMergeSize=2147483648, maxMergeSizeForForcedMerge=9223372036854775807, calibrateSizeByDeletes=true, maxMergeDocs=2147483647, maxCFSSegmentSizeMB=8.796093022207999E12, noCFSRatio=0.0]
   [junit4]   2> 2127346 INFO  (TEST-TestLazyCores.testLazySearch-seed#[9F2E10F307F84B33]) [    x:collection4] o.a.s.c.SolrDeletionPolicy SolrDeletionPolicy.onInit: commits: num=1
   [junit4]   2> 	commit{dir=MockDirectoryWrapper(RAMDirectory@3fe87642 lockFactory=org.apache.lucene.store.SingleInstanceLockFactory@1390e4f8),segFN=segments_1,generation=1}
   [junit4]   2> 2127346 INFO  (TEST-TestLazyCores.testLazySearch-seed#[9F2E10F307F84B33]) [    x:collection4] o.a.s.c.SolrDeletionPolicy newest commit generation = 1
   [junit4]   2> 2127347 INFO  (TEST-TestLazyCores.testLazySearch-seed#[9F2E10F307F84B33]) [    x:collection4] o.a.s.s.SolrIndexSearcher Opening [Searcher@11fdeb0a[collection4] main]
   [junit4]   2> 2127347 INFO  (TEST-TestLazyCores.testLazySearch-seed#[9F2E10F307F84B33]) [    x:collection4] o.a.s.r.ManagedResourceStorage File-based storage initialized to use dir: /export/home/jenkins/workspace/Lucene-Solr-trunk-Solaris/solr/build/solr-core/test/J1/temp/solr.core.TestLazyCores_9F2E10F307F84B33-001/tempDir-001/collection4/conf
   [junit4]   2> 2127347 INFO  (TEST-TestLazyCores.testLazySearch-seed#[9F2E10F307F84B33]) [    x:collection4] o.a.s.r.RestManager Initializing RestManager with initArgs: {storageDir=/export/home/jenkins/workspace/Lucene-Solr-trunk-Solaris/solr/build/solr-core/test/J1/temp/solr.core.TestLazyCores_9F2E10F307F84B33-001/tempDir-001/collection4/conf}
   [junit4]   2> 2127347 INFO  (TEST-TestLazyCores.testLazySearch-seed#[9F2E10F307F84B33]) [    x:collection4] o.a.s.r.ManagedResourceStorage Reading _rest_managed.json using file:dir=/export/home/jenkins/workspace/Lucene-Solr-trunk-Solaris/solr/build/solr-core/test/J1/temp/solr.core.TestLazyCores_9F2E10F307F84B33-001/tempDir-001/collection4/conf
   [junit4]   2> 2127347 INFO  (TEST-TestLazyCores.testLazySearch-seed#[9F2E10F307F84B33]) [    x:collection4] o.a.s.r.RestManager Initializing 0 registered ManagedResources
   [junit4]   2> 2127347 INFO  (TEST-TestLazyCores.testLazySearch-seed#[9F2E10F307F84B33]) [    x:collection4] o.a.s.h.ReplicationHandler Commits will be reserved for  10000
   [junit4]   2> 2127348 INFO  (TEST-TestLazyCores.testLazySearch-seed#[9F2E10F307F84B33]) [    x:collection4] o.a.s.c.CoreContainer registering core: collection4
   [junit4]   2> 2127349 INFO  (TEST-TestLazyCores.testLazySearch-seed#[9F2E10F307F84B33]) [    x:collection4] o.a.s.u.DirectUpdateHandler2 start commit{,optimize=false,openSearcher=true,waitSearcher=true,expungeDeletes=false,softCommit=false,prepareCommit=false}
   [junit4]   2> 2127350 INFO  (searcherExecutor-6258-thread-1-processing-x:collection4) [    x:collection4] o.a.s.c.SolrCore [collection4] Registered new searcher Searcher@11fdeb0a[collection4] main{ExitableDirectoryReader(UninvertingDirectoryReader())}
   [junit4]   2> 2127351 INFO  (TEST-TestLazyCores.testLazySearch-seed#[9F2E10F307F84B33]) [    x:collection4] o.a.s.c.SolrDeletionPolicy SolrDeletionPolicy.onCommit: commits: num=2
   [junit4]   2> 	commit{dir=MockDirectoryWrapper(RAMDirectory@3fe87642 lockFactory=org.apache.lucene.store.SingleInstanceLockFactory@1390e4f8),segFN=segments_1,generation=1}
   [junit4]   2> 	commit{dir=MockDirectoryWrapper(RAMDirectory@3fe87642 lockFactory=org.apache.lucene.store.SingleInstanceLockFactory@1390e4f8),segFN=segments_2,generation=2}
   [junit4]   2> 2127351 INFO  (TEST-TestLazyCores.testLazySearch-seed#[9F2E10F307F84B33]) [    x:collection4] o.a.s.c.SolrDeletionPolicy newest commit generation = 2
   [junit4]   2> 2127352 INFO  (TEST-TestLazyCores.testLazySearch-seed#[9F2E10F307F84B33]) [    x:collection4] o.a.s.s.SolrIndexSearcher Opening [Searcher@5bbb16cf[collection4] main]
   [junit4]   2> 2127352 INFO  (TEST-TestLazyCores.testLazySearch-seed#[9F2E10F307F84B33]) [    x:collection4] o.a.s.u.DirectUpdateHandler2 end_commit_flush
   [junit4]   2> 2127352 INFO  (searcherExecutor-6258-thread-1-processing-x:collection4) [    x:collection4] o.a.s.c.SolrCore [collection4] Registered new searcher Searcher@5bbb16cf[collection4] main{ExitableDirectoryReader(UninvertingDirectoryReader(Uninverting(_0(6.0.0):C7)))}
   [junit4]   2> 2127353 INFO  (TEST-TestLazyCores.testLazySearch-seed#[9F2E10F307F84B33]) [    x:collection4] o.a.s.c.S.Request [collection4]  webapp=null path=null params={q={!prefix+f%3Dv_t}hel&wt=xml} hits=2 status=0 QTime=0
   [junit4]   2> 2127355 INFO  (TEST-TestLazyCores.testLazySearch-seed#[9F2E10F307F84B33]) [    x:collection4] o.a.s.c.S.Request [collection4]  webapp=null path=null params={q={!raw+f%3Dv_t}hello&wt=xml} hits=2 status=0 QTime=0
   [junit4]   2> 2127389 INFO  (TEST-TestLazyCores.testLazySearch-seed#[9F2E10F307F84B33]) [    x:collection4] o.a.s.c.S.Request [collection4]  webapp=null path=null params={q={!raw+f%3Dv_t}Hello&wt=xml} hits=0 status=0 QTime=0
   [junit4]   2> 2127389 INFO  (TEST-TestLazyCores.testLazySearch-seed#[9F2E10F307F84B33]) [    x:collection4] o.a.s.c.S.Request [collection4]  webapp=null path=null params={q={!raw+f%3Dv_f}1.5&wt=xml} hits=0 status=0 QTime=0
   [junit4]   2> 2127390 INFO  (TEST-TestLazyCores.testLazySearch-seed#[9F2E10F307F84B33]) [    x:collection4] o.a.s.c.S.Request [collection1]  webapp=null path=null params={q={!raw+f%3Dv_t}hello&wt=xml} hits=0 status=0 QTime=0
   [junit4]   2> 2127390 INFO  (TEST-TestLazyCores.testLazySearch-seed#[9F2E10F307F84B33]) [    x:collection4] o.a.s.c.CoreContainer Shutting down CoreContainer instance=1251820740
   [junit4]   2> 2127390 INFO  (coreCloseExecutor-6262-thread-1-processing-x:collection4) [    x:collection5] o.a.s.c.SolrCore [collection5]  CLOSING SolrCore org.apache.solr.core.SolrCore@5921e543
   [junit4]   2> 2127391 INFO  (coreCloseExecutor-6262-thread-1-processing-x:collection4) [    x:collection5] o.a.s.u.DirectUpdateHandler2 closing DirectUpdateHandler2{commits=0,autocommits=0,soft autocommits=0,optimizes=0,rollbacks=0,expungeDeletes=0,docsPending=0,adds=0,deletesById=0,deletesByQuery=0,errors=0,cumulative_adds=0,cumulative_deletesById=0,cumulative_deletesByQuery=0,cumulative_errors=0}
   [junit4]   2> 2127391 INFO  (coreCloseExecutor-6262-thread-1-processing-x:collection4) [    x:collection5] o.a.s.u.SolrCoreState Closing SolrCoreState
   [junit4]   2> 2127391 INFO  (coreCloseExecutor-6262-thread-1-processing-x:collection4) [    x:collection5] o.a.s.u.DefaultSolrCoreState SolrCoreState ref count has reached 0 - closing IndexWriter
   [junit4]   2> 2127391 INFO  (coreCloseExecutor-6262-thread-1-processing-x:collection4) [    x:collection5] o.a.s.u.DefaultSolrCoreState closing IndexWriter with IndexWriterCloser
   [junit4]   2> 2127392 INFO  (coreCloseExecutor-6262-thread-1-processing-x:collection4) [    x:collection5] o.a.s.c.SolrCore [collection5] Closing main searcher on request.
   [junit4]   2> 2127393 INFO  (coreCloseExecutor-6262-thread-1-processing-x:collection4) [    x:collection5] o.a.s.c.CachingDirectoryFactory Closing MockDirectoryFactory - 2 directories currently being tracked
   [junit4]   2> 2127393 INFO  (coreCloseExecutor-6262-thread-1-processing-x:collection4) [    x:collection5] o.a.s.c.CachingDirectoryFactory looking to close /export/home/jenkins/workspace/Lucene-Solr-trunk-Solaris/solr/build/solr-core/test/J1/temp/solr.core.TestLazyCores_9F2E10F307F84B33-001/tempDir-001/collection5/data [CachedDir<<refCount=0;path=/export/home/jenkins/workspace/Lucene-Solr-trunk-Solaris/solr/build/solr-core/test/J1/temp/solr.core.TestLazyCores_9F2E10F307F84B33-001/tempDir-001/collection5/data;done=false>>]
   [junit4]   2> 2127393 INFO  (coreCloseExecutor-6262-thread-1-processing-x:collection4) [    x:collection5] o.a.s.c.CachingDirectoryFactory Closing directory: /export/home/jenkins/workspace/Lucene-Solr-trunk-Solaris/solr/build/solr-core/test/J1/temp/solr.core.TestLazyCores_9F2E10F307F84B33-001/tempDir-001/collection5/data
   [junit4]   2> 2127393 INFO  (coreCloseExecutor-6262-thread-1-processing-x:collection4) [    x:collection5] o.a.s.c.CachingDirectoryFactory looking to close /export/home/jenkins/workspace/Lucene-Solr-trunk-Solaris/solr/build/solr-core/test/J1/temp/solr.core.TestLazyCores_9F2E10F307F84B33-001/tempDir-001/collection5/data/index [CachedDir<<refCount=0;path=/export/home/jenkins/workspace/Lucene-Solr-trunk-Solaris/solr/build/solr-core/test/J1/temp/solr.core.TestLazyCores_9F2E10F307F84B33-001/tempDir-001/collection5/data/index;done=false>>]
   [junit4]   2> 2127393 INFO  (coreCloseExecutor-6262-thread-1-processing-x:collection4) [    x:collection5] o.a.s.c.CachingDirectoryFactory Closing directory: /export/home/jenkins/workspace/Lucene-Solr-trunk-Solaris/solr/build/solr-core/test/J1/temp/solr.core.TestLazyCores_9F2E10F307F84B33-001/tempDir-001/collection5/data/index
   [junit4]   2> 2127393 INFO  (coreCloseExecutor-6263-thread-1-processing-x:collection4) [    x:collection1] o.a.s.c.SolrCore [collection1]  CLOSING SolrCore org.apache.solr.core.SolrCore@67e8fa37
   [junit4]   2> 2127393 INFO  (coreCloseExecutor-6263-thread-1-processing-x:collection4) [    x:collection1] o.a.s.u.DirectUpdateHandler2 closing DirectUpdateHandler2{commits=0,autocommits=0,soft autocommits=0,optimizes=0,rollbacks=0,expungeDeletes=0,docsPending=0,adds=0,deletesById=0,deletesByQuery=0,errors=0,cumulative_adds=0,cumulative_deletesById=0,cumulative_deletesByQuery=0,cumulative_errors=0}
   [junit4]   2> 2127393 INFO  (coreCloseExecutor-6263-thread-1-processing-x:collection4) [    x:collection1] o.a.s.u.SolrCoreState Closing SolrCoreState
   [junit4]   2> 2127394 INFO  (coreCloseExecutor-6263-thread-1-processing-x:collection4) [    x:collection1] o.a.s.u.DefaultSolrCoreState SolrCoreState ref count has reached 0 - closing IndexWriter
   [junit4]   2> 2127394 INFO  (coreCloseExecutor-6263-thread-1-processing-x:collection4) [    x:collection1] o.a.s.u.DefaultSolrCoreState closing IndexWriter with IndexWriterCloser
   [junit4]   2> 2127394 INFO  (coreCloseExecutor-6263-thread-1-processing-x:collection4) [    x:collection1] o.a.s.c.SolrCore [collection1] Closing main searcher on request.
   [junit4]   2> 2127395 INFO  (coreCloseExecutor-6263-thread-1-processing-x:collection4) [    x:collection1] o.a.s.c.CachingDirectoryFactory Closing MockDirectoryFactory - 2 directories currently being tracked
   [junit4]   2> 2127395 INFO  (coreCloseExecutor-6263-thread-1-processing-x:collection4) [    x:collection1] o.a.s.c.CachingDirectoryFactory looking to close /export/home/jenkins/workspace/Lucene-Solr-trunk-Solaris/solr/build/solr-core/test/J1/temp/solr.core.TestLazyCores_9F2E10F307F84B33-001/tempDir-001/collection1/data/index [CachedDir<<refCount=0;path=/export/home/jenkins/workspace/Lucene-Solr-trunk-Solaris/solr/build/solr-core/test/J1/temp/solr.core.TestLazyCores_9F2E10F307F84B33-001/tempDir-001/collection1/data/index;done=false>>]
   [junit4]   2> 2127395 INFO  (coreCloseExecutor-6263-thread-1-processing-x:collection4) [    x:collection1] o.a.s.c.CachingDirectoryFactory Closing directory: /export/home/jenkins/workspace/Lucene-Solr-trunk-Solaris/solr/build/solr-core/test/J1/temp/solr.core.TestLazyCores_9F2E10F307F84B33-001/tempDir-001/collection1/data/index
   [junit4]   2> 2127395 INFO  (coreCloseExecutor-6263-thread-1-processing-x:collection4) [    x:collection1] o.a.s.c.CachingDirectoryFactory looking to close /export/home/jenkins/workspace/Lucene-Solr-trunk-Solaris/solr/build/solr-core/test/J1/temp/solr.core.TestLazyCores_9F2E10F307F84B33-001/tempDir-001/collection1/data [CachedDir<<refCount=0;path=/export/home/jenkins/workspace/Lucene-Solr-trunk-Solaris/solr/build/solr-core/test/J1/temp/solr.core.TestLazyCores_9F2E10F307F84B33-001/tempDir-001/collection1/data;done=false>>]
   [junit4]   2> 2127395 INFO  (coreCloseExecutor-6263-thread-1-processing-x:collection4) [    x:collection1] o.a.s.c.CachingDirectoryFactory Closing directory: /export/home/jenkins/workspace/Lucene-Solr-trunk-Solaris/solr/build/solr-core/test/J1/temp/solr.core.TestLazyCores_9F2E10F307F84B33-001/tempDir-001/collection1/data
   [junit4]   2> 2127395 INFO  (coreCloseExecutor-6264-thread-1-processing-x:collection4) [    x:collection4] o.a.s.c.SolrCore [collection4]  CLOSING SolrCore org.apache.solr.core.SolrCore@4da123ad
   [junit4]   2> 2127395 INFO  (coreCloseExecutor-6264-thread-1-processing-x:collection4) [    x:collection4] o.a.s.u.DirectUpdateHandler2 closing DirectUpdateHandler2{commits=1,autocommits=0,soft autocommits=0,optimizes=0,rollbacks=0,expungeDeletes=0,docsPending=0,adds=0,deletesById=0,deletesByQuery=0,errors=0,cumulative_adds=7,cumulative_deletesById=0,cumulative_deletesByQuery=0,cumulative_errors=0}
   [junit4]   2> 2127395 INFO  (coreCloseExecutor-6264-thread-1-processing-x:collection4) [    x:collection4] o.a.s.u.SolrCoreState Closing SolrCoreState
   [junit4]   2> 2127395 INFO  (coreCloseExecutor-6264-thread-1-processing-x:collection4) [    x:collection4] o.a.s.u.DefaultSolrCoreState SolrCoreState ref count has reached 0 - closing IndexWriter
   [junit4]   2> 2127395 INFO  (coreCloseExecutor-6264-thread-1-processing-x:collection4) [    x:collection4] o.a.s.u.DefaultSolrCoreState closing IndexWriter with IndexWriterCloser
   [junit4]   2> 2127397 INFO  (coreCloseExecutor-6264-thread-1-processing-x:collection4) [    x:collection4] o.a.s.c.SolrCore [collection4] Closing main searcher on request.
   [junit4]   2> 2127397 INFO  (coreCloseExecutor-6264-thread-1-processing-x:collection4) [    x:collection4] o.a.s.c.CachingDirectoryFactory Closing MockDirectoryFactory - 2 directories currently being tracked
   [junit4]   2> 2127398 INFO  (coreCloseExecutor-6264-thread-1-processing-x:collection4) [    x:collection4] o.a.s.c.CachingDirectoryFactory looking to close /export/home/jenkins/workspace/Lucene-Solr-trunk-Solaris/solr/build/solr-core/test/J1/temp/solr.core.TestLazyCores_9F2E10F307F84B33-001/tempDir-001/collection4/data/index [CachedDir<<refCount=0;path=/export/home/jenkins/workspace/Lucene-Solr-trunk-Solaris/solr/build/solr-core/test/J1/temp/solr.core.TestLazyCores_9F2E10F307F84B33-001/tempDir-001/collection4/data/index;done=false>>]
   [junit4]   2> 2127398 INFO  (coreCloseExecutor-6264-thread-1-processing-x:collection4) [    x:collection4] o.a.s.c.CachingDirectoryFactory Closing directory: /export/home/jenkins/workspace/Lucene-Solr-trunk-Solaris/solr/build/solr-core/test/J1/temp/solr.core.TestLazyCores_9F2E10F307F84B33-001/tempDir-001/collection4/data/index
   [junit4]   2> 2127398 INFO  (coreCloseExecutor-6264-thread-1-processing-x:collection4) [    x:collection4] o.a.s.c.CachingDirectoryFactory looking to close /export/home/jenkins/workspace/Lucene-Solr-trunk-Solaris/solr/build/solr-core/test/J1/temp/solr.core.TestLazyCores_9F2E10F307F84B33-001/tempDir-001/collection4/data [CachedDir<<refCount=0;path=/export/home/jenkins/workspace/Lucene-Solr-trunk-Solaris/solr/build/solr-core/test/J1/temp/solr.core.TestLazyCores_9F2E10F307F84B33-001/tempDir-001/collection4/data;done=false>>]
   [junit4]   2> 2127398 INFO  (coreCloseExecutor-6264-thread-1-processing-x:collection4) [    x:collection4] o.a.s.c.CachingDirectoryFactory Closing directory: /export/home/jenkins/workspace/Lucene-Solr-trunk-Solaris/solr/build/solr-core/test/J1/temp/solr.core.TestLazyCores_9F2E10F307F84B33-001/tempDir-001/collection4/data
   [junit4]   2> 2127398 INFO  (coreCloseExecutor-6265-thread-1-processing-x:collection4) [    x:collection2] o.a.s.c.SolrCore [collection2]  CLOSING SolrCore org.apache.solr.core.SolrCore@54dd631e
   [junit4]   2> 2127398 INFO  (coreCloseExecutor-6265-thread-1-processing-x:collection4) [    x:collection2] o.a.s.u.DirectUpdateHandler2 closing DirectUpdateHandler2{commits=0,autocommits=0,soft autocommits=0,optimizes=0,rollbacks=0,expungeDeletes=0,docsPending=0,adds=0,deletesById=0,deletesByQuery=0,errors=0,cumulative_adds=0,cumulative_deletesById=0,cumulative_deletesByQuery=0,cumulative_errors=0}
   [junit4]   2> 2127398 INFO  (coreCloseExecutor-6265-thread-1-processing-x:collection4) [    x:collection2] o.a.s.u.SolrCoreState Closing SolrCoreState
   [junit4]   2> 2127398 INFO  (coreCloseExecutor-6265-thread-1-processing-x:collection4) [    x:collection2] o.a.s.u.DefaultSolrCoreState SolrCoreState ref count has reached 0 - closing IndexWriter
   [junit4]   2> 2127398 INFO  (coreCloseExecutor-6265-thread-1-processing-x:collection4) [    x:collection2] o.a.s.u.DefaultSolrCoreState closing IndexWriter with IndexWriterCloser
   [junit4]   2> 2127399 INFO  (coreCloseExecutor-6265-thread-1-processing-x:collection4) [    x:collection2] o.a.s.c.SolrCore [collection2] Closing main searcher on request.
   [junit4]   2> 2127399 INFO  (coreCloseExecutor-6265-thread-1-processing-x:collection4) [    x:collection2] o.a.s.c.CachingDirectoryFactory Closing MockDirectoryFactory - 2 directories currently being tracked
   [junit4]   2> 2127399 INFO  (coreCloseExecutor-6265-thread-1-processing-x:collection4) [    x:collection2] o.a.s.c.CachingDirectoryFactory looking to close /export/home/jenkins/workspace/Lucene-Solr-trunk-Solaris/solr/build/solr-core/test/J1/temp/solr.core.TestLazyCores_9F2E10F307F84B33-001/tempDir-001/collection2/data/index [CachedDir<<refCount=0;path=/export/home/jenkins/workspace/Lucene-Solr-trunk-Solaris/solr/build/solr-core/test/J1/temp/solr.core.TestLazyCores_9F2E10F307F84B33-001/tempDir-001/collection2/data/index;done=false>>]
   [junit4]   2> 2127399 INFO  (coreCloseExecutor-6265-thread-1-processing-x:collection4) [    x:collection2] o.a.s.c.CachingDirectoryFactory Closing directory: /export/home/jenkins/workspace/Lucene-Solr-trunk-Solaris/solr/build/solr-core/test/J1/temp/solr.core.TestLazyCores_9F2E10F307F84B33-001/tempDir-001/collection2/data/index
   [junit4]   2> 2127400 INFO  (coreCloseExecutor-6265-thread-1-processing-x:collection4) [    x:collection2] o.a.s.c.CachingDirectoryFactory looking to close /export/home/jenkins/workspace/Lucene-Solr-trunk-Solaris/solr/build/solr-core/test/J1/temp/solr.core.TestLazyCores_9F2E10F307F84B33-001/tempDir-001/collection2/data [CachedDir<<refCount=0;path=/export/home/jenkins/workspace/Lucene-Solr-trunk-Solaris/solr/build/solr-core/test/J1/temp/solr.core.TestLazyCores_9F2E10F307F84B33-001/tempDir-001/collection2/data;done=false>>]
   [junit4]   2> 2127400 INFO  (coreCloseExecutor-6265-thread-1-processing-x:collection4) [    x:collection2] o.a.s.c.CachingDirectoryFactory Closing directory: /export/home/jenkins/workspace/Lucene-Solr-trunk-Solaris/solr/build/solr-core/test/J1/temp/solr.core.TestLazyCores_9F2E10F307F84B33-001/tempDir-001/collection2/data
   [junit4]   2> 2127400 INFO  (TEST-TestLazyCores.testLazySearch-seed#[9F2E10F307F84B33]) [    x:collection4] o.a.s.SolrTestCaseJ4 ###Ending testLazySearch
   [junit4]   2> 2127402 INFO  (TEST-TestLazyCores.testBadConfigsGenerateErrors-seed#[9F2E10F307F84B33]) [    x:collection4] o.a.s.SolrTestCaseJ4 ###Starting testBadConfigsGenerateErrors
   [junit4]   2> 2127414 INFO  (TEST-TestLazyCores.testBadConfigsGenerateErrors-seed#[9F2E10F307F84B33]) [    x:collection4] o.a.s.c.SolrResourceLoader new SolrResourceLoader for directory: '/export/home/jenkins/workspace/Lucene-Solr-trunk-Solaris/solr/build/solr-core/test/J1/temp/solr.core.TestLazyCores_9F2E10F307F84B33-001/tempDir-002'
   [junit4]   2> 2127414 INFO  (TEST-TestLazyCores.testBadConfigsGenerateErrors-seed#[9F2E10F307F84B33]) [    x:collection4] o.a.s.c.SolrResourceLoader JNDI not configured for solr (NoInitialContextEx)
   [junit4]   2> 2127414 INFO  (TEST-TestLazyCores.testBadConfigsGenerateErrors-seed#[9F2E10F307F84B33]) [    x:collection4] o.a.s.c.SolrResourceLoader solr home defaulted to 'solr/' (could not find system property or JNDI)
   [junit4]   2> 2127418 INFO  (TEST-TestLazyCores.testBadConfigsGenerateErrors-seed#[9F2E10F307F84B33]) [    x:collection4] o.a.s.c.CorePropertiesLocator Config-defined core root directory: /export/home/jenkins/workspace/Lucene-Solr-trunk-Solaris/solr/build/solr-core/test/J1/temp/solr.core.TestLazyCores_9F2E10F307F84B33-001/tempDir-002
   [junit4]   2> 2127418 INFO  (TEST-TestLazyCores.testBadConfigsGenerateErrors-seed#[9F2E10F307F84B33]) [    x:collection4] o.a.s.c.CoreContainer New CoreContainer 1118616873
   [junit4]   2> 2127418 INFO  (TEST-TestLazyCores.testBadConfigsGenerateErrors-seed#[9F2E10F307F84B33]) [    x:collection4] o.a.s.c.CoreContainer Loading cores into CoreContainer [instanceDir=/export/home/jenkins/workspace/Lucene-Solr-trunk-Solaris/solr/build/solr-core/test/J1/temp/solr.core.TestLazyCores_9F2E10F307F84B33-001/tempDir-002]
   [junit4]   2> 2127418 WARN  (TEST-TestLazyCores.testBadConfigsGenerateErrors-seed#[9F2E10F307F84B33]) [    x:collection4] o.a.s.c.CoreContainer Couldn't add files from /export/home/jenkins/workspace/Lucene-Solr-trunk-Solaris/solr/build/solr-core/test/J1/temp/solr.core.TestLazyCores_9F2E10F307F84B33-001/tempDir-002/lib to classpath: /export/home/jenkins/workspace/Lucene-Solr-trunk-Solaris/solr/build/solr-core/test/J1/temp/solr.core.TestLazyCores_9F2E10F307F84B33-001/tempDir-002/lib
   [junit4]   2> 2127419 INFO  (TEST-TestLazyCores.testBadConfigsGenerateErrors-seed#[9F2E10F307F84B33]) [    x:collection4] o.a.s.h.c.HttpShardHandlerFactory created with socketTimeout : 600000,connTimeout : 60000,maxConnectionsPerHost : 20,maxConnections : 10000,corePoolSize : 0,maximumPoolSize : 2147483647,maxThreadIdleTime : 5,sizeOfQueue : -1,fairnessPolicy : false,useRetries : false,
   [junit4]   2> 2127420 INFO  (TEST-TestLazyCores.testBadConfigsGenerateErrors-seed#[9F2E10F307F84B33]) [    x:collection4] o.a.s.u.UpdateShardHandler Creating UpdateShardHandler HTTP client with params: socketTimeout=600000&connTimeout=60000&retry=true
   [junit4]   2> 2127421 INFO  (TEST-TestLazyCores.testBadConfigsGenerateErrors-seed#[9F2E10F307F84B33]) [    x:collection4] o.a.s.l.LogWatcher SLF4J impl is org.slf4j.impl.Log4jLoggerFactory
   [junit4]   2> 2127421 INFO  (TEST-TestLazyCores.testBadConfigsGenerateErrors-seed#[9F2E10F307F84B33]) [    x:collection4] o.a.s.l.LogWatcher Registering Log Listener [Log4j (org.slf4j.impl.Log4jLoggerFactory)]
   [junit4]   2> 2127421 INFO  (TEST-TestLazyCores.testBadConfigsGenerateErrors-seed#[9F2E10F307F84B33]) [    x:collection4] o.a.s.c.CoreContainer Security conf doesn't exist. Skipping setup for authorization module.
   [junit4]   2> 2127421 INFO  (TEST-TestLazyCores.testBadConfigsGenerateErrors-seed#[9F2E10F307F84B33]) [    x:collection4] o.a.s.c.CoreContainer No authentication plugin used.
   [junit4]   2> 2127422 INFO  (TEST-TestLazyCores.testBadConfigsGenerateErrors-seed#[9F2E10F307F84B33]) [    x:collection4] o.a.s.c.CorePropertiesLocator Looking for core definitions underneath /export/home/jenkins/workspace/Lucene-Solr-trunk-Solaris/solr/build/solr-core/test/J1/temp/solr.core.TestLazyCores_9F2E10F307F84B33-001/tempDir-002
   [junit4]   2> 2127422 INFO  (TEST-TestLazyCores.testBadConfigsGenerateErrors-seed#[9F2E10F307F84B33]) [    x:collection4] o.a.s.c.CoreDescriptor Created CoreDescriptor: {name=core1, config=solrconfig.xml, loadOnStartup=true, schema=schema.xml, configSetProperties=configsetprops.json, transient=false, dataDir=data/}
   [junit4]   2> 2127422 INFO  (TEST-TestLazyCores.testBadConfigsGenerateErrors-seed#[9F2E10F307F84B33]) [    x:collection4] o.a.s.c.CorePropertiesLocator Found core core1 in /export/home/jenkins/workspace/Lucene-Solr-trunk-Solaris/solr/build/solr-core/test/J1/temp/solr.core.TestLazyCores_9F2E10F307F84B33-001/tempDir-002/core1
   [junit4]   2> 2127422 INFO  (TEST-TestLazyCores.testBadConfigsGenerateErrors-seed#[9F2E10F307F84B33]) [    x:collection4] o.a.s.c.CoreDescriptor Created CoreDescriptor: {name=badSchema2, config=solrconfig.xml, loadOnStartup=true, schema=schema.xml, configSetProperties=configsetprops.json, transient=true, dataDir=data/}
   [junit4]   2> 2127423 INFO  (TEST-TestLazyCores.testBadConfigsGenerateErrors-seed#[9F2E10F307F84B33]) [    x:collection4] o.a.s.c.CorePropertiesLocator Found core badSchema2 in /export/home/jenkins/workspace/Lucene-Solr-trunk-Solaris/solr/build/solr-core/test/J1/temp/solr.core.TestLazyCores_9F2E10F307F84B33-001/tempDir-002/badSchema2
   [junit4]   2> 2127423 INFO  (TEST-TestLazyCores.testBadConfigsGenerateErrors-seed#[9F2E10F307F84B33]) [    x:collection4] o.a.s.c.CoreDescriptor Created CoreDescriptor: {name=badConfig1, config=solrconfig.xml, loadOnStartup=true, schema=schema.xml, configSetProperties=configsetprops.json, transient=true, dataDir=data/}
   [junit4]   2> 2127423 INFO  (TEST-TestLazyCores.testBadConfigsGenerateErrors-seed#[9F2E10F307F84B33]) [    x:collection4] o.a.s.c.CorePropertiesLocator Found core badConfig1 in /export/home/jenkins/workspace/Lucene-Solr-trunk-Solaris/solr/build/solr-core/test/J1/temp/solr.core.TestLazyCores_9F2E10F307F84B33-001/tempDir-002/badConfig1
   [junit4]   2> 2127425 INFO  (TEST-TestLazyCores.testBadConfigsGenerateErrors-seed#[9F2E10F307F84B33]) [    x:collection4] o.a.s.c.CoreDescriptor Created CoreDescriptor: {name=core2, config=solrconfig.xml, loadOnStartup=true, schema=schema.xml, configSetProperties=configsetprops.json, transient=false, dataDir=data/}
   [junit4]   2> 2127425 INFO  (TEST-TestLazyCores.testBadConfigsGenerateErrors-seed#[9F2E10F307F84B33]) [    x:collection4] o.a.s.c.CorePropertiesLocator Found core core2 in /export/home/jenkins/workspace/Lucene-Solr-trunk-Solaris/solr/build/solr-core/test/J1/temp/solr.core.TestLazyCores_9F2E10F307F84B33-001/tempDir-002/core2
   [junit4]   2> 2127425 INFO  (TEST-TestLazyCores.testBadConfigsGenerateErrors-seed#[9F2E10F307F84B33]) [    x:collection4] o.a.s.c.CoreDescriptor Created CoreDescriptor: {name=badSchema1, config=solrconfig.xml, loadOnStartup=true, schema=schema.xml, configSetProperties=configsetprops.json, transient=true, dataDir=data/}
   [junit4]   2> 2127425 INFO  (TEST-TestLazyCores.testBadConfigsGenerateErrors-seed#[9F2E10F307F84B33]) [    x:collection4] o.a.s.c.CorePropertiesLocator Found core badSchema1 in /export/home/jenkins/workspace/Lucene-Solr-trunk-Solaris/solr/build/solr-core/test/J1/temp/solr.core.TestLazyCores_9F2E10F307F84B33-001/tempDir-002/badSchema1
   [junit4]   2> 2127426 INFO  (TEST-TestLazyCores.testBadConfigsGenerateErrors-seed#[9F2E10F307F84B33]) [    x:collection4] o.a.s.c.CoreDescriptor Created CoreDescriptor: {name=badConfig2, config=solrconfig.xml, loadOnStartup=true, schema=schema.xml, configSetProperties=configsetprops.json, transient=true, dataDir=data/}
   [junit4]   2> 2127426 INFO  (TEST-TestLazyCores.testBadConfigsGenerateErrors-seed#[9F2E10F307F84B33]) [    x:collection4] o.a.s.c.CorePropertiesLocator Found core badConfig2 in /export/home/jenkins/workspace/Lucene-Solr-trunk-Solaris/solr/build/solr-core/test/J1/temp/solr.core.TestLazyCores_9F2E10F307F84B33-001/tempDir-002/badConfig2
   [junit4]   2> 2127426 INFO  (TEST-TestLazyCores.testBadConfigsGenerateErrors-seed#[9F2E10F307F84B33]) [    x:collection4] o.a.s.c.CorePropertiesLocator Found 6 core definitions
   [junit4]   2> 2127426 INFO  (coreLoadExecutor-6271-thread-1-processing-x:collection4) [    x:collection4] o.a.s.c.SolrResourceLoader new SolrResourceLoader for directory: '/export/home/jenkins/workspace/Lucene-Solr-trunk-Solaris/solr/build/solr-core/test/J1/temp/solr.core.TestLazyCores_9F2E10F307F84B33-001/tempDir-002/core1'
   [junit4]   2> 2127426 INFO  (coreLoadExecutor-6271-thread-1-processing-x:collection4) [    x:collection4] o.a.s.c.SolrResourceLoader JNDI not configured for solr (NoInitialContextEx)
   [junit4]   2> 2127426 INFO  (coreLoadExecutor-6271-thread-1-processing-x:collection4) [    x:collection4] o.a.s.c.SolrResourceLoader solr home defaulted to 'solr/' (could not find system property or JNDI)
   [junit4]   2> 2127427 INFO  (coreLoadExecutor-6271-thread-3-processing-x:collection4) [    x:collection4] o.a.s.c.SolrResourceLoader new SolrResourceLoader for directory: '/export/home/jenkins/workspace/Lucene-Solr-trunk-Solaris/solr/build/solr-core/test/J1/temp/solr.core.TestLazyCores_9F2E10F307F84B33-001/tempDir-002/badConfig1'
   [junit4]   2> 2127427 INFO  (coreLoadExecutor-6271-thread-3-processing-x:collection4) [    x:collection4] o.a.s.c.SolrResourceLoader JNDI not configured for solr (NoInitialContextEx)
   [junit4]   2> 2127427 INFO  (coreLoadExecutor-6271-thread-3-processing-x:collection4) [    x:collection4] o.a.s.c.SolrResourceLoader solr home defaulted to 'solr/' (could not find system property or JNDI)
   [junit4]   2> 2127427 INFO  (coreLoadExecutor-6271-thread-2-processing-x:collection4) [    x:collection4] o.a.s.c.SolrResourceLoader new SolrResourceLoader for directory: '/export/home/jenkins/workspace/Lucene-Solr-trunk-Solaris/solr/build/solr-core/test/J1/temp/solr.core.TestLazyCores_9F2E10F307F84B33-001/tempDir-002/badSchema2'
   [junit4]   2> 2127429 INFO  (coreLoadExecutor-6271-thread-2-processing-x:collection4) [    x:collection4] o.a.s.c.SolrResourceLoader JNDI not configured for solr (NoInitialContextEx)
   [junit4]   2> 2127429 INFO  (coreLoadExecutor-6271-thread-2-processing-x:collection4) [    x:collection4] o.a.s.c.SolrResourceLoader solr home defaulted to 'solr/' (could not find system property or JNDI)
   [junit4]   2> 2127436 INFO  (coreLoadExecutor-6271-thread-2-processing-x:collection4) [    x:collection4] o.a.s.c.SolrConfig current version of requestparams : -1
   [junit4]   2> 2127438 INFO  (coreLoadExecutor-6271-thread-2-processing-x:collection4) [    x:collection4] o.a.s.c.SolrConfig Using Lucene MatchVersion: 6.0.0
   [junit4]   2> 2127440 INFO  (coreLoadExecutor-6271-thread-1-processing-x:collection4) [    x:collection4] o.a.s.c.SolrConfig current version of requestparams : -1
   [junit4]   2> 2127443 INFO  (coreLoadExecutor-6271-thread-2-processing-x:collection4) [    x:collection4] o.a.s.c.SolrConfig Loaded SolrConfig: solrconfig.xml
   [junit4]   2> 2127443 INFO  (coreLoadExecutor-6271-thread-1-processing-x:collection4) [    x:collection4] o.a.s.c.SolrConfig Using Lucene MatchVersion: 6.0.0
   [junit4]   2> 2127457 INFO  (coreLoadExecutor-6271-thread-1-processing-x:collection4) [    x:collection4] o.a.s.c.SolrConfig Loaded SolrConfig: solrconfig.xml
   [junit4]   2> 2127460 INFO  (coreLoadExecutor-6271-thread-1-processing-x:collection4) [    x:collection4] o.a.s.s.IndexSchema [core1] Schema name=tiny
   [junit4]   2> 2127466 INFO  (coreLoadExecutor-6271-thread-2-processing-x:collection4) [    x:collection4] o.a.s.c.Config Ignoring exception matching \QSAXParseException\E
   [junit4]   2> 2127466 ERROR (coreLoadExecutor-6271-thread-2-processing-x:collection4) [    x:collection4] o.a.s.c.CoreContainer Error creating core [badSchema2]: Could not load conf for core badSchema2: Can't load schema /export/home/jenkins/workspace/Lucene-Solr-trunk-Solaris/solr/build/solr-core/test/J1/temp/solr.core.TestLazyCores_9F2E10F307F84B33-001/tempDir-002/badSchema2/conf/schema.xml: org.xml.sax.SAXParseException; systemId: solrres:/schema.xml; lineNumber: 35; columnNumber: 7; Elementtyp "filedType" m?ste avslutas med matchande sluttagg "</filedType>".
   [junit4]   2> org.apache.solr.common.SolrException: Could not load conf for core badSchema2: Can't load schema /export/home/jenkins/workspace/Lucene-Solr-trunk-Solaris/solr/build/solr-core/test/J1/temp/solr.core.TestLazyCores_9F2E10F307F84B33-001/tempDir-002/badSchema2/conf/schema.xml: org.xml.sax.SAXParseException; systemId: solrres:/schema.xml; lineNumber: 35; columnNumber: 7; Elementtyp "filedType" m?ste avslutas med matchande sluttagg "</filedType>".
   [junit4]   2> 	at org.apache.solr.core.ConfigSetService.getConfig(ConfigSetService.java:86)
   [junit4]   2> 	at org.apache.solr.core.CoreContainer.create(CoreContainer.java:815)
   [junit4]   2> 	at org.apache.solr.core.CoreContainer.access$000(CoreContainer.java:87)
   [junit4]   2> 	at org.apache.solr.core.CoreContainer$1.call(CoreContainer.java:467)
   [junit4]   2> 	at org.apache.solr.core.CoreContainer$1.call(CoreContainer.java:458)
   [junit4]   2> 	at java.util.concurrent.FutureTask.run(FutureTask.java:266)
   [junit4]   2> 	at org.apache.solr.common.util.ExecutorUtil$MDCAwareThreadPoolExecutor$1.run(ExecutorUtil.java:231)
   [junit4]   2> 	at java.util.concurrent.ThreadPoolExecutor.runWorker(ThreadPoolExecutor.java:1142)
   [junit4]   2> 	at java.util.concurrent.ThreadPoolExecutor$Worker.run(ThreadPoolExecutor.java:617)
   [junit4]   2> 	at java.lang.Thread.run(Thread.java:745)
   [junit4]   2> Caused by: org.apache.solr.common.SolrException: Can't load schema /export/home/jenkins/workspace/Lucene-Solr-trunk-Solaris/solr/build/solr-core/test/J1/temp/solr.core.TestLazyCores_9F2E10F307F84B33-001/tempDir-002/badSchema2/conf/schema.xml: org.xml.sax.SAXParseException; systemId: solrres:/schema.xml; lineNumber: 35; columnNumber: 7; Elementtyp "filedType" m?ste avslutas med matchande sluttagg "</filedType>".
   [junit4]   2> 	at org.apache.solr.schema.IndexSchema.readSchema(IndexSchema.java:579)
   [junit4]   2> 	at org.apache.solr.schema.IndexSchema.<init>(IndexSchema.java:162)
   [junit4]   2> 	at org.apache.solr.schema.IndexSchemaFactory.create(IndexSchemaFactory.java:56)
   [junit4]   2> 	at org.apache.solr.schema.IndexSchemaFactory.buildIndexSchema(IndexSchemaFactory.java:75)
   [junit4]   2> 	at org.apache.solr.core.ConfigSetService.createIndexSchema(ConfigSetService.java:108)
   [junit4]   2> 	at org.apache.solr.core.ConfigSetService.getConfig(ConfigSetService.java:79)
   [junit4]   2> 	... 9 more
   [junit4]   2> Caused by: org.apache.solr.common.SolrException: org.xml.sax.SAXParseException; systemId: solrres:/schema.xml; lineNumber: 35; columnNumber: 7; Elementtyp "filedType" m?ste avslutas med matchande sluttagg "</filedType>".
   [junit4]   2> 	at org.apache.solr.core.Config.<init>(Config.java:154)
   [junit4]   2> 	at org.apache.solr.core.Config.<init>(Config.java:90)
   [junit4]   2> 	at org.apache.solr.schema.IndexSchema.readSchema(IndexSchema.java:439)
   [junit4]   2> 	... 14 more
   [junit4]   2> Caused by: org.xml.sax.SAXParseException; systemId: solrres:/schema.xml; lineNumber: 35; columnNumber: 7; Elementtyp "filedType" m?ste avslutas med matchande sluttagg "</filedType>".
   [junit4]   2> 	at com.sun.org.apache.xerces.internal.util.ErrorHandlerWrapper.createSAXParseException(ErrorHandlerWrapper.java:203)
   [junit4]   2> 	at com.sun.org.apache.xerces.internal.util.ErrorHandlerWrapper.fatalError(ErrorHandlerWrapper.java:177)
   [junit4]   2> 	at com.sun.org.apache.xerces.internal.impl.XMLErrorReporter.reportError(XMLErrorReporter.java:400)
   [junit4]   2> 	at com.sun.org.apache.xerces.internal.impl.XMLErrorReporter.reportError(XMLErrorReporter.java:327)
   [junit4]   2> 	at com.sun.org.apache.xerces.internal.impl.XMLScanner.reportFatalError(XMLScanner.java:1437)
   [junit4]   2> 	at com.sun.org.apache.xerces.internal.impl.XMLDocumentFragmentScannerImpl.scanEndElement(XMLDocumentFragmentScannerImpl.java:1750)
   [junit4]   2> 	at com.sun.org.apache.xerces.internal.impl.XMLDocumentFragmentScannerImpl$FragmentContentDriver.next(XMLDocumentFragmentScannerImpl.java:2970)
   [junit4]   2> 	at com.sun.org.apache.xerces.internal.impl.XMLDocumentScannerImpl.next(XMLDocumentScannerImpl.java:606)
   [junit4]   2> 	at com.sun.org.apache.xerces.internal.impl.XMLNSDocumentScannerImpl.next(XMLNSDocumentScannerImpl.java:118)
   [junit4]   2> 	at com.sun.org.apache.xerces.internal.impl.XMLDocumentFragmentScannerImpl.scanDocument(XMLDocumentFragmentScannerImpl.java:510)
   [junit4]   2> 	at com.sun.org.apache.xerces.internal.parsers.XML11Configuration.parse(XML11Configuration.java:848)
   [junit4]   2> 	at com.sun.org.apache.xerces.internal.parsers.XML11Configuration.parse(XML11Configuration.java:777)
   [junit4]   2> 	at com.sun.org.apache.xerces.internal.parsers.XMLParser.parse(XMLParser.java:141)
   [junit4]   2> 	at com.sun.org.apache.xerces.internal.parsers.DOMParser.parse(DOMParser.java:243)
   [junit4]   2> 	at com.sun.org.apache.xerces.internal.jaxp.DocumentBuilderImpl.parse(DocumentBuilderImpl.java:339)
   [junit4]   2> 	at org.apache.solr.core.Config.<init>(Config.java:143)
   [junit4]   2> 	... 16 more
   [junit4]   2> 2127471 INFO  (coreLoadExecutor-6271-thread-2-processing-x:collection4) [    x:collection4] o.a.s.c.SolrResourceLoader new SolrResourceLoader for directory: '/export/home/jenkins/workspace/Lucene-Solr-trunk-Solaris/solr/build/solr-core/test/J1/temp/solr.core.TestLazyCores_9F2E10F307F84B33-001/tempDir-002/core2'
   [junit4]   2> 2127471 INFO  (coreLoadExecutor-6271-thread-2-processing-x:collection4) [    x:collection4] o.a.s.c.SolrResourceLoader JNDI not configured for solr (NoInitialContextEx)
   [junit4]   2> 2127471 INFO  (coreLoadExecutor-6271-thread-2-processing-x:collection4) [    x:collection4] o.a.s.c.SolrResourceLoader solr home defaulted to 'solr/' (could not find system property or JNDI)
   [junit4]   2> 2127473 INFO  (coreLoadExecutor-6271-thread-3-processing-x:collection4) [    x:collection4] o.a.s.c.Config Ignoring exception matching \QSAXParseException\E
   [junit4]   2> 2127473 ERROR (coreLoadExecutor-6271-thread-3-processing-x:collection4) [    x:collection4] o.a.s.c.CoreContainer Error creating core [badConfig1]: Could not load conf for core badConfig1: Error loading solr config from /export/home/jenkins/workspace/Lucene-Solr-trunk-Solaris/solr/build/solr-core/test/J1/temp/solr.core.TestLazyCores_9F2E10F307F84B33-001/tempDir-002/badConfig1/conf/solrconfig.xml
   [junit4]   2> org.apache.solr.common.SolrException: Could not load conf for core badConfig1: Error loading solr config from /export/home/jenkins/workspace/Lucene-Solr-trunk-Solaris/solr/build/solr-core/test/J1/temp/solr.core.TestLazyCores_9F2E10F307F84B33-001/tempDir-002/badConfig1/conf/solrconfig.xml
   [junit4]   2> 	at org.apache.solr.core.ConfigSetService.getConfig(ConfigSetService.java:86)
   [junit4]   2> 	at org.apache.solr.core.CoreContainer.create(CoreContainer.java:815)
   [junit4]   2> 	at org.apache.solr.core.CoreContainer.access$000(CoreContainer.java:87)
   [junit4]   2> 	at org.apache.solr.core.CoreContainer$1.call(CoreContainer.java:467)
   [junit4]   2> 	at org.apache.solr.core.CoreContainer$1.call(CoreContainer.java:458)
   [junit4]   2> 	at java.util.concurrent.FutureTask.run(FutureTask.java:266)
   [junit4]   2> 	at org.apache.solr.common.util.ExecutorUtil$MDCAwareThreadPoolExecutor$1.run(ExecutorUtil.java:231)
   [junit4]   2> 	at java.util.concurrent.ThreadPoolExecutor.runWorker(ThreadPoolExecutor.java:1142)
   [junit4]   2> 	at java.util.concurrent.ThreadPoolExecutor$Worker.run(ThreadPoolExecutor.java:617)
   [junit4]   2> 	at java.lang.Thread.run(Thread.java:745)
   [junit4]   2> Caused by: org.apache.solr.common.SolrException: Error loading solr config from /export/home/jenkins/workspace/Lucene-Solr-trunk-Solaris/solr/build/solr-core/test/J1/temp/solr.core.TestLazyCores_9F2E10F307F84B33-001/tempDir-002/badConfig1/conf/solrconfig.xml
   [junit4]   

[...truncated too long message...]

17)
   [junit4]   2>         at java.lang.Thread.run(Thread.java:745)
   [junit4]   2> Feb 20, 2016 7:49:04 AM com.carrotsearch.randomizedtesting.ThreadLeakControl tryToInterruptAll
   [junit4]   2> INFO: Starting to interrupt leaked threads:
   [junit4]   2>    1) Thread[id=15811, name=searcherExecutor-6343-thread-1, state=WAITING, group=TGRP-TestLazyCores]
   [junit4]   2> Feb 20, 2016 7:49:07 AM com.carrotsearch.randomizedtesting.ThreadLeakControl tryToInterruptAll
   [junit4]   2> SEVERE: There are still zombie threads that couldn't be terminated:
   [junit4]   2>    1) Thread[id=15811, name=searcherExecutor-6343-thread-1, state=WAITING, group=TGRP-TestLazyCores]
   [junit4]   2>         at sun.misc.Unsafe.park(Native Method)
   [junit4]   2>         at java.util.concurrent.locks.LockSupport.park(LockSupport.java:175)
   [junit4]   2>         at java.util.concurrent.locks.AbstractQueuedSynchronizer$ConditionObject.await(AbstractQueuedSynchronizer.java:2039)
   [junit4]   2>         at java.util.concurrent.LinkedBlockingQueue.take(LinkedBlockingQueue.java:442)
   [junit4]   2>         at java.util.concurrent.ThreadPoolExecutor.getTask(ThreadPoolExecutor.java:1067)
   [junit4]   2>         at java.util.concurrent.ThreadPoolExecutor.runWorker(ThreadPoolExecutor.java:1127)
   [junit4]   2>         at java.util.concurrent.ThreadPoolExecutor$Worker.run(ThreadPoolExecutor.java:617)
   [junit4]   2>         at java.lang.Thread.run(Thread.java:745)
   [junit4]   2> NOTE: test params are: codec=Asserting(Lucene60): {v_t=PostingsFormat(name=Memory doPackFST= false), id=PostingsFormat(name=Memory doPackFST= false), v_s=PostingsFormat(name=LuceneVarGapFixedInterval), v_f=PostingsFormat(name=LuceneFixedGap)}, docValues:{}, sim=ClassicSimilarity, locale=sv, timezone=America/Montserrat
   [junit4]   2> NOTE: SunOS 5.11 amd64/Oracle Corporation 1.8.0_72 (64-bit)/cpus=3,threads=2,free=232443048,total=536870912
   [junit4]   2> NOTE: All tests run in this JVM: [SpellingQueryConverterTest, DeleteInactiveReplicaTest, BaseCdcrDistributedZkTest, CdcrReplicationHandlerTest, MultiTermTest, TestMacros, CoreAdminHandlerTest, TestStressRecovery, ChaosMonkeySafeLeaderTest, CacheHeaderTest, RequestHandlersTest, TestManagedStopFilterFactory, TestReload, TestRTGBase, TestSolrConfigHandlerConcurrent, TestShardHandlerFactory, SuggesterWFSTTest, FullSolrCloudDistribCmdsTest, TestFieldSortValues, TestSolrQueryParser, TestRebalanceLeaders, ConnectionManagerTest, BJQParserTest, TestDefaultStatsCache, TestLMJelinekMercerSimilarityFactory, TestCollationFieldDocValues, TestManagedSchemaDynamicFieldResource, TestRecovery, CloudMLTQParserTest, TestTrie, TestLRUStatsCache, DefaultValueUpdateProcessorTest, TestZkChroot, DebugComponentTest, LeaderInitiatedRecoveryOnShardRestartTest, TestHashQParserPlugin, ExplicitHLLTest, TestSolrDynamicMBean, IndexSchemaRuntimeFieldTest, TestReversedWildcardFilterFactory, UniqFieldsUpdateProcessorFactoryTest, TermVectorComponentTest, TestShortCircuitedRequests, DirectoryFactoryTest, SolrCmdDistributorTest, EchoParamsTest, TestUtils, TestSchemaNameResource, DistributedExpandComponentTest, HdfsRecoveryZkTest, DirectUpdateHandlerOptimizeTest, TlogReplayBufferedWhileIndexingTest, SearchHandlerTest, QueryParsingTest, TestPerFieldSimilarityWithDefaultOverride, SuggesterTSTTest, CollectionReloadTest, TestBM25SimilarityFactory, TestUseDocValuesAsStored2, HdfsWriteToMultipleCollectionsTest, TestFastOutputStream, TestBulkSchemaAPI, LeaderFailoverAfterPartitionTest, EnumFieldTest, UpdateRequestProcessorFactoryTest, ConcurrentDeleteAndCreateCollectionTest, ConnectionReuseTest, ShardRoutingCustomTest, TestExclusionRuleCollectionAccess, ShardSplitTest, RAMDirectoryFactoryTest, OverseerRolesTest, TestCollationField, ZkNodePropsTest, SortByFunctionTest, TestConfigReload, BinaryUpdateRequestHandlerTest, TestSolrIndexConfig, AnalysisErrorHandlingTest, SuggesterTest, TestQuerySenderListener, DistributedIntervalFacetingTest, TestExpandComponent, RestartWhileUpdatingTest, CheckHdfsIndexTest, BlockCacheTest, PKIAuthenticationIntegrationTest, DistanceFunctionTest, TestMaxScoreQueryParser, NoCacheHeaderTest, TestNRTOpen, OverseerTaskQueueTest, SparseHLLTest, FieldAnalysisRequestHandlerTest, TestTestInjection, TestCloudPivotFacet, DistanceUnitsTest, LukeRequestHandlerTest, ConjunctionSolrSpellCheckerTest, CoreAdminRequestStatusTest, CopyFieldTest, SpatialHeatmapFacetsTest, DistributedFacetPivotSmallTest, TestQueryUtils, SharedFSAutoReplicaFailoverUtilsTest, TestFastWriter, ConvertedLegacyTest, DeleteStatusTest, TermVectorComponentDistributedTest, TestExceedMaxTermLength, SpellCheckComponentTest, TestQueryTypes, TestRealTimeGet, OpenCloseCoreStressTest, TestPKIAuthenticationPlugin, AtomicUpdatesTest, TestNonDefinedSimilarityFactory, BasicZkTest, HdfsNNFailoverTest, TestOmitPositions, TestManagedResourceStorage, TestSerializedLuceneMatchVersion, TestSQLHandler, SynonymTokenizerTest, WordBreakSolrSpellCheckerTest, TestSmileRequest, TestAuthenticationFramework, OutputWriterTest, TestSearcherReuse, LeaderElectionIntegrationTest, LoggingHandlerTest, TestBinaryField, TestConfigSetsAPIZkFailure, TestJoin, TestCustomDocTransformer, SolrPluginUtilsTest, MergeStrategyTest, TestFiltering, SortSpecParsingTest, TestConfigSetsAPI, NotRequiredUniqueKeyTest, BasicDistributedZk2Test, UnloadDistributedZkTest, CollectionsAPIDistributedZkTest, ZkSolrClientTest, AutoCommitTest, TestHashPartitioner, DistributedSpellCheckComponentTest, TestRangeQuery, SimpleFacetsTest, SolrCoreTest, TestGroupingSearch, PeerSyncTest, BadIndexSchemaTest, BasicFunctionalityTest, TestLazyCores]
   [junit4]   2> NOTE: reproduce with: ant test  -Dtestcase=TestLazyCores -Dtests.seed=9F2E10F307F84B33 -Dtests.slow=true -Dtests.locale=sv -Dtests.timezone=America/Montserrat -Dtests.asserts=true -Dtests.file.encoding=US-ASCII
   [junit4] ERROR   0.00s J1 | TestLazyCores (suite) <<<
   [junit4]    > Throwable #1: java.lang.AssertionError: ObjectTracker found 4 object(s) that were not released!!! [MockDirectoryWrapper, MockDirectoryWrapper, MDCAwareThreadPoolExecutor, SolrCore]
   [junit4]    > 	at __randomizedtesting.SeedInfo.seed([9F2E10F307F84B33]:0)
   [junit4]    > 	at org.apache.solr.SolrTestCaseJ4.afterClass(SolrTestCaseJ4.java:228)
   [junit4]    > 	at java.lang.Thread.run(Thread.java:745)Throwable #2: com.carrotsearch.randomizedtesting.ThreadLeakError: 1 thread leaked from SUITE scope at org.apache.solr.core.TestLazyCores: 
   [junit4]    >    1) Thread[id=15811, name=searcherExecutor-6343-thread-1, state=WAITING, group=TGRP-TestLazyCores]
   [junit4]    >         at sun.misc.Unsafe.park(Native Method)
   [junit4]    >         at java.util.concurrent.locks.LockSupport.park(LockSupport.java:175)
   [junit4]    >         at java.util.concurrent.locks.AbstractQueuedSynchronizer$ConditionObject.await(AbstractQueuedSynchronizer.java:2039)
   [junit4]    >         at java.util.concurrent.LinkedBlockingQueue.take(LinkedBlockingQueue.java:442)
   [junit4]    >         at java.util.concurrent.ThreadPoolExecutor.getTask(ThreadPoolExecutor.java:1067)
   [junit4]    >         at java.util.concurrent.ThreadPoolExecutor.runWorker(ThreadPoolExecutor.java:1127)
   [junit4]    >         at java.util.concurrent.ThreadPoolExecutor$Worker.run(ThreadPoolExecutor.java:617)
   [junit4]    >         at java.lang.Thread.run(Thread.java:745)
   [junit4]    > 	at __randomizedtesting.SeedInfo.seed([9F2E10F307F84B33]:0)Throwable #3: com.carrotsearch.randomizedtesting.ThreadLeakError: There are still zombie threads that couldn't be terminated:
   [junit4]    >    1) Thread[id=15811, name=searcherExecutor-6343-thread-1, state=WAITING, group=TGRP-TestLazyCores]
   [junit4]    >         at sun.misc.Unsafe.park(Native Method)
   [junit4]    >         at java.util.concurrent.locks.LockSupport.park(LockSupport.java:175)
   [junit4]    >         at java.util.concurrent.locks.AbstractQueuedSynchronizer$ConditionObject.await(AbstractQueuedSynchronizer.java:2039)
   [junit4]    >         at java.util.concurrent.LinkedBlockingQueue.take(LinkedBlockingQueue.java:442)
   [junit4]    >         at java.util.concurrent.ThreadPoolExecutor.getTask(ThreadPoolExecutor.java:1067)
   [junit4]    >         at java.util.concurrent.ThreadPoolExecutor.runWorker(ThreadPoolExecutor.java:1127)
   [junit4]    >         at java.util.concurrent.ThreadPoolExecutor$Worker.run(ThreadPoolExecutor.java:617)
   [junit4]    >         at java.lang.Thread.run(Thread.java:745)
   [junit4]    > 	at __randomizedtesting.SeedInfo.seed([9F2E10F307F84B33]:0)
   [junit4] Completed [392/579 (1!)] on J1 in 149.51s, 8 tests, 1 failure, 2 errors <<< FAILURES!

[...truncated 619 lines...]
BUILD FAILED
/export/home/jenkins/workspace/Lucene-Solr-trunk-Solaris/build.xml:740: The following error occurred while executing this line:
/export/home/jenkins/workspace/Lucene-Solr-trunk-Solaris/build.xml:684: The following error occurred while executing this line:
/export/home/jenkins/workspace/Lucene-Solr-trunk-Solaris/build.xml:59: The following error occurred while executing this line:
/export/home/jenkins/workspace/Lucene-Solr-trunk-Solaris/solr/build.xml:233: The following error occurred while executing this line:
/export/home/jenkins/workspace/Lucene-Solr-trunk-Solaris/solr/common-build.xml:524: The following error occurred while executing this line:
/export/home/jenkins/workspace/Lucene-Solr-trunk-Solaris/lucene/common-build.xml:1457: The following error occurred while executing this line:
/export/home/jenkins/workspace/Lucene-Solr-trunk-Solaris/lucene/common-build.xml:1014: There were test failures: 579 suites (8 ignored), 2331 tests, 3 suite-level errors, 598 ignored (72 assumptions) [seed: 9F2E10F307F84B33]

Total time: 60 minutes 44 seconds
Build step 'Invoke Ant' marked build as failure
Archiving artifacts
[WARNINGS] Skipping publisher since build result is FAILURE
Recording test results
Email was triggered for: Failure - Any
Sending email for trigger: Failure - Any



Mime
View raw message