lucene-dev mailing list archives

Site index · List index
Message view « Date » · « Thread »
Top « Date » · « Thread »
From Policeman Jenkins Server <jenk...@thetaphi.de>
Subject [JENKINS] Lucene-Solr-5.x-Windows (64bit/jdk1.8.0_72) - Build # 5462 - Failure!
Date Thu, 04 Feb 2016 06:19:30 GMT
Build: http://jenkins.thetaphi.de/job/Lucene-Solr-5.x-Windows/5462/
Java: 64bit/jdk1.8.0_72 -XX:+UseCompressedOops -XX:+UseG1GC

1 tests failed.
FAILED:  org.apache.solr.handler.TestReplicationHandler.doTestStressReplication

Error Message:
timed out waiting for collection1 startAt time to exceed: Thu Feb 04 06:55:40 CET 2016

Stack Trace:
java.lang.AssertionError: timed out waiting for collection1 startAt time to exceed: Thu Feb 04 06:55:40 CET 2016
	at __randomizedtesting.SeedInfo.seed([4F6377ECCCC1A69E:94C8772AC9E9CF2D]:0)
	at org.junit.Assert.fail(Assert.java:93)
	at org.apache.solr.handler.TestReplicationHandler.watchCoreStartAt(TestReplicationHandler.java:1419)
	at org.apache.solr.handler.TestReplicationHandler.doTestStressReplication(TestReplicationHandler.java:771)
	at sun.reflect.NativeMethodAccessorImpl.invoke0(Native Method)
	at sun.reflect.NativeMethodAccessorImpl.invoke(NativeMethodAccessorImpl.java:62)
	at sun.reflect.DelegatingMethodAccessorImpl.invoke(DelegatingMethodAccessorImpl.java:43)
	at java.lang.reflect.Method.invoke(Method.java:498)
	at com.carrotsearch.randomizedtesting.RandomizedRunner.invoke(RandomizedRunner.java:1764)
	at com.carrotsearch.randomizedtesting.RandomizedRunner$8.evaluate(RandomizedRunner.java:871)
	at com.carrotsearch.randomizedtesting.RandomizedRunner$9.evaluate(RandomizedRunner.java:907)
	at com.carrotsearch.randomizedtesting.RandomizedRunner$10.evaluate(RandomizedRunner.java:921)
	at com.carrotsearch.randomizedtesting.rules.SystemPropertiesRestoreRule$1.evaluate(SystemPropertiesRestoreRule.java:57)
	at org.apache.lucene.util.TestRuleSetupTeardownChained$1.evaluate(TestRuleSetupTeardownChained.java:50)
	at org.apache.lucene.util.AbstractBeforeAfterRule$1.evaluate(AbstractBeforeAfterRule.java:46)
	at org.apache.lucene.util.TestRuleThreadAndTestName$1.evaluate(TestRuleThreadAndTestName.java:49)
	at org.apache.lucene.util.TestRuleIgnoreAfterMaxFailures$1.evaluate(TestRuleIgnoreAfterMaxFailures.java:65)
	at org.apache.lucene.util.TestRuleMarkFailure$1.evaluate(TestRuleMarkFailure.java:48)
	at com.carrotsearch.randomizedtesting.rules.StatementAdapter.evaluate(StatementAdapter.java:36)
	at com.carrotsearch.randomizedtesting.ThreadLeakControl$StatementRunner.run(ThreadLeakControl.java:367)
	at com.carrotsearch.randomizedtesting.ThreadLeakControl.forkTimeoutingTask(ThreadLeakControl.java:809)
	at com.carrotsearch.randomizedtesting.ThreadLeakControl$3.evaluate(ThreadLeakControl.java:460)
	at com.carrotsearch.randomizedtesting.RandomizedRunner.runSingleTest(RandomizedRunner.java:880)
	at com.carrotsearch.randomizedtesting.RandomizedRunner$5.evaluate(RandomizedRunner.java:781)
	at com.carrotsearch.randomizedtesting.RandomizedRunner$6.evaluate(RandomizedRunner.java:816)
	at com.carrotsearch.randomizedtesting.RandomizedRunner$7.evaluate(RandomizedRunner.java:827)
	at com.carrotsearch.randomizedtesting.rules.StatementAdapter.evaluate(StatementAdapter.java:36)
	at com.carrotsearch.randomizedtesting.rules.SystemPropertiesRestoreRule$1.evaluate(SystemPropertiesRestoreRule.java:57)
	at org.apache.lucene.util.AbstractBeforeAfterRule$1.evaluate(AbstractBeforeAfterRule.java:46)
	at com.carrotsearch.randomizedtesting.rules.StatementAdapter.evaluate(StatementAdapter.java:36)
	at org.apache.lucene.util.TestRuleStoreClassName$1.evaluate(TestRuleStoreClassName.java:42)
	at com.carrotsearch.randomizedtesting.rules.NoShadowingOrOverridesOnMethodsRule$1.evaluate(NoShadowingOrOverridesOnMethodsRule.java:40)
	at com.carrotsearch.randomizedtesting.rules.NoShadowingOrOverridesOnMethodsRule$1.evaluate(NoShadowingOrOverridesOnMethodsRule.java:40)
	at com.carrotsearch.randomizedtesting.rules.StatementAdapter.evaluate(StatementAdapter.java:36)
	at com.carrotsearch.randomizedtesting.rules.StatementAdapter.evaluate(StatementAdapter.java:36)
	at com.carrotsearch.randomizedtesting.rules.StatementAdapter.evaluate(StatementAdapter.java:36)
	at org.apache.lucene.util.TestRuleAssertionsRequired$1.evaluate(TestRuleAssertionsRequired.java:54)
	at org.apache.lucene.util.TestRuleMarkFailure$1.evaluate(TestRuleMarkFailure.java:48)
	at org.apache.lucene.util.TestRuleIgnoreAfterMaxFailures$1.evaluate(TestRuleIgnoreAfterMaxFailures.java:65)
	at org.apache.lucene.util.TestRuleIgnoreTestSuites$1.evaluate(TestRuleIgnoreTestSuites.java:55)
	at com.carrotsearch.randomizedtesting.rules.StatementAdapter.evaluate(StatementAdapter.java:36)
	at com.carrotsearch.randomizedtesting.ThreadLeakControl$StatementRunner.run(ThreadLeakControl.java:367)
	at java.lang.Thread.run(Thread.java:745)




Build Log:
[...truncated 11469 lines...]
   [junit4] Suite: org.apache.solr.handler.TestReplicationHandler
   [junit4]   2> Creating dataDir: C:\Users\JenkinsSlave\workspace\Lucene-Solr-5.x-Windows\solr\build\solr-core\test\J1\temp\solr.handler.TestReplicationHandler_4F6377ECCCC1A69E-001\init-core-data-001
   [junit4]   2> 1533595 INFO  (TEST-TestReplicationHandler.doTestStressReplication-seed#[4F6377ECCCC1A69E]) [    ] o.a.s.SolrTestCaseJ4 ###Starting doTestStressReplication
   [junit4]   2> 1533596 INFO  (TEST-TestReplicationHandler.doTestStressReplication-seed#[4F6377ECCCC1A69E]) [    ] o.a.s.SolrTestCaseJ4 Writing core.properties file to C:\Users\JenkinsSlave\workspace\Lucene-Solr-5.x-Windows\solr\build\solr-core\test\J1\temp\solr.handler.TestReplicationHandler_4F6377ECCCC1A69E-001\solr-instance-001\collection1
   [junit4]   2> 1533605 INFO  (TEST-TestReplicationHandler.doTestStressReplication-seed#[4F6377ECCCC1A69E]) [    ] o.e.j.s.Server jetty-9.2.13.v20150730
   [junit4]   2> 1533607 INFO  (TEST-TestReplicationHandler.doTestStressReplication-seed#[4F6377ECCCC1A69E]) [    ] o.e.j.s.h.ContextHandler Started o.e.j.s.ServletContextHandler@494b9f7{/solr,null,AVAILABLE}
   [junit4]   2> 1533608 INFO  (TEST-TestReplicationHandler.doTestStressReplication-seed#[4F6377ECCCC1A69E]) [    ] o.e.j.s.ServerConnector Started ServerConnector@4641673{HTTP/1.1}{127.0.0.1:53027}
   [junit4]   2> 1533608 INFO  (TEST-TestReplicationHandler.doTestStressReplication-seed#[4F6377ECCCC1A69E]) [    ] o.e.j.s.Server Started @1538637ms
   [junit4]   2> 1533608 INFO  (TEST-TestReplicationHandler.doTestStressReplication-seed#[4F6377ECCCC1A69E]) [    ] o.a.s.c.s.e.JettySolrRunner Jetty properties: {solr.data.dir=C:\Users\JenkinsSlave\workspace\Lucene-Solr-5.x-Windows\solr\build\solr-core\test\J1\temp\solr.handler.TestReplicationHandler_4F6377ECCCC1A69E-001\solr-instance-001\collection1\data, hostContext=/solr, hostPort=53027}
   [junit4]   2> 1533608 INFO  (TEST-TestReplicationHandler.doTestStressReplication-seed#[4F6377ECCCC1A69E]) [    ] o.a.s.s.SolrDispatchFilter SolrDispatchFilter.init(): sun.misc.Launcher$AppClassLoader@73d16e93
   [junit4]   2> 1533608 INFO  (TEST-TestReplicationHandler.doTestStressReplication-seed#[4F6377ECCCC1A69E]) [    ] o.a.s.c.SolrResourceLoader new SolrResourceLoader for directory: 'C:\Users\JenkinsSlave\workspace\Lucene-Solr-5.x-Windows\solr\build\solr-core\test\J1\temp\solr.handler.TestReplicationHandler_4F6377ECCCC1A69E-001\solr-instance-001'
   [junit4]   2> 1533609 INFO  (TEST-TestReplicationHandler.doTestStressReplication-seed#[4F6377ECCCC1A69E]) [    ] o.a.s.c.SolrResourceLoader JNDI not configured for solr (NoInitialContextEx)
   [junit4]   2> 1533609 INFO  (TEST-TestReplicationHandler.doTestStressReplication-seed#[4F6377ECCCC1A69E]) [    ] o.a.s.c.SolrResourceLoader solr home defaulted to 'solr/' (could not find system property or JNDI)
   [junit4]   2> 1533609 INFO  (TEST-TestReplicationHandler.doTestStressReplication-seed#[4F6377ECCCC1A69E]) [    ] o.a.s.c.SolrXmlConfig Loading container configuration from C:\Users\JenkinsSlave\workspace\Lucene-Solr-5.x-Windows\solr\build\solr-core\test\J1\temp\solr.handler.TestReplicationHandler_4F6377ECCCC1A69E-001\solr-instance-001\solr.xml
   [junit4]   2> 1533621 INFO  (TEST-TestReplicationHandler.doTestStressReplication-seed#[4F6377ECCCC1A69E]) [    ] o.a.s.c.CorePropertiesLocator Config-defined core root directory: C:\Users\JenkinsSlave\workspace\Lucene-Solr-5.x-Windows\solr\build\solr-core\test\J1\temp\solr.handler.TestReplicationHandler_4F6377ECCCC1A69E-001\solr-instance-001\.
   [junit4]   2> 1533621 INFO  (TEST-TestReplicationHandler.doTestStressReplication-seed#[4F6377ECCCC1A69E]) [    ] o.a.s.c.CoreContainer New CoreContainer 926180700
   [junit4]   2> 1533621 INFO  (TEST-TestReplicationHandler.doTestStressReplication-seed#[4F6377ECCCC1A69E]) [    ] o.a.s.c.CoreContainer Loading cores into CoreContainer [instanceDir=C:\Users\JenkinsSlave\workspace\Lucene-Solr-5.x-Windows\solr\build\solr-core\test\J1\temp\solr.handler.TestReplicationHandler_4F6377ECCCC1A69E-001\solr-instance-001]
   [junit4]   2> 1533622 WARN  (TEST-TestReplicationHandler.doTestStressReplication-seed#[4F6377ECCCC1A69E]) [    ] o.a.s.c.CoreContainer Couldn't add files from C:\Users\JenkinsSlave\workspace\Lucene-Solr-5.x-Windows\solr\build\solr-core\test\J1\temp\solr.handler.TestReplicationHandler_4F6377ECCCC1A69E-001\solr-instance-001\lib to classpath: C:\Users\JenkinsSlave\workspace\Lucene-Solr-5.x-Windows\solr\build\solr-core\test\J1\temp\solr.handler.TestReplicationHandler_4F6377ECCCC1A69E-001\solr-instance-001\lib
   [junit4]   2> 1533623 INFO  (TEST-TestReplicationHandler.doTestStressReplication-seed#[4F6377ECCCC1A69E]) [    ] o.a.s.h.c.HttpShardHandlerFactory created with socketTimeout : 90000,urlScheme : ,connTimeout : 15000,maxConnectionsPerHost : 20,maxConnections : 10000,corePoolSize : 0,maximumPoolSize : 2147483647,maxThreadIdleTime : 5,sizeOfQueue : -1,fairnessPolicy : false,useRetries : false,
   [junit4]   2> 1533626 INFO  (TEST-TestReplicationHandler.doTestStressReplication-seed#[4F6377ECCCC1A69E]) [    ] o.a.s.u.UpdateShardHandler Creating UpdateShardHandler HTTP client with params: socketTimeout=340000&connTimeout=45000&retry=true
   [junit4]   2> 1533627 INFO  (TEST-TestReplicationHandler.doTestStressReplication-seed#[4F6377ECCCC1A69E]) [    ] o.a.s.l.LogWatcher SLF4J impl is org.slf4j.impl.Log4jLoggerFactory
   [junit4]   2> 1533627 INFO  (TEST-TestReplicationHandler.doTestStressReplication-seed#[4F6377ECCCC1A69E]) [    ] o.a.s.l.LogWatcher Registering Log Listener [Log4j (org.slf4j.impl.Log4jLoggerFactory)]
   [junit4]   2> 1533628 INFO  (TEST-TestReplicationHandler.doTestStressReplication-seed#[4F6377ECCCC1A69E]) [    ] o.a.s.c.CoreContainer Security conf doesn't exist. Skipping setup for authorization module.
   [junit4]   2> 1533628 INFO  (TEST-TestReplicationHandler.doTestStressReplication-seed#[4F6377ECCCC1A69E]) [    ] o.a.s.c.CoreContainer No authentication plugin used.
   [junit4]   2> 1533629 INFO  (TEST-TestReplicationHandler.doTestStressReplication-seed#[4F6377ECCCC1A69E]) [    ] o.a.s.c.CorePropertiesLocator Looking for core definitions underneath C:\Users\JenkinsSlave\workspace\Lucene-Solr-5.x-Windows\solr\build\solr-core\test\J1\temp\solr.handler.TestReplicationHandler_4F6377ECCCC1A69E-001\solr-instance-001\.
   [junit4]   2> 1533634 INFO  (TEST-TestReplicationHandler.doTestStressReplication-seed#[4F6377ECCCC1A69E]) [    ] o.a.s.c.CoreDescriptor Created CoreDescriptor: {name=collection1, config=solrconfig.xml, loadOnStartup=true, schema=schema.xml, configSetProperties=configsetprops.json, transient=false, dataDir=data\}
   [junit4]   2> 1533634 INFO  (TEST-TestReplicationHandler.doTestStressReplication-seed#[4F6377ECCCC1A69E]) [    ] o.a.s.c.CorePropertiesLocator Found core collection1 in C:\Users\JenkinsSlave\workspace\Lucene-Solr-5.x-Windows\solr\build\solr-core\test\J1\temp\solr.handler.TestReplicationHandler_4F6377ECCCC1A69E-001\solr-instance-001\.\collection1
   [junit4]   2> 1533634 INFO  (TEST-TestReplicationHandler.doTestStressReplication-seed#[4F6377ECCCC1A69E]) [    ] o.a.s.c.CorePropertiesLocator Found 1 core definitions
   [junit4]   2> 1533635 INFO  (TEST-TestReplicationHandler.doTestStressReplication-seed#[4F6377ECCCC1A69E]) [    ] o.a.s.s.SolrDispatchFilter user.dir=C:\Users\JenkinsSlave\workspace\Lucene-Solr-5.x-Windows\solr\build\solr-core\test\J1
   [junit4]   2> 1533635 INFO  (coreLoadExecutor-4971-thread-1) [    ] o.a.s.c.SolrResourceLoader new SolrResourceLoader for directory: 'C:\Users\JenkinsSlave\workspace\Lucene-Solr-5.x-Windows\solr\build\solr-core\test\J1\temp\solr.handler.TestReplicationHandler_4F6377ECCCC1A69E-001\solr-instance-001\collection1'
   [junit4]   2> 1533635 INFO  (TEST-TestReplicationHandler.doTestStressReplication-seed#[4F6377ECCCC1A69E]) [    ] o.a.s.s.SolrDispatchFilter SolrDispatchFilter.init() done
   [junit4]   2> 1533635 INFO  (coreLoadExecutor-4971-thread-1) [    ] o.a.s.c.SolrResourceLoader JNDI not configured for solr (NoInitialContextEx)
   [junit4]   2> 1533636 INFO  (coreLoadExecutor-4971-thread-1) [    ] o.a.s.c.SolrResourceLoader solr home defaulted to 'solr/' (could not find system property or JNDI)
   [junit4]   2> 1533660 INFO  (coreLoadExecutor-4971-thread-1) [    ] o.a.s.c.SolrConfig current version of requestparams : -1
   [junit4]   2> 1533663 INFO  (coreLoadExecutor-4971-thread-1) [    ] o.a.s.c.SolrConfig Using Lucene MatchVersion: 5.5.0
   [junit4]   2> 1533668 INFO  (coreLoadExecutor-4971-thread-1) [    ] o.a.s.c.SolrConfig Loaded SolrConfig: solrconfig.xml
   [junit4]   2> 1533672 INFO  (coreLoadExecutor-4971-thread-1) [    ] o.a.s.s.IndexSchema [collection1] Schema name=test
   [junit4]   2> 1533678 INFO  (coreLoadExecutor-4971-thread-1) [    ] o.a.s.s.IndexSchema unique key field: id
   [junit4]   2> 1533687 INFO  (coreLoadExecutor-4971-thread-1) [    ] o.a.s.c.ConfigSetProperties Did not find ConfigSet properties, assuming default properties: Can't find resource 'configsetprops.json' in classpath or 'C:\Users\JenkinsSlave\workspace\Lucene-Solr-5.x-Windows\solr\build\solr-core\test\J1\temp\solr.handler.TestReplicationHandler_4F6377ECCCC1A69E-001\solr-instance-001\collection1'
   [junit4]   2> 1533687 INFO  (coreLoadExecutor-4971-thread-1) [    ] o.a.s.c.CoreContainer Creating SolrCore 'collection1' using configuration from instancedir C:\Users\JenkinsSlave\workspace\Lucene-Solr-5.x-Windows\solr\build\solr-core\test\J1\temp\solr.handler.TestReplicationHandler_4F6377ECCCC1A69E-001\solr-instance-001\.\collection1
   [junit4]   2> 1533688 INFO  (coreLoadExecutor-4971-thread-1) [    x:collection1] o.a.s.c.SolrCore org.apache.solr.core.MockDirectoryFactory
   [junit4]   2> 1533688 INFO  (coreLoadExecutor-4971-thread-1) [    x:collection1] o.a.s.c.SolrCore [[collection1] ] Opening new SolrCore at [C:\Users\JenkinsSlave\workspace\Lucene-Solr-5.x-Windows\solr\build\solr-core\test\J1\temp\solr.handler.TestReplicationHandler_4F6377ECCCC1A69E-001\solr-instance-001\collection1], dataDir=[C:\Users\JenkinsSlave\workspace\Lucene-Solr-5.x-Windows\solr\build\solr-core\test\J1\temp\solr.handler.TestReplicationHandler_4F6377ECCCC1A69E-001\solr-instance-001\.\collection1\data\]
   [junit4]   2> 1533688 INFO  (coreLoadExecutor-4971-thread-1) [    x:collection1] o.a.s.c.SolrCore JMX monitoring not detected for core: collection1
   [junit4]   2> 1533688 INFO  (coreLoadExecutor-4971-thread-1) [    x:collection1] o.a.s.c.CachingDirectoryFactory return new directory for C:\Users\JenkinsSlave\workspace\Lucene-Solr-5.x-Windows\solr\build\solr-core\test\J1\temp\solr.handler.TestReplicationHandler_4F6377ECCCC1A69E-001\solr-instance-001\.\collection1\data\
   [junit4]   2> 1533688 INFO  (coreLoadExecutor-4971-thread-1) [    x:collection1] o.a.s.c.SolrCore New index directory detected: old=null new=C:\Users\JenkinsSlave\workspace\Lucene-Solr-5.x-Windows\solr\build\solr-core\test\J1\temp\solr.handler.TestReplicationHandler_4F6377ECCCC1A69E-001\solr-instance-001\.\collection1\data\index/
   [junit4]   2> 1533688 WARN  (coreLoadExecutor-4971-thread-1) [    x:collection1] o.a.s.c.SolrCore [collection1] Solr index directory 'C:\Users\JenkinsSlave\workspace\Lucene-Solr-5.x-Windows\solr\build\solr-core\test\J1\temp\solr.handler.TestReplicationHandler_4F6377ECCCC1A69E-001\solr-instance-001\.\collection1\data\index' doesn't exist. Creating new index...
   [junit4]   2> 1533688 INFO  (coreLoadExecutor-4971-thread-1) [    x:collection1] o.a.s.c.CachingDirectoryFactory return new directory for C:\Users\JenkinsSlave\workspace\Lucene-Solr-5.x-Windows\solr\build\solr-core\test\J1\temp\solr.handler.TestReplicationHandler_4F6377ECCCC1A69E-001\solr-instance-001\.\collection1\data\index
   [junit4]   2> 1533688 INFO  (coreLoadExecutor-4971-thread-1) [    x:collection1] o.a.s.u.RandomMergePolicy RandomMergePolicy wrapping class org.apache.lucene.index.LogDocMergePolicy: [LogDocMergePolicy: minMergeSize=1000, mergeFactor=26, maxMergeSize=9223372036854775807, maxMergeSizeForForcedMerge=9223372036854775807, calibrateSizeByDeletes=true, maxMergeDocs=2147483647, maxCFSSegmentSizeMB=8.796093022207999E12, noCFSRatio=0.5155285091941315]
   [junit4]   2> 1533688 INFO  (coreLoadExecutor-4971-thread-1) [    x:collection1] o.a.s.c.SolrDeletionPolicy SolrDeletionPolicy.onCommit: commits: num=1
   [junit4]   2> 	commit{dir=MockDirectoryWrapper(RAMDirectory@7bfaa5ef lockFactory=org.apache.lucene.store.SingleInstanceLockFactory@442949b),segFN=segments_1,generation=1}
   [junit4]   2> 1533688 INFO  (coreLoadExecutor-4971-thread-1) [    x:collection1] o.a.s.c.SolrDeletionPolicy newest commit generation = 1
   [junit4]   2> 1533689 INFO  (OldIndexDirectoryCleanupThreadForCore-collection1) [    x:collection1] o.a.s.c.SolrCore Looking for old index directories to cleanup for core collection1 in C:\Users\JenkinsSlave\workspace\Lucene-Solr-5.x-Windows\solr\build\solr-core\test\J1\temp\solr.handler.TestReplicationHandler_4F6377ECCCC1A69E-001\solr-instance-001\.\collection1\data\
   [junit4]   2> 1533689 INFO  (coreLoadExecutor-4971-thread-1) [    x:collection1] o.a.s.c.SolrCore no updateRequestProcessorChain defined as default, creating implicit default
   [junit4]   2> 1533697 INFO  (coreLoadExecutor-4971-thread-1) [    x:collection1] o.a.s.h.l.XMLLoader xsltCacheLifetimeSeconds=60
   [junit4]   2> 1533699 INFO  (coreLoadExecutor-4971-thread-1) [    x:collection1] o.a.s.h.l.XMLLoader xsltCacheLifetimeSeconds=60
   [junit4]   2> 1533701 INFO  (coreLoadExecutor-4971-thread-1) [    x:collection1] o.a.s.h.l.XMLLoader xsltCacheLifetimeSeconds=60
   [junit4]   2> 1533703 INFO  (coreLoadExecutor-4971-thread-1) [    x:collection1] o.a.s.h.l.XMLLoader xsltCacheLifetimeSeconds=60
   [junit4]   2> 1533722 INFO  (coreLoadExecutor-4971-thread-1) [    x:collection1] o.a.s.c.PluginBag requestHandler : 'lazy' created with startup=lazy 
   [junit4]   2> 1533722 INFO  (coreLoadExecutor-4971-thread-1) [    x:collection1] o.a.s.c.RequestHandlers Registered paths: /admin/mbeans,standard,lazy,/update/csv,/update/json/docs,/admin/luke,/admin/segments,/get,/admin/system,/replication,/admin/properties,defaults,/config,/schema,/admin/plugins,/admin/logging,/update/json,/admin/threads,/admin/ping,/update,/admin/file
   [junit4]   2> 1533723 INFO  (coreLoadExecutor-4971-thread-1) [    x:collection1] o.a.s.c.SolrCore Using default statsCache cache: org.apache.solr.search.stats.LocalStatsCache
   [junit4]   2> 1533723 INFO  (coreLoadExecutor-4971-thread-1) [    x:collection1] o.a.s.u.CommitTracker Hard AutoCommit: disabled
   [junit4]   2> 1533724 INFO  (coreLoadExecutor-4971-thread-1) [    x:collection1] o.a.s.u.CommitTracker Soft AutoCommit: disabled
   [junit4]   2> 1533724 INFO  (coreLoadExecutor-4971-thread-1) [    x:collection1] o.a.s.u.RandomMergePolicy RandomMergePolicy wrapping class org.apache.lucene.index.AlcoholicMergePolicy: [AlcoholicMergePolicy: minMergeSize=0, mergeFactor=10, maxMergeSize=1851134133, maxMergeSizeForForcedMerge=9223372036854775807, calibrateSizeByDeletes=true, maxMergeDocs=2147483647, maxCFSSegmentSizeMB=8.796093022207999E12, noCFSRatio=0.1]
   [junit4]   2> 1533724 INFO  (coreLoadExecutor-4971-thread-1) [    x:collection1] o.a.s.c.SolrDeletionPolicy SolrDeletionPolicy.onInit: commits: num=1
   [junit4]   2> 	commit{dir=MockDirectoryWrapper(RAMDirectory@7bfaa5ef lockFactory=org.apache.lucene.store.SingleInstanceLockFactory@442949b),segFN=segments_1,generation=1}
   [junit4]   2> 1533724 INFO  (coreLoadExecutor-4971-thread-1) [    x:collection1] o.a.s.c.SolrDeletionPolicy newest commit generation = 1
   [junit4]   2> 1533724 INFO  (coreLoadExecutor-4971-thread-1) [    x:collection1] o.a.s.s.SolrIndexSearcher Opening Searcher@39bd125f[collection1] main
   [junit4]   2> 1533725 INFO  (coreLoadExecutor-4971-thread-1) [    x:collection1] o.a.s.r.ManagedResourceStorage File-based storage initialized to use dir: C:\Users\JenkinsSlave\workspace\Lucene-Solr-5.x-Windows\solr\build\solr-core\test\J1\temp\solr.handler.TestReplicationHandler_4F6377ECCCC1A69E-001\solr-instance-001\collection1\conf
   [junit4]   2> 1533725 INFO  (coreLoadExecutor-4971-thread-1) [    x:collection1] o.a.s.r.RestManager Initializing RestManager with initArgs: {storageDir=C:\Users\JenkinsSlave\workspace\Lucene-Solr-5.x-Windows\solr\build\solr-core\test\J1\temp\solr.handler.TestReplicationHandler_4F6377ECCCC1A69E-001\solr-instance-001\collection1\conf}
   [junit4]   2> 1533725 INFO  (coreLoadExecutor-4971-thread-1) [    x:collection1] o.a.s.r.ManagedResourceStorage Reading _rest_managed.json using file:dir=C:\Users\JenkinsSlave\workspace\Lucene-Solr-5.x-Windows\solr\build\solr-core\test\J1\temp\solr.handler.TestReplicationHandler_4F6377ECCCC1A69E-001\solr-instance-001\collection1\conf
   [junit4]   2> 1533726 INFO  (coreLoadExecutor-4971-thread-1) [    x:collection1] o.a.s.r.RestManager Initializing 0 registered ManagedResources
   [junit4]   2> 1533726 INFO  (coreLoadExecutor-4971-thread-1) [    x:collection1] o.a.s.h.ReplicationHandler Replication enabled for following config files: schema.xml,xslt/dummy.xsl
   [junit4]   2> 1533726 INFO  (coreLoadExecutor-4971-thread-1) [    x:collection1] o.a.s.h.ReplicationHandler Commits will be reserved for  10000
   [junit4]   2> 1533726 INFO  (searcherExecutor-4972-thread-1-processing-x:collection1) [    x:collection1] o.a.s.c.SolrCore [collection1] Registered new searcher Searcher@39bd125f[collection1] main{ExitableDirectoryReader(UninvertingDirectoryReader())}
   [junit4]   2> 1533726 INFO  (coreLoadExecutor-4971-thread-1) [    x:collection1] o.a.s.c.CoreContainer registering core: collection1
   [junit4]   2> 1534079 INFO  (TEST-TestReplicationHandler.doTestStressReplication-seed#[4F6377ECCCC1A69E]) [    ] o.a.s.SolrTestCaseJ4 Writing core.properties file to C:\Users\JenkinsSlave\workspace\Lucene-Solr-5.x-Windows\solr\build\solr-core\test\J1\temp\solr.handler.TestReplicationHandler_4F6377ECCCC1A69E-001\solr-instance-002\collection1
   [junit4]   2> 1534090 INFO  (TEST-TestReplicationHandler.doTestStressReplication-seed#[4F6377ECCCC1A69E]) [    ] o.e.j.s.Server jetty-9.2.13.v20150730
   [junit4]   2> 1534091 INFO  (TEST-TestReplicationHandler.doTestStressReplication-seed#[4F6377ECCCC1A69E]) [    ] o.e.j.s.h.ContextHandler Started o.e.j.s.ServletContextHandler@15fc490a{/solr,null,AVAILABLE}
   [junit4]   2> 1534092 INFO  (TEST-TestReplicationHandler.doTestStressReplication-seed#[4F6377ECCCC1A69E]) [    ] o.e.j.s.ServerConnector Started ServerConnector@28b81030{HTTP/1.1}{127.0.0.1:53030}
   [junit4]   2> 1534092 INFO  (TEST-TestReplicationHandler.doTestStressReplication-seed#[4F6377ECCCC1A69E]) [    ] o.e.j.s.Server Started @1539205ms
   [junit4]   2> 1534092 INFO  (TEST-TestReplicationHandler.doTestStressReplication-seed#[4F6377ECCCC1A69E]) [    ] o.a.s.c.s.e.JettySolrRunner Jetty properties: {solr.data.dir=C:\Users\JenkinsSlave\workspace\Lucene-Solr-5.x-Windows\solr\build\solr-core\test\J1\temp\solr.handler.TestReplicationHandler_4F6377ECCCC1A69E-001\solr-instance-002\collection1\data, hostContext=/solr, hostPort=53030}
   [junit4]   2> 1534093 INFO  (TEST-TestReplicationHandler.doTestStressReplication-seed#[4F6377ECCCC1A69E]) [    ] o.a.s.s.SolrDispatchFilter SolrDispatchFilter.init(): sun.misc.Launcher$AppClassLoader@73d16e93
   [junit4]   2> 1534093 INFO  (TEST-TestReplicationHandler.doTestStressReplication-seed#[4F6377ECCCC1A69E]) [    ] o.a.s.c.SolrResourceLoader new SolrResourceLoader for directory: 'C:\Users\JenkinsSlave\workspace\Lucene-Solr-5.x-Windows\solr\build\solr-core\test\J1\temp\solr.handler.TestReplicationHandler_4F6377ECCCC1A69E-001\solr-instance-002'
   [junit4]   2> 1534093 INFO  (TEST-TestReplicationHandler.doTestStressReplication-seed#[4F6377ECCCC1A69E]) [    ] o.a.s.c.SolrResourceLoader JNDI not configured for solr (NoInitialContextEx)
   [junit4]   2> 1534093 INFO  (TEST-TestReplicationHandler.doTestStressReplication-seed#[4F6377ECCCC1A69E]) [    ] o.a.s.c.SolrResourceLoader solr home defaulted to 'solr/' (could not find system property or JNDI)
   [junit4]   2> 1534094 INFO  (TEST-TestReplicationHandler.doTestStressReplication-seed#[4F6377ECCCC1A69E]) [    ] o.a.s.c.SolrXmlConfig Loading container configuration from C:\Users\JenkinsSlave\workspace\Lucene-Solr-5.x-Windows\solr\build\solr-core\test\J1\temp\solr.handler.TestReplicationHandler_4F6377ECCCC1A69E-001\solr-instance-002\solr.xml
   [junit4]   2> 1534098 INFO  (TEST-TestReplicationHandler.doTestStressReplication-seed#[4F6377ECCCC1A69E]) [    ] o.a.s.c.CorePropertiesLocator Config-defined core root directory: C:\Users\JenkinsSlave\workspace\Lucene-Solr-5.x-Windows\solr\build\solr-core\test\J1\temp\solr.handler.TestReplicationHandler_4F6377ECCCC1A69E-001\solr-instance-002\.
   [junit4]   2> 1534099 INFO  (TEST-TestReplicationHandler.doTestStressReplication-seed#[4F6377ECCCC1A69E]) [    ] o.a.s.c.CoreContainer New CoreContainer 180969045
   [junit4]   2> 1534099 INFO  (TEST-TestReplicationHandler.doTestStressReplication-seed#[4F6377ECCCC1A69E]) [    ] o.a.s.c.CoreContainer Loading cores into CoreContainer [instanceDir=C:\Users\JenkinsSlave\workspace\Lucene-Solr-5.x-Windows\solr\build\solr-core\test\J1\temp\solr.handler.TestReplicationHandler_4F6377ECCCC1A69E-001\solr-instance-002]
   [junit4]   2> 1534099 WARN  (TEST-TestReplicationHandler.doTestStressReplication-seed#[4F6377ECCCC1A69E]) [    ] o.a.s.c.CoreContainer Couldn't add files from C:\Users\JenkinsSlave\workspace\Lucene-Solr-5.x-Windows\solr\build\solr-core\test\J1\temp\solr.handler.TestReplicationHandler_4F6377ECCCC1A69E-001\solr-instance-002\lib to classpath: C:\Users\JenkinsSlave\workspace\Lucene-Solr-5.x-Windows\solr\build\solr-core\test\J1\temp\solr.handler.TestReplicationHandler_4F6377ECCCC1A69E-001\solr-instance-002\lib
   [junit4]   2> 1534100 INFO  (TEST-TestReplicationHandler.doTestStressReplication-seed#[4F6377ECCCC1A69E]) [    ] o.a.s.h.c.HttpShardHandlerFactory created with socketTimeout : 90000,urlScheme : ,connTimeout : 15000,maxConnectionsPerHost : 20,maxConnections : 10000,corePoolSize : 0,maximumPoolSize : 2147483647,maxThreadIdleTime : 5,sizeOfQueue : -1,fairnessPolicy : false,useRetries : false,
   [junit4]   2> 1534101 INFO  (TEST-TestReplicationHandler.doTestStressReplication-seed#[4F6377ECCCC1A69E]) [    ] o.a.s.u.UpdateShardHandler Creating UpdateShardHandler HTTP client with params: socketTimeout=340000&connTimeout=45000&retry=true
   [junit4]   2> 1534101 INFO  (TEST-TestReplicationHandler.doTestStressReplication-seed#[4F6377ECCCC1A69E]) [    ] o.a.s.l.LogWatcher SLF4J impl is org.slf4j.impl.Log4jLoggerFactory
   [junit4]   2> 1534101 INFO  (TEST-TestReplicationHandler.doTestStressReplication-seed#[4F6377ECCCC1A69E]) [    ] o.a.s.l.LogWatcher Registering Log Listener [Log4j (org.slf4j.impl.Log4jLoggerFactory)]
   [junit4]   2> 1534101 INFO  (TEST-TestReplicationHandler.doTestStressReplication-seed#[4F6377ECCCC1A69E]) [    ] o.a.s.c.CoreContainer Security conf doesn't exist. Skipping setup for authorization module.
   [junit4]   2> 1534101 INFO  (TEST-TestReplicationHandler.doTestStressReplication-seed#[4F6377ECCCC1A69E]) [    ] o.a.s.c.CoreContainer No authentication plugin used.
   [junit4]   2> 1534102 INFO  (TEST-TestReplicationHandler.doTestStressReplication-seed#[4F6377ECCCC1A69E]) [    ] o.a.s.c.CorePropertiesLocator Looking for core definitions underneath C:\Users\JenkinsSlave\workspace\Lucene-Solr-5.x-Windows\solr\build\solr-core\test\J1\temp\solr.handler.TestReplicationHandler_4F6377ECCCC1A69E-001\solr-instance-002\.
   [junit4]   2> 1534105 INFO  (TEST-TestReplicationHandler.doTestStressReplication-seed#[4F6377ECCCC1A69E]) [    ] o.a.s.c.CoreDescriptor Created CoreDescriptor: {name=collection1, config=solrconfig.xml, loadOnStartup=true, schema=schema.xml, configSetProperties=configsetprops.json, transient=false, dataDir=data\}
   [junit4]   2> 1534105 INFO  (TEST-TestReplicationHandler.doTestStressReplication-seed#[4F6377ECCCC1A69E]) [    ] o.a.s.c.CorePropertiesLocator Found core collection1 in C:\Users\JenkinsSlave\workspace\Lucene-Solr-5.x-Windows\solr\build\solr-core\test\J1\temp\solr.handler.TestReplicationHandler_4F6377ECCCC1A69E-001\solr-instance-002\.\collection1
   [junit4]   2> 1534106 INFO  (TEST-TestReplicationHandler.doTestStressReplication-seed#[4F6377ECCCC1A69E]) [    ] o.a.s.c.CorePropertiesLocator Found 1 core definitions
   [junit4]   2> 1534106 INFO  (TEST-TestReplicationHandler.doTestStressReplication-seed#[4F6377ECCCC1A69E]) [    ] o.a.s.s.SolrDispatchFilter user.dir=C:\Users\JenkinsSlave\workspace\Lucene-Solr-5.x-Windows\solr\build\solr-core\test\J1
   [junit4]   2> 1534106 INFO  (TEST-TestReplicationHandler.doTestStressReplication-seed#[4F6377ECCCC1A69E]) [    ] o.a.s.s.SolrDispatchFilter SolrDispatchFilter.init() done
   [junit4]   2> 1534106 INFO  (coreLoadExecutor-4981-thread-1) [    ] o.a.s.c.SolrResourceLoader new SolrResourceLoader for directory: 'C:\Users\JenkinsSlave\workspace\Lucene-Solr-5.x-Windows\solr\build\solr-core\test\J1\temp\solr.handler.TestReplicationHandler_4F6377ECCCC1A69E-001\solr-instance-002\collection1'
   [junit4]   2> 1534106 INFO  (coreLoadExecutor-4981-thread-1) [    ] o.a.s.c.SolrResourceLoader JNDI not configured for solr (NoInitialContextEx)
   [junit4]   2> 1534106 INFO  (coreLoadExecutor-4981-thread-1) [    ] o.a.s.c.SolrResourceLoader solr home defaulted to 'solr/' (could not find system property or JNDI)
   [junit4]   2> 1534113 INFO  (coreLoadExecutor-4981-thread-1) [    ] o.a.s.c.SolrConfig current version of requestparams : -1
   [junit4]   2> 1534116 INFO  (coreLoadExecutor-4981-thread-1) [    ] o.a.s.c.SolrConfig Using Lucene MatchVersion: 5.5.0
   [junit4]   2> 1534121 INFO  (coreLoadExecutor-4981-thread-1) [    ] o.a.s.c.SolrConfig Loaded SolrConfig: solrconfig.xml
   [junit4]   2> 1534131 INFO  (coreLoadExecutor-4981-thread-1) [    ] o.a.s.s.IndexSchema [collection1] Schema name=test
   [junit4]   2> 1534154 INFO  (coreLoadExecutor-4981-thread-1) [    ] o.a.s.s.IndexSchema unique key field: id
   [junit4]   2> 1534157 INFO  (coreLoadExecutor-4981-thread-1) [    ] o.a.s.c.ConfigSetProperties Did not find ConfigSet properties, assuming default properties: Can't find resource 'configsetprops.json' in classpath or 'C:\Users\JenkinsSlave\workspace\Lucene-Solr-5.x-Windows\solr\build\solr-core\test\J1\temp\solr.handler.TestReplicationHandler_4F6377ECCCC1A69E-001\solr-instance-002\collection1'
   [junit4]   2> 1534157 INFO  (coreLoadExecutor-4981-thread-1) [    ] o.a.s.c.CoreContainer Creating SolrCore 'collection1' using configuration from instancedir C:\Users\JenkinsSlave\workspace\Lucene-Solr-5.x-Windows\solr\build\solr-core\test\J1\temp\solr.handler.TestReplicationHandler_4F6377ECCCC1A69E-001\solr-instance-002\.\collection1
   [junit4]   2> 1534157 INFO  (coreLoadExecutor-4981-thread-1) [    x:collection1] o.a.s.c.SolrCore org.apache.solr.core.MockDirectoryFactory
   [junit4]   2> 1534157 INFO  (coreLoadExecutor-4981-thread-1) [    x:collection1] o.a.s.c.SolrCore [[collection1] ] Opening new SolrCore at [C:\Users\JenkinsSlave\workspace\Lucene-Solr-5.x-Windows\solr\build\solr-core\test\J1\temp\solr.handler.TestReplicationHandler_4F6377ECCCC1A69E-001\solr-instance-002\collection1], dataDir=[C:\Users\JenkinsSlave\workspace\Lucene-Solr-5.x-Windows\solr\build\solr-core\test\J1\temp\solr.handler.TestReplicationHandler_4F6377ECCCC1A69E-001\solr-instance-002\.\collection1\data\]
   [junit4]   2> 1534157 INFO  (coreLoadExecutor-4981-thread-1) [    x:collection1] o.a.s.c.SolrCore JMX monitoring not detected for core: collection1
   [junit4]   2> 1534157 INFO  (coreLoadExecutor-4981-thread-1) [    x:collection1] o.a.s.c.CachingDirectoryFactory return new directory for C:\Users\JenkinsSlave\workspace\Lucene-Solr-5.x-Windows\solr\build\solr-core\test\J1\temp\solr.handler.TestReplicationHandler_4F6377ECCCC1A69E-001\solr-instance-002\.\collection1\data\
   [junit4]   2> 1534157 INFO  (coreLoadExecutor-4981-thread-1) [    x:collection1] o.a.s.c.SolrCore New index directory detected: old=null new=C:\Users\JenkinsSlave\workspace\Lucene-Solr-5.x-Windows\solr\build\solr-core\test\J1\temp\solr.handler.TestReplicationHandler_4F6377ECCCC1A69E-001\solr-instance-002\.\collection1\data\index/
   [junit4]   2> 1534157 WARN  (coreLoadExecutor-4981-thread-1) [    x:collection1] o.a.s.c.SolrCore [collection1] Solr index directory 'C:\Users\JenkinsSlave\workspace\Lucene-Solr-5.x-Windows\solr\build\solr-core\test\J1\temp\solr.handler.TestReplicationHandler_4F6377ECCCC1A69E-001\solr-instance-002\.\collection1\data\index' doesn't exist. Creating new index...
   [junit4]   2> 1534158 INFO  (coreLoadExecutor-4981-thread-1) [    x:collection1] o.a.s.c.CachingDirectoryFactory return new directory for C:\Users\JenkinsSlave\workspace\Lucene-Solr-5.x-Windows\solr\build\solr-core\test\J1\temp\solr.handler.TestReplicationHandler_4F6377ECCCC1A69E-001\solr-instance-002\.\collection1\data\index
   [junit4]   2> 1534158 INFO  (coreLoadExecutor-4981-thread-1) [    x:collection1] o.a.s.u.RandomMergePolicy RandomMergePolicy wrapping class org.apache.lucene.index.LogDocMergePolicy: [LogDocMergePolicy: minMergeSize=1000, mergeFactor=26, maxMergeSize=9223372036854775807, maxMergeSizeForForcedMerge=9223372036854775807, calibrateSizeByDeletes=true, maxMergeDocs=2147483647, maxCFSSegmentSizeMB=8.796093022207999E12, noCFSRatio=0.5155285091941315]
   [junit4]   2> 1534158 INFO  (coreLoadExecutor-4981-thread-1) [    x:collection1] o.a.s.c.SolrDeletionPolicy SolrDeletionPolicy.onCommit: commits: num=1
   [junit4]   2> 	commit{dir=MockDirectoryWrapper(RAMDirectory@60e25218 lockFactory=org.apache.lucene.store.SingleInstanceLockFactory@64848f6a),segFN=segments_1,generation=1}
   [junit4]   2> 1534158 INFO  (coreLoadExecutor-4981-thread-1) [    x:collection1] o.a.s.c.SolrDeletionPolicy newest commit generation = 1
   [junit4]   2> 1534159 INFO  (OldIndexDirectoryCleanupThreadForCore-collection1) [    x:collection1] o.a.s.c.SolrCore Looking for old index directories to cleanup for core collection1 in C:\Users\JenkinsSlave\workspace\Lucene-Solr-5.x-Windows\solr\build\solr-core\test\J1\temp\solr.handler.TestReplicationHandler_4F6377ECCCC1A69E-001\solr-instance-002\.\collection1\data\
   [junit4]   2> 1534160 INFO  (coreLoadExecutor-4981-thread-1) [    x:collection1] o.a.s.c.SolrCore no updateRequestProcessorChain defined as default, creating implicit default
   [junit4]   2> 1534160 INFO  (coreLoadExecutor-4981-thread-1) [    x:collection1] o.a.s.h.l.XMLLoader xsltCacheLifetimeSeconds=60
   [junit4]   2> 1534161 INFO  (coreLoadExecutor-4981-thread-1) [    x:collection1] o.a.s.h.l.XMLLoader xsltCacheLifetimeSeconds=60
   [junit4]   2> 1534162 INFO  (coreLoadExecutor-4981-thread-1) [    x:collection1] o.a.s.h.l.XMLLoader xsltCacheLifetimeSeconds=60
   [junit4]   2> 1534163 INFO  (coreLoadExecutor-4981-thread-1) [    x:collection1] o.a.s.h.l.XMLLoader xsltCacheLifetimeSeconds=60
   [junit4]   2> 1534166 INFO  (coreLoadExecutor-4981-thread-1) [    x:collection1] o.a.s.c.PluginBag requestHandler : 'lazy' created with startup=lazy 
   [junit4]   2> 1534166 INFO  (coreLoadExecutor-4981-thread-1) [    x:collection1] o.a.s.c.RequestHandlers Registered paths: /admin/mbeans,standard,lazy,/update/csv,/update/json/docs,/admin/luke,/admin/segments,/get,/admin/system,/replication,/admin/properties,defaults,/config,/schema,/admin/plugins,/admin/logging,/update/json,/admin/threads,/admin/ping,/update,/admin/file
   [junit4]   2> 1534166 INFO  (coreLoadExecutor-4981-thread-1) [    x:collection1] o.a.s.c.SolrCore Using default statsCache cache: org.apache.solr.search.stats.LocalStatsCache
   [junit4]   2> 1534167 INFO  (coreLoadExecutor-4981-thread-1) [    x:collection1] o.a.s.u.CommitTracker Hard AutoCommit: disabled
   [junit4]   2> 1534167 INFO  (coreLoadExecutor-4981-thread-1) [    x:collection1] o.a.s.u.CommitTracker Soft AutoCommit: disabled
   [junit4]   2> 1534168 INFO  (coreLoadExecutor-4981-thread-1) [    x:collection1] o.a.s.u.RandomMergePolicy RandomMergePolicy wrapping class org.apache.lucene.index.AlcoholicMergePolicy: [AlcoholicMergePolicy: minMergeSize=0, mergeFactor=10, maxMergeSize=1851134133, maxMergeSizeForForcedMerge=9223372036854775807, calibrateSizeByDeletes=true, maxMergeDocs=2147483647, maxCFSSegmentSizeMB=8.796093022207999E12, noCFSRatio=0.1]
   [junit4]   2> 1534168 INFO  (coreLoadExecutor-4981-thread-1) [    x:collection1] o.a.s.c.SolrDeletionPolicy SolrDeletionPolicy.onInit: commits: num=1
   [junit4]   2> 	commit{dir=MockDirectoryWrapper(RAMDirectory@60e25218 lockFactory=org.apache.lucene.store.SingleInstanceLockFactory@64848f6a),segFN=segments_1,generation=1}
   [junit4]   2> 1534168 INFO  (coreLoadExecutor-4981-thread-1) [    x:collection1] o.a.s.c.SolrDeletionPolicy newest commit generation = 1
   [junit4]   2> 1534169 INFO  (coreLoadExecutor-4981-thread-1) [    x:collection1] o.a.s.s.SolrIndexSearcher Opening Searcher@16c8e2e3[collection1] main
   [junit4]   2> 1534169 INFO  (coreLoadExecutor-4981-thread-1) [    x:collection1] o.a.s.r.ManagedResourceStorage File-based storage initialized to use dir: C:\Users\JenkinsSlave\workspace\Lucene-Solr-5.x-Windows\solr\build\solr-core\test\J1\temp\solr.handler.TestReplicationHandler_4F6377ECCCC1A69E-001\solr-instance-002\collection1\conf
   [junit4]   2> 1534169 INFO  (coreLoadExecutor-4981-thread-1) [    x:collection1] o.a.s.r.RestManager Initializing RestManager with initArgs: {storageDir=C:\Users\JenkinsSlave\workspace\Lucene-Solr-5.x-Windows\solr\build\solr-core\test\J1\temp\solr.handler.TestReplicationHandler_4F6377ECCCC1A69E-001\solr-instance-002\collection1\conf}
   [junit4]   2> 1534169 INFO  (coreLoadExecutor-4981-thread-1) [    x:collection1] o.a.s.r.ManagedResourceStorage Reading _rest_managed.json using file:dir=C:\Users\JenkinsSlave\workspace\Lucene-Solr-5.x-Windows\solr\build\solr-core\test\J1\temp\solr.handler.TestReplicationHandler_4F6377ECCCC1A69E-001\solr-instance-002\collection1\conf
   [junit4]   2> 1534170 INFO  (coreLoadExecutor-4981-thread-1) [    x:collection1] o.a.s.r.RestManager Initializing 0 registered ManagedResources
   [junit4]   2> 1534174 INFO  (coreLoadExecutor-4981-thread-1) [    x:collection1] o.a.s.h.ReplicationHandler Poll scheduled at an interval of 1000ms
   [junit4]   2> 1534174 INFO  (searcherExecutor-4982-thread-1-processing-x:collection1) [    x:collection1] o.a.s.c.SolrCore [collection1] Registered new searcher Searcher@16c8e2e3[collection1] main{ExitableDirectoryReader(UninvertingDirectoryReader())}
   [junit4]   2> 1534174 INFO  (coreLoadExecutor-4981-thread-1) [    x:collection1] o.a.s.c.CoreContainer registering core: collection1
   [junit4]   2> 1534616 INFO  (TEST-TestReplicationHandler.doTestStressReplication-seed#[4F6377ECCCC1A69E]) [    ] o.e.j.s.ServerConnector Stopped ServerConnector@28b81030{HTTP/1.1}{127.0.0.1:0}
   [junit4]   2> 1534616 INFO  (TEST-TestReplicationHandler.doTestStressReplication-seed#[4F6377ECCCC1A69E]) [    ] o.a.s.c.CoreContainer Shutting down CoreContainer instance=180969045
   [junit4]   2> 1534627 INFO  (TEST-TestReplicationHandler.doTestStressReplication-seed#[4F6377ECCCC1A69E]) [    x:collection1] o.a.s.c.SolrCore [collection1]  CLOSING SolrCore org.apache.solr.core.SolrCore@25f1e991
   [junit4]   2> 1534627 INFO  (TEST-TestReplicationHandler.doTestStressReplication-seed#[4F6377ECCCC1A69E]) [    x:collection1] o.a.s.u.DirectUpdateHandler2 closing DirectUpdateHandler2{commits=0,autocommits=0,soft autocommits=0,optimizes=0,rollbacks=0,expungeDeletes=0,docsPending=0,adds=0,deletesById=0,deletesByQuery=0,errors=0,cumulative_adds=0,cumulative_deletesById=0,cumulative_deletesByQuery=0,cumulative_errors=0}
   [junit4]   2> 1534627 INFO  (TEST-TestReplicationHandler.doTestStressReplication-seed#[4F6377ECCCC1A69E]) [    x:collection1] o.a.s.u.SolrCoreState Closing SolrCoreState
   [junit4]   2> 1534627 INFO  (TEST-TestReplicationHandler.doTestStressReplication-seed#[4F6377ECCCC1A69E]) [    x:collection1] o.a.s.u.DefaultSolrCoreState SolrCoreState ref count has reached 0 - closing IndexWriter
   [junit4]   2> 1534627 INFO  (TEST-TestReplicationHandler.doTestStressReplication-seed#[4F6377ECCCC1A69E]) [    x:collection1] o.a.s.u.DefaultSolrCoreState closing IndexWriter with IndexWriterCloser
   [junit4]   2> 1534627 INFO  (qtp1684468898-12984) [    x:collection1] o.a.s.c.S.Request [collection1]  webapp=/solr path=/replication params={qt=/replication&wt=javabin&version=2&command=indexversion} status=0 QTime=0
   [junit4]   2> 1534627 INFO  (TEST-TestReplicationHandler.doTestStressReplication-seed#[4F6377ECCCC1A69E]) [    x:collection1] o.a.s.c.SolrCore [collection1] Closing main searcher on request.
   [junit4]   2> 1534627 INFO  (TEST-TestReplicationHandler.doTestStressReplication-seed#[4F6377ECCCC1A69E]) [    x:collection1] o.a.s.c.CachingDirectoryFactory Closing MockDirectoryFactory - 2 directories currently being tracked
   [junit4]   2> 1534627 INFO  (TEST-TestReplicationHandler.doTestStressReplication-seed#[4F6377ECCCC1A69E]) [    x:collection1] o.a.s.c.CachingDirectoryFactory looking to close C:\Users\JenkinsSlave\workspace\Lucene-Solr-5.x-Windows\solr\build\solr-core\test\J1\temp\solr.handler.TestReplicationHandler_4F6377ECCCC1A69E-001\solr-instance-002\.\collection1\data\index [CachedDir<<refCount=0;path=C:\Users\JenkinsSlave\workspace\Lucene-Solr-5.x-Windows\solr\build\solr-core\test\J1\temp\solr.handler.TestReplicationHandler_4F6377ECCCC1A69E-001\solr-instance-002\.\collection1\data\index;done=false>>]
   [junit4]   2> 1534627 INFO  (TEST-TestReplicationHandler.doTestStressReplication-seed#[4F6377ECCCC1A69E]) [    x:collection1] o.a.s.c.CachingDirectoryFactory Closing directory: C:\Users\JenkinsSlave\workspace\Lucene-Solr-5.x-Windows\solr\build\solr-core\test\J1\temp\solr.handler.TestReplicationHandler_4F6377ECCCC1A69E-001\solr-instance-002\.\collection1\data\index
   [junit4]   2> 1534627 INFO  (TEST-TestReplicationHandler.doTestStressReplication-seed#[4F6377ECCCC1A69E]) [    x:collection1] o.a.s.c.CachingDirectoryFactory looking to close C:\Users\JenkinsSlave\workspace\Lucene-Solr-5.x-Windows\solr\build\solr-core\test\J1\temp\solr.handler.TestReplicationHandler_4F6377ECCCC1A69E-001\solr-instance-002\.\collection1\data\ [CachedDir<<refCount=0;path=C:\Users\JenkinsSlave\workspace\Lucene-Solr-5.x-Windows\solr\build\solr-core\test\J1\temp\solr.handler.TestReplicationHandler_4F6377ECCCC1A69E-001\solr-instance-002\.\collection1\data\;done=false>>]
   [junit4]   2> 1534627 INFO  (TEST-TestReplicationHandler.doTestStressReplication-seed#[4F6377ECCCC1A69E]) [    x:collection1] o.a.s.c.CachingDirectoryFactory Closing directory: C:\Users\JenkinsSlave\workspace\Lucene-Solr-5.x-Windows\solr\build\solr-core\test\J1\temp\solr.handler.TestReplicationHandler_4F6377ECCCC1A69E-001\solr-instance-002\.\collection1\data\
   [junit4]   2> 1534628 INFO  (TEST-TestReplicationHandler.doTestStressReplication-seed#[4F6377ECCCC1A69E]) [    x:collection1] o.e.j.s.h.ContextHandler Stopped o.e.j.s.ServletContextHandler@15fc490a{/solr,null,UNAVAILABLE}
   [junit4]   2> 1534632 INFO  (TEST-TestReplicationHandler.doTestStressReplication-seed#[4F6377ECCCC1A69E]) [    ] o.e.j.s.Server jetty-9.2.13.v20150730
   [junit4]   2> 1534636 INFO  (TEST-TestReplicationHandler.doTestStressReplication-seed#[4F6377ECCCC1A69E]) [    ] o.e.j.s.h.ContextHandler Started o.e.j.s.ServletContextHandler@2bd8aac0{/solr,null,AVAILABLE}
   [junit4]   2> 1534637 INFO  (TEST-TestReplicationHandler.doTestStressReplication-seed#[4F6377ECCCC1A69E]) [    ] o.e.j.s.ServerConnector Started ServerConnector@13e09884{HTTP/1.1}{127.0.0.1:53034}
   [junit4]   2> 1534637 INFO  (TEST-TestReplicationHandler.doTestStressReplication-seed#[4F6377ECCCC1A69E]) [    ] o.e.j.s.Server Started @1539843ms
   [junit4]   2> 1534637 INFO  (TEST-TestReplicationHandler.doTestStressReplication-seed#[4F6377ECCCC1A69E]) [    ] o.a.s.c.s.e.JettySolrRunner Jetty properties: {solr.data.dir=C:\Users\JenkinsSlave\workspace\Lucene-Solr-5.x-Windows\solr\build\solr-core\test\J1\temp\solr.handler.TestReplicationHandler_4F6377ECCCC1A69E-001\solr-instance-002\collection1\data, hostContext=/solr, hostPort=53034}
   [junit4]   2> 1534637 INFO  (TEST-TestReplicationHandler.doTestStressReplication-seed#[4F6377ECCCC1A69E]) [    ] o.a.s.s.SolrDispatchFilter SolrDispatchFilter.init(): sun.misc.Launcher$AppClassLoader@73d16e93
   [junit4]   2> 1534637 INFO  (TEST-TestReplicationHandler.doTestStressReplication-seed#[4F6377ECCCC1A69E]) [    ] o.a.s.c.SolrResourceLoader new SolrResourceLoader for directory: 'C:\Users\JenkinsSlave\workspace\Lucene-Solr-5.x-Windows\solr\build\solr-core\test\J1\temp\solr.handler.TestReplicationHandler_4F6377ECCCC1A69E-001\solr-instance-002'
   [junit4]   2> 1534637 INFO  (TEST-TestReplicationHandler.doTestStressReplication-seed#[4F6377ECCCC1A69E]) [    ] o.a.s.c.SolrResourceLoader JNDI not configured for solr (NoInitialContextEx)
   [junit4]   2> 1534637 INFO  (TEST-TestReplicationHandler.doTestStressReplication-seed#[4F6377ECCCC1A69E]) [    ] o.a.s.c.SolrResourceLoader solr home defaulted to 'solr/' (could not find system property or JNDI)
   [junit4]   2> 1534637 INFO  (TEST-TestReplicationHandler.doTestStressReplication-seed#[4F6377ECCCC1A69E]) [    ] o.a.s.c.SolrXmlConfig Loading container configuration from C:\Users\JenkinsSlave\workspace\Lucene-Solr-5.x-Windows\solr\build\solr-core\test\J1\temp\solr.handler.TestReplicationHandler_4F6377ECCCC1A69E-001\solr-instance-002\solr.xml
   [junit4]   2> 1534643 INFO  (TEST-TestReplicationHandler.doTestStressReplication-seed#[4F6377ECCCC1A69E]) [    ] o.a.s.c.CorePropertiesLocator Config-defined core root directory: C:\Users\JenkinsSlave\workspace\Lucene-Solr-5.x-Windows\solr\build\solr-core\test\J1\temp\solr.handler.TestReplicationHandler_4F6377ECCCC1A69E-001\solr-instance-002\.
   [junit4]   2> 1534643 INFO  (TEST-TestReplicationHandler.doTestStressReplication-seed#[4F6377ECCCC1A69E]) [    ] o.a.s.c.CoreContainer New CoreContainer 1390304867
   [junit4]   2> 1534643 INFO  (TEST-TestReplicationHandler.doTestStressReplication-seed#[4F6377ECCCC1A69E]) [    ] o.a.s.c.CoreContainer Loading cores into CoreContainer [instanceDir=C:\Users\JenkinsSlave\workspace\Lucene-Solr-5.x-Windows\solr\build\solr-core\test\J1\temp\solr.handler.TestReplicationHandler_4F6377ECCCC1A69E-001\solr-instance-002]
   [junit4]   2> 1534643 WARN  (TEST-TestReplicationHandler.doTestStressReplication-seed#[4F6377ECCCC1A69E]) [    ] o.a.s.c.CoreContainer Couldn't add files from C:\Users\JenkinsSlave\workspace\Lucene-Solr-5.x-Windows\solr\build\solr-core\test\J1\temp\solr.handler.TestReplicationHandler_4F6377ECCCC1A69E-001\solr-instance-002\lib to classpath: C:\Users\JenkinsSlave\workspace\Lucene-Solr-5.x-Windows\solr\build\solr-core\test\J1\temp\solr.handler.TestReplicationHandler_4F6377ECCCC1A69E-001\solr-instance-002\lib
   [junit4]   2> 1534645 INFO  (TEST-TestReplicationHandler.doTestStressReplication-seed#[4F6377ECCCC1A69E]) [    ] o.a.s.h.c.HttpShardHandlerFactory created with socketTimeout : 90000,urlScheme : ,connTimeout : 15000,maxConnectionsPerHost : 20,maxConnections : 10000,corePoolSize : 0,maximumPoolSize : 2147483647,maxThreadIdleTime : 5,sizeOfQueue : -1,fairnessPolicy : false,useRetries : false,
   [junit4]   2> 1534646 INFO  (TEST-TestReplicationHandler.doTestStressReplication-seed#[4F6377ECCCC1A69E]) [    ] o.a.s.u.UpdateShardHandler Creating UpdateShardHandler HTTP client with params: socketTimeout=340000&connTimeout=45000&retry=true
   [junit4]   2> 1534646 INFO  (TEST-TestReplicationHandler.doTestStressReplication-seed#[4F6377ECCCC1A69E]) [    ] o.a.s.l.LogWatcher SLF4J impl is org.slf4j.impl.Log4jLoggerFactory
   [junit4]   2> 1534646 INFO  (TEST-TestReplicationHandler.doTestStressReplication-seed#[4F6377ECCCC1A69E]) [    ] o.a.s.l.LogWatcher Registering Log Listener [Log4j (org.slf4j.impl.Log4jLoggerFactory)]
   [junit4]   2> 1534646 INFO  (TEST-TestReplicationHandler.doTestStressReplication-seed#[4F6377ECCCC1A69E]) [    ] o.a.s.c.CoreContainer Security conf doesn't exist. Skipping setup for authorization module.
   [junit4]   2> 1534646 INFO  (TEST-TestReplicationHandler.doTestStressReplication-seed#[4F6377ECCCC1A69E]) [    ] o.a.s.c.CoreContainer No authentication plugin used.
   [junit4]   2> 1534647 INFO  (TEST-TestReplicationHandler.doTestStressReplication-seed#[4F6377ECCCC1A69E]) [    ] o.a.s.c.CorePropertiesLocator Looking for core definitions underneath C:\Users\JenkinsSlave\workspace\Lucene-Solr-5.x-Windows\solr\build\solr-core\test\J1\temp\solr.handler.TestReplicationHandler_4F6377ECCCC1A69E-001\solr-instance-002\.
   [junit4]   2> 1534648 INFO  (TEST-TestReplicationHandler.doTestStressReplication-seed#[4F6377ECCCC1A69E]) [    ] o.a.s.c.CoreDescriptor Created CoreDescriptor: {name=collection1, config=solrconfig.xml, loadOnStartup=true, schema=schema.xml, configSetProperties=configsetprops.json, transient=false, dataDir=data\}
   [junit4]   2> 1534648 INFO  (TEST-TestReplicationHandler.doTestStressReplication-seed#[4F6377ECCCC1A69E]) [    ] o.a.s.c.CorePropertiesLocator Found core collection1 in C:\Users\JenkinsSlave\workspace\Lucene-Solr-5.x-Windows\solr\build\solr-core\test\J1\temp\solr.handler.TestReplicationHandler_4F6377ECCCC1A69E-001\solr-instance-002\.\collection1
   [junit4]   2> 1534648 INFO  (TEST-TestReplicationHandler.doTestStressReplication-seed#[4F6377ECCCC1A69E]) [    ] o.a.s.c.CorePropertiesLocator Found 1 core definitions
   [junit4]   2> 1534648 INFO  (TEST-TestReplicationHandler.doTestStressReplication-seed#[4F6377ECCCC1A69E]) [    ] o.a.s.s.SolrDispatchFilter user.dir=C:\Users\JenkinsSlave\workspace\Lucene-Solr-5.x-Windows\solr\build\solr-core\test\J1
   [junit4]   2> 1534648 INFO  (coreLoadExecutor-4992-thread-1) [    ] o.a.s.c.SolrResourceLoader new SolrResourceLoader for directory: 'C:\Users\JenkinsSlave\workspace\Lucene-Solr-5.x-Windows\solr\build\solr-core\test\J1\temp\solr.handler.TestReplicationHandler_4F6377ECCCC1A69E-001\solr-instance-002\collection1'
   [junit4]   2> 1534648 INFO  (TEST-TestReplicationHandler.doTestStressReplication-seed#[4F6377ECCCC1A69E]) [    ] o.a.s.s.SolrDispatchFilter SolrDispatchFilter.init() done
   [junit4]   2> 1534649 INFO  (coreLoadExecutor-4992-thread-1) [    ] o.a.s.c.SolrResourceLoader JNDI not configured for solr (NoInitialContextEx)
   [junit4]   2> 1534649 INFO  (coreLoadExecutor-4992-thread-1) [    ] o.a.s.c.SolrResourceLoader solr home defaulted to 'solr/' (could not find system property or JNDI)
   [junit4]   2> 1534662 INFO  (coreLoadExecutor-4992-thread-1) [    ] o.a.s.c.SolrConfig current version of requestparams : -1
   [junit4]   2> 1534663 INFO  (coreLoadExecutor-4992-thread-1) [    ] o.a.s.c.SolrConfig Using Lucene MatchVersion: 5.5.0
   [junit4]   2> 1534667 INFO  (coreLoadExecutor-4992-thread-1) [    ] o.a.s.c.SolrConfig Loaded SolrConfig: solrconfig.xml
   [junit4]   2> 1534671 INFO  (coreLoadExecutor-4992-thread-1) [    ] o.a.s.s.IndexSchema [collection1] Schema name=test
   [junit4]   2> 1534677 INFO  (coreLoadExecutor-4992-thread-1) [    ] o.a.s.s.IndexSchema unique key field: id
   [junit4]   2> 1534679 INFO  (coreLoadExecutor-4992-thread-1) [    ] o.a.s.c.ConfigSetProperties Did not find ConfigSet properties, assuming default properties: Can't find resource 'configsetprops.json' in classpath or 'C:\Users\JenkinsSlave\workspace\Lucene-Solr-5.x-Windows\solr\build\solr-core\test\J1\temp\solr.handler.TestReplicationHandler_4F6377ECCCC1A69E-001\solr-instance-002\collection1'
   [junit4]   2> 1534679 INFO  (coreLoadExecutor-4992-thread-1) [    ] o.a.s.c.CoreContainer Creating SolrCore 'collection1' using configuration from instancedir C:\Users\JenkinsSlave\workspace\Lucene-Solr-5.x-Windows\solr\build\solr-core\test\J1\temp\solr.handler.TestReplicationHandler_4F6377ECCCC1A69E-001\solr-instance-002\.\collection1
   [junit4]   2> 1534679 INFO  (coreLoadExecutor-4992-thread-1) [    x:collection1] o.a.s.c.SolrCore solr.NRTCachingDirectoryFactory
   [junit4]   2> 1534679 INFO  (coreLoadExecutor-4992-thread-1) [    x:collection1] o.a.s.c.SolrCore [[collection1] ] Opening new SolrCore at [C:\Users\JenkinsSlave\workspace\Lucene-Solr-5.x-Windows\solr\build\solr-core\test\J1\temp\solr.handler.TestReplicationHandler_4F6377ECCCC1A69E-001\solr-instance-002\collection1], dataDir=[C:\Users\JenkinsSlave\workspace\Lucene-Solr-5.x-Windows\solr\build\solr-core\test\J1\temp\solr.handler.TestReplicationHandler_4F6377ECCCC1A69E-001\solr-instance-002\.\collection1\data\]
   [junit4]   2> 1534679 INFO  (coreLoadExecutor-4992-thread-1) [    x:collection1] o.a.s.c.SolrCore JMX monitoring not detected for core: collection1
   [junit4]   2> 1534681 INFO  (coreLoadExecutor-4992-thread-1) [    x:collection1] o.a.s.c.CachingDirectoryFactory return new directory for C:\Users\JenkinsSlave\workspace\Lucene-Solr-5.x-Windows\solr\build\solr-core\test\J1\temp\solr.handler.TestReplicationHandler_4F6377ECCCC1A69E-001\solr-instance-002\collection1\data
   [junit4]   2> 1534681 INFO  (coreLoadExecutor-4992-thread-1) [    x:collection1] o.a.s.c.SolrCore New index directory detected: old=null new=C:\Users\JenkinsSlave\workspace\Lucene-Solr-5.x-Windows\solr\build\solr-core\test\J1\temp\solr.handler.TestReplicationHandler_4F6377ECCCC1A69E-001\solr-instance-002\.\collection1\data\index/
   [junit4]   2> 1534681 WARN  (coreLoadExecutor-4992-thread-1) [    x:collection1] o.a.s.c.SolrCore [collection1] Solr index directory 'C:\Users\JenkinsSlave\workspace\Lucene-Solr-5.x-Windows\solr\build\solr-core\test\J1\temp\solr.handler.TestReplicationHandler_4F6377ECCCC1A69E-001\solr-instance-002\.\collection1\data\index' doesn't exist. Creating new index...
   [junit4]   2> 1534683 INFO  (coreLoadExecutor-4992-thread-1) [    x:collection1] o.a.s.c.CachingDirectoryFactory return new directory for C:\Users\JenkinsSlave\workspace\Lucene-Solr-5.x-Windows\solr\build\solr-core\test\J1\temp\solr.handler.TestReplicationHandler_4F6377ECCCC1A69E-001\solr-instance-002\collection1\data\index
   [junit4]   2> 1534683 INFO  (coreLoadExecutor-4992-thread-1) [    x:collection1] o.a.s.u.RandomMergePolicy RandomMergePolicy wrapping class org.apache.lucene.index.TieredMergePolicy: [TieredMergePolicy: maxMergeAtOnce=37, maxMergeAtOnceExplicit=50, maxMergedSegmentMB=47.263671875, floorSegmentMB=1.6640625, forceMergeDeletesPctAllowed=1.501560409305246, segmentsPerTier=11.0, maxCFSSegmentSizeMB=8.796093022207999E12, noCFSRatio=1.0
   [junit4]   2> 1534741 INFO  (coreLoadExecutor-4992-thread-1) [    x:collection1] o.a.s.c.SolrDeletionPolicy SolrDeletionPolicy.onCommit: commits: num=1
   [junit4]   2> 	commit{dir=NRTCachingDirectory(MMapDirectory@C:\Users\JenkinsSlave\workspace\Lucene-Solr-5.x-Windows\solr\build\solr-core\test\J1\temp\solr.handler.TestReplicationHandler_4F6377ECCCC1A69E-001\solr-instance-002\collection1\data\index lockFactory=org.apache.lucene.store.SingleInstanceLockFactory@323b6f6a; maxCacheMB=48.0 maxMergeSizeMB=4.0),segFN=segments_1,generation=1}
   [junit4]   2> 1534741 INFO  (coreLoadExecutor-4992-thread-1) [    x:collection1] o.a.s.c.SolrDeletionPolicy newest commit generation = 1
   [junit4]   2> 1534743 INFO  (OldIndexDirectoryCleanupThreadForCore-collection1) [    x:collection1] o.a.s.c.SolrCore Looking for old index directories to cleanup for core collection1 in C:\Users\JenkinsSlave\workspace\Lucene-Solr-5.x-Windows\solr\build\solr-core\test\J1\temp\solr.handler.TestReplicationHandler_4F6377ECCCC1A69E-001\solr-instance-002\.\collection1\data\
   [junit4]   2> 1534745 INFO  (coreLoadExecutor-4992-thread-1) [    x:collection1] o.a.s.c.SolrCore no updateRequestProcessorChain defined as default, creating implicit default
   [junit4]   2> 1534746 INFO  (coreLoadExecutor-4992-thread-1) [    x:collection1] o.a.s.h.l.XMLLoader xsltCacheLifetimeSeconds=60
   [junit4]   2> 1534748 INFO  (coreLoadExecutor-4992-thread-1) [    x:collection1] o.a.s.h.l.XMLLoader xsltCacheLifetimeSeconds=60
   [junit4]   2> 1534749 INFO  (coreLoadExecutor-4992-thread-1) [    x:collection1] o.a.s.h.l.XMLLoader xsltCacheLifetimeSeconds=60
   [junit4]   2> 1534751 INFO  (coreLoadExecutor-4992-thread-1) [    x:collection1] o.a.s.h.l.XMLLoader xsltCacheLifetimeSeconds=60
   [junit4]   2> 1534751 INFO  (coreLoadExecutor-4992-thread-1) [    x:collection1] o.a.s.c.PluginBag requestHandler : 'lazy' created with startup=lazy 
   [junit4]   2> 1534751 INFO  (coreLoadExecutor-4992-thread-1) [    x:collection1] o.a.s.c.RequestHandlers Registered paths: /admin/mbeans,standard,lazy,/update/csv,/update/json/docs,/admin/luke,/admin/segments,/get,/admin/system,/replication,/admin/properties,defaults,/config,/schema,/admin/plugins,/admin/logging,/update/json,/admin/threads,/admin/ping,/update,/admin/file
   [junit4]   2> 1534752 INFO  (coreLoadExecutor-4992-thread-1) [    x:collection1] o.a.s.c.SolrCore Using default statsCache cache: org.apache.solr.search.stats.LocalStatsCache
   [junit4]   2> 1534752 INFO  (coreLoadExecutor-4992-thread-1) [    x:collection1] o.a.s.u.CommitTracker Hard AutoCommit: disabled
   [junit4]   2> 1534752 INFO  (coreLoadExecutor-4992-thread-1) [    x:collection1] o.a.s.u.CommitTracker Soft AutoCommit: disabled
   [junit4]   2> 1534753 INFO  (coreLoadExecutor-4992-thread-1) [    x:collection1] o.a.s.u.RandomMergePolicy RandomMergePolicy wrapping class org.apache.lucene.index.AlcoholicMergePolicy: [AlcoholicMergePolicy: minMergeSize=0, mergeFactor=10, maxMergeSize=1851134133, maxMergeSizeForForcedMerge=9223372036854775807, calibrateSizeByDeletes=true, maxMergeDocs=2147483647, maxCFSSegmentSizeMB=8.796093022207999E12, noCFSRatio=0.1]
   [junit4]   2> 1534753 INFO  (coreLoadExecutor-4992-thread-1) [    x:collection1] o.a.s.c.SolrDeletionPolicy SolrDeletionPolicy.onInit: commits: num=1
   [junit4]   2> 	commit{dir=NRTCachingDirectory(MMapDirectory@C:\Users\JenkinsSlave\workspace\Lucene-Solr-5.x-Windows\solr\build\solr-core\test\J1\temp\solr.handler.TestReplicationHandler_4F6377ECCCC1A69E-001\solr-instance-002\collection1\data\index lockFactory=org.apache.lucene.store.SingleInstanceLockFactory@323b6f6a; maxCacheMB=48.0 maxMergeSizeMB=4.0),segFN=segments_1,generation=1}
   [junit4]   2> 1534754 INFO  (coreLoadExecutor-4992-thread-1) [    x:collection1] o.a.s.c.SolrDeletionPolicy newest commit generation = 1
   [junit4]   2> 1534754 INFO  (coreLoadExecutor-4992-thread-1) [    x:collection1] o.a.s.s.SolrIndexSearcher Opening Searcher@5ea6ef1c[collection1] main
   [junit4]   2> 1534754 INFO  (coreLoadExecutor-4992-thread-1) [    x:collection1] o.a.s.r.ManagedResourceStorage File-based storage initialized to use dir: C:\Users\JenkinsSlave\workspace\Lucene-Solr-5.x-Windows\solr\build\solr-core\test\J1\temp\solr.handler.TestReplicationHandler_4F6377ECCCC1A69E-001\solr-instance-002\collection1\conf
   [junit4]   2> 1534754 INFO  (coreLoadExecutor-4992-thread-1) [    x:collection1] o.a.s.r.RestManager Initializing RestManager with initArgs: {storageDir=C:\Users\JenkinsSlave\workspace\Lucene-Solr-5.x-Windows\solr\build\solr-core\test\J1\temp\solr.handler.TestReplicationHandler_4F6377ECCCC1A69E-001\solr-instance-002\collection1\conf}
   [junit4]   2> 1534754 INFO  (coreLoadExecutor-4992-thread-1) [    x:collection1] o.a.s.r.ManagedResourceStorage Reading _rest_managed.json using file:dir=C:\Users\JenkinsSlave\workspace\Lucene-Solr-5.x-Windows\solr\build\solr-core\test\J1\temp\solr.handler.TestReplicationHandler_4F6377ECCCC1A69E-001\solr-instance-002\collection1\conf
   [junit4]   2> 1534755 INFO  (coreLoadExecutor-4992-thread-1) [    x:collection1] o.a.s.r.RestManager Initializing 0 registered ManagedResources
   [junit4]   2> 1534755 INFO  (coreLoadExecutor-4992-thread-1) [    x:collection1] o.a.s.h.ReplicationHandler Commits will be reserved for  10000
   [junit4]   2> 1534755 INFO  (searcherExecutor-4993-thread-1-processing-x:collection1) [    x:collection1] o.a.s.c.SolrCore [collection1] Registered new searcher Searcher@5ea6ef1c[collection1] main{ExitableDirectoryReader(UninvertingDirectoryReader())}
   [junit4]   2> 1534755 INFO  (coreLoadExecutor-4992-thread-1) [    x:collection1] o.a.s.c.CoreContainer registering core: collection1
   [junit4]   2> 1535084 INFO  (TEST-TestReplicationHandler.doTestStressReplication-seed#[4F6377ECCCC1A69E]) [    ] o.e.j.s.ServerConnector Stopped ServerConnector@4641673{HTTP/1.1}{127.0.0.1:0}
   [junit4]   2> 1535084 INFO  (TEST-TestReplicationHandler.doTestStressReplication-seed#[4F6377ECCCC1A69E]) [    ] o.a.s.c.CoreContainer Shutting down CoreContainer instance=926180700
   [junit4]   2> 1535084 INFO  (TEST-TestReplicationHandler.doTestStressReplication-seed#[4F6377ECCCC1A69E]) [    x:collection1] o.a.s.c.SolrCore [collection1]  CLOSING SolrCore org.apache.solr.core.SolrCore@9fdc89a
   [junit4]   2> 1535084 INFO  (TEST-TestReplicationHandler.doTestStressReplication-seed#[4F6377ECCCC1A69E]) [    x:collection1] o.a.s.u.DirectUpdateHandler2 closing DirectUpdateHandler2{commits=0,autocommits=0,soft autocommits=0,optimizes=0,rollbacks=0,expungeDeletes=0,docsPending=0,adds=0,deletesById=0,deletesByQuery=0,errors=0,cumulative_adds=0,cumulative_deletesById=0,cumulative_deletesByQuery=0,cumulative_errors=0}
   [junit4]   2> 1535084 INFO  (TEST-TestReplicationHandler.doTestStressReplication-seed#[4F6377ECCCC1A69E]) [    x:collection1] o.a.s.u.SolrCoreState Closing SolrCoreState
   [junit4]   2> 1535084 INFO  (TEST-TestReplicationHandler.doTestStressReplication-seed#[4F6377ECCCC1A69E]) [    x:collection1] o.a.s.u.DefaultSolrCoreState SolrCoreState ref count has reached 0 - closing IndexWriter
   [junit4]   2> 1535084 INFO  (TEST-TestReplicationHandler.doTestStressReplication-seed#[4F6377ECCCC1A69E]) [    x:collection1] o.a.s.u.DefaultSolrCoreState closing IndexWriter with IndexWriterCloser
   [junit4]   2> 1535086 INFO  (TEST-TestReplicationHandler.doTestStressReplication-seed#[4F6377ECCCC1A69E]) [    x:collection1] o.a.s.c.SolrCore [collection1] Closing main searcher on request.
   [junit4]   2> 1535086 INFO  (TEST-TestReplicationHandler.doTestStressReplication-seed#[4F6377ECCCC1A69E]) [    x:collection1] o.a.s.c.CachingDirectoryFactory Closing MockDirectoryFactory - 2 directories currently being tracked
   [junit4]   2> 1535086 INFO  (TEST-TestReplicationHandler.doTestStressReplication-seed#[4F6377ECCCC1A69E]) [    x:collection1] o.a.s.c.CachingDirectoryFactory looking to close C:\Users\JenkinsSlave\workspace\Lucene-Solr-5.x-Windows\solr\build\solr-core\test\J1\temp\solr.handler.TestReplicationHandler_4F6377ECCCC1A69E-001\solr-instance-001\.\collection1\data\index [CachedDir<<refCount=0;path=C:\Users\JenkinsSlave\workspace\Lucene-Solr-5.x-Windows\solr\build\solr-core\test\J1\temp\solr.handler.TestReplicationHandler_4F6377ECCCC1A69E-001\solr-instance-001\.\collection1\data\index;done=false>>]
   [junit4]   2> 1535086 INFO  (TEST-TestReplicationHandler.doTestStressReplication-seed#[4F6377ECCCC1A69E]) [    x:collection1] o.a.s.c.CachingDirectoryFactory Closing directory: C:\Users\JenkinsSlave\workspace\Lucene-Solr-5.x-Windows\solr\build\solr-core\test\J1\temp\solr.handler.TestReplicationHandler_4F6377ECCCC1A69E-001\solr-instance-001\.\collection1\data\index
   [junit4]   2> 1535086 INFO  (TEST-TestReplicationHandler.doTestStressReplication-seed#[4F6377ECCCC1A69E]) [    x:collection1] o.a.s.c.CachingDirectoryFactory looking to close C:\Users\JenkinsSlave\workspace\Lucene-Solr-5.x-Windows\solr\build\solr-core\test\J1\temp\solr.handler.TestReplicationHandler_4F6377ECCCC1A69E-001\solr-instance-001\.\collection1\data\ [CachedDir<<refCount=0;path=C:\Users\JenkinsSlave\workspace\Lucene-Solr-5.x-Windows\solr\build\solr-core\test\J1\temp\solr.handler.TestReplicationHandler_4F6377ECCCC1A69E-001\solr-instance-001\.\collection1\data\;done=false>>]
   [junit4]   2> 1535086 INFO  (TEST-TestReplicationHandler.doTestStressReplication-seed#[4F6377ECCCC1A69E]) [    x:collection1] o.a.s.c.CachingDirectoryFactory Closing directory: C:\Users\JenkinsSlave\workspace\Lucene-Solr-5.x-Windows\solr\build\solr-core\test\J1\temp\solr.handler.TestReplicationHandler_4F6377ECCCC1A69E-001\solr-instance-001\.\collection1\data\
   [junit4]   2> 1535087 INFO  (TEST-TestReplicationHandler.doTestStressReplication-seed#[4F6377ECCCC1A69E]) [    x:collection1] o.e.j.s.h.ContextHandler Stopped o.e.j.s.ServletContextHandler@494b9f7{/solr,null,UNAVAILABLE}
   [junit4]   2> 1535089 INFO  (TEST-TestReplicationHandler.doTestStressReplication-seed#[4F6377ECCCC1A69E]) [    ] o.e.j.s.Server jetty-9.2.13.v20150730
   [junit4]   2> 1535091 INFO  (TEST-TestReplicationHandler.doTestStressReplication-seed#[4F6377ECCCC1A69E]) [    ] o.e.j.s.h.ContextHandler Started o.e.j.s.ServletContextHandler@377230a5{/solr,null,AVAILABLE}
   [junit4]   2> 1535092 INFO  (TEST-TestReplicationHandler.doTestStressReplication-seed#[4F6377ECCCC1A69E]) [    ] o.e.j.s.ServerConnector Started ServerConnector@320c3ade{HTTP/1.1}{127.0.0.1:53037}
   [junit4]   2> 1535092 INFO  (TEST-TestReplicationHandler.doTestStressReplication-seed#[4F6377ECCCC1A69E]) [    ] o.e.j.s.Server Started @1540385ms
   [junit4]   2> 1535092 INFO  (TEST-TestReplicationHandler.doTestStressReplication-seed#[4F6377ECCCC1A69E]) [    ] o.a.s.c.s.e.JettySolrRunner Jetty properties: {solr.data.dir=C:\Users\JenkinsSlave\workspace\Lucene-Solr-5.x-Windows\solr\build\solr-core\test\J1\temp\solr.handler.TestReplicationHandler_4F6377ECCCC1A69E-001\solr-instance-001\collection1\data, hostContext=/solr, hostPort=53037}
   [junit4]   2> 1535092 INFO  (TEST-TestReplicationHandler.doTestStressReplication-seed#[4F6377ECCCC1A69E]) [    ] o.a.s.s.SolrDispatchFilter SolrDispatchFilter.init(): sun.misc.Launcher$AppClassLoader@73d16e93
   [junit4]   2> 1535093 INFO  (TEST-TestReplicationHandler.doTestStressReplication-seed#[4F6377ECCCC1A69E]) [    ] o.a.s.c.SolrResourceLoader new SolrResourceLoader for directory: 'C:\Users\JenkinsSlave\workspace\Lucene-Solr-5.x-Windows\solr\build\solr-core\test\J1\temp\solr.handler.TestReplicationHandler_4F6377ECCCC1A69E-001\solr-instance-001'
   [junit4]   2> 1535093 INFO  (TEST-TestReplicationHandler.doTestStressReplication-seed#[4F6377ECCCC1A69E]) [    ] o.a.s.c.SolrResourceLoader JNDI not configured for solr (NoInitialContextEx)
   [junit4]   2> 1535093 INFO  (TEST-TestReplicationHandler.doTestStressReplication-seed#[4F6377ECCCC1A69E]) [    ] o.a.s.c.SolrResourceLoader solr home defaulted to 'solr/' (could not find system property or JNDI)
   [junit4]   2> 1535093 INFO  (TEST-TestReplicationHandler.doTestStressReplication-seed#[4F6377ECCCC1A69E]) [    ] o.a.s.c.SolrXmlConfig Loading container configuration from C:\Users\JenkinsSlave\workspace\Lucene-Solr-5.x-Windows\solr\build\solr-core\test\J1\temp\solr.handler.TestReplicationHandler_4F6377ECCCC1A69E-001\solr-instance-001\solr.xml
   [junit4]   2> 1535097 INFO  (TEST-TestReplicationHandler.doTestStressReplication-seed#[4F6377ECCCC1A69E]) [    ] o.a.s.c.CorePropertiesLocator Config-defined core root directory: C:\Users\JenkinsSlave\workspace\Lucene-Solr-5.x-Windows\solr\build\solr-core\test\J1\temp\solr.handler.TestReplicationHandler_4F6377ECCCC1A69E-001\solr-instance-001\.
   [junit4]   2> 1535097 INFO  (TEST-TestReplicationHandler.doTestStressReplication-seed#[4F6377ECCCC1A69E]) [    ] o.a.s.c.CoreContainer New CoreContainer 1559311506
   [junit4]   2> 1535097 INFO  (TEST-TestReplicationHandler.doTestStressReplication-seed#[4F6377ECCCC1A69E]) [    ] o.a.s.c.CoreContainer Loading cores into CoreContainer [instanceDir=C:\Users\JenkinsSlave\workspace\Lucene-Solr-5.x-Windows\solr\build\solr-core\test\J1\temp\solr.handler.TestReplicationHandler_4F6377ECCCC1A69E-001\solr-instance-001]
   [junit4]   2> 1535097 WARN  (TEST-TestReplicationHandler.doTestStressReplication-seed#[4F6377ECCCC1A69E]) [    ] o.a.s.c.CoreContainer Couldn't add files from C:\Users\JenkinsSlave\workspace\Lucene-Solr-5.x-Windows\solr\build\solr-core\test\J1\temp\solr.handler.TestReplicationHandler_4F6377ECCCC1A69E-001\solr-instance-001\lib to classpath: C:\Users\JenkinsSlave\workspace\Lucene-Solr-5.x-Windows\solr\build\solr-core\test\J1\temp\solr.handler.TestReplicationHandler_4F6377ECCCC1A69E-001\solr-instance-001\lib
   [junit4]   2> 1535098 INFO  (TEST-TestReplicationHandler.doTestStressReplication-seed#[4F6377ECCCC1A69E]) [    ] o.a.s.h.c.HttpShardHandlerFactory created with socketTimeout : 90000,urlScheme : ,connTimeout : 15000,maxConnectionsPerHost : 20,maxConnections : 10000,corePoolSize : 0,maximumPoolSize : 2147483647,maxThreadIdleTime : 5,sizeOfQueue : -1,fairnessPolicy : false,useRetries : false,
   [junit4]   2> 1535098 INFO  (TEST-TestReplicationHandler.doTestStressReplication-seed#[4F6377ECCCC1A69E]) [    ] o.a.s.u.UpdateShardHandler Creating UpdateShardHandler HTTP client with params: socketTimeout=340000&connTimeout=45000&retry=true
   [junit4]   2> 1535099 INFO  (TEST-TestReplicationHandler.doTestStressReplication-seed#[4F6377ECCCC1A69E]) [    ] o.a.s.l.LogWatcher SLF4J impl is org.slf4j.impl.Log4jLoggerFactory
   [junit4]   2> 1535099 INFO  (TEST-TestReplicationHandler.doTestStressReplication-seed#[4F6377ECCCC1A69E]) [    ] o.a.s.l.LogWatcher Registering Log Listener [Log4j (org.slf4j.impl.Log4jLoggerFactory)]
   [junit4]   2> 1535099 INFO  (TEST-TestReplicationHandler.doTestStressReplication-seed#[4F6377ECCCC1A69E]) [    ] o.a.s.c.CoreContainer Security conf doesn't exist. Skipping setup for authorization module.
   [junit4]   2> 1535099 INFO  (TEST-TestReplicationHandler.doTestStressReplication-seed#[4F6377ECCCC1A69E]) [    ] o.a.s.c.CoreContainer No authentication plugin used.
   [junit4]   2> 1535100 INFO  (TEST-TestReplicationHandler.doTestStressReplication-seed#[4F6377ECCCC1A69E]) [    ] o.a.s.c.CorePropertiesLocator Looking for core definitions underneath C:\Users\JenkinsSlave\workspace\Lucene-Solr-5.x-Windows\solr\build\solr-core\test\J1\temp\solr.handler.TestReplicationHandler_4F6377ECCCC1A69E-001\solr-instance-001\.
   [junit4]   2> 1535103 INFO  (TEST-TestReplicationHandler.doTestStressReplication-seed#[4F6377ECCCC1A69E]) [    ] o.a.s.c.CoreDescriptor Created CoreDescriptor: {name=collection1, config=solrconfig.xml, loadOnStartup=true, schema=schema.xml, configSetProperties=configsetprops.json, transient=false, dataDir=data\}
   [junit4]   2> 1535103 INFO  (TEST-TestReplicationHandler.doTestStressReplication-seed#[4F6377ECCCC1A69E]) [    ] o.a.s.c.CorePropertiesLocator Found core collection1 in C:\Users\JenkinsSlave\workspace\Lucene-Solr-5.x-Windows\solr\build\solr-core\test\J1\temp\solr.handler.TestReplicationHandler_4F6377ECCCC1A69E-001\solr-instance-001\.\collection1
   [junit4]   2> 1535103 INFO  (TEST-TestReplicationHandler.doTestStressReplication-seed#[4F6377ECCCC1A69E]) [    ] o.a.s.c.CorePropertiesLocator Found 1 core definitions
   [junit4]   2> 1535104 INFO  (coreLoadExecutor-5002-thread-1) [    ] o.a.s.c.SolrResourceLoader new SolrResourceLoader for directory: 'C:\Users\JenkinsSlave\workspace\Lucene-Solr-5.x-Windows\solr\build\solr-core\test\J1\temp\solr.handler.TestReplicationHandler_4F6377ECCCC1A69E-001\solr-instance-001\collection1'
   [junit4]   2> 1535104 INFO  (TEST-TestReplicationHandler.doTestStressReplication-seed#[4F6377ECCCC1A69E]) [    ] o.a.s.s.SolrDispatchFilter user.dir=C:\Users\JenkinsSlave\workspace\Lucene-Solr-5.x-Windows\solr\build\solr-core\test\J1
   [junit4]   2> 1535104 INFO  (TEST-TestReplicationHandler.doTestStressReplication-seed#[4F6377ECCCC1A69E]) [    ] o.a.s.s.SolrDispatchFilter SolrDispatchFilter.init() done
   [junit4]   2> 1535104 INFO  (coreLoadExecutor-5002-thread-1) [    ] o.a.s.c.SolrResourceLoader JNDI not configured for solr (NoInitialContextEx)
   [junit4]   2> 1535104 INFO  (coreLoadExecutor-5002-thread-1) [    ] o.a.s.c.SolrResourceLoader solr home defaulted to 'solr/' (could not find system property or JNDI)
   [junit4]   2> 1535112 INFO  (coreLoadExecutor-5002-thread-1) [    ] o.a.s.c.SolrConfig current version of requestparams : -1
   [junit4]   2> 1535115 INFO  (coreLoadExecutor-5002-thread-1) [    ] o.a.s.c.SolrConfig Using Lucene MatchVersion: 5.5.0
   [junit4]   2> 1535120 INFO  (coreLoadExecutor-5002-thread-1) [    ] o.a.s.c.SolrConfig Loaded SolrConfig: solrconfig.xml
   [junit4]   2> 1535124 INFO  (coreLoadExecutor-5002-thread-1) [    ] o.a.s.s.IndexSchema [collection1] Schema name=test
   [junit4]   2> 1535127 INFO  (coreLoadExecutor-5002-thread-1) [    ] o.a.s.s.IndexSchema unique key field: id
   [junit4]   2> 1535135 INFO  (coreLoadExecutor-5002-thread-1) [    ] o.a.s.c.ConfigSetProperties Did not find ConfigSet properties, assuming default properties: Can't find resource 'configsetprops.json' in classpath or 'C:\Users\JenkinsSlave\workspace\Lucene-Solr-5.x-Windows\solr\build\solr-core\test\J1\temp\solr.handler.TestReplicationHandler_4F6377ECCCC1A69E-001\solr-instance-001\collection1'
   [junit4]   2> 1535136 INFO  (coreLoadExecutor-5002-thread-1) [    ] o.a.s.c.CoreContainer Creating SolrCore 'collection1' using configuration from instancedir C:\Users\JenkinsSlave\workspace\Lucene-Solr-5.x-Windows\solr\build\solr-core\test\J1\temp\solr.handler.TestReplicationHandler_4F6377ECCCC1A69E-001\solr-instance-001\.\collection1
   [junit4]   2> 1535136 INFO  (coreLoadExecutor-5002-thread-1) [    x:collection1] o.a.s.c.SolrCore solr.NRTCachingDirectoryFactory
   [junit4]   2> 1535136 INFO  (coreLoadExecutor-5002-thread-1) [    x:collection1] o.a.s.c.SolrCore [[collection1] ] Opening new SolrCore at [C:\Users\JenkinsSlave\workspace\Lucene-Solr-5.x-Windows\solr\build\solr-core\test\J1\temp\solr.handler.TestReplicationHandler_4F6377ECCCC1A69E-001\solr-instance-001\collection1], dataDir=[C:\Users\JenkinsSlave\workspace\Lucene-Solr-5.x-Windows\solr\build\solr-core\test\J1\temp\solr.handler.TestReplicationHandler_4F6377ECCCC1A69E-001\solr-instance-001\.\collection1\data\]
   [junit4]   2> 1535136 INFO  (coreLoadExecutor-5002-thread-1) [    x:collection1] o.a.s.c.SolrCore JMX monitoring not detected for core: collection1
   [junit4]   2> 1535138 INFO  (coreLoadExecutor-5002-thread-1) [    x:collection1] o.a.s.c.CachingDirectoryFactory return new directory for C:\Users\JenkinsSlave\workspace\Lucene-Solr-5.x-Windows\solr\build\solr-core\test\J1\temp\solr.handler.TestReplicationHandler_4F6377ECCCC1A69E-001\solr-instance-001\collection1\data
   [junit4]   2> 1535139 INFO  (coreLoadExecutor-5002-thread-1) [    x:collection1] o.a.s.c.SolrCore New index directory detected: old=null new=C:\Users\JenkinsSlave\workspace\Lucene-Solr-5.x-Windows\solr\build\solr-core\test\J1\temp\solr.handler.TestReplicationHandler_4F6377ECCCC1A69E-001\solr-instance-001\.\collection1\data\index/
   [junit4]   2> 1535140 WARN  (coreLoadExecutor-5002-thread-1) [    x:collection1] o.a.s.c.SolrCore [collection1] Solr index directory 'C:\Users\JenkinsSlave\workspace\Lucene-Solr-5.x-Windows\solr\build\solr-core\test\J1\temp\solr.handler.TestReplicationHandler_4F6377ECCCC1A69E-001\solr-instance-001\.\collection1\data\index' doesn't exist. Creating new index...
   [junit4]   2> 1535142 INFO  (coreLoadExecutor-5002-thread-1) [    x:collection1] o.a.s.c.CachingDirectoryFactory return new directory for C:\Users\JenkinsSlave\workspace\Lucene-Solr-5.x-Windows\solr\build\solr-core\test\J1\temp\solr.handler.TestReplicationHandler_4F6377ECCCC1A69E-001\solr-instance-001\collection1\data\index
   [junit4]   2> 1535142 INFO  (coreLoadExecutor-5002-thread-1) [    x:collection1] o.a.s.u.RandomMergePolicy RandomMergePolicy wrapping class org.apache.lucene.index.TieredMergePolicy: [TieredMergePolicy: maxMergeAtOnce=37, maxMergeAtOnceExplicit=50, maxMergedSegmentMB=47.263671875, floorSegmentMB=1.6640625, forceMergeDeletesPctAllowed=1.501560409305246, segmentsPerTier=11.0, maxCFSSegmentSizeMB=8.796093022207999E12, noCFSRatio=1.0
   [junit4]   2> 1535153 INFO  (coreLoadExecutor-5002-thread-1) [    x:collection1] o.a.s.c.SolrDeletionPolicy SolrDeletionPolicy.onCommit: commits: num=1
   [junit4]   2> 	commit{dir=NRTCachingDirectory(MMapDirectory@C:\Users\JenkinsSlave\workspace\Lucene-Solr-5.x-Windows\solr\build\solr-core\test\J1\temp\solr.handler.TestReplicationHandler_4F6377ECCCC1A69E-001\solr-instance-001\collection1\data\index lockFactory=org.apache.lucene.store.SingleInstanceLockFactory@3c95440c; maxCacheMB=48.0 maxMergeSizeMB=4.0),segFN=segments_1,generation=1}
   [junit4]   2> 1535153 INFO  (coreLoadExecutor-5002-thread-1) [    x:collection1] o.a.s.c.SolrDeletionPolicy newest commit generation = 1
   [junit4]   2> 1535154 INFO  (OldIndexDirectoryCleanupThreadForCore-collection1) [    x:collection1] o.a.s.c.SolrCore Looking for old index directories to cleanup for core collection1 in C:\Users\JenkinsSlave\workspace\Lucene-Solr-5.x-Windows\solr\build\solr-core\test\J1\temp\solr.handler.TestReplicationHandler_4F6377ECCCC1A69E-001\solr-instance-001\.\collection1\data\
   [junit4]   2> 1535155 INFO  (coreLoadExecutor-5002-thread-1) [    x:collection1] o.a.s.c.SolrCore no updateRequestProcessorChain defined as default, creating implicit default
   [junit4]   2> 1535163 INFO  (coreLoadExecutor-5002-thread-1) [    x:collection1] o.a.s.h.l.XMLLoader xsltCacheLifetimeSeconds=60
   [junit4]   2> 1535163 INFO  (coreLoadExecutor-5002-thread-1) [    x:collection1] o.a.s.h.l.XMLLoader xsltCacheLifetimeSeconds=60
   [junit4]   2> 1535164 INFO  (coreLoadExecutor-5002-thread-1) [    x:collection1] o.a.s.h.l.XMLLoader xsltCacheLifetimeSeconds=60
   [junit4]   2> 1535165 INFO  (coreLoadExecutor-5002-thread-1) [    x:collection1] o.a.s.h.l.XMLLoader xsltCacheLifetimeSeconds=60
   [junit4]   2> 1535165 INFO  (coreLoadExecutor-5002-thread-1) [    x:collection1] o.a.s.c.PluginBag requestHandler : 'lazy' created with startup=lazy 
   [junit4]   2> 1535165 INFO  (coreLoadExecutor-5002-thread-1) [    x:collection1] o.a.s.c.RequestHandlers Registered paths: /admin/mbeans,standard,lazy,/update/csv,/update/json/docs,/admin/luke,/admin/segments,/get,/admin/system,/replication,/admin/properties,defaults,/config,/schema,/admin/plugins,/admin/logging,/update/json,/admin/threads,/admin/ping,/update,/admin/file
   [junit4]   2> 1535166 INFO  (coreLoadExecutor-5002-thread-1) [    x:collection1] o.a.s.c.SolrCore Using default statsCache cache: org.apache.solr.search.stats.LocalStatsCache
   [junit4]   2> 1535167 INFO  (coreLoadExecutor-5002-thread-1) [    x:collection1] o.a.s.u.CommitTracker Hard AutoCommit: disabled
   [junit4]   2> 1535167 INFO  (coreLoadExecutor-5002-thread-1) [    x:collection1] o.a.s.u.CommitTracker Soft AutoCommit: disabled
   [junit4]   2> 1535168 INFO  (coreLoadExecutor-5002-thread-1) [    x:collection1] o.a.s.u.RandomMergePolicy RandomMergePolicy wrapping class org.apache.lucene.index.AlcoholicMergePolicy: [AlcoholicMergePolicy: minMergeSize=0, mergeFactor=10, maxMergeSize=1851134133, maxMergeSizeForForcedMerge=9223372036854775807, calibrateSizeByDeletes=true, maxMergeDocs=2147483647, maxCFSSegmentSizeMB=8.796093022207999E12, noCFSRatio=0.1]
   [junit4]   2> 1535169 INFO  (coreLoadExecutor-5002-thread-1) [    x:collection1] o.a.s.c.SolrDeletionPolicy SolrDeletionPolicy.onInit: commits: num=1
   [junit4]   2> 	commit{dir=NRTCachingDirectory(MMapDirectory@C:\Users\JenkinsSlave\workspace\Lucene-Solr-5.x-Windows\solr\build\solr-core\test\J1\temp\solr.handler.TestReplicationHandler_4F6377ECCCC1A69E-001\solr-instance-001\collection1\data\index lockFactory=org.apache.lucene.store.SingleInstanceLockFactory@3c95440c; maxCacheMB=48.0 maxMergeSizeMB=4.0),segFN=segments_1,generation=1}
   [junit4]   2> 1535169 INFO  (coreLoadExecutor-5002-thread-1) [    x:collection1] o.a.s.c.SolrDeletionPolicy newest commit generation = 1
   [junit4]   2> 1535169 INFO  (coreLoadExecutor-5002-thread-1) [    x:collection1] o.a.s.s.SolrIndexSearcher Opening Searcher@7ba5c887[collection1] main
   [junit4]   2> 1535169 INFO  (coreLoadExecutor-5002-thread-1) [    x:collection1] o.a.s.r.ManagedResourceStorage File-based storage initialized to use dir: C:\Users\JenkinsSlave\workspace\Lucene-Solr-5.x-Windows\solr\build\solr-core\test\J1\temp\solr.handler.TestReplicationHandler_4F6377ECCCC1A69E-001\solr-instance-001\collection1\conf
   [junit4]   2> 1535169 INFO  (coreLoadExecutor-5002-thread-1) [    x:collection1] o.a.s.r.RestManager Initializing RestManager with initArgs: {storageDir=C:\Users\JenkinsSlave\workspace\Lucene-Solr-5.x-Windows\solr\build\solr-core\test\J1\temp\solr.handler.TestReplicationHandler_4F6377ECCCC1A69E-001\solr-instance-001\collection1\conf}
   [junit4]   2> 1535169 INFO  (coreLoadExecutor-5002-thread-1) [    x:collection1] o.a.s.r.ManagedResourceStorage Reading _rest_managed.json using file:dir=C:\Users\JenkinsSlave\workspace\Lucene-Solr-5.x-Windows\solr\build\solr-core\test\J1\temp\solr.handler.TestReplicationHandler_4F6377ECCCC1A69E-001\solr-instance-001\collection1\conf
   [junit4]   2> 1535169 INFO  (coreLoadExecutor-5002-thread-1) [    x:collection1] o.a.s.r.RestManager Initializing 0 registered ManagedResources
   [junit4]   2> 1535169 INFO  (coreLoadExecutor-5002-thread-1) [    x:collection1] o.a.s.h.ReplicationHandler Replication enabled for following config files: schema.xml
   [junit4]   2> 1535169 INFO  (coreLoadExecutor-5002-thread-1) [    x:collection1] o.a.s.h.ReplicationHandler Commits will be reserved for  10000
   [junit4]   2> 1535169 INFO  (searcherExecutor-5003-thread-1-processing-x:collection1) [    x:collection1] o.a.s.c.SolrCore [collection1] Registered new searcher Searcher@7ba5c887[collection1] main{ExitableDirectoryReader(UninvertingDirectoryReader())}
   [junit4]   2> 1535169 INFO  (coreLoadExecutor-5002-thread-1) [    x:collection1] o.a.s.c.CoreContainer registering core: collection1
   [junit4]   2> 1535538 INFO  (qtp1331208864-13042) [    x:collection1] o.a.s.u.DirectUpdateHandler2 [collection1] REMOVING ALL DOCUMENTS FROM INDEX
   [junit4]   2> 1535538 INFO  (qtp1331208864-13042) [    x:collection1] o.a.s.u.p.LogUpdateProcessorFactory [collection1]  webapp=/solr path=/update params={wt=javabin&version=2}{deleteByQuery=*:*} 0 0
   [junit4]   2> 1535540 INFO  (qtp1809805184-13023) [    x:collection1] o.a.s.u.DirectUpdateHandler2 [collection1] REMOVING ALL DOCUMENTS FROM INDEX
   [junit4]   2> 1535541 INFO  (qtp1809805184-13023) [    x:collection1] o.a.s.u.p.LogUpdateProcessorFactory [collection1]  webapp=/solr path=/update params={wt=javabin&version=2}{deleteByQuery=*:*} 0 0
   [junit4]   2> 1535543 INFO  (qtp1809805184-13024) [    x:collection1] o.a.s.u.DirectUpdateHandler2 start commit{,optimize=false,openSearcher=true,waitSearcher=true,expungeDeletes=false,softCommit=false,prepareCommit=false}
   [junit4]   2> 1535551 INFO  (qtp1809805184-13024) [    x:collection1] o.a.s.c.SolrDeletionPolicy SolrDeletionPolicy.onCommit: commits: num=2
   [junit4]   2> 	commit{dir=NRTCachingDirectory(MMapDirectory@C:\Users\JenkinsSlave\workspace\Lucene-Solr-5.x-Windows\solr\build\solr-core\test\J1\temp\solr.handler.TestReplicationHandler_4F6377ECCCC1A69E-001\solr-instance-002\collection1\data\index lockFactory=org.apache.lucene.store.SingleInstanceLockFactory@323b6f6a; maxCacheMB=48.0 maxMergeSizeMB=4.0),segFN=segments_1,generation=1}
   [junit4]   2> 	commit{dir=NRTCachingDirectory(MMapDirectory@C:\Users\JenkinsSlave\workspace\Lucene-Solr-5.x-Windows\solr\build\solr-core\test\J1\temp\solr.handler.TestReplicationHandler_4F6377ECCCC1A69E-001\solr-instance-002\collection1\data\index lockFactory=org.apache.lucene.store.SingleInstanceLockFactory@323b6f6a; maxCacheMB=48.0 maxMergeSizeMB=4.0),segFN=segments_2,generation=2}
   [junit4]   2> 1535551 INFO  (qtp1809805184-13024) [    x:collection1] o.a.s.c.SolrDeletionPolicy newest commit generation = 2
   [junit4]   2> 1535552 INFO  (qtp1809805184-13024) [    x:collection1] o.a.s.s.SolrIndexSearcher Opening Searcher@7b57b4c0[collection1] main
   [junit4]   2> 1535552 INFO  (qtp1809805184-13024) [    x:collection1] o.a.s.u.DirectUpdateHandler2 end_commit_flush
   [junit4]   2> 1535554 INFO  (searcherExecutor-4993-thread-1-processing-x:collection1) [    x:collection1] o.a.s.c.SolrCore [collection1] Registered new searcher Searcher@7b57b4c0[collection1] main{ExitableDirectoryReader(UninvertingDirectoryReader())}
   [junit4]   2> 1535554 INFO  (qtp1809805184-13024) [    x:collection1] o.a.s.u.p.LogUpdateProcessorFactory [collection1]  webapp=/solr path=/update params={waitSearcher=true&commit=true&softCommit=false&wt=javabin&version=2}{commit=} 0 11
   [junit4]   2> 1535557 INFO  (qtp1331208864-13044) [    x:collection1] o.a.s.u.p.LogUpdateProcessorFactory [collection1]  webapp=/solr path=/update params={wt=javabin&version=2}{add=[0]} 0 2
   [junit4]   2> 1535559 INFO  (qtp1331208864-13043) [    x:collection1] o.a.s.u.p.LogUpdateProcessorFactory [collection1]  webapp=/solr path=/update params={wt=javabin&version=2}{add=[1]} 0 0
   [junit4]   2> 1535560 INFO  (qtp1331208864-13045) [    x:collection1] o.a.s.u.p.LogUpdateProcessorFactory [collection1]  webapp=/solr path=/update params={wt=javabin&version=2}{add=[2]} 0 0
   [junit4]   2> 1535562 INFO  (qtp1331208864-13046) [    x:collection1] o.a.s.u.p.LogUpdateProcessorFactory [collection1]  webapp=/solr path=/update params={wt=javabin&version=2}{add=[3]} 0 0
   [junit4]   2> 1535564 INFO  (qtp1331208864-13047) [    x:collection1] o.a.s.u.p.LogUpdateProcessorFactory [collection1]  webapp=/solr path=/update params={wt=javabin&version=2}{add=[4]} 0 0
   [junit4]   2> 1535565 INFO  (qtp1331208864-13042) [    x:collection1] o.a.s.u.p.LogUpdateProcessorFactory [collection1]  webapp=/solr path=/update params={wt=javabin&version=2}{add=[5]} 0 0
   [junit4]   2> 1535567 INFO  (qtp1331208864-13044) [    x:collection1] o.a.s.u.p.LogUpdateProcessorFactory [collection1]  webapp=/solr path=/update params={wt=javabin&version=2}{add=[6]} 0 0
   [junit4]   2> 1535569 INFO  (qtp1331208864-13043) [    x:collection1] o.a.s.u.p.LogUpdateProcessorFactory [collection1]  webapp=/solr path=/update params={wt=javabin&version=2}{add=[7]} 0 0
   [junit4]   2> 1535572 INFO  (qtp1331208864-13045) [    x:collection1] o.a.s.u.p.LogUpdateProcessorFactory [collection1]  webapp=/solr path=/update params={wt=javabin&version=2}{add=[8]} 0 0
   [junit4]   2> 1535575 INFO  (qtp1331208864-13046) [    x:collection1] o.a.s.u.p.LogUpdateProcessorFactory [collection1]  webapp=/solr path=/update params={wt=javabin&version=2}{add=[9]} 0 0
   [junit4]   2> 1535576 INFO  (qtp1331208864-13047) [    x:collection1] o.a.s.u.p.LogUpdateProcessorFactory [collection1]  webapp=/solr path=/update params={wt=javabin&version=2}{add=[10]} 0 0
   [junit4]   2> 1535578 INFO  (qtp1331208864-13042) [    x:collection1] o.a.s.u.p.LogUpdateProcessorFactory [collection1]  webapp=/solr path=/update params={wt=javabin&version=2}{add=[11]} 0 0
   [junit4]   2> 1535580 INFO  (qtp1331208864-13044) [    x:collection1] o.a.s.u.p.LogUpdateProcessorFactory [collection1]  webapp=/solr path=/update params={wt=javabin&version=2}{add=[12]} 0 0
   [junit4]   2> 1535581 INFO  (qtp1331208864-13043) [    x:collection1] o.a.s.u.p.LogUpdateProcessorFactory [collection1]  webapp=/solr path=/update params={wt=javabin&version=2}{add=[13]} 0 0
   [junit4]   2> 1535583 INFO  (qtp1331208864-13045) [    x:collection1] o.a.s.u.p.LogUpdateProcessorFactory [collection1]  webapp=/solr path=/update params={wt=javabin&version=2}{add=[14]} 0 0
   [junit4]   2> 1535585 INFO  (qtp1331208864-13046) [    x:collection1] o.a.s.u.p.LogUpdateProcessorFactory [collection1]  webapp=/solr path=/update params={wt=javabin&version=2}{add=[15]} 0 0
   [junit4]   2> 1535586 INFO  (qtp1331208864-13047) [    x:collection1] o.a.s.u.p.LogUpdateProcessorFactory [collection1]  webapp=/solr path=/update params={wt=javabin&version=2}{add=[16]} 0 0
   [junit4]   2> 1535588 INFO  (qtp1331208864-13042) [    x:collection1] o.a.s.u.p.LogUpdateProcessorFactory [collection1]  webapp=/solr path=/update params={wt=javabin&version=2}{add=[17]} 0 0
   [junit4]   2> 1535590 INFO  (qtp1331208864-13044) [    x:collection1] o.a.s.u.p.LogUpdateProcessorFactory [collection1]  webapp=/solr path=/update params={wt=javabin&version=2}{add=[18]} 0 0
   [junit4]   2> 1535592 INFO  (qtp1331208864-13043) [    x:collection1] o.a.s.u.p.LogUpdateProcessorFactory [collection1]  webapp=/solr path=/update params={wt=javabin&version=2}{add=[19]} 0 0
   [junit4]   2> 1535594 INFO  (qtp1331208864-13045) [    x:collection1] o.a.s.u.p.LogUpdateProcessorFactory [collection1]  webapp=/solr path=/update params={wt=javabin&version=2}{add=[20]} 0 0
   [junit4]   2> 1535596 INFO  (qtp1331208864-13046) [    x:collection1] o.a.s.u.p.LogUpdateProcessorFactory [collection1]  webapp=/solr path=/update params={wt=javabin&version=2}{add=[21]} 0 0
   [junit4]   2> 1535597 INFO  (qtp1331208864-13047) [    x:collection1] o.a.s.u.p.LogUpdateProcessorFactory [collection1]  webapp=/solr path=/update params={wt=javabin&version=2}{add=[22]} 0 0
   [junit4]   2> 1535599 INFO  (qtp1331208864-13042) [    x:collection1] o.a.s.u.p.LogUpdateProcessorFactory [collection1]  webapp=/solr path=/update params={wt=javabin&version=2}{add=[23]} 0 0
   [ju

[...truncated too long message...]

1\data\
   [junit4]   2> 1628621 INFO  (TEST-TestReplicationHandler.doTestDetails-seed#[4F6377ECCCC1A69E]) [    x:collection1] o.e.j.s.h.ContextHandler Stopped o.e.j.s.ServletContextHandler@6cf5779f{/solr,null,UNAVAILABLE}
   [junit4]   2> 1628624 INFO  (TEST-TestReplicationHandler.doTestDetails-seed#[4F6377ECCCC1A69E]) [    ] o.e.j.s.ServerConnector Stopped ServerConnector@a8cd6c1{HTTP/1.1}{127.0.0.1:0}
   [junit4]   2> 1628624 INFO  (TEST-TestReplicationHandler.doTestDetails-seed#[4F6377ECCCC1A69E]) [    ] o.a.s.c.CoreContainer Shutting down CoreContainer instance=1752150761
   [junit4]   2> 1628629 INFO  (TEST-TestReplicationHandler.doTestDetails-seed#[4F6377ECCCC1A69E]) [    x:collection1] o.a.s.c.SolrCore [collection1]  CLOSING SolrCore org.apache.solr.core.SolrCore@25617422
   [junit4]   2> 1628630 INFO  (TEST-TestReplicationHandler.doTestDetails-seed#[4F6377ECCCC1A69E]) [    x:collection1] o.a.s.u.DirectUpdateHandler2 closing DirectUpdateHandler2{commits=0,autocommits=0,soft autocommits=0,optimizes=0,rollbacks=0,expungeDeletes=0,docsPending=0,adds=0,deletesById=0,deletesByQuery=0,errors=0,cumulative_adds=0,cumulative_deletesById=0,cumulative_deletesByQuery=0,cumulative_errors=0}
   [junit4]   2> 1628630 INFO  (TEST-TestReplicationHandler.doTestDetails-seed#[4F6377ECCCC1A69E]) [    x:collection1] o.a.s.u.SolrCoreState Closing SolrCoreState
   [junit4]   2> 1628630 INFO  (TEST-TestReplicationHandler.doTestDetails-seed#[4F6377ECCCC1A69E]) [    x:collection1] o.a.s.u.DefaultSolrCoreState SolrCoreState ref count has reached 0 - closing IndexWriter
   [junit4]   2> 1628630 INFO  (TEST-TestReplicationHandler.doTestDetails-seed#[4F6377ECCCC1A69E]) [    x:collection1] o.a.s.u.DefaultSolrCoreState closing IndexWriter with IndexWriterCloser
   [junit4]   2> 1628631 INFO  (TEST-TestReplicationHandler.doTestDetails-seed#[4F6377ECCCC1A69E]) [    x:collection1] o.a.s.c.SolrCore [collection1] Closing main searcher on request.
   [junit4]   2> 1628631 INFO  (TEST-TestReplicationHandler.doTestDetails-seed#[4F6377ECCCC1A69E]) [    x:collection1] o.a.s.c.CachingDirectoryFactory Closing MockDirectoryFactory - 2 directories currently being tracked
   [junit4]   2> 1628631 INFO  (TEST-TestReplicationHandler.doTestDetails-seed#[4F6377ECCCC1A69E]) [    x:collection1] o.a.s.c.CachingDirectoryFactory looking to close C:\Users\JenkinsSlave\workspace\Lucene-Solr-5.x-Windows\solr\build\solr-core\test\J1\temp\solr.handler.TestReplicationHandler_4F6377ECCCC1A69E-001\solr-instance-027\.\collection1\data\index.20160204065710764 [CachedDir<<refCount=0;path=C:\Users\JenkinsSlave\workspace\Lucene-Solr-5.x-Windows\solr\build\solr-core\test\J1\temp\solr.handler.TestReplicationHandler_4F6377ECCCC1A69E-001\solr-instance-027\.\collection1\data\index.20160204065710764;done=false>>]
   [junit4]   2> 1628631 INFO  (TEST-TestReplicationHandler.doTestDetails-seed#[4F6377ECCCC1A69E]) [    x:collection1] o.a.s.c.CachingDirectoryFactory Closing directory: C:\Users\JenkinsSlave\workspace\Lucene-Solr-5.x-Windows\solr\build\solr-core\test\J1\temp\solr.handler.TestReplicationHandler_4F6377ECCCC1A69E-001\solr-instance-027\.\collection1\data\index.20160204065710764
   [junit4]   2> 1628632 INFO  (TEST-TestReplicationHandler.doTestDetails-seed#[4F6377ECCCC1A69E]) [    x:collection1] o.a.s.c.CachingDirectoryFactory looking to close C:\Users\JenkinsSlave\workspace\Lucene-Solr-5.x-Windows\solr\build\solr-core\test\J1\temp\solr.handler.TestReplicationHandler_4F6377ECCCC1A69E-001\solr-instance-027\.\collection1\data\ [CachedDir<<refCount=0;path=C:\Users\JenkinsSlave\workspace\Lucene-Solr-5.x-Windows\solr\build\solr-core\test\J1\temp\solr.handler.TestReplicationHandler_4F6377ECCCC1A69E-001\solr-instance-027\.\collection1\data\;done=false>>]
   [junit4]   2> 1628632 INFO  (TEST-TestReplicationHandler.doTestDetails-seed#[4F6377ECCCC1A69E]) [    x:collection1] o.a.s.c.CachingDirectoryFactory Closing directory: C:\Users\JenkinsSlave\workspace\Lucene-Solr-5.x-Windows\solr\build\solr-core\test\J1\temp\solr.handler.TestReplicationHandler_4F6377ECCCC1A69E-001\solr-instance-027\.\collection1\data\
   [junit4]   2> 1628632 INFO  (TEST-TestReplicationHandler.doTestDetails-seed#[4F6377ECCCC1A69E]) [    x:collection1] o.e.j.s.h.ContextHandler Stopped o.e.j.s.ServletContextHandler@79ac38e5{/solr,null,UNAVAILABLE}
   [junit4]   2> 1628635 INFO  (SUITE-TestReplicationHandler-seed#[4F6377ECCCC1A69E]-worker) [    ] o.a.s.SolrTestCaseJ4 ###deleteCore
   [junit4]   2> NOTE: leaving temporary files on disk at: C:\Users\JenkinsSlave\workspace\Lucene-Solr-5.x-Windows\solr\build\solr-core\test\J1\temp\solr.handler.TestReplicationHandler_4F6377ECCCC1A69E-001
   [junit4]   2> NOTE: test params are: codec=Asserting(Lucene54): {name=PostingsFormat(name=MockRandom), id=PostingsFormat(name=MockRandom), newname=PostingsFormat(name=MockRandom)}, docValues:{}, sim=DefaultSimilarity, locale=da-DK, timezone=Poland
   [junit4]   2> NOTE: Windows 7 6.1 amd64/Oracle Corporation 1.8.0_72 (64-bit)/cpus=3,threads=1,free=254365648,total=536870912
   [junit4]   2> NOTE: All tests run in this JVM: [CoreAdminHandlerTest, TestLMJelinekMercerSimilarityFactory, TestOverriddenPrefixQueryForCustomFieldType, SpellPossibilityIteratorTest, TestObjectReleaseTracker, HdfsThreadLeakTest, ChaosMonkeySafeLeaderTest, SearchHandlerTest, TestAuthenticationFramework, TestSha256AuthenticationProvider, SortByFunctionTest, TestSolrCLIRunExample, TestFreeTextSuggestions, HdfsLockFactoryTest, PreAnalyzedUpdateProcessorTest, TestClusterStateMutator, SpellCheckCollatorTest, SolrIndexSplitterTest, TestMacros, TestOrdValues, NoCacheHeaderTest, TestAtomicUpdateErrorCases, TestDistributedGrouping, MinimalSchemaTest, TestFuzzyAnalyzedSuggestions, SimpleMLTQParserTest, TestSchemaNameResource, BadIndexSchemaTest, RemoteQueryErrorTest, ConnectionReuseTest, DistributedIntervalFacetingTest, FieldAnalysisRequestHandlerTest, SolrCloudExampleTest, ForceLeaderTest, DateRangeFieldTest, TestDefaultStatsCache, TestComplexPhraseQParserPlugin, TestSchemaManager, DistributedFacetPivotLargeTest, TestConfigReload, TestSimpleTrackingShardHandler, SuggesterTSTTest, RestartWhileUpdatingTest, TestSolrConfigHandlerCloud, TermVectorComponentDistributedTest, TestCopyFieldCollectionResource, ResourceLoaderTest, EnumFieldTest, CollectionStateFormat2Test, TestSolrIndexConfig, LeaderFailoverAfterPartitionTest, BitVectorTest, TestSchemaSimilarityResource, TestExclusionRuleCollectionAccess, DistanceFunctionTest, HighlighterConfigTest, HdfsRestartWhileUpdatingTest, TestReload, UUIDUpdateProcessorFallbackTest, TestCharFilters, SuggestComponentContextFilterQueryTest, SolrPluginUtilsTest, DirectoryFactoryTest, LeaderElectionIntegrationTest, TestManagedResourceStorage, SuggesterTest, DistributedTermsComponentTest, TestDFISimilarityFactory, TestShortCircuitedRequests, UpdateRequestProcessorFactoryTest, TestRealTimeGet, TestFieldSortValues, PKIAuthenticationIntegrationTest, FullSolrCloudDistribCmdsTest, TestManagedSchemaDynamicFieldResource, TestTrieFacet, TestUseDocValuesAsStored2, ConvertedLegacyTest, SpellCheckComponentTest, OpenCloseCoreStressTest, CloudExitableDirectoryReaderTest, TestNRTOpen, CacheHeaderTest, BigEndianAscendingWordDeserializerTest, BlockCacheTest, TestJoin, FacetPivotSmallTest, TestRecovery, TestFieldCollectionResource, TestJsonFacets, CopyFieldTest, TestBM25SimilarityFactory, TestRecoveryHdfs, DistributedFacetPivotWhiteBoxTest, MultiTermTest, DistributedQueueTest, TestSuggestSpellingConverter, AsyncCallRequestStatusResponseTest, TestPKIAuthenticationPlugin, SolrInfoMBeanTest, IndexSchemaRuntimeFieldTest, NumericFieldsTest, TestInfoStreamLogging, DistributedFacetPivotSmallAdvancedTest, TestBinaryResponseWriter, ZkSolrClientTest, TestCustomDocTransformer, TestJettySolrRunner, TestFastWriter, HdfsWriteToMultipleCollectionsTest, TestDistribDocBasedVersion, TestFieldTypeCollectionResource, TestFastOutputStream, BasicFunctionalityTest, TestWriterPerf, AutoCommitTest, DateFieldTest, AliasIntegrationTest, TestDynamicFieldCollectionResource, SolrCmdDistributorTest, TestRangeQuery, HdfsCollectionsAPIDistributedZkTest, BasicZkTest, TestHdfsUpdateLog, EchoParamsTest, TestCloudManagedSchemaConcurrent, TestCollationFieldDocValues, CoreAdminCreateDiscoverTest, TestReqParamsAPI, CSVRequestHandlerTest, TestOmitPositions, TestFoldingMultitermQuery, OutputWriterTest, RAMDirectoryFactoryTest, ZkNodePropsTest, TestSolrQueryParserResource, OverseerRolesTest, DistributedDebugComponentTest, TestReversedWildcardFilterFactory, ShardRoutingTest, TestReplicationHandler]
   [junit4] Completed [293/566 (1!)] on J1 in 95.06s, 13 tests, 1 failure <<< FAILURES!

[...truncated 872 lines...]
BUILD FAILED
C:\Users\JenkinsSlave\workspace\Lucene-Solr-5.x-Windows\build.xml:750: The following error occurred while executing this line:
C:\Users\JenkinsSlave\workspace\Lucene-Solr-5.x-Windows\build.xml:694: The following error occurred while executing this line:
C:\Users\JenkinsSlave\workspace\Lucene-Solr-5.x-Windows\build.xml:59: The following error occurred while executing this line:
C:\Users\JenkinsSlave\workspace\Lucene-Solr-5.x-Windows\solr\build.xml:233: The following error occurred while executing this line:
C:\Users\JenkinsSlave\workspace\Lucene-Solr-5.x-Windows\solr\common-build.xml:534: The following error occurred while executing this line:
C:\Users\JenkinsSlave\workspace\Lucene-Solr-5.x-Windows\lucene\common-build.xml:1477: The following error occurred while executing this line:
C:\Users\JenkinsSlave\workspace\Lucene-Solr-5.x-Windows\lucene\common-build.xml:1033: There were test failures: 566 suites (7 ignored), 2271 tests, 1 failure, 93 ignored (49 assumptions) [seed: 4F6377ECCCC1A69E]

Total time: 69 minutes 47 seconds
Build step 'Invoke Ant' marked build as failure
Archiving artifacts
[WARNINGS] Skipping publisher since build result is FAILURE
Recording test results
Email was triggered for: Failure - Any
Sending email for trigger: Failure - Any



Mime
View raw message