lucene-dev mailing list archives

Site index · List index
Message view « Date » · « Thread »
Top « Date » · « Thread »
From Policeman Jenkins Server <jenk...@thetaphi.de>
Subject [JENKINS] Lucene-Solr-5.x-Windows (32bit/jdk1.7.0_80) - Build # 5463 - Still Failing!
Date Thu, 04 Feb 2016 15:12:44 GMT
Build: http://jenkins.thetaphi.de/job/Lucene-Solr-5.x-Windows/5463/
Java: 32bit/jdk1.7.0_80 -server -XX:+UseConcMarkSweepGC

1 tests failed.
FAILED:  junit.framework.TestSuite.org.apache.solr.schema.TestBulkSchemaConcurrent

Error Message:
ObjectTracker found 0 object(s) that were not released!!! [NRTCachingDirectory]

Stack Trace:
java.lang.AssertionError: ObjectTracker found 0 object(s) that were not released!!! [NRTCachingDirectory]
	at __randomizedtesting.SeedInfo.seed([678F586E284B0617]:0)
	at org.junit.Assert.fail(Assert.java:93)
	at org.junit.Assert.assertTrue(Assert.java:43)
	at org.junit.Assert.assertNull(Assert.java:551)
	at org.apache.solr.SolrTestCaseJ4.afterClass(SolrTestCaseJ4.java:229)
	at sun.reflect.GeneratedMethodAccessor29.invoke(Unknown Source)
	at sun.reflect.DelegatingMethodAccessorImpl.invoke(DelegatingMethodAccessorImpl.java:43)
	at java.lang.reflect.Method.invoke(Method.java:606)
	at com.carrotsearch.randomizedtesting.RandomizedRunner.invoke(RandomizedRunner.java:1764)
	at com.carrotsearch.randomizedtesting.RandomizedRunner$7.evaluate(RandomizedRunner.java:834)
	at com.carrotsearch.randomizedtesting.rules.StatementAdapter.evaluate(StatementAdapter.java:36)
	at com.carrotsearch.randomizedtesting.rules.SystemPropertiesRestoreRule$1.evaluate(SystemPropertiesRestoreRule.java:57)
	at org.apache.lucene.util.AbstractBeforeAfterRule$1.evaluate(AbstractBeforeAfterRule.java:46)
	at com.carrotsearch.randomizedtesting.rules.StatementAdapter.evaluate(StatementAdapter.java:36)
	at org.apache.lucene.util.TestRuleStoreClassName$1.evaluate(TestRuleStoreClassName.java:42)
	at com.carrotsearch.randomizedtesting.rules.NoShadowingOrOverridesOnMethodsRule$1.evaluate(NoShadowingOrOverridesOnMethodsRule.java:40)
	at com.carrotsearch.randomizedtesting.rules.NoShadowingOrOverridesOnMethodsRule$1.evaluate(NoShadowingOrOverridesOnMethodsRule.java:40)
	at com.carrotsearch.randomizedtesting.rules.StatementAdapter.evaluate(StatementAdapter.java:36)
	at com.carrotsearch.randomizedtesting.rules.StatementAdapter.evaluate(StatementAdapter.java:36)
	at com.carrotsearch.randomizedtesting.rules.StatementAdapter.evaluate(StatementAdapter.java:36)
	at org.apache.lucene.util.TestRuleAssertionsRequired$1.evaluate(TestRuleAssertionsRequired.java:54)
	at org.apache.lucene.util.TestRuleMarkFailure$1.evaluate(TestRuleMarkFailure.java:48)
	at org.apache.lucene.util.TestRuleIgnoreAfterMaxFailures$1.evaluate(TestRuleIgnoreAfterMaxFailures.java:65)
	at org.apache.lucene.util.TestRuleIgnoreTestSuites$1.evaluate(TestRuleIgnoreTestSuites.java:55)
	at com.carrotsearch.randomizedtesting.rules.StatementAdapter.evaluate(StatementAdapter.java:36)
	at com.carrotsearch.randomizedtesting.ThreadLeakControl$StatementRunner.run(ThreadLeakControl.java:367)
	at java.lang.Thread.run(Thread.java:745)




Build Log:
[...truncated 10971 lines...]
   [junit4] Suite: org.apache.solr.schema.TestBulkSchemaConcurrent
   [junit4]   2> Creating dataDir: C:\Users\JenkinsSlave\workspace\Lucene-Solr-5.x-Windows\solr\build\solr-core\test\J1\temp\solr.schema.TestBulkSchemaConcurrent_678F586E284B0617-001\init-core-data-001
   [junit4]   2> 897350 INFO  (SUITE-TestBulkSchemaConcurrent-seed#[678F586E284B0617]-worker) [    ] o.a.s.SolrTestCaseJ4 Randomized ssl (false) and clientAuth (true)
   [junit4]   2> 897350 INFO  (SUITE-TestBulkSchemaConcurrent-seed#[678F586E284B0617]-worker) [    ] o.a.s.BaseDistributedSearchTestCase Setting hostContext system property: /h_lwq/
   [junit4]   2> 897353 INFO  (TEST-TestBulkSchemaConcurrent.test-seed#[678F586E284B0617]) [    ] o.a.s.c.ZkTestServer STARTING ZK TEST SERVER
   [junit4]   2> 897353 INFO  (Thread-1974) [    ] o.a.s.c.ZkTestServer client port:0.0.0.0/0.0.0.0:0
   [junit4]   2> 897353 INFO  (Thread-1974) [    ] o.a.s.c.ZkTestServer Starting server
   [junit4]   2> 897450 INFO  (TEST-TestBulkSchemaConcurrent.test-seed#[678F586E284B0617]) [    ] o.a.s.c.ZkTestServer start zk server on port:64013
   [junit4]   2> 897450 INFO  (TEST-TestBulkSchemaConcurrent.test-seed#[678F586E284B0617]) [    ] o.a.s.c.c.SolrZkClient Using default ZkCredentialsProvider
   [junit4]   2> 897451 INFO  (TEST-TestBulkSchemaConcurrent.test-seed#[678F586E284B0617]) [    ] o.a.s.c.c.ConnectionManager Waiting for client to connect to ZooKeeper
   [junit4]   2> 897454 INFO  (zkCallback-704-thread-1) [    ] o.a.s.c.c.ConnectionManager Watcher org.apache.solr.common.cloud.ConnectionManager@16ae0ed name:ZooKeeperConnection Watcher:127.0.0.1:64013 got event WatchedEvent state:SyncConnected type:None path:null path:null type:None
   [junit4]   2> 897454 INFO  (TEST-TestBulkSchemaConcurrent.test-seed#[678F586E284B0617]) [    ] o.a.s.c.c.ConnectionManager Client is connected to ZooKeeper
   [junit4]   2> 897455 INFO  (TEST-TestBulkSchemaConcurrent.test-seed#[678F586E284B0617]) [    ] o.a.s.c.c.SolrZkClient Using default ZkACLProvider
   [junit4]   2> 897455 INFO  (TEST-TestBulkSchemaConcurrent.test-seed#[678F586E284B0617]) [    ] o.a.s.c.c.SolrZkClient makePath: /solr
   [junit4]   2> 897458 INFO  (TEST-TestBulkSchemaConcurrent.test-seed#[678F586E284B0617]) [    ] o.a.s.c.c.SolrZkClient Using default ZkCredentialsProvider
   [junit4]   2> 897459 INFO  (TEST-TestBulkSchemaConcurrent.test-seed#[678F586E284B0617]) [    ] o.a.s.c.c.ConnectionManager Waiting for client to connect to ZooKeeper
   [junit4]   2> 897461 INFO  (zkCallback-705-thread-1) [    ] o.a.s.c.c.ConnectionManager Watcher org.apache.solr.common.cloud.ConnectionManager@1caeb79 name:ZooKeeperConnection Watcher:127.0.0.1:64013/solr got event WatchedEvent state:SyncConnected type:None path:null path:null type:None
   [junit4]   2> 897461 INFO  (TEST-TestBulkSchemaConcurrent.test-seed#[678F586E284B0617]) [    ] o.a.s.c.c.ConnectionManager Client is connected to ZooKeeper
   [junit4]   2> 897461 INFO  (TEST-TestBulkSchemaConcurrent.test-seed#[678F586E284B0617]) [    ] o.a.s.c.c.SolrZkClient Using default ZkACLProvider
   [junit4]   2> 897461 INFO  (TEST-TestBulkSchemaConcurrent.test-seed#[678F586E284B0617]) [    ] o.a.s.c.c.SolrZkClient makePath: /collections/collection1
   [junit4]   2> 897463 INFO  (TEST-TestBulkSchemaConcurrent.test-seed#[678F586E284B0617]) [    ] o.a.s.c.c.SolrZkClient makePath: /collections/collection1/shards
   [junit4]   2> 897464 INFO  (TEST-TestBulkSchemaConcurrent.test-seed#[678F586E284B0617]) [    ] o.a.s.c.c.SolrZkClient makePath: /collections/control_collection
   [junit4]   2> 897465 INFO  (TEST-TestBulkSchemaConcurrent.test-seed#[678F586E284B0617]) [    ] o.a.s.c.c.SolrZkClient makePath: /collections/control_collection/shards
   [junit4]   2> 897467 INFO  (TEST-TestBulkSchemaConcurrent.test-seed#[678F586E284B0617]) [    ] o.a.s.c.AbstractZkTestCase put C:\Users\JenkinsSlave\workspace\Lucene-Solr-5.x-Windows\solr\core\src\test-files\solr\collection1\conf\solrconfig-managed-schema.xml to /configs/conf1/solrconfig.xml
   [junit4]   2> 897468 INFO  (TEST-TestBulkSchemaConcurrent.test-seed#[678F586E284B0617]) [    ] o.a.s.c.c.SolrZkClient makePath: /configs/conf1/solrconfig.xml
   [junit4]   2> 897471 INFO  (TEST-TestBulkSchemaConcurrent.test-seed#[678F586E284B0617]) [    ] o.a.s.c.AbstractZkTestCase put C:\Users\JenkinsSlave\workspace\Lucene-Solr-5.x-Windows\solr\core\src\test-files\solr\collection1\conf\schema.xml to /configs/conf1/schema.xml
   [junit4]   2> 897471 INFO  (TEST-TestBulkSchemaConcurrent.test-seed#[678F586E284B0617]) [    ] o.a.s.c.c.SolrZkClient makePath: /configs/conf1/schema.xml
   [junit4]   2> 897474 INFO  (TEST-TestBulkSchemaConcurrent.test-seed#[678F586E284B0617]) [    ] o.a.s.c.AbstractZkTestCase put C:\Users\JenkinsSlave\workspace\Lucene-Solr-5.x-Windows\solr\core\src\test-files\solr\collection1\conf\solrconfig.snippet.randomindexconfig.xml to /configs/conf1/solrconfig.snippet.randomindexconfig.xml
   [junit4]   2> 897474 INFO  (TEST-TestBulkSchemaConcurrent.test-seed#[678F586E284B0617]) [    ] o.a.s.c.c.SolrZkClient makePath: /configs/conf1/solrconfig.snippet.randomindexconfig.xml
   [junit4]   2> 897476 INFO  (TEST-TestBulkSchemaConcurrent.test-seed#[678F586E284B0617]) [    ] o.a.s.c.AbstractZkTestCase put C:\Users\JenkinsSlave\workspace\Lucene-Solr-5.x-Windows\solr\core\src\test-files\solr\collection1\conf\stopwords.txt to /configs/conf1/stopwords.txt
   [junit4]   2> 897476 INFO  (TEST-TestBulkSchemaConcurrent.test-seed#[678F586E284B0617]) [    ] o.a.s.c.c.SolrZkClient makePath: /configs/conf1/stopwords.txt
   [junit4]   2> 897478 INFO  (TEST-TestBulkSchemaConcurrent.test-seed#[678F586E284B0617]) [    ] o.a.s.c.AbstractZkTestCase put C:\Users\JenkinsSlave\workspace\Lucene-Solr-5.x-Windows\solr\core\src\test-files\solr\collection1\conf\protwords.txt to /configs/conf1/protwords.txt
   [junit4]   2> 897478 INFO  (TEST-TestBulkSchemaConcurrent.test-seed#[678F586E284B0617]) [    ] o.a.s.c.c.SolrZkClient makePath: /configs/conf1/protwords.txt
   [junit4]   2> 897481 INFO  (TEST-TestBulkSchemaConcurrent.test-seed#[678F586E284B0617]) [    ] o.a.s.c.AbstractZkTestCase put C:\Users\JenkinsSlave\workspace\Lucene-Solr-5.x-Windows\solr\core\src\test-files\solr\collection1\conf\currency.xml to /configs/conf1/currency.xml
   [junit4]   2> 897481 INFO  (TEST-TestBulkSchemaConcurrent.test-seed#[678F586E284B0617]) [    ] o.a.s.c.c.SolrZkClient makePath: /configs/conf1/currency.xml
   [junit4]   2> 897482 INFO  (TEST-TestBulkSchemaConcurrent.test-seed#[678F586E284B0617]) [    ] o.a.s.c.AbstractZkTestCase put C:\Users\JenkinsSlave\workspace\Lucene-Solr-5.x-Windows\solr\core\src\test-files\solr\collection1\conf\enumsConfig.xml to /configs/conf1/enumsConfig.xml
   [junit4]   2> 897482 INFO  (TEST-TestBulkSchemaConcurrent.test-seed#[678F586E284B0617]) [    ] o.a.s.c.c.SolrZkClient makePath: /configs/conf1/enumsConfig.xml
   [junit4]   2> 897484 INFO  (TEST-TestBulkSchemaConcurrent.test-seed#[678F586E284B0617]) [    ] o.a.s.c.AbstractZkTestCase put C:\Users\JenkinsSlave\workspace\Lucene-Solr-5.x-Windows\solr\core\src\test-files\solr\collection1\conf\open-exchange-rates.json to /configs/conf1/open-exchange-rates.json
   [junit4]   2> 897485 INFO  (TEST-TestBulkSchemaConcurrent.test-seed#[678F586E284B0617]) [    ] o.a.s.c.c.SolrZkClient makePath: /configs/conf1/open-exchange-rates.json
   [junit4]   2> 897487 INFO  (TEST-TestBulkSchemaConcurrent.test-seed#[678F586E284B0617]) [    ] o.a.s.c.AbstractZkTestCase put C:\Users\JenkinsSlave\workspace\Lucene-Solr-5.x-Windows\solr\core\src\test-files\solr\collection1\conf\mapping-ISOLatin1Accent.txt to /configs/conf1/mapping-ISOLatin1Accent.txt
   [junit4]   2> 897487 INFO  (TEST-TestBulkSchemaConcurrent.test-seed#[678F586E284B0617]) [    ] o.a.s.c.c.SolrZkClient makePath: /configs/conf1/mapping-ISOLatin1Accent.txt
   [junit4]   2> 897489 INFO  (TEST-TestBulkSchemaConcurrent.test-seed#[678F586E284B0617]) [    ] o.a.s.c.AbstractZkTestCase put C:\Users\JenkinsSlave\workspace\Lucene-Solr-5.x-Windows\solr\core\src\test-files\solr\collection1\conf\old_synonyms.txt to /configs/conf1/old_synonyms.txt
   [junit4]   2> 897489 INFO  (TEST-TestBulkSchemaConcurrent.test-seed#[678F586E284B0617]) [    ] o.a.s.c.c.SolrZkClient makePath: /configs/conf1/old_synonyms.txt
   [junit4]   2> 897491 INFO  (TEST-TestBulkSchemaConcurrent.test-seed#[678F586E284B0617]) [    ] o.a.s.c.AbstractZkTestCase put C:\Users\JenkinsSlave\workspace\Lucene-Solr-5.x-Windows\solr\core\src\test-files\solr\collection1\conf\synonyms.txt to /configs/conf1/synonyms.txt
   [junit4]   2> 897492 INFO  (TEST-TestBulkSchemaConcurrent.test-seed#[678F586E284B0617]) [    ] o.a.s.c.c.SolrZkClient makePath: /configs/conf1/synonyms.txt
   [junit4]   2> 897871 INFO  (TEST-TestBulkSchemaConcurrent.test-seed#[678F586E284B0617]) [    ] o.a.s.SolrTestCaseJ4 Writing core.properties file to C:\Users\JenkinsSlave\workspace\Lucene-Solr-5.x-Windows\solr\build\solr-core\test\J1\temp\solr.schema.TestBulkSchemaConcurrent_678F586E284B0617-001\control-001\cores\collection1
   [junit4]   2> 897873 INFO  (TEST-TestBulkSchemaConcurrent.test-seed#[678F586E284B0617]) [    ] o.e.j.s.Server jetty-9.2.13.v20150730
   [junit4]   2> 897880 INFO  (TEST-TestBulkSchemaConcurrent.test-seed#[678F586E284B0617]) [    ] o.e.j.s.h.ContextHandler Started o.e.j.s.ServletContextHandler@6fb9df{/h_lwq,null,AVAILABLE}
   [junit4]   2> 897884 INFO  (TEST-TestBulkSchemaConcurrent.test-seed#[678F586E284B0617]) [    ] o.e.j.s.ServerConnector Started ServerConnector@11404a0{HTTP/1.1}{127.0.0.1:64020}
   [junit4]   2> 897884 INFO  (TEST-TestBulkSchemaConcurrent.test-seed#[678F586E284B0617]) [    ] o.e.j.s.Server Started @901816ms
   [junit4]   2> 897884 INFO  (TEST-TestBulkSchemaConcurrent.test-seed#[678F586E284B0617]) [    ] o.a.s.c.s.e.JettySolrRunner Jetty properties: {hostContext=/h_lwq, coreRootDirectory=C:\Users\JenkinsSlave\workspace\Lucene-Solr-5.x-Windows\solr\build\solr-core\test\J1\..\..\..\..\..\..\..\..\..\Users\JenkinsSlave\workspace\Lucene-Solr-5.x-Windows\solr\build\solr-core\test\J1\temp\solr.schema.TestBulkSchemaConcurrent_678F586E284B0617-001\control-001\cores, solr.data.dir=C:\Users\JenkinsSlave\workspace\Lucene-Solr-5.x-Windows\solr\build\solr-core\test\J1\temp\solr.schema.TestBulkSchemaConcurrent_678F586E284B0617-001\tempDir-001/control/data, hostPort=64020}
   [junit4]   2> 897884 INFO  (TEST-TestBulkSchemaConcurrent.test-seed#[678F586E284B0617]) [    ] o.a.s.s.SolrDispatchFilter SolrDispatchFilter.init(): sun.misc.Launcher$AppClassLoader@1db04ed
   [junit4]   2> 897884 INFO  (TEST-TestBulkSchemaConcurrent.test-seed#[678F586E284B0617]) [    ] o.a.s.c.SolrResourceLoader new SolrResourceLoader for directory: 'C:\Users\JenkinsSlave\workspace\Lucene-Solr-5.x-Windows\solr\build\solr-core\test\J1\temp\solr.schema.TestBulkSchemaConcurrent_678F586E284B0617-001\control-001'
   [junit4]   2> 897884 INFO  (TEST-TestBulkSchemaConcurrent.test-seed#[678F586E284B0617]) [    ] o.a.s.c.SolrResourceLoader JNDI not configured for solr (NoInitialContextEx)
   [junit4]   2> 897884 INFO  (TEST-TestBulkSchemaConcurrent.test-seed#[678F586E284B0617]) [    ] o.a.s.c.SolrResourceLoader solr home defaulted to 'solr/' (could not find system property or JNDI)
   [junit4]   2> 897885 INFO  (TEST-TestBulkSchemaConcurrent.test-seed#[678F586E284B0617]) [    ] o.a.s.c.c.SolrZkClient Using default ZkCredentialsProvider
   [junit4]   2> 897887 INFO  (TEST-TestBulkSchemaConcurrent.test-seed#[678F586E284B0617]) [    ] o.a.s.c.c.ConnectionManager Waiting for client to connect to ZooKeeper
   [junit4]   2> 897888 INFO  (zkCallback-706-thread-1) [    ] o.a.s.c.c.ConnectionManager Watcher org.apache.solr.common.cloud.ConnectionManager@18bbad2 name:ZooKeeperConnection Watcher:127.0.0.1:64013/solr got event WatchedEvent state:SyncConnected type:None path:null path:null type:None
   [junit4]   2> 897888 INFO  (TEST-TestBulkSchemaConcurrent.test-seed#[678F586E284B0617]) [    ] o.a.s.c.c.ConnectionManager Client is connected to ZooKeeper
   [junit4]   2> 897889 INFO  (TEST-TestBulkSchemaConcurrent.test-seed#[678F586E284B0617]) [    ] o.a.s.c.c.SolrZkClient Using default ZkACLProvider
   [junit4]   2> 897890 INFO  (TEST-TestBulkSchemaConcurrent.test-seed#[678F586E284B0617]) [    ] o.a.s.s.SolrDispatchFilter Loading solr.xml from SolrHome (not found in ZooKeeper)
   [junit4]   2> 897890 INFO  (TEST-TestBulkSchemaConcurrent.test-seed#[678F586E284B0617]) [    ] o.a.s.c.SolrXmlConfig Loading container configuration from C:\Users\JenkinsSlave\workspace\Lucene-Solr-5.x-Windows\solr\build\solr-core\test\J1\temp\solr.schema.TestBulkSchemaConcurrent_678F586E284B0617-001\control-001\solr.xml
   [junit4]   2> 897918 INFO  (TEST-TestBulkSchemaConcurrent.test-seed#[678F586E284B0617]) [    ] o.a.s.c.CorePropertiesLocator Config-defined core root directory: C:\Users\JenkinsSlave\workspace\Lucene-Solr-5.x-Windows\solr\build\solr-core\test\J1\..\..\..\..\..\..\..\..\..\Users\JenkinsSlave\workspace\Lucene-Solr-5.x-Windows\solr\build\solr-core\test\J1\temp\solr.schema.TestBulkSchemaConcurrent_678F586E284B0617-001\control-001\cores
   [junit4]   2> 897918 INFO  (TEST-TestBulkSchemaConcurrent.test-seed#[678F586E284B0617]) [    ] o.a.s.c.CoreContainer New CoreContainer 14568691
   [junit4]   2> 897918 INFO  (TEST-TestBulkSchemaConcurrent.test-seed#[678F586E284B0617]) [    ] o.a.s.c.CoreContainer Loading cores into CoreContainer [instanceDir=C:\Users\JenkinsSlave\workspace\Lucene-Solr-5.x-Windows\solr\build\solr-core\test\J1\temp\solr.schema.TestBulkSchemaConcurrent_678F586E284B0617-001\control-001]
   [junit4]   2> 897919 WARN  (TEST-TestBulkSchemaConcurrent.test-seed#[678F586E284B0617]) [    ] o.a.s.c.CoreContainer Couldn't add files from C:\Users\JenkinsSlave\workspace\Lucene-Solr-5.x-Windows\solr\build\solr-core\test\J1\temp\solr.schema.TestBulkSchemaConcurrent_678F586E284B0617-001\control-001\lib to classpath: C:\Users\JenkinsSlave\workspace\Lucene-Solr-5.x-Windows\solr\build\solr-core\test\J1\temp\solr.schema.TestBulkSchemaConcurrent_678F586E284B0617-001\control-001\lib
   [junit4]   2> 897919 INFO  (TEST-TestBulkSchemaConcurrent.test-seed#[678F586E284B0617]) [    ] o.a.s.h.c.HttpShardHandlerFactory created with socketTimeout : 90000,urlScheme : ,connTimeout : 15000,maxConnectionsPerHost : 20,maxConnections : 10000,corePoolSize : 0,maximumPoolSize : 2147483647,maxThreadIdleTime : 5,sizeOfQueue : -1,fairnessPolicy : false,useRetries : false,
   [junit4]   2> 897923 INFO  (TEST-TestBulkSchemaConcurrent.test-seed#[678F586E284B0617]) [    ] o.a.s.u.UpdateShardHandler Creating UpdateShardHandler HTTP client with params: socketTimeout=340000&connTimeout=45000&retry=true
   [junit4]   2> 897924 INFO  (TEST-TestBulkSchemaConcurrent.test-seed#[678F586E284B0617]) [    ] o.a.s.l.LogWatcher SLF4J impl is org.slf4j.impl.Log4jLoggerFactory
   [junit4]   2> 897924 INFO  (TEST-TestBulkSchemaConcurrent.test-seed#[678F586E284B0617]) [    ] o.a.s.l.LogWatcher Registering Log Listener [Log4j (org.slf4j.impl.Log4jLoggerFactory)]
   [junit4]   2> 897924 INFO  (TEST-TestBulkSchemaConcurrent.test-seed#[678F586E284B0617]) [    ] o.a.s.c.ZkContainer Zookeeper client=127.0.0.1:64013/solr
   [junit4]   2> 897924 INFO  (TEST-TestBulkSchemaConcurrent.test-seed#[678F586E284B0617]) [    ] o.a.s.c.ZkController zkHost includes chroot
   [junit4]   2> 897924 INFO  (TEST-TestBulkSchemaConcurrent.test-seed#[678F586E284B0617]) [    ] o.a.s.c.c.SolrZkClient Using default ZkCredentialsProvider
   [junit4]   2> 897925 INFO  (TEST-TestBulkSchemaConcurrent.test-seed#[678F586E284B0617]) [    ] o.a.s.c.c.ConnectionManager Waiting for client to connect to ZooKeeper
   [junit4]   2> 897927 INFO  (zkCallback-709-thread-1) [    ] o.a.s.c.c.ConnectionManager Watcher org.apache.solr.common.cloud.ConnectionManager@b4e5a0 name:ZooKeeperConnection Watcher:127.0.0.1:64013 got event WatchedEvent state:SyncConnected type:None path:null path:null type:None
   [junit4]   2> 897927 INFO  (TEST-TestBulkSchemaConcurrent.test-seed#[678F586E284B0617]) [    ] o.a.s.c.c.ConnectionManager Client is connected to ZooKeeper
   [junit4]   2> 897927 INFO  (TEST-TestBulkSchemaConcurrent.test-seed#[678F586E284B0617]) [    ] o.a.s.c.c.SolrZkClient Using default ZkACLProvider
   [junit4]   2> 897930 INFO  (TEST-TestBulkSchemaConcurrent.test-seed#[678F586E284B0617]) [n:127.0.0.1:64020_h_lwq    ] o.a.s.c.c.ConnectionManager Waiting for client to connect to ZooKeeper
   [junit4]   2> 897931 INFO  (zkCallback-710-thread-1-processing-n:127.0.0.1:64020_h_lwq) [n:127.0.0.1:64020_h_lwq    ] o.a.s.c.c.ConnectionManager Watcher org.apache.solr.common.cloud.ConnectionManager@18df130 name:ZooKeeperConnection Watcher:127.0.0.1:64013/solr got event WatchedEvent state:SyncConnected type:None path:null path:null type:None
   [junit4]   2> 897931 INFO  (TEST-TestBulkSchemaConcurrent.test-seed#[678F586E284B0617]) [n:127.0.0.1:64020_h_lwq    ] o.a.s.c.c.ConnectionManager Client is connected to ZooKeeper
   [junit4]   2> 897932 INFO  (TEST-TestBulkSchemaConcurrent.test-seed#[678F586E284B0617]) [n:127.0.0.1:64020_h_lwq    ] o.a.s.c.c.SolrZkClient makePath: /overseer/queue
   [junit4]   2> 897934 INFO  (TEST-TestBulkSchemaConcurrent.test-seed#[678F586E284B0617]) [n:127.0.0.1:64020_h_lwq    ] o.a.s.c.c.SolrZkClient makePath: /overseer/collection-queue-work
   [junit4]   2> 897938 INFO  (TEST-TestBulkSchemaConcurrent.test-seed#[678F586E284B0617]) [n:127.0.0.1:64020_h_lwq    ] o.a.s.c.c.SolrZkClient makePath: /overseer/collection-map-running
   [junit4]   2> 897941 INFO  (TEST-TestBulkSchemaConcurrent.test-seed#[678F586E284B0617]) [n:127.0.0.1:64020_h_lwq    ] o.a.s.c.c.SolrZkClient makePath: /overseer/collection-map-completed
   [junit4]   2> 897944 INFO  (TEST-TestBulkSchemaConcurrent.test-seed#[678F586E284B0617]) [n:127.0.0.1:64020_h_lwq    ] o.a.s.c.c.SolrZkClient makePath: /overseer/collection-map-failure
   [junit4]   2> 897947 INFO  (TEST-TestBulkSchemaConcurrent.test-seed#[678F586E284B0617]) [n:127.0.0.1:64020_h_lwq    ] o.a.s.c.c.SolrZkClient makePath: /live_nodes
   [junit4]   2> 897949 INFO  (TEST-TestBulkSchemaConcurrent.test-seed#[678F586E284B0617]) [n:127.0.0.1:64020_h_lwq    ] o.a.s.c.c.SolrZkClient makePath: /aliases.json
   [junit4]   2> 897951 INFO  (TEST-TestBulkSchemaConcurrent.test-seed#[678F586E284B0617]) [n:127.0.0.1:64020_h_lwq    ] o.a.s.c.c.SolrZkClient makePath: /clusterstate.json
   [junit4]   2> 897952 INFO  (TEST-TestBulkSchemaConcurrent.test-seed#[678F586E284B0617]) [n:127.0.0.1:64020_h_lwq    ] o.a.s.c.c.SolrZkClient makePath: /security.json
   [junit4]   2> 897952 INFO  (TEST-TestBulkSchemaConcurrent.test-seed#[678F586E284B0617]) [n:127.0.0.1:64020_h_lwq    ] o.a.s.c.ZkController Register node as live in ZooKeeper:/live_nodes/127.0.0.1:64020_h_lwq
   [junit4]   2> 897953 INFO  (TEST-TestBulkSchemaConcurrent.test-seed#[678F586E284B0617]) [n:127.0.0.1:64020_h_lwq    ] o.a.s.c.c.SolrZkClient makePath: /live_nodes/127.0.0.1:64020_h_lwq
   [junit4]   2> 897955 INFO  (TEST-TestBulkSchemaConcurrent.test-seed#[678F586E284B0617]) [n:127.0.0.1:64020_h_lwq    ] o.a.s.c.c.SolrZkClient makePath: /overseer_elect
   [junit4]   2> 897957 INFO  (TEST-TestBulkSchemaConcurrent.test-seed#[678F586E284B0617]) [n:127.0.0.1:64020_h_lwq    ] o.a.s.c.c.SolrZkClient makePath: /overseer_elect/election
   [junit4]   2> 897958 INFO  (TEST-TestBulkSchemaConcurrent.test-seed#[678F586E284B0617]) [n:127.0.0.1:64020_h_lwq    ] o.a.s.c.Overseer Overseer (id=null) closing
   [junit4]   2> 897959 INFO  (TEST-TestBulkSchemaConcurrent.test-seed#[678F586E284B0617]) [n:127.0.0.1:64020_h_lwq    ] o.a.s.c.LeaderElector Joined leadership election with path: /overseer_elect/election/95328407904256004-127.0.0.1:64020_h_lwq-n_0000000000
   [junit4]   2> 897959 INFO  (TEST-TestBulkSchemaConcurrent.test-seed#[678F586E284B0617]) [n:127.0.0.1:64020_h_lwq    ] o.a.s.c.OverseerElectionContext I am going to be the leader 127.0.0.1:64020_h_lwq
   [junit4]   2> 897959 INFO  (TEST-TestBulkSchemaConcurrent.test-seed#[678F586E284B0617]) [n:127.0.0.1:64020_h_lwq    ] o.a.s.c.c.SolrZkClient makePath: /overseer_elect/leader
   [junit4]   2> 897961 INFO  (TEST-TestBulkSchemaConcurrent.test-seed#[678F586E284B0617]) [n:127.0.0.1:64020_h_lwq    ] o.a.s.c.Overseer Overseer (id=95328407904256004-127.0.0.1:64020_h_lwq-n_0000000000) starting
   [junit4]   2> 897963 INFO  (TEST-TestBulkSchemaConcurrent.test-seed#[678F586E284B0617]) [n:127.0.0.1:64020_h_lwq    ] o.a.s.c.c.SolrZkClient makePath: /overseer/queue-work
   [junit4]   2> 897970 INFO  (TEST-TestBulkSchemaConcurrent.test-seed#[678F586E284B0617]) [n:127.0.0.1:64020_h_lwq    ] o.a.s.c.OverseerAutoReplicaFailoverThread Starting OverseerAutoReplicaFailoverThread autoReplicaFailoverWorkLoopDelay=10000 autoReplicaFailoverWaitAfterExpiration=30000 autoReplicaFailoverBadNodeExpiration=60000
   [junit4]   2> 897970 INFO  (TEST-TestBulkSchemaConcurrent.test-seed#[678F586E284B0617]) [n:127.0.0.1:64020_h_lwq    ] o.a.s.c.c.ZkStateReader Updating cluster state from ZooKeeper... 
   [junit4]   2> 897970 INFO  (OverseerCollectionConfigSetProcessor-95328407904256004-127.0.0.1:64020_h_lwq-n_0000000000) [n:127.0.0.1:64020_h_lwq    ] o.a.s.c.OverseerTaskProcessor Process current queue of overseer operations
   [junit4]   2> 897970 INFO  (OverseerStateUpdate-95328407904256004-127.0.0.1:64020_h_lwq-n_0000000000) [n:127.0.0.1:64020_h_lwq    ] o.a.s.c.Overseer Starting to work on the main queue
   [junit4]   2> 897988 INFO  (TEST-TestBulkSchemaConcurrent.test-seed#[678F586E284B0617]) [n:127.0.0.1:64020_h_lwq    ] o.a.s.c.CoreContainer Security conf doesn't exist. Skipping setup for authorization module.
   [junit4]   2> 897988 INFO  (TEST-TestBulkSchemaConcurrent.test-seed#[678F586E284B0617]) [n:127.0.0.1:64020_h_lwq    ] o.a.s.c.CoreContainer No authentication plugin used.
   [junit4]   2> 897989 INFO  (TEST-TestBulkSchemaConcurrent.test-seed#[678F586E284B0617]) [n:127.0.0.1:64020_h_lwq    ] o.a.s.c.CorePropertiesLocator Looking for core definitions underneath C:\Users\JenkinsSlave\workspace\Lucene-Solr-5.x-Windows\solr\build\solr-core\test\J1\..\..\..\..\..\..\..\..\..\Users\JenkinsSlave\workspace\Lucene-Solr-5.x-Windows\solr\build\solr-core\test\J1\temp\solr.schema.TestBulkSchemaConcurrent_678F586E284B0617-001\control-001\cores
   [junit4]   2> 897992 INFO  (TEST-TestBulkSchemaConcurrent.test-seed#[678F586E284B0617]) [n:127.0.0.1:64020_h_lwq    ] o.a.s.c.CoreDescriptor Created CoreDescriptor: {name=collection1, shard=, coreNodeName=, configSetProperties=configsetprops.json, dataDir=data\, loadOnStartup=true, collection=control_collection, schema=schema.xml, transient=false, config=solrconfig.xml}
   [junit4]   2> 897992 INFO  (TEST-TestBulkSchemaConcurrent.test-seed#[678F586E284B0617]) [n:127.0.0.1:64020_h_lwq    ] o.a.s.c.CorePropertiesLocator Found core collection1 in C:\Users\JenkinsSlave\workspace\Lucene-Solr-5.x-Windows\solr\build\solr-core\test\J1\..\..\..\..\..\..\..\..\..\Users\JenkinsSlave\workspace\Lucene-Solr-5.x-Windows\solr\build\solr-core\test\J1\temp\solr.schema.TestBulkSchemaConcurrent_678F586E284B0617-001\control-001\cores\collection1
   [junit4]   2> 897992 INFO  (TEST-TestBulkSchemaConcurrent.test-seed#[678F586E284B0617]) [n:127.0.0.1:64020_h_lwq    ] o.a.s.c.CorePropertiesLocator Found 1 core definitions
   [junit4]   2> 897993 INFO  (TEST-TestBulkSchemaConcurrent.test-seed#[678F586E284B0617]) [n:127.0.0.1:64020_h_lwq    ] o.a.s.s.SolrDispatchFilter user.dir=C:\Users\JenkinsSlave\workspace\Lucene-Solr-5.x-Windows\solr\build\solr-core\test\J1
   [junit4]   2> 897993 INFO  (TEST-TestBulkSchemaConcurrent.test-seed#[678F586E284B0617]) [n:127.0.0.1:64020_h_lwq    ] o.a.s.s.SolrDispatchFilter SolrDispatchFilter.init() done
   [junit4]   2> 897993 INFO  (coreLoadExecutor-2307-thread-1-processing-n:127.0.0.1:64020_h_lwq) [n:127.0.0.1:64020_h_lwq c:control_collection   x:collection1] o.a.s.c.ZkController publishing state=down
   [junit4]   2> 897993 INFO  (coreLoadExecutor-2307-thread-1-processing-n:127.0.0.1:64020_h_lwq) [n:127.0.0.1:64020_h_lwq c:control_collection   x:collection1] o.a.s.c.ZkController numShards not found on descriptor - reading it from system property
   [junit4]   2> 897995 INFO  (OverseerStateUpdate-95328407904256004-127.0.0.1:64020_h_lwq-n_0000000000) [n:127.0.0.1:64020_h_lwq    ] o.a.s.c.Overseer processMessage: queueSize: 1, message = {
   [junit4]   2>   "node_name":"127.0.0.1:64020_h_lwq",
   [junit4]   2>   "core":"collection1",
   [junit4]   2>   "numShards":"1",
   [junit4]   2>   "roles":null,
   [junit4]   2>   "state":"down",
   [junit4]   2>   "base_url":"http://127.0.0.1:64020/h_lwq",
   [junit4]   2>   "collection":"control_collection",
   [junit4]   2>   "operation":"state",
   [junit4]   2>   "shard":null} current state version: 0
   [junit4]   2> 897996 INFO  (coreLoadExecutor-2307-thread-1-processing-n:127.0.0.1:64020_h_lwq) [n:127.0.0.1:64020_h_lwq c:control_collection   x:collection1] o.a.s.c.ZkController look for our core node name
   [junit4]   2> 897996 INFO  (OverseerStateUpdate-95328407904256004-127.0.0.1:64020_h_lwq-n_0000000000) [n:127.0.0.1:64020_h_lwq    ] o.a.s.c.o.ReplicaMutator Update state numShards=1 message={
   [junit4]   2>   "node_name":"127.0.0.1:64020_h_lwq",
   [junit4]   2>   "core":"collection1",
   [junit4]   2>   "numShards":"1",
   [junit4]   2>   "roles":null,
   [junit4]   2>   "state":"down",
   [junit4]   2>   "base_url":"http://127.0.0.1:64020/h_lwq",
   [junit4]   2>   "collection":"control_collection",
   [junit4]   2>   "operation":"state",
   [junit4]   2>   "shard":null}
   [junit4]   2> 897996 INFO  (OverseerStateUpdate-95328407904256004-127.0.0.1:64020_h_lwq-n_0000000000) [n:127.0.0.1:64020_h_lwq    ] o.a.s.c.o.ClusterStateMutator building a new cName: control_collection
   [junit4]   2> 897997 INFO  (OverseerStateUpdate-95328407904256004-127.0.0.1:64020_h_lwq-n_0000000000) [n:127.0.0.1:64020_h_lwq    ] o.a.s.c.o.ReplicaMutator Assigning new node to shard shard=shard1
   [junit4]   2> 897998 INFO  (zkCallback-710-thread-1-processing-n:127.0.0.1:64020_h_lwq) [n:127.0.0.1:64020_h_lwq    ] o.a.s.c.c.ZkStateReader A cluster state change: [WatchedEvent state:SyncConnected type:NodeDataChanged path:/clusterstate.json], has occurred - updating... (live nodes size: [1])
   [junit4]   2> 898966 INFO  (coreLoadExecutor-2307-thread-1-processing-n:127.0.0.1:64020_h_lwq) [n:127.0.0.1:64020_h_lwq c:control_collection   x:collection1] o.a.s.c.ZkController waiting to find shard id in clusterstate for collection1
   [junit4]   2> 898966 INFO  (coreLoadExecutor-2307-thread-1-processing-n:127.0.0.1:64020_h_lwq) [n:127.0.0.1:64020_h_lwq c:control_collection   x:collection1] o.a.s.c.ZkController Check for collection zkNode:control_collection
   [junit4]   2> 898966 INFO  (coreLoadExecutor-2307-thread-1-processing-n:127.0.0.1:64020_h_lwq) [n:127.0.0.1:64020_h_lwq c:control_collection   x:collection1] o.a.s.c.ZkController Collection zkNode exists
   [junit4]   2> 898966 INFO  (coreLoadExecutor-2307-thread-1-processing-n:127.0.0.1:64020_h_lwq) [n:127.0.0.1:64020_h_lwq c:control_collection   x:collection1] o.a.s.c.c.ZkStateReader Load collection config from: [/collections/control_collection]
   [junit4]   2> 898967 INFO  (coreLoadExecutor-2307-thread-1-processing-n:127.0.0.1:64020_h_lwq) [n:127.0.0.1:64020_h_lwq c:control_collection   x:collection1] o.a.s.c.c.ZkStateReader path=[/collections/control_collection] [configName]=[conf1] specified config exists in ZooKeeper
   [junit4]   2> 898967 INFO  (coreLoadExecutor-2307-thread-1-processing-n:127.0.0.1:64020_h_lwq) [n:127.0.0.1:64020_h_lwq c:control_collection   x:collection1] o.a.s.c.SolrResourceLoader new SolrResourceLoader for directory: 'C:\Users\JenkinsSlave\workspace\Lucene-Solr-5.x-Windows\solr\build\solr-core\test\J1\temp\solr.schema.TestBulkSchemaConcurrent_678F586E284B0617-001\control-001\cores\collection1'
   [junit4]   2> 898967 INFO  (coreLoadExecutor-2307-thread-1-processing-n:127.0.0.1:64020_h_lwq) [n:127.0.0.1:64020_h_lwq c:control_collection   x:collection1] o.a.s.c.SolrResourceLoader JNDI not configured for solr (NoInitialContextEx)
   [junit4]   2> 898967 INFO  (coreLoadExecutor-2307-thread-1-processing-n:127.0.0.1:64020_h_lwq) [n:127.0.0.1:64020_h_lwq c:control_collection   x:collection1] o.a.s.c.SolrResourceLoader solr home defaulted to 'solr/' (could not find system property or JNDI)
   [junit4]   2> 898971 INFO  (coreLoadExecutor-2307-thread-1-processing-n:127.0.0.1:64020_h_lwq) [n:127.0.0.1:64020_h_lwq c:control_collection   x:collection1] o.a.s.c.Config loaded config solrconfig.xml with version 0 
   [junit4]   2> 898979 INFO  (coreLoadExecutor-2307-thread-1-processing-n:127.0.0.1:64020_h_lwq) [n:127.0.0.1:64020_h_lwq c:control_collection   x:collection1] o.a.s.c.SolrConfig current version of requestparams : -1
   [junit4]   2> 898999 INFO  (coreLoadExecutor-2307-thread-1-processing-n:127.0.0.1:64020_h_lwq) [n:127.0.0.1:64020_h_lwq c:control_collection   x:collection1] o.a.s.c.SolrConfig Using Lucene MatchVersion: 5.5.0
   [junit4]   2> 899032 INFO  (coreLoadExecutor-2307-thread-1-processing-n:127.0.0.1:64020_h_lwq) [n:127.0.0.1:64020_h_lwq c:control_collection   x:collection1] o.a.s.c.SolrConfig Loaded SolrConfig: solrconfig.xml
   [junit4]   2> 899034 INFO  (coreLoadExecutor-2307-thread-1-processing-n:127.0.0.1:64020_h_lwq) [n:127.0.0.1:64020_h_lwq c:control_collection   x:collection1] o.a.s.s.ManagedIndexSchemaFactory The schema is configured as managed, but managed schema resource managed-schema not found - loading non-managed schema schema.xml instead
   [junit4]   2> 899040 INFO  (coreLoadExecutor-2307-thread-1-processing-n:127.0.0.1:64020_h_lwq) [n:127.0.0.1:64020_h_lwq c:control_collection   x:collection1] o.a.s.s.IndexSchema [collection1] Schema name=test
   [junit4]   2> 899383 INFO  (coreLoadExecutor-2307-thread-1-processing-n:127.0.0.1:64020_h_lwq) [n:127.0.0.1:64020_h_lwq c:control_collection   x:collection1] o.a.s.s.OpenExchangeRatesOrgProvider Initialized with rates=open-exchange-rates.json, refreshInterval=1440.
   [junit4]   2> 899394 INFO  (coreLoadExecutor-2307-thread-1-processing-n:127.0.0.1:64020_h_lwq) [n:127.0.0.1:64020_h_lwq c:control_collection   x:collection1] o.a.s.s.IndexSchema default search field in schema is text
   [junit4]   2> 899396 INFO  (coreLoadExecutor-2307-thread-1-processing-n:127.0.0.1:64020_h_lwq) [n:127.0.0.1:64020_h_lwq c:control_collection   x:collection1] o.a.s.s.IndexSchema unique key field: id
   [junit4]   2> 899414 INFO  (coreLoadExecutor-2307-thread-1-processing-n:127.0.0.1:64020_h_lwq) [n:127.0.0.1:64020_h_lwq c:control_collection   x:collection1] o.a.s.s.FileExchangeRateProvider Reloading exchange rates from file currency.xml
   [junit4]   2> 899417 INFO  (coreLoadExecutor-2307-thread-1-processing-n:127.0.0.1:64020_h_lwq) [n:127.0.0.1:64020_h_lwq c:control_collection   x:collection1] o.a.s.s.FileExchangeRateProvider Reloading exchange rates from file currency.xml
   [junit4]   2> 899420 INFO  (coreLoadExecutor-2307-thread-1-processing-n:127.0.0.1:64020_h_lwq) [n:127.0.0.1:64020_h_lwq c:control_collection   x:collection1] o.a.s.s.OpenExchangeRatesOrgProvider Reloading exchange rates from open-exchange-rates.json
   [junit4]   2> 899422 INFO  (coreLoadExecutor-2307-thread-1-processing-n:127.0.0.1:64020_h_lwq) [n:127.0.0.1:64020_h_lwq c:control_collection   x:collection1] o.a.s.s.OpenExchangeRatesOrgProvider Reloading exchange rates from open-exchange-rates.json
   [junit4]   2> 899427 INFO  (coreLoadExecutor-2307-thread-1-processing-n:127.0.0.1:64020_h_lwq) [n:127.0.0.1:64020_h_lwq c:control_collection   x:collection1] o.a.s.s.ManagedIndexSchema Created and persisted managed schema znode at /configs/conf1/managed-schema
   [junit4]   2> 899428 INFO  (coreLoadExecutor-2307-thread-1-processing-n:127.0.0.1:64020_h_lwq) [n:127.0.0.1:64020_h_lwq c:control_collection   x:collection1] o.a.s.c.c.SolrZkClient makePath: /configs/conf1/schema.xml.bak
   [junit4]   2> 899435 INFO  (coreLoadExecutor-2307-thread-1-processing-n:127.0.0.1:64020_h_lwq) [n:127.0.0.1:64020_h_lwq c:control_collection   x:collection1] o.a.s.s.ManagedIndexSchemaFactory After upgrading to managed schema in ZooKeeper, renamed the non-managed schema /configs/conf1/schema.xml to /configs/conf1/schema.xml.bak
   [junit4]   2> 899439 INFO  (coreLoadExecutor-2307-thread-1-processing-n:127.0.0.1:64020_h_lwq) [n:127.0.0.1:64020_h_lwq c:control_collection   x:collection1] o.a.s.c.ConfigSetProperties Did not find ConfigSet properties, assuming default properties: Can't find resource 'configsetprops.json' in classpath or '/configs/conf1', cwd=C:\Users\JenkinsSlave\workspace\Lucene-Solr-5.x-Windows\solr\build\solr-core\test\J1
   [junit4]   2> 899439 INFO  (coreLoadExecutor-2307-thread-1-processing-n:127.0.0.1:64020_h_lwq) [n:127.0.0.1:64020_h_lwq c:control_collection   x:collection1] o.a.s.c.CoreContainer Creating SolrCore 'collection1' using configuration from collection control_collection
   [junit4]   2> 899439 INFO  (coreLoadExecutor-2307-thread-1-processing-n:127.0.0.1:64020_h_lwq) [n:127.0.0.1:64020_h_lwq c:control_collection s:shard1 r:core_node1 x:collection1] o.a.s.c.SolrCore solr.NRTCachingDirectoryFactory
   [junit4]   2> 899439 INFO  (coreLoadExecutor-2307-thread-1-processing-n:127.0.0.1:64020_h_lwq) [n:127.0.0.1:64020_h_lwq c:control_collection s:shard1 r:core_node1 x:collection1] o.a.s.c.SolrCore [[collection1] ] Opening new SolrCore at [C:\Users\JenkinsSlave\workspace\Lucene-Solr-5.x-Windows\solr\build\solr-core\test\J1\temp\solr.schema.TestBulkSchemaConcurrent_678F586E284B0617-001\control-001\cores\collection1], dataDir=[C:\Users\JenkinsSlave\workspace\Lucene-Solr-5.x-Windows\solr\build\solr-core\test\J1\..\..\..\..\..\..\..\..\..\Users\JenkinsSlave\workspace\Lucene-Solr-5.x-Windows\solr\build\solr-core\test\J1\temp\solr.schema.TestBulkSchemaConcurrent_678F586E284B0617-001\control-001\cores\collection1\data\]
   [junit4]   2> 899439 INFO  (coreLoadExecutor-2307-thread-1-processing-n:127.0.0.1:64020_h_lwq) [n:127.0.0.1:64020_h_lwq c:control_collection s:shard1 r:core_node1 x:collection1] o.a.s.c.SolrCore JMX monitoring not detected for core: collection1
   [junit4]   2> 899440 INFO  (coreLoadExecutor-2307-thread-1-processing-n:127.0.0.1:64020_h_lwq) [n:127.0.0.1:64020_h_lwq c:control_collection s:shard1 r:core_node1 x:collection1] o.a.s.c.SchemaCodecFactory Using default compressionMode: BEST_SPEED
   [junit4]   2> 899441 INFO  (coreLoadExecutor-2307-thread-1-processing-n:127.0.0.1:64020_h_lwq) [n:127.0.0.1:64020_h_lwq c:control_collection s:shard1 r:core_node1 x:collection1] o.a.s.c.CachingDirectoryFactory return new directory for C:\Users\JenkinsSlave\workspace\Lucene-Solr-5.x-Windows\solr\build\solr-core\test\J1\temp\solr.schema.TestBulkSchemaConcurrent_678F586E284B0617-001\control-001\cores\collection1\data
   [junit4]   2> 899441 INFO  (coreLoadExecutor-2307-thread-1-processing-n:127.0.0.1:64020_h_lwq) [n:127.0.0.1:64020_h_lwq c:control_collection s:shard1 r:core_node1 x:collection1] o.a.s.c.SolrCore New index directory detected: old=null new=C:\Users\JenkinsSlave\workspace\Lucene-Solr-5.x-Windows\solr\build\solr-core\test\J1\..\..\..\..\..\..\..\..\..\Users\JenkinsSlave\workspace\Lucene-Solr-5.x-Windows\solr\build\solr-core\test\J1\temp\solr.schema.TestBulkSchemaConcurrent_678F586E284B0617-001\control-001\cores\collection1\data\index/
   [junit4]   2> 899442 WARN  (coreLoadExecutor-2307-thread-1-processing-n:127.0.0.1:64020_h_lwq) [n:127.0.0.1:64020_h_lwq c:control_collection s:shard1 r:core_node1 x:collection1] o.a.s.c.SolrCore [collection1] Solr index directory 'C:\Users\JenkinsSlave\workspace\Lucene-Solr-5.x-Windows\solr\build\solr-core\test\J1\..\..\..\..\..\..\..\..\..\Users\JenkinsSlave\workspace\Lucene-Solr-5.x-Windows\solr\build\solr-core\test\J1\temp\solr.schema.TestBulkSchemaConcurrent_678F586E284B0617-001\control-001\cores\collection1\data\index' doesn't exist. Creating new index...
   [junit4]   2> 899443 INFO  (coreLoadExecutor-2307-thread-1-processing-n:127.0.0.1:64020_h_lwq) [n:127.0.0.1:64020_h_lwq c:control_collection s:shard1 r:core_node1 x:collection1] o.a.s.c.CachingDirectoryFactory return new directory for C:\Users\JenkinsSlave\workspace\Lucene-Solr-5.x-Windows\solr\build\solr-core\test\J1\temp\solr.schema.TestBulkSchemaConcurrent_678F586E284B0617-001\control-001\cores\collection1\data\index
   [junit4]   2> 899444 INFO  (coreLoadExecutor-2307-thread-1-processing-n:127.0.0.1:64020_h_lwq) [n:127.0.0.1:64020_h_lwq c:control_collection s:shard1 r:core_node1 x:collection1] o.a.s.u.RandomMergePolicy RandomMergePolicy wrapping class org.apache.lucene.index.AlcoholicMergePolicy: [AlcoholicMergePolicy: minMergeSize=0, mergeFactor=10, maxMergeSize=1115555145, maxMergeSizeForForcedMerge=9223372036854775807, calibrateSizeByDeletes=true, maxMergeDocs=2147483647, maxCFSSegmentSizeMB=8.796093022207999E12, noCFSRatio=0.1]
   [junit4]   2> 899453 INFO  (coreLoadExecutor-2307-thread-1-processing-n:127.0.0.1:64020_h_lwq) [n:127.0.0.1:64020_h_lwq c:control_collection s:shard1 r:core_node1 x:collection1] o.a.s.c.SolrDeletionPolicy SolrDeletionPolicy.onCommit: commits: num=1
   [junit4]   2> 	commit{dir=NRTCachingDirectory(SimpleFSDirectory@C:\Users\JenkinsSlave\workspace\Lucene-Solr-5.x-Windows\solr\build\solr-core\test\J1\temp\solr.schema.TestBulkSchemaConcurrent_678F586E284B0617-001\control-001\cores\collection1\data\index lockFactory=org.apache.lucene.store.SingleInstanceLockFactory@16820d7; maxCacheMB=48.0 maxMergeSizeMB=4.0),segFN=segments_1,generation=1}
   [junit4]   2> 899453 INFO  (coreLoadExecutor-2307-thread-1-processing-n:127.0.0.1:64020_h_lwq) [n:127.0.0.1:64020_h_lwq c:control_collection s:shard1 r:core_node1 x:collection1] o.a.s.c.SolrDeletionPolicy newest commit generation = 1
   [junit4]   2> 899454 INFO  (OldIndexDirectoryCleanupThreadForCore-collection1) [n:127.0.0.1:64020_h_lwq c:control_collection s:shard1 r:core_node1 x:collection1] o.a.s.c.SolrCore Looking for old index directories to cleanup for core collection1 in C:\Users\JenkinsSlave\workspace\Lucene-Solr-5.x-Windows\solr\build\solr-core\test\J1\..\..\..\..\..\..\..\..\..\Users\JenkinsSlave\workspace\Lucene-Solr-5.x-Windows\solr\build\solr-core\test\J1\temp\solr.schema.TestBulkSchemaConcurrent_678F586E284B0617-001\control-001\cores\collection1\data\
   [junit4]   2> 899455 INFO  (coreLoadExecutor-2307-thread-1-processing-n:127.0.0.1:64020_h_lwq) [n:127.0.0.1:64020_h_lwq c:control_collection s:shard1 r:core_node1 x:collection1] o.a.s.c.SolrCore no updateRequestProcessorChain defined as default, creating implicit default
   [junit4]   2> 899455 WARN  (coreLoadExecutor-2307-thread-1-processing-n:127.0.0.1:64020_h_lwq) [n:127.0.0.1:64020_h_lwq c:control_collection s:shard1 r:core_node1 x:collection1] o.a.s.c.RequestHandlers INVALID paramSet a in requestHandler {type = requestHandler,name = /dump,class = DumpRequestHandler,args = {defaults={a=A,b=B}}}
   [junit4]   2> 899465 INFO  (coreLoadExecutor-2307-thread-1-processing-n:127.0.0.1:64020_h_lwq) [n:127.0.0.1:64020_h_lwq c:control_collection s:shard1 r:core_node1 x:collection1] o.a.s.h.l.XMLLoader xsltCacheLifetimeSeconds=60
   [junit4]   2> 899467 INFO  (coreLoadExecutor-2307-thread-1-processing-n:127.0.0.1:64020_h_lwq) [n:127.0.0.1:64020_h_lwq c:control_collection s:shard1 r:core_node1 x:collection1] o.a.s.h.l.XMLLoader xsltCacheLifetimeSeconds=60
   [junit4]   2> 899468 INFO  (coreLoadExecutor-2307-thread-1-processing-n:127.0.0.1:64020_h_lwq) [n:127.0.0.1:64020_h_lwq c:control_collection s:shard1 r:core_node1 x:collection1] o.a.s.h.l.XMLLoader xsltCacheLifetimeSeconds=60
   [junit4]   2> 899470 INFO  (coreLoadExecutor-2307-thread-1-processing-n:127.0.0.1:64020_h_lwq) [n:127.0.0.1:64020_h_lwq c:control_collection s:shard1 r:core_node1 x:collection1] o.a.s.h.l.XMLLoader xsltCacheLifetimeSeconds=60
   [junit4]   2> 899471 INFO  (coreLoadExecutor-2307-thread-1-processing-n:127.0.0.1:64020_h_lwq) [n:127.0.0.1:64020_h_lwq c:control_collection s:shard1 r:core_node1 x:collection1] o.a.s.c.RequestHandlers Registered paths: /update/json/docs,/admin/logging,/update/csv,/dump,/config,/schema,/admin/mbeans,/admin/luke,/get,/admin/plugins,/admin/threads,/admin/system,/update/json,/admin/segments,/replication,/admin/ping,/admin/file,/admin/properties,/update,standard
   [junit4]   2> 899472 INFO  (coreLoadExecutor-2307-thread-1-processing-n:127.0.0.1:64020_h_lwq) [n:127.0.0.1:64020_h_lwq c:control_collection s:shard1 r:core_node1 x:collection1] o.a.s.c.SolrCore Using default statsCache cache: org.apache.solr.search.stats.LocalStatsCache
   [junit4]   2> 899473 INFO  (coreLoadExecutor-2307-thread-1-processing-n:127.0.0.1:64020_h_lwq) [n:127.0.0.1:64020_h_lwq c:control_collection s:shard1 r:core_node1 x:collection1] o.a.s.u.UpdateHandler Using UpdateLog implementation: org.apache.solr.update.UpdateLog
   [junit4]   2> 899473 INFO  (coreLoadExecutor-2307-thread-1-processing-n:127.0.0.1:64020_h_lwq) [n:127.0.0.1:64020_h_lwq c:control_collection s:shard1 r:core_node1 x:collection1] o.a.s.u.UpdateLog Initializing UpdateLog: dataDir= defaultSyncLevel=FLUSH numRecordsToKeep=100 maxNumLogsToKeep=10 numVersionBuckets=65536
   [junit4]   2> 899474 INFO  (coreLoadExecutor-2307-thread-1-processing-n:127.0.0.1:64020_h_lwq) [n:127.0.0.1:64020_h_lwq c:control_collection s:shard1 r:core_node1 x:collection1] o.a.s.u.CommitTracker Hard AutoCommit: disabled
   [junit4]   2> 899474 INFO  (coreLoadExecutor-2307-thread-1-processing-n:127.0.0.1:64020_h_lwq) [n:127.0.0.1:64020_h_lwq c:control_collection s:shard1 r:core_node1 x:collection1] o.a.s.u.CommitTracker Soft AutoCommit: disabled
   [junit4]   2> 899474 INFO  (coreLoadExecutor-2307-thread-1-processing-n:127.0.0.1:64020_h_lwq) [n:127.0.0.1:64020_h_lwq c:control_collection s:shard1 r:core_node1 x:collection1] o.a.s.u.RandomMergePolicy RandomMergePolicy wrapping class org.apache.lucene.index.TieredMergePolicy: [TieredMergePolicy: maxMergeAtOnce=14, maxMergeAtOnceExplicit=30, maxMergedSegmentMB=26.275390625, floorSegmentMB=0.787109375, forceMergeDeletesPctAllowed=21.893471854655516, segmentsPerTier=14.0, maxCFSSegmentSizeMB=8.796093022207999E12, noCFSRatio=0.35970816990066967
   [junit4]   2> 899475 INFO  (coreLoadExecutor-2307-thread-1-processing-n:127.0.0.1:64020_h_lwq) [n:127.0.0.1:64020_h_lwq c:control_collection s:shard1 r:core_node1 x:collection1] o.a.s.c.SolrDeletionPolicy SolrDeletionPolicy.onInit: commits: num=1
   [junit4]   2> 	commit{dir=NRTCachingDirectory(SimpleFSDirectory@C:\Users\JenkinsSlave\workspace\Lucene-Solr-5.x-Windows\solr\build\solr-core\test\J1\temp\solr.schema.TestBulkSchemaConcurrent_678F586E284B0617-001\control-001\cores\collection1\data\index lockFactory=org.apache.lucene.store.SingleInstanceLockFactory@16820d7; maxCacheMB=48.0 maxMergeSizeMB=4.0),segFN=segments_1,generation=1}
   [junit4]   2> 899475 INFO  (coreLoadExecutor-2307-thread-1-processing-n:127.0.0.1:64020_h_lwq) [n:127.0.0.1:64020_h_lwq c:control_collection s:shard1 r:core_node1 x:collection1] o.a.s.c.SolrDeletionPolicy newest commit generation = 1
   [junit4]   2> 899475 INFO  (coreLoadExecutor-2307-thread-1-processing-n:127.0.0.1:64020_h_lwq) [n:127.0.0.1:64020_h_lwq c:control_collection s:shard1 r:core_node1 x:collection1] o.a.s.s.SolrIndexSearcher Opening Searcher@1e7b114[collection1] main
   [junit4]   2> 899475 INFO  (coreLoadExecutor-2307-thread-1-processing-n:127.0.0.1:64020_h_lwq) [n:127.0.0.1:64020_h_lwq c:control_collection s:shard1 r:core_node1 x:collection1] o.a.s.c.c.ZkStateReader Load collection config from: [/collections/control_collection]
   [junit4]   2> 899476 INFO  (coreLoadExecutor-2307-thread-1-processing-n:127.0.0.1:64020_h_lwq) [n:127.0.0.1:64020_h_lwq c:control_collection s:shard1 r:core_node1 x:collection1] o.a.s.c.c.ZkStateReader path=[/collections/control_collection] [configName]=[conf1] specified config exists in ZooKeeper
   [junit4]   2> 899476 INFO  (coreLoadExecutor-2307-thread-1-processing-n:127.0.0.1:64020_h_lwq) [n:127.0.0.1:64020_h_lwq c:control_collection s:shard1 r:core_node1 x:collection1] o.a.s.r.ManagedResourceStorage Setting up ZooKeeper-based storage for the RestManager with znodeBase: /configs/conf1
   [junit4]   2> 899477 INFO  (coreLoadExecutor-2307-thread-1-processing-n:127.0.0.1:64020_h_lwq) [n:127.0.0.1:64020_h_lwq c:control_collection s:shard1 r:core_node1 x:collection1] o.a.s.r.ManagedResourceStorage Configured ZooKeeperStorageIO with znodeBase: /configs/conf1
   [junit4]   2> 899477 INFO  (coreLoadExecutor-2307-thread-1-processing-n:127.0.0.1:64020_h_lwq) [n:127.0.0.1:64020_h_lwq c:control_collection s:shard1 r:core_node1 x:collection1] o.a.s.r.RestManager Initializing RestManager with initArgs: {}
   [junit4]   2> 899477 INFO  (coreLoadExecutor-2307-thread-1-processing-n:127.0.0.1:64020_h_lwq) [n:127.0.0.1:64020_h_lwq c:control_collection s:shard1 r:core_node1 x:collection1] o.a.s.r.ManagedResourceStorage Reading _rest_managed.json using ZooKeeperStorageIO:path=/configs/conf1
   [junit4]   2> 899477 INFO  (coreLoadExecutor-2307-thread-1-processing-n:127.0.0.1:64020_h_lwq) [n:127.0.0.1:64020_h_lwq c:control_collection s:shard1 r:core_node1 x:collection1] o.a.s.r.ManagedResourceStorage No data found for znode /configs/conf1/_rest_managed.json
   [junit4]   2> 899477 INFO  (coreLoadExecutor-2307-thread-1-processing-n:127.0.0.1:64020_h_lwq) [n:127.0.0.1:64020_h_lwq c:control_collection s:shard1 r:core_node1 x:collection1] o.a.s.r.ManagedResourceStorage Loaded null at path _rest_managed.json using ZooKeeperStorageIO:path=/configs/conf1
   [junit4]   2> 899477 INFO  (coreLoadExecutor-2307-thread-1-processing-n:127.0.0.1:64020_h_lwq) [n:127.0.0.1:64020_h_lwq c:control_collection s:shard1 r:core_node1 x:collection1] o.a.s.r.RestManager Initializing 0 registered ManagedResources
   [junit4]   2> 899481 INFO  (coreLoadExecutor-2307-thread-1-processing-n:127.0.0.1:64020_h_lwq) [n:127.0.0.1:64020_h_lwq c:control_collection s:shard1 r:core_node1 x:collection1] o.a.s.s.ZkIndexSchemaReader Creating ZooKeeper watch for the managed schema at /configs/conf1/managed-schema
   [junit4]   2> 899484 INFO  (coreLoadExecutor-2307-thread-1-processing-n:127.0.0.1:64020_h_lwq) [n:127.0.0.1:64020_h_lwq c:control_collection s:shard1 r:core_node1 x:collection1] o.a.s.h.ReplicationHandler Commits will be reserved for  10000
   [junit4]   2> 899484 INFO  (coreLoadExecutor-2307-thread-1-processing-n:127.0.0.1:64020_h_lwq) [n:127.0.0.1:64020_h_lwq c:control_collection s:shard1 r:core_node1 x:collection1] o.a.s.u.UpdateLog Looking up max value of version field to seed version buckets
   [junit4]   2> 899484 INFO  (searcherExecutor-2308-thread-1-processing-n:127.0.0.1:64020_h_lwq x:collection1 c:control_collection r:core_node1 s:shard1) [n:127.0.0.1:64020_h_lwq c:control_collection s:shard1 r:core_node1 x:collection1] o.a.s.c.SolrCore [collection1] Registered new searcher Searcher@1e7b114[collection1] main{ExitableDirectoryReader(UninvertingDirectoryReader())}
   [junit4]   2> 899484 INFO  (coreLoadExecutor-2307-thread-1-processing-n:127.0.0.1:64020_h_lwq) [n:127.0.0.1:64020_h_lwq c:control_collection s:shard1 r:core_node1 x:collection1] o.a.s.u.VersionInfo Refreshing highest value of _version_ for 65536 version buckets from index
   [junit4]   2> 899484 INFO  (coreLoadExecutor-2307-thread-1-processing-n:127.0.0.1:64020_h_lwq) [n:127.0.0.1:64020_h_lwq c:control_collection s:shard1 r:core_node1 x:collection1] o.a.s.u.VersionInfo No terms found for _version_, cannot seed version bucket highest value from index
   [junit4]   2> 899484 INFO  (coreLoadExecutor-2307-thread-1-processing-n:127.0.0.1:64020_h_lwq) [n:127.0.0.1:64020_h_lwq c:control_collection s:shard1 r:core_node1 x:collection1] o.a.s.u.UpdateLog Could not find max version in index or recent updates, using new clock 1525254528699465728
   [junit4]   2> 899486 INFO  (coreLoadExecutor-2307-thread-1-processing-n:127.0.0.1:64020_h_lwq) [n:127.0.0.1:64020_h_lwq c:control_collection s:shard1 r:core_node1 x:collection1] o.a.s.u.UpdateLog Took 1.0ms to seed version buckets with highest version 1525254528699465728
   [junit4]   2> 899486 INFO  (coreLoadExecutor-2307-thread-1-processing-n:127.0.0.1:64020_h_lwq) [n:127.0.0.1:64020_h_lwq c:control_collection s:shard1 r:core_node1 x:collection1] o.a.s.c.ZkController watch zkdir /configs/conf1
   [junit4]   2> 899486 INFO  (coreLoadExecutor-2307-thread-1-processing-n:127.0.0.1:64020_h_lwq) [n:127.0.0.1:64020_h_lwq c:control_collection s:shard1 r:core_node1 x:collection1] o.a.s.c.CoreContainer registering core: collection1
   [junit4]   2> 899487 INFO  (coreZkRegister-2301-thread-1-processing-n:127.0.0.1:64020_h_lwq x:collection1 c:control_collection r:core_node1 s:shard1) [n:127.0.0.1:64020_h_lwq c:control_collection s:shard1 r:core_node1 x:collection1] o.a.s.c.ZkController Register replica - core:collection1 address:http://127.0.0.1:64020/h_lwq collection:control_collection shard:shard1
   [junit4]   2> 899488 INFO  (coreZkRegister-2301-thread-1-processing-n:127.0.0.1:64020_h_lwq x:collection1 c:control_collection r:core_node1 s:shard1) [n:127.0.0.1:64020_h_lwq c:control_collection s:shard1 r:core_node1 x:collection1] o.a.s.c.c.SolrZkClient makePath: /collections/control_collection/leader_elect/shard1/election
   [junit4]   2> 899492 INFO  (coreZkRegister-2301-thread-1-processing-n:127.0.0.1:64020_h_lwq x:collection1 c:control_collection r:core_node1 s:shard1) [n:127.0.0.1:64020_h_lwq c:control_collection s:shard1 r:core_node1 x:collection1] o.a.s.c.LeaderElector Joined leadership election with path: /collections/control_collection/leader_elect/shard1/election/95328407904256004-core_node1-n_0000000000
   [junit4]   2> 899493 INFO  (coreZkRegister-2301-thread-1-processing-n:127.0.0.1:64020_h_lwq x:collection1 c:control_collection r:core_node1 s:shard1) [n:127.0.0.1:64020_h_lwq c:control_collection s:shard1 r:core_node1 x:collection1] o.a.s.c.ShardLeaderElectionContext Running the leader process for shard=shard1 and weAreReplacement=false and leaderVoteWait=10000
   [junit4]   2> 899495 INFO  (coreZkRegister-2301-thread-1-processing-n:127.0.0.1:64020_h_lwq x:collection1 c:control_collection r:core_node1 s:shard1) [n:127.0.0.1:64020_h_lwq c:control_collection s:shard1 r:core_node1 x:collection1] o.a.s.c.ShardLeaderElectionContext Enough replicas found to continue.
   [junit4]   2> 899495 INFO  (coreZkRegister-2301-thread-1-processing-n:127.0.0.1:64020_h_lwq x:collection1 c:control_collection r:core_node1 s:shard1) [n:127.0.0.1:64020_h_lwq c:control_collection s:shard1 r:core_node1 x:collection1] o.a.s.c.ShardLeaderElectionContext I may be the new leader - try and sync
   [junit4]   2> 899495 INFO  (coreZkRegister-2301-thread-1-processing-n:127.0.0.1:64020_h_lwq x:collection1 c:control_collection r:core_node1 s:shard1) [n:127.0.0.1:64020_h_lwq c:control_collection s:shard1 r:core_node1 x:collection1] o.a.s.c.SyncStrategy Sync replicas to http://127.0.0.1:64020/h_lwq/collection1/
   [junit4]   2> 899495 INFO  (coreZkRegister-2301-thread-1-processing-n:127.0.0.1:64020_h_lwq x:collection1 c:control_collection r:core_node1 s:shard1) [n:127.0.0.1:64020_h_lwq c:control_collection s:shard1 r:core_node1 x:collection1] o.a.s.c.SyncStrategy Sync Success - now sync replicas to me
   [junit4]   2> 899495 INFO  (coreZkRegister-2301-thread-1-processing-n:127.0.0.1:64020_h_lwq x:collection1 c:control_collection r:core_node1 s:shard1) [n:127.0.0.1:64020_h_lwq c:control_collection s:shard1 r:core_node1 x:collection1] o.a.s.c.SyncStrategy http://127.0.0.1:64020/h_lwq/collection1/ has no replicas
   [junit4]   2> 899495 INFO  (OverseerStateUpdate-95328407904256004-127.0.0.1:64020_h_lwq-n_0000000000) [n:127.0.0.1:64020_h_lwq    ] o.a.s.c.Overseer processMessage: queueSize: 1, message = {
   [junit4]   2>   "operation":"leader",
   [junit4]   2>   "shard":"shard1",
   [junit4]   2>   "collection":"control_collection"} current state version: 1
   [junit4]   2> 899497 INFO  (coreZkRegister-2301-thread-1-processing-n:127.0.0.1:64020_h_lwq x:collection1 c:control_collection r:core_node1 s:shard1) [n:127.0.0.1:64020_h_lwq c:control_collection s:shard1 r:core_node1 x:collection1] o.a.s.c.c.SolrZkClient makePath: /collections/control_collection/leaders/shard1
   [junit4]   2> 899497 INFO  (zkCallback-710-thread-1-processing-n:127.0.0.1:64020_h_lwq) [n:127.0.0.1:64020_h_lwq    ] o.a.s.c.c.ZkStateReader A cluster state change: [WatchedEvent state:SyncConnected type:NodeDataChanged path:/clusterstate.json], has occurred - updating... (live nodes size: [1])
   [junit4]   2> 899500 INFO  (coreZkRegister-2301-thread-1-processing-n:127.0.0.1:64020_h_lwq x:collection1 c:control_collection r:core_node1 s:shard1) [n:127.0.0.1:64020_h_lwq c:control_collection s:shard1 r:core_node1 x:collection1] o.a.s.c.ShardLeaderElectionContextBase Creating leader registration node
   [junit4]   2> 899502 INFO  (coreZkRegister-2301-thread-1-processing-n:127.0.0.1:64020_h_lwq x:collection1 c:control_collection r:core_node1 s:shard1) [n:127.0.0.1:64020_h_lwq c:control_collection s:shard1 r:core_node1 x:collection1] o.a.s.c.ShardLeaderElectionContext I am the new leader: http://127.0.0.1:64020/h_lwq/collection1/ shard1
   [junit4]   2> 899503 INFO  (OverseerStateUpdate-95328407904256004-127.0.0.1:64020_h_lwq-n_0000000000) [n:127.0.0.1:64020_h_lwq    ] o.a.s.c.Overseer processMessage: queueSize: 1, message = {
   [junit4]   2>   "operation":"leader",
   [junit4]   2>   "shard":"shard1",
   [junit4]   2>   "collection":"control_collection",
   [junit4]   2>   "base_url":"http://127.0.0.1:64020/h_lwq",
   [junit4]   2>   "core":"collection1",
   [junit4]   2>   "state":"active"} current state version: 2
   [junit4]   2> 899604 INFO  (zkCallback-710-thread-1-processing-n:127.0.0.1:64020_h_lwq) [n:127.0.0.1:64020_h_lwq    ] o.a.s.c.c.ZkStateReader A cluster state change: [WatchedEvent state:SyncConnected type:NodeDataChanged path:/clusterstate.json], has occurred - updating... (live nodes size: [1])
   [junit4]   2> 899651 INFO  (coreZkRegister-2301-thread-1-processing-n:127.0.0.1:64020_h_lwq x:collection1 c:control_collection r:core_node1 s:shard1) [n:127.0.0.1:64020_h_lwq c:control_collection s:shard1 r:core_node1 x:collection1] o.a.s.c.ZkController We are http://127.0.0.1:64020/h_lwq/collection1/ and leader is http://127.0.0.1:64020/h_lwq/collection1/
   [junit4]   2> 899651 INFO  (coreZkRegister-2301-thread-1-processing-n:127.0.0.1:64020_h_lwq x:collection1 c:control_collection r:core_node1 s:shard1) [n:127.0.0.1:64020_h_lwq c:control_collection s:shard1 r:core_node1 x:collection1] o.a.s.c.ZkController No LogReplay needed for core=collection1 baseURL=http://127.0.0.1:64020/h_lwq
   [junit4]   2> 899651 INFO  (coreZkRegister-2301-thread-1-processing-n:127.0.0.1:64020_h_lwq x:collection1 c:control_collection r:core_node1 s:shard1) [n:127.0.0.1:64020_h_lwq c:control_collection s:shard1 r:core_node1 x:collection1] o.a.s.c.ZkController I am the leader, no recovery necessary
   [junit4]   2> 899651 INFO  (coreZkRegister-2301-thread-1-processing-n:127.0.0.1:64020_h_lwq x:collection1 c:control_collection r:core_node1 s:shard1) [n:127.0.0.1:64020_h_lwq c:control_collection s:shard1 r:core_node1 x:collection1] o.a.s.c.ZkController publishing state=active
   [junit4]   2> 899651 INFO  (coreZkRegister-2301-thread-1-processing-n:127.0.0.1:64020_h_lwq x:collection1 c:control_collection r:core_node1 s:shard1) [n:127.0.0.1:64020_h_lwq c:control_collection s:shard1 r:core_node1 x:collection1] o.a.s.c.ZkController numShards not found on descriptor - reading it from system property
   [junit4]   2> 899652 INFO  (OverseerStateUpdate-95328407904256004-127.0.0.1:64020_h_lwq-n_0000000000) [n:127.0.0.1:64020_h_lwq    ] o.a.s.c.Overseer processMessage: queueSize: 1, message = {
   [junit4]   2>   "node_name":"127.0.0.1:64020_h_lwq",
   [junit4]   2>   "core":"collection1",
   [junit4]   2>   "numShards":"1",
   [junit4]   2>   "roles":null,
   [junit4]   2>   "state":"active",
   [junit4]   2>   "base_url":"http://127.0.0.1:64020/h_lwq",
   [junit4]   2>   "collection":"control_collection",
   [junit4]   2>   "core_node_name":"core_node1",
   [junit4]   2>   "operation":"state",
   [junit4]   2>   "shard":"shard1"} current state version: 3
   [junit4]   2> 899652 INFO  (OverseerStateUpdate-95328407904256004-127.0.0.1:64020_h_lwq-n_0000000000) [n:127.0.0.1:64020_h_lwq    ] o.a.s.c.o.ReplicaMutator Update state numShards=1 message={
   [junit4]   2>   "node_name":"127.0.0.1:64020_h_lwq",
   [junit4]   2>   "core":"collection1",
   [junit4]   2>   "numShards":"1",
   [junit4]   2>   "roles":null,
   [junit4]   2>   "state":"active",
   [junit4]   2>   "base_url":"http://127.0.0.1:64020/h_lwq",
   [junit4]   2>   "collection":"control_collection",
   [junit4]   2>   "core_node_name":"core_node1",
   [junit4]   2>   "operation":"state",
   [junit4]   2>   "shard":"shard1"}
   [junit4]   2> 899752 INFO  (zkCallback-710-thread-1-processing-n:127.0.0.1:64020_h_lwq) [n:127.0.0.1:64020_h_lwq    ] o.a.s.c.c.ZkStateReader A cluster state change: [WatchedEvent state:SyncConnected type:NodeDataChanged path:/clusterstate.json], has occurred - updating... (live nodes size: [1])
   [junit4]   2> 899935 INFO  (TEST-TestBulkSchemaConcurrent.test-seed#[678F586E284B0617]) [    ] o.a.s.c.c.SolrZkClient Using default ZkCredentialsProvider
   [junit4]   2> 899937 INFO  (TEST-TestBulkSchemaConcurrent.test-seed#[678F586E284B0617]) [    ] o.a.s.c.c.ConnectionManager Waiting for client to connect to ZooKeeper
   [junit4]   2> 899938 INFO  (zkCallback-712-thread-1) [    ] o.a.s.c.c.ConnectionManager Watcher org.apache.solr.common.cloud.ConnectionManager@2df2c9 name:ZooKeeperConnection Watcher:127.0.0.1:64013/solr got event WatchedEvent state:SyncConnected type:None path:null path:null type:None
   [junit4]   2> 899938 INFO  (TEST-TestBulkSchemaConcurrent.test-seed#[678F586E284B0617]) [    ] o.a.s.c.c.ConnectionManager Client is connected to ZooKeeper
   [junit4]   2> 899939 INFO  (TEST-TestBulkSchemaConcurrent.test-seed#[678F586E284B0617]) [    ] o.a.s.c.c.SolrZkClient Using default ZkACLProvider
   [junit4]   2> 899939 INFO  (TEST-TestBulkSchemaConcurrent.test-seed#[678F586E284B0617]) [    ] o.a.s.c.c.ZkStateReader Updating cluster state from ZooKeeper... 
   [junit4]   2> 899942 INFO  (TEST-TestBulkSchemaConcurrent.test-seed#[678F586E284B0617]) [    ] o.a.s.c.ChaosMonkey monkey: init - expire sessions:false cause connection loss:false
   [junit4]   2> 900396 INFO  (TEST-TestBulkSchemaConcurrent.test-seed#[678F586E284B0617]) [    ] o.a.s.SolrTestCaseJ4 Writing core.properties file to C:\Users\JenkinsSlave\workspace\Lucene-Solr-5.x-Windows\solr\build\solr-core\test\J1\temp\solr.schema.TestBulkSchemaConcurrent_678F586E284B0617-001\shard-1-001\cores\collection1
   [junit4]   2> 900399 INFO  (TEST-TestBulkSchemaConcurrent.test-seed#[678F586E284B0617]) [    ] o.a.s.c.AbstractFullDistribZkTestBase create jetty 1 in directory C:\Users\JenkinsSlave\workspace\Lucene-Solr-5.x-Windows\solr\build\solr-core\test\J1\temp\solr.schema.TestBulkSchemaConcurrent_678F586E284B0617-001\shard-1-001
   [junit4]   2> 900399 INFO  (TEST-TestBulkSchemaConcurrent.test-seed#[678F586E284B0617]) [    ] o.e.j.s.Server jetty-9.2.13.v20150730
   [junit4]   2> 900402 INFO  (TEST-TestBulkSchemaConcurrent.test-seed#[678F586E284B0617]) [    ] o.e.j.s.h.ContextHandler Started o.e.j.s.ServletContextHandler@1bdbe34{/h_lwq,null,AVAILABLE}
   [junit4]   2> 900402 INFO  (TEST-TestBulkSchemaConcurrent.test-seed#[678F586E284B0617]) [    ] o.e.j.s.ServerConnector Started ServerConnector@125419{HTTP/1.1}{127.0.0.1:64035}
   [junit4]   2> 900403 INFO  (TEST-TestBulkSchemaConcurrent.test-seed#[678F586E284B0617]) [    ] o.e.j.s.Server Started @904334ms
   [junit4]   2> 900403 INFO  (TEST-TestBulkSchemaConcurrent.test-seed#[678F586E284B0617]) [    ] o.a.s.c.s.e.JettySolrRunner Jetty properties: {solr.data.dir=C:\Users\JenkinsSlave\workspace\Lucene-Solr-5.x-Windows\solr\build\solr-core\test\J1\temp\solr.schema.TestBulkSchemaConcurrent_678F586E284B0617-001\tempDir-001/jetty1, hostContext=/h_lwq, hostPort=64035, solrconfig=solrconfig.xml, coreRootDirectory=C:\Users\JenkinsSlave\workspace\Lucene-Solr-5.x-Windows\solr\build\solr-core\test\J1\temp\solr.schema.TestBulkSchemaConcurrent_678F586E284B0617-001\shard-1-001\cores}
   [junit4]   2> 900403 INFO  (TEST-TestBulkSchemaConcurrent.test-seed#[678F586E284B0617]) [    ] o.a.s.s.SolrDispatchFilter SolrDispatchFilter.init(): sun.misc.Launcher$AppClassLoader@1db04ed
   [junit4]   2> 900403 INFO  (TEST-TestBulkSchemaConcurrent.test-seed#[678F586E284B0617]) [    ] o.a.s.c.SolrResourceLoader new SolrResourceLoader for directory: 'C:\Users\JenkinsSlave\workspace\Lucene-Solr-5.x-Windows\solr\build\solr-core\test\J1\temp\solr.schema.TestBulkSchemaConcurrent_678F586E284B0617-001\shard-1-001'
   [junit4]   2> 900403 INFO  (TEST-TestBulkSchemaConcurrent.test-seed#[678F586E284B0617]) [    ] o.a.s.c.SolrResourceLoader JNDI not configured for solr (NoInitialContextEx)
   [junit4]   2> 900403 INFO  (TEST-TestBulkSchemaConcurrent.test-seed#[678F586E284B0617]) [    ] o.a.s.c.SolrResourceLoader solr home defaulted to 'solr/' (could not find system property or JNDI)
   [junit4]   2> 900404 INFO  (TEST-TestBulkSchemaConcurrent.test-seed#[678F586E284B0617]) [    ] o.a.s.c.c.SolrZkClient Using default ZkCredentialsProvider
   [junit4]   2> 900405 INFO  (TEST-TestBulkSchemaConcurrent.test-seed#[678F586E284B0617]) [    ] o.a.s.c.c.ConnectionManager Waiting for client to connect to ZooKeeper
   [junit4]   2> 900406 INFO  (zkCallback-713-thread-1) [    ] o.a.s.c.c.ConnectionManager Watcher org.apache.solr.common.cloud.ConnectionManager@1b44e1e name:ZooKeeperConnection Watcher:127.0.0.1:64013/solr got event WatchedEvent state:SyncConnected type:None path:null path:null type:None
   [junit4]   2> 900406 INFO  (TEST-TestBulkSchemaConcurrent.test-seed#[678F586E284B0617]) [    ] o.a.s.c.c.ConnectionManager Client is connected to ZooKeeper
   [junit4]   2> 900407 INFO  (TEST-TestBulkSchemaConcurrent.test-seed#[678F586E284B0617]) [    ] o.a.s.c.c.SolrZkClient Using default ZkACLProvider
   [junit4]   2> 900408 INFO  (TEST-TestBulkSchemaConcurrent.test-seed#[678F586E284B0617]) [    ] o.a.s.s.SolrDispatchFilter Loading solr.xml from SolrHome (not found in ZooKeeper)
   [junit4]   2> 900408 INFO  (TEST-TestBulkSchemaConcurrent.test-seed#[678F586E284B0617]) [    ] o.a.s.c.SolrXmlConfig Loading container configuration from C:\Users\JenkinsSlave\workspace\Lucene-Solr-5.x-Windows\solr\build\solr-core\test\J1\temp\solr.schema.TestBulkSchemaConcurrent_678F586E284B0617-001\shard-1-001\solr.xml
   [junit4]   2> 900409 WARN  (NIOServerCxn.Factory:0.0.0.0/0.0.0.0:0) [    ] o.a.z.s.NIOServerCnxn caught end of stream exception
   [junit4]   2> EndOfStreamException: Unable to read additional data from client sessionid 0x152acae92230006, likely client has closed socket
   [junit4]   2> 	at org.apache.zookeeper.server.NIOServerCnxn.doIO(NIOServerCnxn.java:228)
   [junit4]   2> 	at org.apache.zookeeper.server.NIOServerCnxnFactory.run(NIOServerCnxnFactory.java:208)
   [junit4]   2> 	at java.lang.Thread.run(Thread.java:745)
   [junit4]   2> 900452 INFO  (TEST-TestBulkSchemaConcurrent.test-seed#[678F586E284B0617]) [    ] o.a.s.c.CorePropertiesLocator Config-defined core root directory: C:\Users\JenkinsSlave\workspace\Lucene-Solr-5.x-Windows\solr\build\solr-core\test\J1\temp\solr.schema.TestBulkSchemaConcurrent_678F586E284B0617-001\shard-1-001\cores
   [junit4]   2> 900452 INFO  (TEST-TestBulkSchemaConcurrent.test-seed#[678F586E284B0617]) [    ] o.a.s.c.CoreContainer New CoreContainer 32249708
   [junit4]   2> 900452 INFO  (TEST-TestBulkSchemaConcurrent.test-seed#[678F586E284B0617]) [    ] o.a.s.c.CoreContainer Loading cores into CoreContainer [instanceDir=C:\Users\JenkinsSlave\workspace\Lucene-Solr-5.x-Windows\solr\build\solr-core\test\J1\temp\solr.schema.TestBulkSchemaConcurrent_678F586E284B0617-001\shard-1-001]
   [junit4]   2> 900452 WARN  (TEST-TestBulkSchemaConcurrent.test-seed#[678F586E284B0617]) [    ] o.a.s.c.CoreContainer Couldn't add files from C:\Users\JenkinsSlave\workspace\Lucene-Solr-5.x-Windows\solr\build\solr-core\test\J1\temp\solr.schema.TestBulkSchemaConcurrent_678F586E284B0617-001\shard-1-001\lib to classpath: C:\Users\JenkinsSlave\workspace\Lucene-Solr-5.x-Windows\solr\build\solr-core\test\J1\temp\solr.schema.TestBulkSchemaConcurrent_678F586E284B0617-001\shard-1-001\lib
   [junit4]   2> 900452 INFO  (TEST-TestBulkSchemaConcurrent.test-seed#[678F586E284B0617]) [    ] o.a.s.h.c.HttpShardHandlerFactory created with socketTimeout : 90000,urlScheme : ,connTimeout : 15000,maxConnectionsPerHost : 20,maxConnections : 10000,corePoolSize : 0,maximumPoolSize : 2147483647,maxThreadIdleTime : 5,sizeOfQueue : -1,fairnessPolicy : false,useRetries : false,
   [junit4]   2> 900455 INFO  (TEST-TestBulkSchemaConcurrent.test-seed#[678F586E284B0617]) [    ] o.a.s.u.UpdateShardHandler Creating UpdateShardHandler HTTP client with params: socketTimeout=340000&connTimeout=45000&retry=true
   [junit4]   2> 900456 INFO  (TEST-TestBulkSchemaConcurrent.test-seed#[678F586E284B0617]) [    ] o.a.s.l.LogWatcher SLF4J impl is org.slf4j.impl.Log4jLoggerFactory
   [junit4]   2> 900456 INFO  (TEST-TestBulkSchemaConcurrent.test-seed#[678F586E284B0617]) [    ] o.a.s.l.LogWatcher Registering Log Listener [Log4j (org.slf4j.impl.Log4jLoggerFactory)]
   [junit4]   2> 900456 INFO  (TEST-TestBulkSchemaConcurrent.test-seed#[678F586E284B0617]) [    ] o.a.s.c.ZkContainer Zookeeper client=127.0.0.1:64013/solr
   [junit4]   2> 900456 INFO  (TEST-TestBulkSchemaConcurrent.test-seed#[678F586E284B0617]) [    ] o.a.s.c.ZkController zkHost includes chroot
   [junit4]   2> 900456 INFO  (TEST-TestBulkSchemaConcurrent.test-seed#[678F586E284B0617]) [    ] o.a.s.c.c.SolrZkClient Using default ZkCredentialsProvider
   [junit4]   2> 900459 INFO  (TEST-TestBulkSchemaConcurrent.test-seed#[678F586E284B0617]) [    ] o.a.s.c.c.ConnectionManager Waiting for client to connect to ZooKeeper
   [junit4]   2> 900460 INFO  (zkCallback-716-thread-1) [    ] o.a.s.c.c.ConnectionManager Watcher org.apache.solr.common.cloud.ConnectionManager@35c28 name:ZooKeeperConnection Watcher:127.0.0.1:64013 got event WatchedEvent state:SyncConnected type:None path:null path:null type:None
   [junit4]   2> 900461 INFO  (TEST-TestBulkSchemaConcurrent.test-seed#[678F586E284B0617]) [    ] o.a.s.c.c.ConnectionManager Client is connected to ZooKeeper
   [junit4]   2> 900461 INFO  (TEST-TestBulkSchemaConcurrent.test-seed#[678F586E284B0617]) [    ] o.a.s.c.c.SolrZkClient Using default ZkACLProvider
   [junit4]   2> 900462 WARN  (NIOServerCxn.Factory:0.0.0.0/0.0.0.0:0) [    ] o.a.z.s.NIOServerCnxn caught end of stream exception
   [junit4]   2> EndOfStreamException: Unable to read additional data from client sessionid 0x152acae92230007, likely client has closed socket
   [junit4]   2> 	at org.apache.zookeeper.server.NIOServerCnxn.doIO(NIOServerCnxn.java:228)
   [junit4]   2> 	at org.apache.zookeeper.server.NIOServerCnxnFactory.run(NIOServerCnxnFactory.java:208)
   [junit4]   2> 	at java.lang.Thread.run(Thread.java:745)
   [junit4]   2> 900464 INFO  (TEST-TestBulkSchemaConcurrent.test-seed#[678F586E284B0617]) [n:127.0.0.1:64035_h_lwq    ] o.a.s.c.c.ConnectionManager Waiting for client to connect to ZooKeeper
   [junit4]   2> 900466 INFO  (zkCallback-717-thread-1-processing-n:127.0.0.1:64035_h_lwq) [n:127.0.0.1:64035_h_lwq    ] o.a.s.c.c.ConnectionManager Watcher org.apache.solr.common.cloud.ConnectionManager@1e85dd0 name:ZooKeeperConnection Watcher:127.0.0.1:64013/solr got event WatchedEvent state:SyncConnected type:None path:null path:null type:None
   [junit4]   2> 900466 INFO  (TEST-TestBulkSchemaConcurrent.test-seed#[678F586E284B0617]) [n:127.0.0.1:64035_h_lwq    ] o.a.s.c.c.ConnectionManager Client is connected to ZooKeeper
   [junit4]   2> 900474 INFO  (TEST-TestBulkSchemaConcurrent.test-seed#[678F586E284B0617]) [n:127.0.0.1:64035_h_lwq    ] o.a.s.c.c.ZkStateReader Updating cluster state from ZooKeeper... 
   [junit4]   2> 901453 INFO  (TEST-TestBulkSchemaConcurrent.test-seed#[678F586E284B0617]) [n:127.0.0.1:64035_h_lwq    ] o.a.s.c.ZkController Register node as live in ZooKeeper:/live_nodes/127.0.0.1:64035_h_lwq
   [junit4]   2> 901454 INFO  (TEST-TestBulkSchemaConcurrent.test-seed#[678F586E284B0617]) [n:127.0.0.1:64035_h_lwq    ] o.a.s.c.c.SolrZkClient makePath: /live_nodes/127.0.0.1:64035_h_lwq
   [junit4]   2> 901456 INFO  (zkCallback-712-thread-1) [    ] o.a.s.c.c.ZkStateReader A live node change: [WatchedEvent state:SyncConnected type:NodeChildrenChanged path:/live_nodes], has occurred - updating... (live nodes size: [1])
   [junit4]   2> 901456 INFO  (zkCallback-717-thread-1-processing-n:127.0.0.1:64035_h_lwq) [n:127.0.0.1:64035_h_lwq    ] o.a.s.c.c.ZkStateReader A live node change: [WatchedEvent state:SyncConnected type:NodeChildrenChanged path:/live_nodes], has occurred - updating... (live nodes size: [1])
   [junit4]   2> 901456 INFO  (zkCallback-710-thread-1-processing-n:127.0.0.1:64020_h_lwq) [n:127.0.0.1:64020_h_lwq    ] o.a.s.c.c.ZkStateReader A live node change: [WatchedEvent state:SyncConnected type:NodeChildrenChanged path:/live_nodes], has occurred - updating... (live nodes size: [1])
   [junit4]   2> 901458 INFO  (TEST-TestBulkSchemaConcurrent.test-seed#[678F586E284B0617]) [n:127.0.0.1:64035_h_lwq    ] o.a.s.c.Overseer Overseer (id=null) closing
   [junit4]   2> 901460 INFO  (TEST-TestBulkSchemaConcurrent.test-seed#[678F586E284B0617]) [n:127.0.0.1:64035_h_lwq    ] o.a.s.c.LeaderElector Joined leadership election with path: /overseer_elect/election/95328407904256008-127.0.0.1:64035_h_lwq-n_0000000001
   [junit4]   2> 901461 INFO  (TEST-TestBulkSchemaConcurrent.test-seed#[678F586E284B0617]) [n:127.0.0.1:64035_h_lwq    ] o.a.s.c.LeaderElector Watching path /overseer_elect/election/95328407904256004-127.0.0.1:64020_h_lwq-n_0000000000 to know if I could be the leader
   [junit4]   2> 901492 INFO  (TEST-TestBulkSchemaConcurrent.test-seed#[678F586E284B0617]) [n:127.0.0.1:64035_h_lwq    ] o.a.s.c.CoreContainer Security conf doesn't exist. Skipping setup for authorization module.
   [junit4]   2> 901492 INFO  (TEST-TestBulkSchemaConcurrent.test-seed#[678F586E284B0617]) [n:127.0.0.1:64035_h_lwq    ] o.a.s.c.CoreContainer No authentication plugin used.
   [junit4]   2> 901496 INFO  (TEST-TestBulkSchemaConcurrent.test-seed#[678F586E284B0617]) [n:127.0.0.1:64035_h_lwq    ] o.a.s.c.CorePropertiesLocator Looking for core definitions underneath C:\Users\JenkinsSlave\workspace\Lucene-Solr-5.x-Windows\solr\build\solr-core\test\J1\temp\solr.schema.TestBulkSchemaConcurrent_678F586E284B0617-001\shard-1-001\cores
   [junit4]   2> 901499 INFO  (TEST-TestBulkSchemaConcurrent.test-seed#[678F586E284B0617]) [n:127.0.0.1:64035_h_lwq    ] o.a.s.c.CoreDescriptor Created CoreDescriptor: {configSetProperties=configsetprops.json, schema=schema.xml, loadOnStartup=true, collection=collection1, name=collection1, config=solrconfig.xml, coreNodeName=, dataDir=data\, shard=, transient=false}
   [junit4]   2> 901499 INFO  (TEST-TestBulkSchemaConcurrent.test-seed#[678F586E284B0617]) [n:127.0.0.1:64035_h_lwq    ] o.a.s.c.CorePropertiesLocator Found core collection1 in C:\Users\JenkinsSlave\workspace\Lucene-Solr-5.x-Windows\solr\build\solr-core\test\J1\temp\solr.schema.TestBulkSchemaConcurrent_678F586E284B0617-001\shard-1-001\cores\collection1
   [junit4]   2> 901499 INFO  (TEST-TestBulkSchemaConcurrent.test-seed#[678F586E284B0617]) [n:127.0.0.1:64035_h_lwq    ] o.a.s.c.CorePropertiesLocator Found 1 core definitions
   [junit4]   2> 901501 INFO  (TEST-TestBulkSchemaConcurrent.test-seed#[678F586E284B0617]) [n:127.0.0.1:64035_h_lwq    ] o.a.s.s.SolrDispatchFilter user.dir=C:\Users\JenkinsSlave\workspace\Lucene-Solr-5.x-Windows\solr\build\solr-core\test\J1
   [junit4]   2> 901501 INFO  (TEST-TestBulkSchemaConcurrent.test-seed#[678F586E284B0617]) [n:127.0.0.1:64035_h_lwq    ] o.a.s.s.SolrDispatchFilter SolrDispatchFilter.init() done
   [junit4]   2> 901501 INFO  (coreLoadExecutor-2318-thread-1-processing-n:127.0.0.1:64035_h_lwq) [n:127.0.0.1:64035_h_lwq c:collection1   x:collection1] o.a.s.c.ZkController publishing state=down
   [junit4]   2> 901501 INFO  (coreLoadExecutor-2318-thread-1-processing-n:127.0.0.1:64035_h_lwq) [n:127.0.0.1:64035_h_lwq c:collection1   x:collection1] o.a.s.c.ZkController numShards not found on descriptor - reading it from system property
   [junit4]   2> 901503 INFO  (coreLoadExecutor-2318-thread-1-processing-n:127.0.0.1:64035_h_lwq) [n:127.0.0.1:64035_h_lwq c:collection1   x:collection1] o.a.s.c.ZkController look for our core node name
   [junit4]   2> 901503 INFO  (OverseerStateUpdate-95328407904256004-127.0.0.1:64020_h_lwq-n_0000000000) [n:127.0.0.1:64020_h_lwq    ] o.a.s.c.Overseer processMessage: queueSize: 1, message = {
   [junit4]   2>   "node_name":"127.0.0.1:64035_h_lwq",
   [junit4]   2>   "core":"collection1",
   [junit4]   2>   "numShards":"2",
   [junit4]   2>   "roles":null,
   [junit4]   2>   "state":"down",
   [junit4]   2>   "base_url":"http://127.0.0.1:64035/h_lwq",
   [junit4]   2>   "collection":"collection1",
   [junit4]   2>   "operation":"state",
   [junit4]   2>   "shard":null} current state version: 4
   [junit4]   2> 901504 INFO  (OverseerStateUpdate-95328407904256004-127.0.0.1:64020_h_lwq-n_0000000000) [n:127.0.0.1:64020_h_lwq    ] o.a.s.c.o.ReplicaMutator Update state numShards=2 message={
   [junit4]   2>   "node_name":"127.0.0.1:64035_h_lwq",
   [junit4]   2>   "core":"collection1",
   [junit4]   2>   "numShards":"2",
   [junit4]   2>   "roles":null,
   [junit4]   2>   "state":"down",
   [junit4]   2>   "base_url":"http://127.0.0.1:64035/h_lwq",
   [junit4]   2>   "collection":"collection1",
   [junit4]   2>   "operation":"state",
   [junit4]   2>   "shard":null}
   [junit4]   2> 901504 INFO  (OverseerStateUpdate-95328407904256004-127.0.0.1:64020_h_lwq-n_0000000000) [n:127.0.0.1:64020_h_lwq    ] o.a.s.c.o.ClusterStateMutator building a new cName: collection1
   [junit4]   2> 901504 INFO  (OverseerStateUpdate-95328407904256004-127.0.0.1:64020_h_lwq-n_0000000000) [n:127.0.0.1:64020_h_lwq    ] o.a.s.c.o.ReplicaMutator Assigning new node to shard shard=shard2
   [junit4]   2> 901506 INFO  (zkCallback-712-thread-1) [    ] o.a.s.c.c.ZkStateReader A cluster state change: [WatchedEvent state:SyncConnected type:NodeDataChanged path:/clusterstate.json], has occurred - updating... (live nodes size: [2])
   [junit4]   2> 901506 INFO  (zkCallback-717-thread-1-processing-n:127.0.0.1:64035_h_lwq) [n:127.0.0.1:64035_h_lwq    ] o.a.s.c.c.ZkStateReader A cluster state change: [WatchedEvent state:SyncConnected type:NodeDataChanged path:/clusterstate.json], has occurred - updating... (live nodes size: [2])
   [junit4]   2> 901506 INFO  (zkCallback-710-thread-1-processing-n:127.0.0.1:64020_h_lwq) [n:127.0.0.1:64020_h_lwq    ] o.a.s.c.c.ZkStateReader A cluster state change: [WatchedEvent state:SyncConnected type:NodeDataChanged path:/clusterstate.json], has occurred - updating... (live nodes size: [2])
   [junit4]   2> 902504 INFO  (coreLoadExecutor-2318-thread-1-processing-n:127.0.0.1:64035_h_lwq) [n:127.0.0.1:64035_h_lwq c:collection1   x:collection1] o.a.s.c.ZkController waiting to find shard id in clusterstate for collection1
   [junit4]   2> 902504 INFO  (coreLoadExecutor-2318-thread-1-processing-n:127.0.0.1:64035_h_lwq) [n:127.0.0.1:64035_h_lwq c:collection1   x:collection1] o.a.s.c.ZkController Check for collection zkNode:collection1
   [junit4]   2> 902505 INFO  (coreLoadExecutor-2318-thread-1-processing-n:127.0.0.1:64035_h_lwq) [n:127.0.0.1:64035_h_lwq c:collection1   x:collection1] o.a.s.c.ZkController Collection zkNode exists
   [junit4]   2> 902505 INFO  (coreLoadExecutor-2318-thread-1-processing-n:127.0.0.1:64035_h_lwq) [n:127.0.0.1:64035_h_lwq c:collection1   x:collection1] o.a.s.c.c.ZkStateReader Load collection config from: [/collections/collection1]
   [junit4]   2> 902505 INFO  (coreLoadExecutor-2318-thread-1-processing-n:127.0.0.1:64035_h_lwq) [n:127.0.0.1:64035_h_lwq c:collection1   x:collection1] o.a.s.c.c.ZkStateReader path=[/collections/collection1] [configName]=[conf1] specified config exists in ZooKeeper
   [junit4]   2> 902505 INFO  (coreLoadExecutor-2318-thread-1-processing-n:127.0.0.1:64035_h_lwq) [n:127.0.0.1:64035_h_lwq c:collection1   x:collection1] o.a.s.c.SolrResourceLoader new SolrResourceLoader for directory: 'C:\Users\JenkinsSlave\workspace\Lucene-Solr-5.x-Windows\solr\build\solr-core\test\J1\temp\solr.schema.TestBulkSchemaConcurrent_678F586E284B0617-001\shard-1-001\cores\collection1'
   [junit4]   2> 902505 INFO  (coreLoadExecutor-2318-thread-1-processing-n:127.0.0.1:64035_h_lwq) [n:127.0.0.1:64035_h_lwq c:collection1   x:collection1] o.a.s.c.SolrResourceLoader JNDI not configured for solr (NoInitialContextEx)
   [junit4]   2> 902505 INFO  (coreLoadExecutor-2318-thread-1-processing-n:127.0.0.1:64035_h_lwq) [n:127.0.0.1:64035_h_lwq c:collection1   x:collection1] o.a.s.c.SolrResourceLoader solr home defaulted to 'solr/' (could not find system property or JNDI)
   [junit4]   2> 902508 INFO  (coreLoadExecutor-2318-thread-1-processing-n:127.0.0.1:64035_h_lwq) [n:127.0.0.1:64035_h_lwq c:collection1   x:collection1] o.a.s.c.Config loaded config solrconfig.xml with version 0 
   [junit4]   2> 902517 INFO  (coreLoadExecutor-2318-thread-1-processing-n:127.0.0.1:64035_h_lwq) [n:127.0.0.1:64035_h_lwq c:collection1   x:collection1] o.a.s.c.SolrConfig current version of requestparams : -1
   [junit4]   2> 902536 INFO  (coreLoadExecutor-2318-thread-1-processing-n:127.0.0.1:64035_h_lwq) [n:127.0.0.1:64035_h_lwq c:collection1   x:collection1] o.a.s.c.SolrConfig Using Lucene MatchVersion: 5.5.0
   [junit4]   2> 902572 INFO  (coreLoadExecutor-2318-thread-1-processing-n:127.0.0.1:64035_h_lwq) [n:127.0.0.1:64035_h_lwq c:collection1   x:collection1] o.a.s.c.SolrConfig Loaded SolrConfig: solrconfig.xml
   [junit4]   2> 902581 INFO  (coreLoadExecutor-2318-thread-1-processing-n:127.0.0.1:64035_h_lwq) [n:127.0.0.1:64035_h_lwq c:collection1   x:collection1] o.a.s.s.IndexSchema [collection1] Schema name=test
   [junit4]   2> 902930 INFO  (coreLoadExecutor-2318-thread-1-processing-n:127.0.0.1:64035_h_lwq) [n:127.0.0.1:64035_h_lwq c:collection1   x:collection1] o.a.s.s.OpenExchangeRatesOrgProvider Initialized with rates=open-exchange-rates.json, refreshInterval=1440.
   [junit4]   2> 902940 INFO  (coreLoadExecutor-2318-thread-1-processing-n:127.0.0.1:64035_h_lwq) [n:127.0.0.1:64035_h_lwq c:collection1   x:collection1] o.a.s.s.IndexSchema default search field in schema is text
   [junit4]   2> 902941 INFO  (coreLoadExecutor-2318-thread-1-processing-n:127.0.0.1:64035_h_lwq) [n:127.0.0.1:64035_h_lwq c:collection1   x:collection1] o.a.s.s.IndexSchema unique key field: id
   [junit4]   2> 902954 INFO  (coreLoadExecutor-2318-thread-1-processing-n:127.0.0.1:64035_h_lwq) [n:127.0.0.1:64035_h_lwq c:collection1   x:collection1] o.a.s.s.FileExchangeRateProvider Reloading exchange rates from file currency.xml
   [junit4]   2> 902958 INFO  (coreLoadExecutor-2318-thread-1-processing-n:127.0.0.1:64035_h_lwq) [n:127.0.0.1:64035_h_lwq c:collection1   x:collection1] o.a.s.s.FileExchangeRateProvider Reloading exchange rates from file currency.xml
   [junit4]   2> 902968 INFO  (coreLoadExecutor-2318-thread-1-processing-n:127.0.0.1:64035_h_lwq) [n:127.0.0.1:64035_h_lwq c:collection1   x:collection1] o.a.s.s.OpenExchangeRatesOrgProvider Reloading exchange rates from open-exchange-rates.json
   [junit4]   2> 902969 INFO  (coreLoadExecutor-2318-thread-1-processing-n:127.0.0.1:64035_h_lwq) [n:127.0.0.1:64035_h_lwq c:collection1   x:collection1] o.a.s.s.OpenExchangeRatesOrgProvider Reloading exchange rates from open-exchange-rates.json
   [junit4]   2> 902975 INFO  (coreLoadExecutor-2318-thread-1-processing-n:127.0.0.1:64035_h_lwq) [n:127.0.0.1:64035_h_lwq c:collection1   x:collection1] o.a.s.c.ConfigSetProperties Did not find ConfigSet properties, assuming default properties: Can't find resource 'configsetprops.json' in classpath or '/configs/conf1', cwd=C:\Users\JenkinsSlave\workspace\Lucene-Solr-5.x-Windows\solr\build\solr-core\test\J1
   [junit4]   2> 902975 INFO  (coreLoadExecutor-2318-thread-1-processing-n:127.0.0.1:64035_h_lwq) [n:127.0.0.1:64035_h_lwq c:collection1   x:collection1] o.a.s.c.CoreContainer Creating SolrCore 'collection1' using configuration from collection collection1
   [junit4]   2> 902975 INFO  (coreLoadExecutor-2318-thread-1-processing-n:127.0.0.1:64035_h_lwq) [n:127.0.0.1:64035_h_lwq c:collection1 s:shard2 r:core_node1 x:collection1] o.a.s.c.SolrCore solr.NRTCachingDirectoryFactory
   [junit4]   2> 902975 INFO  (coreLoadExecutor-2318-thread-1-processing-n:127.0.0.1:64035_h_lwq) [n:127.0.0.1:64035_h_lwq c:collection1 s:shard2 r:core_node1 x:collection1] o.a.s.c.SolrCore [[collection1] ] Opening new SolrCore at [C:\Users\JenkinsSlave\workspace\Lucene-Solr-5.x-Windows\solr\build\solr-core\test\J1\temp\solr.schema.TestBulkSchemaConcurrent_678F586E284B0617-001\shard-1-001\cores\collection1], dataDir=[C:\Users\JenkinsSlave\workspace\Lucene-Solr-5.x-Windows\solr\build\solr-core\test\J1\temp\solr.schema.TestBulkSchemaConcurrent_678F586E284B0617-001\shard-1-001\cores\collection1\data\]
   [junit4]   2> 902975 INFO  (coreLoadExecutor-2318-thread-1-processing-n:127.0.0.1:64035_h_lwq) [n:127.0.0.1:64035_h_lwq c:collection1 s:shard2 r:core_node1 x:collection1] o.a.s.c.SolrCore JMX monitoring not detected for core: collection1
   [junit4]   2> 902976 INFO  (coreLoadExecutor-2318-thread-1-processing-n:127.0.0.1:64035_h_lwq) [n:127.0.0.1:64035_h_lwq c:collection1 s:shard2 r:core_node1 x:collection1] o.a.s.c.SchemaCodecFactory Using default compressionMode: BEST_SPEED
   [junit4]   2> 902977 INFO  (coreLoadExecutor-2318-thread-1-processing-n:127.0.0.1:64035_h_lwq) [n:127.0.0.1:64035_h_lwq c:collection1 s:shard2 r:core_node1 x:collection1] o.a.s.c.CachingDirectoryFactory return new directory for C:\Users\JenkinsSlave\workspace\Lucene-Solr-5.x-Windows\solr\build\solr-core\test\J1\temp\solr.schema.TestBulkSchemaConcurrent_678F586E284B0617-001\shard-1-001\cores\collection1\data
   [junit4]   2> 902978 INFO  (coreLoadExecutor-2318-thread-1-processing-n:127.0.0.1:64035_h_lwq) [n:127.0.0.1:64035_h_lwq c:collection1 s:shard2 r:core_node1 x:collection1] o.a.s.c.SolrCore New index directory detected: old=null new=C:\Users\JenkinsSlave\workspace\Lucene-Solr-5.x-Windows\solr\build\solr-core\test\J1\temp\solr.schema.TestBulkSchemaConcurrent_678F586E284B0617-001\shard-1-001\cores\collection1\data\index/
   [junit4]   2> 902978 WARN  (coreLoadExecutor-2318-thread-1-processing-n:127.0.0.1:64035_h_lwq) [n:127.0.0.1:64035_h_lwq c:collection1 s:shard2 r:core_node1 x:collection1] o.a.s.c.SolrCore [collection1] Solr index directory 'C:\Users\JenkinsSlave\workspace\Lucene-Solr-5.x-Windows\solr\build\solr-core\test\J1\temp\solr.schema.TestBulkSchemaConcurrent_678F586E284B0617-001\shard-1-001\cores\collection1\data\index' doesn't exist. Creating new index...
   [junit4]   2> 902979 INFO  (coreLoadExecutor-2318-thread-1-processing-n:127.0.0.1:64035_h_lwq) [n:127.0.0.1:64035_h_lwq c:collection1 s:shard2 r:core_node1 x:collection1] o.a.s.c.CachingDirectoryFactory return new directory for C:\Users\JenkinsSlave\workspace\Lucene-Solr-5.x-Windows\solr\build\solr-core\test\J1\temp\solr.schema.TestBulkSchemaConcurrent_678F586E284B0617-001\shard-1-001\cores\collection1\data\index
   [junit4]   2> 902980 INFO  (coreLoadExecutor-2318-thread-1-processing-n:127.0.0.1:64035_h_lwq) [n:127.0.0.1:64035_h_lwq c:collection1 s:shard2 r:core_node1 x:collection1] o.a.s.u.RandomMergePolicy RandomMergePolicy wrapping class org.apache.lucene.index.AlcoholicMergePolicy: [AlcoholicMergePolicy: minMergeSize=0, mergeFactor=10, maxMergeSize=1115555145, maxMergeSizeForForcedMerge=9223372036854775807, calibrateSizeByDeletes=true, maxMergeDocs=2147483647, maxCFSSegmentSizeMB=8.796093022207999E12, noCFSRatio=0.1]
   [junit4]   2> 903417 INFO  (coreLoadExecutor-2318-thread-1-processing-n:127.0.0.1:64035_h_lwq) [n:127.0.0.1:64035_h_lwq c:collection1 s:shard2 r:core_node1 x:collection1] o.a.s.c.SolrDeletionPolicy SolrDeletionPolicy.onCommit: commits: num=1
   [junit4]   2> 	commit{dir=NRTCachingDirectory(SimpleFSDirectory@C:\Users\JenkinsSlave\workspace\Lucene-Solr-5.x-Windows\solr\build\solr-core\test\J1\temp\solr.schema.TestBulkSchemaConcurrent_678F586E284B0617-001\shard-1-001\cores\collection1\data\index lockFactory=org.apache.lucene.store.SingleInstanceLockFactory@1af1049; maxCacheMB=48.0 maxMergeSizeMB=4.0),segFN=segments_1,generation=1}
   [junit4]   2> 903417 INFO  (coreLoadExecutor-2318-thread-1-processing-n:127.0.0.1:64035_h_lwq) [n:127.0.0.1:64035_h_lwq c:collection1 s:shard2 r:core_node1 x:collection1] o.a.s.c.SolrDeletionPolicy newest commit generation = 1
   [junit4]   2> 903418 INFO  (OldIndexDirectoryCleanupThreadForCore-collection1) [n:127.0.0.1:64035_h_lwq c:collection1 s:shard2 r:core_node1 x:collection1] o.a.s.c.SolrCore Looking for old index directories to cleanup for core collection1 in C:\Users\JenkinsSlave\workspace\Lucene-Solr-5.x-Windows\solr\build\solr-core\test\J1\temp\solr.schema.TestBulkSchemaConcurrent_678F586E284B0617-001\shard-1-001\cores\collection1\data\
   [junit4]   2> 903420 INFO  (coreLoadExecutor-2318-thread-1-processing-n:127.0.0.1:64035_h_lwq) [n:127.0.0.1:64035_h_lwq c:collection1 s:shard2 r:core_node1 x:collection1] o.a.s.c.SolrCore no updateRequestProcessorChain defined as default, creating implicit default
   [junit4]   2> 903420 WARN  (coreLoadExecutor-2318-thread-1-processing-n:127.0.0.1:64035_h_lwq) [n:127.0.0.1:64035_h_lwq c:collection1 s:shard2 r:core_node1 x:collection1] o.a.s.c.RequestHandlers INVALID paramSet a in requestHandler {type = requestHandler,name = /dump,class = DumpRequestHandler,args = {defaults={a=A,b=B}}}
   [junit4]   2> 903429 INFO  (coreLoadExecutor-2318-thread-1-processing-n:127.0.0.1:64035_h_lwq) [n:127.0.0.1:64035_h_lwq c:collection1 s:shard2 r:core_node1 x:collection1] o.a.s.h.l.XMLLoader xsltCacheLifetimeSeconds=60
   [junit4]   2> 903430 INFO  (coreLoadExecutor-2318-thread-1-processing-n:127.0.0.1:64035_h_lwq) [n:127.0.0.1:64035_h_lwq c:collection1 s:shard2 r:core_node1 x:collection1] o.a.s.h.l.XMLLoader xsltCacheLifetimeSeconds=60
   [junit4]   2> 903432 INFO  (coreLoadExecutor-2318-thread-1-processing-n:127.0.0.1:64035_h_lwq) [n:127.0.0.1:64035_h_lwq c:collection1 s:shard2 r:core_node1 x:collection1] o.a.s.h.l.XMLLoader xsltCacheLifetimeSeconds=60
   [junit4]   2> 903434 INFO  (coreLoadExecutor-2318-thread-1-processing-n:127.0.0.1:6403

[...truncated too long message...]

.0.1:64091_h_lwq c:collection1 s:shard1 r:core_node4 x:collection1] o.a.s.c.CachingDirectoryFactory Closing NRTCachingDirectoryFactory - 2 directories currently being tracked
   [junit4]   2> 935179 INFO  (Thread-2083) [n:127.0.0.1:64091_h_lwq c:collection1 s:shard1 r:core_node4 x:collection1] o.a.s.c.CachingDirectoryFactory looking to close C:\Users\JenkinsSlave\workspace\Lucene-Solr-5.x-Windows\solr\build\solr-core\test\J1\temp\solr.schema.TestBulkSchemaConcurrent_678F586E284B0617-001\shard-4-001\cores\collection1\data [CachedDir<<refCount=0;path=C:\Users\JenkinsSlave\workspace\Lucene-Solr-5.x-Windows\solr\build\solr-core\test\J1\temp\solr.schema.TestBulkSchemaConcurrent_678F586E284B0617-001\shard-4-001\cores\collection1\data;done=false>>]
   [junit4]   2> 935179 INFO  (Thread-2083) [n:127.0.0.1:64091_h_lwq c:collection1 s:shard1 r:core_node4 x:collection1] o.a.s.c.CachingDirectoryFactory Closing directory: C:\Users\JenkinsSlave\workspace\Lucene-Solr-5.x-Windows\solr\build\solr-core\test\J1\temp\solr.schema.TestBulkSchemaConcurrent_678F586E284B0617-001\shard-4-001\cores\collection1\data
   [junit4]   2> 935179 INFO  (Thread-2083) [n:127.0.0.1:64091_h_lwq c:collection1 s:shard1 r:core_node4 x:collection1] o.a.s.c.CachingDirectoryFactory looking to close C:\Users\JenkinsSlave\workspace\Lucene-Solr-5.x-Windows\solr\build\solr-core\test\J1\temp\solr.schema.TestBulkSchemaConcurrent_678F586E284B0617-001\shard-4-001\cores\collection1\data\index [CachedDir<<refCount=0;path=C:\Users\JenkinsSlave\workspace\Lucene-Solr-5.x-Windows\solr\build\solr-core\test\J1\temp\solr.schema.TestBulkSchemaConcurrent_678F586E284B0617-001\shard-4-001\cores\collection1\data\index;done=false>>]
   [junit4]   2> 935179 INFO  (SUITE-TestBulkSchemaConcurrent-seed#[678F586E284B0617]-worker) [n:127.0.0.1:64091_h_lwq c:collection1 s:shard1 r:core_node4 x:collection1] o.a.s.SolrTestCaseJ4 ###deleteCore
   [junit4]   2> 935179 INFO  (Thread-2083) [n:127.0.0.1:64091_h_lwq c:collection1 s:shard1 r:core_node4 x:collection1] o.a.s.c.CachingDirectoryFactory Closing directory: C:\Users\JenkinsSlave\workspace\Lucene-Solr-5.x-Windows\solr\build\solr-core\test\J1\temp\solr.schema.TestBulkSchemaConcurrent_678F586E284B0617-001\shard-4-001\cores\collection1\data\index
   [junit4]   2> 935179 WARN  (Thread-2083) [n:127.0.0.1:64091_h_lwq c:collection1 s:shard1 r:core_node4 x:collection1] o.a.s.c.SolrCores Tried to remove core collection1 from pendingCoreOps and it wasn't there. 
   [junit4]   2> ObjectTracker found 0 object(s) that were not released!!! [NRTCachingDirectory]
   [junit4]   2> 935179 WARN  (Thread-2083) [n:127.0.0.1:64091_h_lwq c:collection1 s:shard1 r:core_node4 x:collection1] o.a.s.c.ZkController listener throws error
   [junit4]   2> org.apache.solr.common.SolrException: Unable to reload core [collection1]
   [junit4]   2> 	at org.apache.solr.core.CoreContainer.reload(CoreContainer.java:936)
   [junit4]   2> 	at org.apache.solr.core.SolrCore$11.run(SolrCore.java:2604)
   [junit4]   2> 	at org.apache.solr.cloud.ZkController$5.run(ZkController.java:2449)
   [junit4]   2> Caused by: org.apache.solr.common.SolrException: Failed to load stored data for /rest/managed due to: java.io.IOException: Failed to read data at /configs/conf1/_rest_managed.json
   [junit4]   2> 	at org.apache.solr.core.SolrCore.<init>(SolrCore.java:821)
   [junit4]   2> 	at org.apache.solr.core.SolrCore.reload(SolrCore.java:461)
   [junit4]   2> 	at org.apache.solr.core.CoreContainer.reload(CoreContainer.java:931)
   [junit4]   2> 	... 2 more
   [junit4]   2> Caused by: org.apache.solr.common.SolrException: Failed to load stored data for /rest/managed due to: java.io.IOException: Failed to read data at /configs/conf1/_rest_managed.json
   [junit4]   2> 	at org.apache.solr.rest.RestManager$RestManagerManagedResource.reloadFromStorage(RestManager.java:466)
   [junit4]   2> 	at org.apache.solr.rest.ManagedResource.loadManagedDataAndNotify(ManagedResource.java:88)
   [junit4]   2> 	at org.apache.solr.rest.RestManager.init(RestManager.java:624)
   [junit4]   2> 	at org.apache.solr.core.SolrCore.initRestManager(SolrCore.java:2399)
   [junit4]   2> 	at org.apache.solr.core.SolrCore.<init>(SolrCore.java:797)
   [junit4]   2> 	... 4 more
   [junit4]   2> Caused by: java.io.IOException: Failed to read data at /configs/conf1/_rest_managed.json
   [junit4]   2> 	at org.apache.solr.rest.ManagedResourceStorage$ZooKeeperStorageIO.openInputStream(ManagedResourceStorage.java:269)
   [junit4]   2> 	at org.apache.solr.rest.ManagedResourceStorage.load(ManagedResourceStorage.java:494)
   [junit4]   2> 	at org.apache.solr.rest.RestManager$RestManagerManagedResource.reloadFromStorage(RestManager.java:462)
   [junit4]   2> 	... 8 more
   [junit4]   2> Caused by: org.apache.zookeeper.KeeperException$SessionExpiredException: KeeperErrorCode = Session expired for /configs/conf1/_rest_managed.json
   [junit4]   2> 	at org.apache.zookeeper.KeeperException.create(KeeperException.java:127)
   [junit4]   2> 	at org.apache.zookeeper.KeeperException.create(KeeperException.java:51)
   [junit4]   2> 	at org.apache.zookeeper.ZooKeeper.exists(ZooKeeper.java:1045)
   [junit4]   2> 	at org.apache.solr.common.cloud.SolrZkClient$5.execute(SolrZkClient.java:312)
   [junit4]   2> 	at org.apache.solr.common.cloud.SolrZkClient$5.execute(SolrZkClient.java:309)
   [junit4]   2> 	at org.apache.solr.common.cloud.ZkCmdExecutor.retryOperation(ZkCmdExecutor.java:61)
   [junit4]   2> 	at org.apache.solr.common.cloud.SolrZkClient.exists(SolrZkClient.java:309)
   [junit4]   2> 	at org.apache.solr.rest.ManagedResourceStorage$ZooKeeperStorageIO.openInputStream(ManagedResourceStorage.java:262)
   [junit4]   2> 	... 10 more
   [junit4]   2> NOTE: test params are: codec=Asserting(Lucene54): {}, docValues:{}, sim=DefaultSimilarity, locale=ko-KR, timezone=Asia/Damascus
   [junit4]   2> NOTE: Windows 7 6.1 x86/Oracle Corporation 1.7.0_80 (32-bit)/cpus=3,threads=1,free=344763328,total=518979584
   [junit4]   2> NOTE: All tests run in this JVM: [HdfsThreadLeakTest, TestShortCircuitedRequests, OpenExchangeRatesOrgProviderTest, BadIndexSchemaTest, BufferStoreTest, TestConfigOverlay, ConfigSetsAPITest, TestNRTOpen, CollectionsAPIDistributedZkTest, DefaultValueUpdateProcessorTest, AutoCommitTest, CurrencyFieldOpenExchangeTest, TestValueSourceCache, CacheHeaderTest, TestLMJelinekMercerSimilarityFactory, TestSchemaNameResource, TestRecoveryHdfs, RemoteQueryErrorTest, ConjunctionSolrSpellCheckerTest, TestFieldCollectionResource, TestRecovery, RequestLoggingTest, CopyFieldTest, FullHLLTest, MultiTermTest, TestOverriddenPrefixQueryForCustomFieldType, CustomCollectionTest, DistributedFacetPivotLargeTest, ZkSolrClientTest, TestSolrQueryParser, ZkNodePropsTest, SolrCmdDistributorTest, TestExclusionRuleCollectionAccess, ResourceLoaderTest, TermVectorComponentTest, FileBasedSpellCheckerTest, NoCacheHeaderTest, DateFieldTest, TestStandardQParsers, TestInfoStreamLogging, DistributedDebugComponentTest, DeleteShardTest, DirectoryFactoryTest, TestPerFieldSimilarity, TestRawTransformer, BJQParserTest, MinimalSchemaTest, OpenCloseCoreStressTest, FieldMutatingUpdateProcessorTest, TestOmitPositions, ForceLeaderTest, PluginInfoTest, TestFieldSortValues, TestReversedWildcardFilterFactory, CSVRequestHandlerTest, TestExactSharedStatsCache, DistributedFacetPivotSmallAdvancedTest, HdfsChaosMonkeyNothingIsSafeTest, DistributedQueryComponentOptimizationTest, TestPerFieldSimilarityWithDefaultOverride, TestDistributedGrouping, BasicDistributedZk2Test, TestManagedSchemaFieldTypeResource, SearchHandlerTest, BasicFunctionalityTest, CloudExitableDirectoryReaderTest, TestOrdValues, TestScoreJoinQPNoScore, HdfsRecoverLeaseTest, OverriddenZkACLAndCredentialsProvidersTest, TestFastOutputStream, TestSolrQueryParserResource, SuggesterWFSTTest, ConvertedLegacyTest, TestBulkSchemaConcurrent]
   [junit4]   2> NOTE: reproduce with: ant test  -Dtestcase=TestBulkSchemaConcurrent -Dtests.seed=678F586E284B0617 -Dtests.slow=true -Dtests.locale=ko-KR -Dtests.timezone=Asia/Damascus -Dtests.asserts=true -Dtests.file.encoding=UTF-8
   [junit4] ERROR   0.00s J1 | TestBulkSchemaConcurrent (suite) <<<
   [junit4]    > Throwable #1: java.lang.AssertionError: ObjectTracker found 0 object(s) that were not released!!! [NRTCachingDirectory]
   [junit4]    > 	at __randomizedtesting.SeedInfo.seed([678F586E284B0617]:0)
   [junit4]    > 	at org.apache.solr.SolrTestCaseJ4.afterClass(SolrTestCaseJ4.java:229)
   [junit4]    > 	at java.lang.Thread.run(Thread.java:745)
   [junit4] Completed [150/564 (1!)] on J1 in 39.20s, 1 test, 1 failure <<< FAILURES!

[...truncated 1326 lines...]
BUILD FAILED
C:\Users\JenkinsSlave\workspace\Lucene-Solr-5.x-Windows\build.xml:750: The following error occurred while executing this line:
C:\Users\JenkinsSlave\workspace\Lucene-Solr-5.x-Windows\build.xml:694: The following error occurred while executing this line:
C:\Users\JenkinsSlave\workspace\Lucene-Solr-5.x-Windows\build.xml:59: The following error occurred while executing this line:
C:\Users\JenkinsSlave\workspace\Lucene-Solr-5.x-Windows\solr\build.xml:233: The following error occurred while executing this line:
C:\Users\JenkinsSlave\workspace\Lucene-Solr-5.x-Windows\solr\common-build.xml:534: The following error occurred while executing this line:
C:\Users\JenkinsSlave\workspace\Lucene-Solr-5.x-Windows\lucene\common-build.xml:1477: The following error occurred while executing this line:
C:\Users\JenkinsSlave\workspace\Lucene-Solr-5.x-Windows\lucene\common-build.xml:1033: There were test failures: 564 suites (7 ignored), 2266 tests, 1 suite-level error, 93 ignored (49 assumptions) [seed: 678F586E284B0617]

Total time: 87 minutes 7 seconds
Build step 'Invoke Ant' marked build as failure
Archiving artifacts
[WARNINGS] Skipping publisher since build result is FAILURE
Recording test results
Email was triggered for: Failure - Any
Sending email for trigger: Failure - Any



Mime
View raw message