lucene-dev mailing list archives

Site index · List index
Message view « Date » · « Thread »
Top « Date » · « Thread »
From Policeman Jenkins Server <jenk...@thetaphi.de>
Subject [JENKINS-EA] Lucene-Solr-trunk-Linux (64bit/jdk-9-ea+104) - Build # 15827 - Failure!
Date Tue, 09 Feb 2016 13:46:43 GMT
Build: http://jenkins.thetaphi.de/job/Lucene-Solr-trunk-Linux/15827/
Java: 64bit/jdk-9-ea+104 -XX:-UseCompressedOops -XX:+UseG1GC -XX:-CompactStrings -XX:-UseSuperWord

1 tests failed.
FAILED:  org.apache.solr.cloud.CollectionsAPIDistributedZkTest.test

Error Message:
Error from server at http://127.0.0.1:53572/awholynewcollection_0: non ok status: 500, message:Server Error

Stack Trace:
org.apache.solr.client.solrj.impl.HttpSolrClient$RemoteSolrException: Error from server at http://127.0.0.1:53572/awholynewcollection_0: non ok status: 500, message:Server Error
	at __randomizedtesting.SeedInfo.seed([F46F9DBF2A70DB9A:7C3BA265848CB662]:0)
	at org.apache.solr.client.solrj.impl.HttpSolrClient.executeMethod(HttpSolrClient.java:511)
	at org.apache.solr.client.solrj.impl.HttpSolrClient.request(HttpSolrClient.java:240)
	at org.apache.solr.client.solrj.impl.HttpSolrClient.request(HttpSolrClient.java:229)
	at org.apache.solr.client.solrj.SolrRequest.process(SolrRequest.java:149)
	at org.apache.solr.client.solrj.SolrClient.query(SolrClient.java:942)
	at org.apache.solr.client.solrj.SolrClient.query(SolrClient.java:957)
	at org.apache.solr.cloud.AbstractFullDistribZkTestBase.waitForNon403or404or503(AbstractFullDistribZkTestBase.java:1773)
	at org.apache.solr.cloud.CollectionsAPIDistributedZkTest.testCollectionsAPI(CollectionsAPIDistributedZkTest.java:723)
	at org.apache.solr.cloud.CollectionsAPIDistributedZkTest.test(CollectionsAPIDistributedZkTest.java:160)
	at sun.reflect.NativeMethodAccessorImpl.invoke0(Native Method)
	at sun.reflect.NativeMethodAccessorImpl.invoke(NativeMethodAccessorImpl.java:62)
	at sun.reflect.DelegatingMethodAccessorImpl.invoke(DelegatingMethodAccessorImpl.java:43)
	at java.lang.reflect.Method.invoke(Method.java:520)
	at com.carrotsearch.randomizedtesting.RandomizedRunner.invoke(RandomizedRunner.java:1764)
	at com.carrotsearch.randomizedtesting.RandomizedRunner$8.evaluate(RandomizedRunner.java:871)
	at com.carrotsearch.randomizedtesting.RandomizedRunner$9.evaluate(RandomizedRunner.java:907)
	at com.carrotsearch.randomizedtesting.RandomizedRunner$10.evaluate(RandomizedRunner.java:921)
	at org.apache.solr.BaseDistributedSearchTestCase$ShardsRepeatRule$ShardsFixedStatement.callStatement(BaseDistributedSearchTestCase.java:964)
	at org.apache.solr.BaseDistributedSearchTestCase$ShardsRepeatRule$ShardsStatement.evaluate(BaseDistributedSearchTestCase.java:939)
	at com.carrotsearch.randomizedtesting.rules.SystemPropertiesRestoreRule$1.evaluate(SystemPropertiesRestoreRule.java:57)
	at org.apache.lucene.util.TestRuleSetupTeardownChained$1.evaluate(TestRuleSetupTeardownChained.java:49)
	at org.apache.lucene.util.AbstractBeforeAfterRule$1.evaluate(AbstractBeforeAfterRule.java:45)
	at org.apache.lucene.util.TestRuleThreadAndTestName$1.evaluate(TestRuleThreadAndTestName.java:48)
	at org.apache.lucene.util.TestRuleIgnoreAfterMaxFailures$1.evaluate(TestRuleIgnoreAfterMaxFailures.java:64)
	at org.apache.lucene.util.TestRuleMarkFailure$1.evaluate(TestRuleMarkFailure.java:47)
	at com.carrotsearch.randomizedtesting.rules.StatementAdapter.evaluate(StatementAdapter.java:36)
	at com.carrotsearch.randomizedtesting.ThreadLeakControl$StatementRunner.run(ThreadLeakControl.java:367)
	at com.carrotsearch.randomizedtesting.ThreadLeakControl.forkTimeoutingTask(ThreadLeakControl.java:809)
	at com.carrotsearch.randomizedtesting.ThreadLeakControl$3.evaluate(ThreadLeakControl.java:460)
	at com.carrotsearch.randomizedtesting.RandomizedRunner.runSingleTest(RandomizedRunner.java:880)
	at com.carrotsearch.randomizedtesting.RandomizedRunner$5.evaluate(RandomizedRunner.java:781)
	at com.carrotsearch.randomizedtesting.RandomizedRunner$6.evaluate(RandomizedRunner.java:816)
	at com.carrotsearch.randomizedtesting.RandomizedRunner$7.evaluate(RandomizedRunner.java:827)
	at com.carrotsearch.randomizedtesting.rules.StatementAdapter.evaluate(StatementAdapter.java:36)
	at com.carrotsearch.randomizedtesting.rules.SystemPropertiesRestoreRule$1.evaluate(SystemPropertiesRestoreRule.java:57)
	at org.apache.lucene.util.AbstractBeforeAfterRule$1.evaluate(AbstractBeforeAfterRule.java:45)
	at com.carrotsearch.randomizedtesting.rules.StatementAdapter.evaluate(StatementAdapter.java:36)
	at org.apache.lucene.util.TestRuleStoreClassName$1.evaluate(TestRuleStoreClassName.java:41)
	at com.carrotsearch.randomizedtesting.rules.NoShadowingOrOverridesOnMethodsRule$1.evaluate(NoShadowingOrOverridesOnMethodsRule.java:40)
	at com.carrotsearch.randomizedtesting.rules.NoShadowingOrOverridesOnMethodsRule$1.evaluate(NoShadowingOrOverridesOnMethodsRule.java:40)
	at com.carrotsearch.randomizedtesting.rules.StatementAdapter.evaluate(StatementAdapter.java:36)
	at com.carrotsearch.randomizedtesting.rules.StatementAdapter.evaluate(StatementAdapter.java:36)
	at com.carrotsearch.randomizedtesting.rules.StatementAdapter.evaluate(StatementAdapter.java:36)
	at org.apache.lucene.util.TestRuleAssertionsRequired$1.evaluate(TestRuleAssertionsRequired.java:53)
	at org.apache.lucene.util.TestRuleMarkFailure$1.evaluate(TestRuleMarkFailure.java:47)
	at org.apache.lucene.util.TestRuleIgnoreAfterMaxFailures$1.evaluate(TestRuleIgnoreAfterMaxFailures.java:64)
	at org.apache.lucene.util.TestRuleIgnoreTestSuites$1.evaluate(TestRuleIgnoreTestSuites.java:54)
	at com.carrotsearch.randomizedtesting.rules.StatementAdapter.evaluate(StatementAdapter.java:36)
	at com.carrotsearch.randomizedtesting.ThreadLeakControl$StatementRunner.run(ThreadLeakControl.java:367)
	at java.lang.Thread.run(Thread.java:804)




Build Log:
[...truncated 11278 lines...]
   [junit4] Suite: org.apache.solr.cloud.CollectionsAPIDistributedZkTest
   [junit4]   2> Creating dataDir: /home/jenkins/workspace/Lucene-Solr-trunk-Linux/solr/build/solr-core/test/J0/temp/solr.cloud.CollectionsAPIDistributedZkTest_F46F9DBF2A70DB9A-001/init-core-data-001
   [junit4]   2> 985144 INFO  (SUITE-CollectionsAPIDistributedZkTest-seed#[F46F9DBF2A70DB9A]-worker) [    ] o.a.s.SolrTestCaseJ4 Randomized ssl (false) and clientAuth (false)
   [junit4]   2> 985144 INFO  (SUITE-CollectionsAPIDistributedZkTest-seed#[F46F9DBF2A70DB9A]-worker) [    ] o.a.s.BaseDistributedSearchTestCase Setting hostContext system property: /
   [junit4]   2> 985146 INFO  (TEST-CollectionsAPIDistributedZkTest.test-seed#[F46F9DBF2A70DB9A]) [    ] o.a.s.c.ZkTestServer STARTING ZK TEST SERVER
   [junit4]   2> 985146 INFO  (Thread-3021) [    ] o.a.s.c.ZkTestServer client port:0.0.0.0/0.0.0.0:0
   [junit4]   2> 985146 INFO  (Thread-3021) [    ] o.a.s.c.ZkTestServer Starting server
   [junit4]   2> 985246 INFO  (TEST-CollectionsAPIDistributedZkTest.test-seed#[F46F9DBF2A70DB9A]) [    ] o.a.s.c.ZkTestServer start zk server on port:38220
   [junit4]   2> 985246 INFO  (TEST-CollectionsAPIDistributedZkTest.test-seed#[F46F9DBF2A70DB9A]) [    ] o.a.s.c.c.SolrZkClient Using default ZkCredentialsProvider
   [junit4]   2> 985247 INFO  (TEST-CollectionsAPIDistributedZkTest.test-seed#[F46F9DBF2A70DB9A]) [    ] o.a.s.c.c.ConnectionManager Waiting for client to connect to ZooKeeper
   [junit4]   2> 985249 INFO  (zkCallback-1271-thread-1) [    ] o.a.s.c.c.ConnectionManager Watcher org.apache.solr.common.cloud.ConnectionManager@6ccd5e21 name:ZooKeeperConnection Watcher:127.0.0.1:38220 got event WatchedEvent state:SyncConnected type:None path:null path:null type:None
   [junit4]   2> 985249 INFO  (TEST-CollectionsAPIDistributedZkTest.test-seed#[F46F9DBF2A70DB9A]) [    ] o.a.s.c.c.ConnectionManager Client is connected to ZooKeeper
   [junit4]   2> 985249 INFO  (TEST-CollectionsAPIDistributedZkTest.test-seed#[F46F9DBF2A70DB9A]) [    ] o.a.s.c.c.SolrZkClient Using default ZkACLProvider
   [junit4]   2> 985249 INFO  (TEST-CollectionsAPIDistributedZkTest.test-seed#[F46F9DBF2A70DB9A]) [    ] o.a.s.c.c.SolrZkClient makePath: /solr
   [junit4]   2> 985251 INFO  (TEST-CollectionsAPIDistributedZkTest.test-seed#[F46F9DBF2A70DB9A]) [    ] o.a.s.c.c.SolrZkClient Using default ZkCredentialsProvider
   [junit4]   2> 985251 INFO  (TEST-CollectionsAPIDistributedZkTest.test-seed#[F46F9DBF2A70DB9A]) [    ] o.a.s.c.c.ConnectionManager Waiting for client to connect to ZooKeeper
   [junit4]   2> 985252 INFO  (zkCallback-1272-thread-1) [    ] o.a.s.c.c.ConnectionManager Watcher org.apache.solr.common.cloud.ConnectionManager@cf8cb4 name:ZooKeeperConnection Watcher:127.0.0.1:38220/solr got event WatchedEvent state:SyncConnected type:None path:null path:null type:None
   [junit4]   2> 985252 INFO  (TEST-CollectionsAPIDistributedZkTest.test-seed#[F46F9DBF2A70DB9A]) [    ] o.a.s.c.c.ConnectionManager Client is connected to ZooKeeper
   [junit4]   2> 985252 INFO  (TEST-CollectionsAPIDistributedZkTest.test-seed#[F46F9DBF2A70DB9A]) [    ] o.a.s.c.c.SolrZkClient Using default ZkACLProvider
   [junit4]   2> 985252 INFO  (TEST-CollectionsAPIDistributedZkTest.test-seed#[F46F9DBF2A70DB9A]) [    ] o.a.s.c.c.SolrZkClient makePath: /collections/collection1
   [junit4]   2> 985253 INFO  (TEST-CollectionsAPIDistributedZkTest.test-seed#[F46F9DBF2A70DB9A]) [    ] o.a.s.c.c.SolrZkClient makePath: /collections/collection1/shards
   [junit4]   2> 985253 INFO  (TEST-CollectionsAPIDistributedZkTest.test-seed#[F46F9DBF2A70DB9A]) [    ] o.a.s.c.c.SolrZkClient makePath: /collections/control_collection
   [junit4]   2> 985253 INFO  (TEST-CollectionsAPIDistributedZkTest.test-seed#[F46F9DBF2A70DB9A]) [    ] o.a.s.c.c.SolrZkClient makePath: /collections/control_collection/shards
   [junit4]   2> 985254 INFO  (TEST-CollectionsAPIDistributedZkTest.test-seed#[F46F9DBF2A70DB9A]) [    ] o.a.s.c.AbstractZkTestCase put /home/jenkins/workspace/Lucene-Solr-trunk-Linux/solr/core/src/test-files/solr/collection1/conf/solrconfig-tlog.xml to /configs/conf1/solrconfig.xml
   [junit4]   2> 985254 INFO  (TEST-CollectionsAPIDistributedZkTest.test-seed#[F46F9DBF2A70DB9A]) [    ] o.a.s.c.c.SolrZkClient makePath: /configs/conf1/solrconfig.xml
   [junit4]   2> 985254 INFO  (TEST-CollectionsAPIDistributedZkTest.test-seed#[F46F9DBF2A70DB9A]) [    ] o.a.s.c.AbstractZkTestCase put /home/jenkins/workspace/Lucene-Solr-trunk-Linux/solr/core/src/test-files/solr/collection1/conf/schema.xml to /configs/conf1/schema.xml
   [junit4]   2> 985255 INFO  (TEST-CollectionsAPIDistributedZkTest.test-seed#[F46F9DBF2A70DB9A]) [    ] o.a.s.c.c.SolrZkClient makePath: /configs/conf1/schema.xml
   [junit4]   2> 985255 INFO  (TEST-CollectionsAPIDistributedZkTest.test-seed#[F46F9DBF2A70DB9A]) [    ] o.a.s.c.AbstractZkTestCase put /home/jenkins/workspace/Lucene-Solr-trunk-Linux/solr/core/src/test-files/solr/collection1/conf/solrconfig.snippet.randomindexconfig.xml to /configs/conf1/solrconfig.snippet.randomindexconfig.xml
   [junit4]   2> 985255 INFO  (TEST-CollectionsAPIDistributedZkTest.test-seed#[F46F9DBF2A70DB9A]) [    ] o.a.s.c.c.SolrZkClient makePath: /configs/conf1/solrconfig.snippet.randomindexconfig.xml
   [junit4]   2> 985256 INFO  (TEST-CollectionsAPIDistributedZkTest.test-seed#[F46F9DBF2A70DB9A]) [    ] o.a.s.c.AbstractZkTestCase put /home/jenkins/workspace/Lucene-Solr-trunk-Linux/solr/core/src/test-files/solr/collection1/conf/stopwords.txt to /configs/conf1/stopwords.txt
   [junit4]   2> 985256 INFO  (TEST-CollectionsAPIDistributedZkTest.test-seed#[F46F9DBF2A70DB9A]) [    ] o.a.s.c.c.SolrZkClient makePath: /configs/conf1/stopwords.txt
   [junit4]   2> 985256 INFO  (TEST-CollectionsAPIDistributedZkTest.test-seed#[F46F9DBF2A70DB9A]) [    ] o.a.s.c.AbstractZkTestCase put /home/jenkins/workspace/Lucene-Solr-trunk-Linux/solr/core/src/test-files/solr/collection1/conf/protwords.txt to /configs/conf1/protwords.txt
   [junit4]   2> 985256 INFO  (TEST-CollectionsAPIDistributedZkTest.test-seed#[F46F9DBF2A70DB9A]) [    ] o.a.s.c.c.SolrZkClient makePath: /configs/conf1/protwords.txt
   [junit4]   2> 985257 INFO  (TEST-CollectionsAPIDistributedZkTest.test-seed#[F46F9DBF2A70DB9A]) [    ] o.a.s.c.AbstractZkTestCase put /home/jenkins/workspace/Lucene-Solr-trunk-Linux/solr/core/src/test-files/solr/collection1/conf/currency.xml to /configs/conf1/currency.xml
   [junit4]   2> 985257 INFO  (TEST-CollectionsAPIDistributedZkTest.test-seed#[F46F9DBF2A70DB9A]) [    ] o.a.s.c.c.SolrZkClient makePath: /configs/conf1/currency.xml
   [junit4]   2> 985258 INFO  (TEST-CollectionsAPIDistributedZkTest.test-seed#[F46F9DBF2A70DB9A]) [    ] o.a.s.c.AbstractZkTestCase put /home/jenkins/workspace/Lucene-Solr-trunk-Linux/solr/core/src/test-files/solr/collection1/conf/enumsConfig.xml to /configs/conf1/enumsConfig.xml
   [junit4]   2> 985258 INFO  (TEST-CollectionsAPIDistributedZkTest.test-seed#[F46F9DBF2A70DB9A]) [    ] o.a.s.c.c.SolrZkClient makePath: /configs/conf1/enumsConfig.xml
   [junit4]   2> 985258 INFO  (TEST-CollectionsAPIDistributedZkTest.test-seed#[F46F9DBF2A70DB9A]) [    ] o.a.s.c.AbstractZkTestCase put /home/jenkins/workspace/Lucene-Solr-trunk-Linux/solr/core/src/test-files/solr/collection1/conf/open-exchange-rates.json to /configs/conf1/open-exchange-rates.json
   [junit4]   2> 985258 INFO  (TEST-CollectionsAPIDistributedZkTest.test-seed#[F46F9DBF2A70DB9A]) [    ] o.a.s.c.c.SolrZkClient makePath: /configs/conf1/open-exchange-rates.json
   [junit4]   2> 985259 INFO  (TEST-CollectionsAPIDistributedZkTest.test-seed#[F46F9DBF2A70DB9A]) [    ] o.a.s.c.AbstractZkTestCase put /home/jenkins/workspace/Lucene-Solr-trunk-Linux/solr/core/src/test-files/solr/collection1/conf/mapping-ISOLatin1Accent.txt to /configs/conf1/mapping-ISOLatin1Accent.txt
   [junit4]   2> 985259 INFO  (TEST-CollectionsAPIDistributedZkTest.test-seed#[F46F9DBF2A70DB9A]) [    ] o.a.s.c.c.SolrZkClient makePath: /configs/conf1/mapping-ISOLatin1Accent.txt
   [junit4]   2> 985259 INFO  (TEST-CollectionsAPIDistributedZkTest.test-seed#[F46F9DBF2A70DB9A]) [    ] o.a.s.c.AbstractZkTestCase put /home/jenkins/workspace/Lucene-Solr-trunk-Linux/solr/core/src/test-files/solr/collection1/conf/old_synonyms.txt to /configs/conf1/old_synonyms.txt
   [junit4]   2> 985259 INFO  (TEST-CollectionsAPIDistributedZkTest.test-seed#[F46F9DBF2A70DB9A]) [    ] o.a.s.c.c.SolrZkClient makePath: /configs/conf1/old_synonyms.txt
   [junit4]   2> 985260 INFO  (TEST-CollectionsAPIDistributedZkTest.test-seed#[F46F9DBF2A70DB9A]) [    ] o.a.s.c.AbstractZkTestCase put /home/jenkins/workspace/Lucene-Solr-trunk-Linux/solr/core/src/test-files/solr/collection1/conf/synonyms.txt to /configs/conf1/synonyms.txt
   [junit4]   2> 985260 INFO  (TEST-CollectionsAPIDistributedZkTest.test-seed#[F46F9DBF2A70DB9A]) [    ] o.a.s.c.c.SolrZkClient makePath: /configs/conf1/synonyms.txt
   [junit4]   2> 985307 INFO  (TEST-CollectionsAPIDistributedZkTest.test-seed#[F46F9DBF2A70DB9A]) [    ] o.a.s.SolrTestCaseJ4 Writing core.properties file to /home/jenkins/workspace/Lucene-Solr-trunk-Linux/solr/build/solr-core/test/J0/temp/solr.cloud.CollectionsAPIDistributedZkTest_F46F9DBF2A70DB9A-001/control-001/cores/collection1
   [junit4]   2> 985308 INFO  (TEST-CollectionsAPIDistributedZkTest.test-seed#[F46F9DBF2A70DB9A]) [    ] o.e.j.s.Server jetty-9.2.13.v20150730
   [junit4]   2> 985309 INFO  (TEST-CollectionsAPIDistributedZkTest.test-seed#[F46F9DBF2A70DB9A]) [    ] o.e.j.s.h.ContextHandler Started o.e.j.s.ServletContextHandler@4412b671{/,null,AVAILABLE}
   [junit4]   2> 985310 INFO  (TEST-CollectionsAPIDistributedZkTest.test-seed#[F46F9DBF2A70DB9A]) [    ] o.e.j.s.ServerConnector Started ServerConnector@2da40cef{HTTP/1.1}{127.0.0.1:۵۶۴۸۸}
   [junit4]   2> 985310 INFO  (TEST-CollectionsAPIDistributedZkTest.test-seed#[F46F9DBF2A70DB9A]) [    ] o.e.j.s.Server Started @۹۸۷۱۳۵ms
   [junit4]   2> 985310 INFO  (TEST-CollectionsAPIDistributedZkTest.test-seed#[F46F9DBF2A70DB9A]) [    ] o.a.s.c.s.e.JettySolrRunner Jetty properties: {solr.data.dir=/home/jenkins/workspace/Lucene-Solr-trunk-Linux/solr/build/solr-core/test/J0/temp/solr.cloud.CollectionsAPIDistributedZkTest_F46F9DBF2A70DB9A-001/tempDir-001/control/data, hostContext=/, hostPort=56488, coreRootDirectory=/home/jenkins/workspace/Lucene-Solr-trunk-Linux/solr/build/solr-core/test/J0/temp/solr.cloud.CollectionsAPIDistributedZkTest_F46F9DBF2A70DB9A-001/control-001/cores}
   [junit4]   2> 985311 INFO  (TEST-CollectionsAPIDistributedZkTest.test-seed#[F46F9DBF2A70DB9A]) [    ] o.a.s.s.SolrDispatchFilter SolrDispatchFilter.init(): sun.misc.Launcher$AppClassLoader@6996db8
   [junit4]   2> 985311 INFO  (TEST-CollectionsAPIDistributedZkTest.test-seed#[F46F9DBF2A70DB9A]) [    ] o.a.s.c.SolrResourceLoader new SolrResourceLoader for directory: '/home/jenkins/workspace/Lucene-Solr-trunk-Linux/solr/build/solr-core/test/J0/temp/solr.cloud.CollectionsAPIDistributedZkTest_F46F9DBF2A70DB9A-001/control-001'
   [junit4]   2> 985311 INFO  (TEST-CollectionsAPIDistributedZkTest.test-seed#[F46F9DBF2A70DB9A]) [    ] o.a.s.c.SolrResourceLoader JNDI not configured for solr (NoInitialContextEx)
   [junit4]   2> 985311 INFO  (TEST-CollectionsAPIDistributedZkTest.test-seed#[F46F9DBF2A70DB9A]) [    ] o.a.s.c.SolrResourceLoader solr home defaulted to 'solr/' (could not find system property or JNDI)
   [junit4]   2> 985311 INFO  (TEST-CollectionsAPIDistributedZkTest.test-seed#[F46F9DBF2A70DB9A]) [    ] o.a.s.c.c.SolrZkClient Using default ZkCredentialsProvider
   [junit4]   2> 985311 INFO  (TEST-CollectionsAPIDistributedZkTest.test-seed#[F46F9DBF2A70DB9A]) [    ] o.a.s.c.c.ConnectionManager Waiting for client to connect to ZooKeeper
   [junit4]   2> 985312 INFO  (zkCallback-1273-thread-1) [    ] o.a.s.c.c.ConnectionManager Watcher org.apache.solr.common.cloud.ConnectionManager@78d9539b name:ZooKeeperConnection Watcher:127.0.0.1:38220/solr got event WatchedEvent state:SyncConnected type:None path:null path:null type:None
   [junit4]   2> 985312 INFO  (TEST-CollectionsAPIDistributedZkTest.test-seed#[F46F9DBF2A70DB9A]) [    ] o.a.s.c.c.ConnectionManager Client is connected to ZooKeeper
   [junit4]   2> 985312 INFO  (TEST-CollectionsAPIDistributedZkTest.test-seed#[F46F9DBF2A70DB9A]) [    ] o.a.s.c.c.SolrZkClient Using default ZkACLProvider
   [junit4]   2> 985312 INFO  (TEST-CollectionsAPIDistributedZkTest.test-seed#[F46F9DBF2A70DB9A]) [    ] o.a.s.s.SolrDispatchFilter Loading solr.xml from SolrHome (not found in ZooKeeper)
   [junit4]   2> 985312 INFO  (TEST-CollectionsAPIDistributedZkTest.test-seed#[F46F9DBF2A70DB9A]) [    ] o.a.s.c.SolrXmlConfig Loading container configuration from /home/jenkins/workspace/Lucene-Solr-trunk-Linux/solr/build/solr-core/test/J0/temp/solr.cloud.CollectionsAPIDistributedZkTest_F46F9DBF2A70DB9A-001/control-001/solr.xml
   [junit4]   2> 985316 INFO  (TEST-CollectionsAPIDistributedZkTest.test-seed#[F46F9DBF2A70DB9A]) [    ] o.a.s.c.CorePropertiesLocator Config-defined core root directory: /home/jenkins/workspace/Lucene-Solr-trunk-Linux/solr/build/solr-core/test/J0/temp/solr.cloud.CollectionsAPIDistributedZkTest_F46F9DBF2A70DB9A-001/control-001/cores
   [junit4]   2> 985316 INFO  (TEST-CollectionsAPIDistributedZkTest.test-seed#[F46F9DBF2A70DB9A]) [    ] o.a.s.c.CoreContainer New CoreContainer 243339786
   [junit4]   2> 985316 INFO  (TEST-CollectionsAPIDistributedZkTest.test-seed#[F46F9DBF2A70DB9A]) [    ] o.a.s.c.CoreContainer Loading cores into CoreContainer [instanceDir=/home/jenkins/workspace/Lucene-Solr-trunk-Linux/solr/build/solr-core/test/J0/temp/solr.cloud.CollectionsAPIDistributedZkTest_F46F9DBF2A70DB9A-001/control-001]
   [junit4]   2> 985316 WARN  (TEST-CollectionsAPIDistributedZkTest.test-seed#[F46F9DBF2A70DB9A]) [    ] o.a.s.c.CoreContainer Couldn't add files from /home/jenkins/workspace/Lucene-Solr-trunk-Linux/solr/build/solr-core/test/J0/temp/solr.cloud.CollectionsAPIDistributedZkTest_F46F9DBF2A70DB9A-001/control-001/lib to classpath: /home/jenkins/workspace/Lucene-Solr-trunk-Linux/solr/build/solr-core/test/J0/temp/solr.cloud.CollectionsAPIDistributedZkTest_F46F9DBF2A70DB9A-001/control-001/lib
   [junit4]   2> 985316 INFO  (TEST-CollectionsAPIDistributedZkTest.test-seed#[F46F9DBF2A70DB9A]) [    ] o.a.s.h.c.HttpShardHandlerFactory created with socketTimeout : 90000,urlScheme : ,connTimeout : 15000,maxConnectionsPerHost : 20,maxConnections : 10000,corePoolSize : 0,maximumPoolSize : 2147483647,maxThreadIdleTime : 5,sizeOfQueue : -1,fairnessPolicy : false,useRetries : false,
   [junit4]   2> 985317 INFO  (TEST-CollectionsAPIDistributedZkTest.test-seed#[F46F9DBF2A70DB9A]) [    ] o.a.s.u.UpdateShardHandler Creating UpdateShardHandler HTTP client with params: socketTimeout=340000&connTimeout=45000&retry=true
   [junit4]   2> 985317 INFO  (TEST-CollectionsAPIDistributedZkTest.test-seed#[F46F9DBF2A70DB9A]) [    ] o.a.s.l.LogWatcher SLF4J impl is org.slf4j.impl.Log4jLoggerFactory
   [junit4]   2> 985317 INFO  (TEST-CollectionsAPIDistributedZkTest.test-seed#[F46F9DBF2A70DB9A]) [    ] o.a.s.l.LogWatcher Registering Log Listener [Log4j (org.slf4j.impl.Log4jLoggerFactory)]
   [junit4]   2> 985317 INFO  (TEST-CollectionsAPIDistributedZkTest.test-seed#[F46F9DBF2A70DB9A]) [    ] o.a.s.c.ZkContainer Zookeeper client=127.0.0.1:38220/solr
   [junit4]   2> 985317 INFO  (TEST-CollectionsAPIDistributedZkTest.test-seed#[F46F9DBF2A70DB9A]) [    ] o.a.s.c.ZkController zkHost includes chroot
   [junit4]   2> 985317 INFO  (TEST-CollectionsAPIDistributedZkTest.test-seed#[F46F9DBF2A70DB9A]) [    ] o.a.s.c.c.SolrZkClient Using default ZkCredentialsProvider
   [junit4]   2> 985317 INFO  (TEST-CollectionsAPIDistributedZkTest.test-seed#[F46F9DBF2A70DB9A]) [    ] o.a.s.c.c.ConnectionManager Waiting for client to connect to ZooKeeper
   [junit4]   2> 985318 INFO  (zkCallback-1276-thread-1) [    ] o.a.s.c.c.ConnectionManager Watcher org.apache.solr.common.cloud.ConnectionManager@39daede7 name:ZooKeeperConnection Watcher:127.0.0.1:38220 got event WatchedEvent state:SyncConnected type:None path:null path:null type:None
   [junit4]   2> 985318 INFO  (TEST-CollectionsAPIDistributedZkTest.test-seed#[F46F9DBF2A70DB9A]) [    ] o.a.s.c.c.ConnectionManager Client is connected to ZooKeeper
   [junit4]   2> 985319 INFO  (TEST-CollectionsAPIDistributedZkTest.test-seed#[F46F9DBF2A70DB9A]) [    ] o.a.s.c.c.SolrZkClient Using default ZkACLProvider
   [junit4]   2> 985319 INFO  (TEST-CollectionsAPIDistributedZkTest.test-seed#[F46F9DBF2A70DB9A]) [    ] o.a.s.c.c.ConnectionManager Waiting for client to connect to ZooKeeper
   [junit4]   2> 985320 INFO  (zkCallback-1277-thread-1) [    ] o.a.s.c.c.ConnectionManager Watcher org.apache.solr.common.cloud.ConnectionManager@39ba220c name:ZooKeeperConnection Watcher:127.0.0.1:38220/solr got event WatchedEvent state:SyncConnected type:None path:null path:null type:None
   [junit4]   2> 985320 INFO  (TEST-CollectionsAPIDistributedZkTest.test-seed#[F46F9DBF2A70DB9A]) [    ] o.a.s.c.c.ConnectionManager Client is connected to ZooKeeper
   [junit4]   2> 985320 INFO  (TEST-CollectionsAPIDistributedZkTest.test-seed#[F46F9DBF2A70DB9A]) [    ] o.a.s.c.c.SolrZkClient makePath: /overseer/queue
   [junit4]   2> 985321 INFO  (TEST-CollectionsAPIDistributedZkTest.test-seed#[F46F9DBF2A70DB9A]) [    ] o.a.s.c.c.SolrZkClient makePath: /overseer/collection-queue-work
   [junit4]   2> 985322 INFO  (TEST-CollectionsAPIDistributedZkTest.test-seed#[F46F9DBF2A70DB9A]) [    ] o.a.s.c.c.SolrZkClient makePath: /overseer/collection-map-running
   [junit4]   2> 985323 INFO  (TEST-CollectionsAPIDistributedZkTest.test-seed#[F46F9DBF2A70DB9A]) [    ] o.a.s.c.c.SolrZkClient makePath: /overseer/collection-map-completed
   [junit4]   2> 985323 INFO  (TEST-CollectionsAPIDistributedZkTest.test-seed#[F46F9DBF2A70DB9A]) [    ] o.a.s.c.c.SolrZkClient makePath: /overseer/collection-map-failure
   [junit4]   2> 985324 INFO  (TEST-CollectionsAPIDistributedZkTest.test-seed#[F46F9DBF2A70DB9A]) [    ] o.a.s.c.c.SolrZkClient makePath: /live_nodes
   [junit4]   2> 985324 INFO  (TEST-CollectionsAPIDistributedZkTest.test-seed#[F46F9DBF2A70DB9A]) [    ] o.a.s.c.c.SolrZkClient makePath: /aliases.json
   [junit4]   2> 985325 INFO  (TEST-CollectionsAPIDistributedZkTest.test-seed#[F46F9DBF2A70DB9A]) [    ] o.a.s.c.c.SolrZkClient makePath: /clusterstate.json
   [junit4]   2> 985325 INFO  (TEST-CollectionsAPIDistributedZkTest.test-seed#[F46F9DBF2A70DB9A]) [    ] o.a.s.c.c.SolrZkClient makePath: /security.json
   [junit4]   2> 985325 INFO  (TEST-CollectionsAPIDistributedZkTest.test-seed#[F46F9DBF2A70DB9A]) [    ] o.a.s.c.ZkController Register node as live in ZooKeeper:/live_nodes/127.0.0.1:56488_
   [junit4]   2> 985326 INFO  (TEST-CollectionsAPIDistributedZkTest.test-seed#[F46F9DBF2A70DB9A]) [    ] o.a.s.c.c.SolrZkClient makePath: /live_nodes/127.0.0.1:56488_
   [junit4]   2> 985326 INFO  (TEST-CollectionsAPIDistributedZkTest.test-seed#[F46F9DBF2A70DB9A]) [    ] o.a.s.c.c.SolrZkClient makePath: /overseer_elect
   [junit4]   2> 985326 INFO  (TEST-CollectionsAPIDistributedZkTest.test-seed#[F46F9DBF2A70DB9A]) [    ] o.a.s.c.c.SolrZkClient makePath: /overseer_elect/election
   [junit4]   2> 985327 INFO  (TEST-CollectionsAPIDistributedZkTest.test-seed#[F46F9DBF2A70DB9A]) [    ] o.a.s.c.Overseer Overseer (id=null) closing
   [junit4]   2> 985327 INFO  (TEST-CollectionsAPIDistributedZkTest.test-seed#[F46F9DBF2A70DB9A]) [    ] o.a.s.c.LeaderElector Joined leadership election with path: /overseer_elect/election/95356509452828676-127.0.0.1:56488_-n_0000000000
   [junit4]   2> 985327 INFO  (TEST-CollectionsAPIDistributedZkTest.test-seed#[F46F9DBF2A70DB9A]) [    ] o.a.s.c.OverseerElectionContext I am going to be the leader 127.0.0.1:56488_
   [junit4]   2> 985327 INFO  (TEST-CollectionsAPIDistributedZkTest.test-seed#[F46F9DBF2A70DB9A]) [    ] o.a.s.c.c.SolrZkClient makePath: /overseer_elect/leader
   [junit4]   2> 985328 INFO  (TEST-CollectionsAPIDistributedZkTest.test-seed#[F46F9DBF2A70DB9A]) [    ] o.a.s.c.Overseer Overseer (id=95356509452828676-127.0.0.1:56488_-n_0000000000) starting
   [junit4]   2> 985328 INFO  (TEST-CollectionsAPIDistributedZkTest.test-seed#[F46F9DBF2A70DB9A]) [    ] o.a.s.c.c.SolrZkClient makePath: /overseer/queue-work
   [junit4]   2> 985330 INFO  (TEST-CollectionsAPIDistributedZkTest.test-seed#[F46F9DBF2A70DB9A]) [    ] o.a.s.c.OverseerAutoReplicaFailoverThread Starting OverseerAutoReplicaFailoverThread autoReplicaFailoverWorkLoopDelay=10000 autoReplicaFailoverWaitAfterExpiration=10000 autoReplicaFailoverBadNodeExpiration=60000
   [junit4]   2> 985330 INFO  (TEST-CollectionsAPIDistributedZkTest.test-seed#[F46F9DBF2A70DB9A]) [    ] o.a.s.c.c.ZkStateReader Updating cluster state from ZooKeeper... 
   [junit4]   2> 985330 INFO  (OverseerCollectionConfigSetProcessor-95356509452828676-127.0.0.1:56488_-n_0000000000) [    ] o.a.s.c.OverseerTaskProcessor Process current queue of overseer operations
   [junit4]   2> 985330 INFO  (OverseerStateUpdate-95356509452828676-127.0.0.1:56488_-n_0000000000) [    ] o.a.s.c.Overseer Starting to work on the main queue
   [junit4]   2> 985342 INFO  (TEST-CollectionsAPIDistributedZkTest.test-seed#[F46F9DBF2A70DB9A]) [    ] o.a.s.c.CoreContainer Security conf doesn't exist. Skipping setup for authorization module.
   [junit4]   2> 985342 INFO  (TEST-CollectionsAPIDistributedZkTest.test-seed#[F46F9DBF2A70DB9A]) [    ] o.a.s.c.CoreContainer No authentication plugin used.
   [junit4]   2> 985342 INFO  (TEST-CollectionsAPIDistributedZkTest.test-seed#[F46F9DBF2A70DB9A]) [    ] o.a.s.c.CorePropertiesLocator Looking for core definitions underneath /home/jenkins/workspace/Lucene-Solr-trunk-Linux/solr/build/solr-core/test/J0/temp/solr.cloud.CollectionsAPIDistributedZkTest_F46F9DBF2A70DB9A-001/control-001/cores
   [junit4]   2> 985343 INFO  (TEST-CollectionsAPIDistributedZkTest.test-seed#[F46F9DBF2A70DB9A]) [    ] o.a.s.c.CoreDescriptor Created CoreDescriptor: {name=collection1, config=solrconfig.xml, transient=false, schema=schema.xml, loadOnStartup=true, configSetProperties=configsetprops.json, collection=control_collection, coreNodeName=, dataDir=data/, shard=}
   [junit4]   2> 985343 INFO  (TEST-CollectionsAPIDistributedZkTest.test-seed#[F46F9DBF2A70DB9A]) [    ] o.a.s.c.CorePropertiesLocator Found core collection1 in /home/jenkins/workspace/Lucene-Solr-trunk-Linux/solr/build/solr-core/test/J0/temp/solr.cloud.CollectionsAPIDistributedZkTest_F46F9DBF2A70DB9A-001/control-001/cores/collection1
   [junit4]   2> 985343 INFO  (TEST-CollectionsAPIDistributedZkTest.test-seed#[F46F9DBF2A70DB9A]) [    ] o.a.s.c.CorePropertiesLocator Found 1 core definitions
   [junit4]   2> 985347 INFO  (TEST-CollectionsAPIDistributedZkTest.test-seed#[F46F9DBF2A70DB9A]) [    ] o.a.s.s.SolrDispatchFilter user.dir=/home/jenkins/workspace/Lucene-Solr-trunk-Linux/solr/build/solr-core/test/J0
   [junit4]   2> 985347 INFO  (TEST-CollectionsAPIDistributedZkTest.test-seed#[F46F9DBF2A70DB9A]) [    ] o.a.s.s.SolrDispatchFilter SolrDispatchFilter.init() done
   [junit4]   2> 985347 INFO  (coreLoadExecutor-3425-thread-1) [    ] o.a.s.c.ZkController publishing state=down
   [junit4]   2> 985347 INFO  (coreLoadExecutor-3425-thread-1) [    ] o.a.s.c.ZkController numShards not found on descriptor - reading it from system property
   [junit4]   2> 985347 INFO  (OverseerStateUpdate-95356509452828676-127.0.0.1:56488_-n_0000000000) [    ] o.a.s.c.Overseer processMessage: queueSize: 1, message = {
   [junit4]   2>   "core":"collection1",
   [junit4]   2>   "roles":null,
   [junit4]   2>   "base_url":"http://127.0.0.1:56488",
   [junit4]   2>   "node_name":"127.0.0.1:56488_",
   [junit4]   2>   "numShards":"1",
   [junit4]   2>   "state":"down",
   [junit4]   2>   "shard":null,
   [junit4]   2>   "collection":"control_collection",
   [junit4]   2>   "operation":"state"} current state version: 0
   [junit4]   2> 985348 INFO  (coreLoadExecutor-3425-thread-1) [    ] o.a.s.c.ZkController look for our core node name
   [junit4]   2> 985348 INFO  (OverseerStateUpdate-95356509452828676-127.0.0.1:56488_-n_0000000000) [    ] o.a.s.c.o.ReplicaMutator Update state numShards=1 message={
   [junit4]   2>   "core":"collection1",
   [junit4]   2>   "roles":null,
   [junit4]   2>   "base_url":"http://127.0.0.1:56488",
   [junit4]   2>   "node_name":"127.0.0.1:56488_",
   [junit4]   2>   "numShards":"1",
   [junit4]   2>   "state":"down",
   [junit4]   2>   "shard":null,
   [junit4]   2>   "collection":"control_collection",
   [junit4]   2>   "operation":"state"}
   [junit4]   2> 985348 INFO  (OverseerStateUpdate-95356509452828676-127.0.0.1:56488_-n_0000000000) [    ] o.a.s.c.o.ClusterStateMutator building a new cName: control_collection
   [junit4]   2> 985348 INFO  (OverseerStateUpdate-95356509452828676-127.0.0.1:56488_-n_0000000000) [    ] o.a.s.c.o.ReplicaMutator Assigning new node to shard shard=shard1
   [junit4]   2> 985349 INFO  (zkCallback-1277-thread-1) [    ] o.a.s.c.c.ZkStateReader A cluster state change: [WatchedEvent state:SyncConnected type:NodeDataChanged path:/clusterstate.json], has occurred - updating... (live nodes size: [1])
   [junit4]   2> 986348 INFO  (coreLoadExecutor-3425-thread-1) [    ] o.a.s.c.ZkController waiting to find shard id in clusterstate for collection1
   [junit4]   2> 986348 INFO  (coreLoadExecutor-3425-thread-1) [    ] o.a.s.c.ZkController Check for collection zkNode:control_collection
   [junit4]   2> 986348 INFO  (coreLoadExecutor-3425-thread-1) [    ] o.a.s.c.ZkController Collection zkNode exists
   [junit4]   2> 986348 INFO  (coreLoadExecutor-3425-thread-1) [    ] o.a.s.c.c.ZkStateReader Load collection config from: [/collections/control_collection]
   [junit4]   2> 986348 INFO  (coreLoadExecutor-3425-thread-1) [    ] o.a.s.c.c.ZkStateReader path=[/collections/control_collection] [configName]=[conf1] specified config exists in ZooKeeper
   [junit4]   2> 986349 INFO  (coreLoadExecutor-3425-thread-1) [    ] o.a.s.c.SolrResourceLoader new SolrResourceLoader for directory: '/home/jenkins/workspace/Lucene-Solr-trunk-Linux/solr/build/solr-core/test/J0/temp/solr.cloud.CollectionsAPIDistributedZkTest_F46F9DBF2A70DB9A-001/control-001/cores/collection1'
   [junit4]   2> 986349 INFO  (coreLoadExecutor-3425-thread-1) [    ] o.a.s.c.SolrResourceLoader JNDI not configured for solr (NoInitialContextEx)
   [junit4]   2> 986349 INFO  (coreLoadExecutor-3425-thread-1) [    ] o.a.s.c.SolrResourceLoader solr home defaulted to 'solr/' (could not find system property or JNDI)
   [junit4]   2> 986350 INFO  (coreLoadExecutor-3425-thread-1) [    ] o.a.s.c.Config loaded config solrconfig.xml with version 0 
   [junit4]   2> 986353 INFO  (coreLoadExecutor-3425-thread-1) [    ] o.a.s.c.SolrConfig current version of requestparams : -1
   [junit4]   2> 986356 INFO  (coreLoadExecutor-3425-thread-1) [    ] o.a.s.c.SolrConfig Using Lucene MatchVersion: 6.0.0
   [junit4]   2> 986363 INFO  (coreLoadExecutor-3425-thread-1) [    ] o.a.s.c.SolrConfig Loaded SolrConfig: solrconfig.xml
   [junit4]   2> 986367 INFO  (coreLoadExecutor-3425-thread-1) [    ] o.a.s.s.IndexSchema [collection1] Schema name=test
   [junit4]   2> 986456 INFO  (coreLoadExecutor-3425-thread-1) [    ] o.a.s.s.OpenExchangeRatesOrgProvider Initialized with rates=open-exchange-rates.json, refreshInterval=1440.
   [junit4]   2> 986460 INFO  (coreLoadExecutor-3425-thread-1) [    ] o.a.s.s.IndexSchema default search field in schema is text
   [junit4]   2> 986460 INFO  (coreLoadExecutor-3425-thread-1) [    ] o.a.s.s.IndexSchema unique key field: id
   [junit4]   2> 986465 INFO  (coreLoadExecutor-3425-thread-1) [    ] o.a.s.s.FileExchangeRateProvider Reloading exchange rates from file currency.xml
   [junit4]   2> 986467 INFO  (coreLoadExecutor-3425-thread-1) [    ] o.a.s.s.FileExchangeRateProvider Reloading exchange rates from file currency.xml
   [junit4]   2> 986468 INFO  (coreLoadExecutor-3425-thread-1) [    ] o.a.s.s.OpenExchangeRatesOrgProvider Reloading exchange rates from open-exchange-rates.json
   [junit4]   2> 986468 INFO  (coreLoadExecutor-3425-thread-1) [    ] o.a.s.s.OpenExchangeRatesOrgProvider Reloading exchange rates from open-exchange-rates.json
   [junit4]   2> 986469 INFO  (coreLoadExecutor-3425-thread-1) [    ] o.a.s.c.ConfigSetProperties Did not find ConfigSet properties, assuming default properties: Can't find resource 'configsetprops.json' in classpath or '/configs/conf1', cwd=/home/jenkins/workspace/Lucene-Solr-trunk-Linux/solr/build/solr-core/test/J0
   [junit4]   2> 986469 INFO  (coreLoadExecutor-3425-thread-1) [    ] o.a.s.c.CoreContainer Creating SolrCore 'collection1' using configuration from collection control_collection
   [junit4]   2> 986469 INFO  (coreLoadExecutor-3425-thread-1) [    ] o.a.s.c.SolrCore org.apache.solr.core.MockDirectoryFactory
   [junit4]   2> 986469 INFO  (coreLoadExecutor-3425-thread-1) [    ] o.a.s.c.SolrCore [[collection1] ] Opening new SolrCore at [/home/jenkins/workspace/Lucene-Solr-trunk-Linux/solr/build/solr-core/test/J0/temp/solr.cloud.CollectionsAPIDistributedZkTest_F46F9DBF2A70DB9A-001/control-001/cores/collection1], dataDir=[/home/jenkins/workspace/Lucene-Solr-trunk-Linux/solr/build/solr-core/test/J0/temp/solr.cloud.CollectionsAPIDistributedZkTest_F46F9DBF2A70DB9A-001/control-001/cores/collection1/data/]
   [junit4]   2> 986470 INFO  (coreLoadExecutor-3425-thread-1) [    ] o.a.s.c.JmxMonitoredMap JMX monitoring is enabled. Adding Solr mbeans to JMX Server: com.sun.jmx.mbeanserver.JmxMBeanServer@3ac80386
   [junit4]   2> 986470 INFO  (coreLoadExecutor-3425-thread-1) [    ] o.a.s.c.CachingDirectoryFactory return new directory for /home/jenkins/workspace/Lucene-Solr-trunk-Linux/solr/build/solr-core/test/J0/temp/solr.cloud.CollectionsAPIDistributedZkTest_F46F9DBF2A70DB9A-001/control-001/cores/collection1/data
   [junit4]   2> 986470 INFO  (coreLoadExecutor-3425-thread-1) [    ] o.a.s.c.SolrCore New index directory detected: old=null new=/home/jenkins/workspace/Lucene-Solr-trunk-Linux/solr/build/solr-core/test/J0/temp/solr.cloud.CollectionsAPIDistributedZkTest_F46F9DBF2A70DB9A-001/control-001/cores/collection1/data/index/
   [junit4]   2> 986470 WARN  (coreLoadExecutor-3425-thread-1) [    ] o.a.s.c.SolrCore [collection1] Solr index directory '/home/jenkins/workspace/Lucene-Solr-trunk-Linux/solr/build/solr-core/test/J0/temp/solr.cloud.CollectionsAPIDistributedZkTest_F46F9DBF2A70DB9A-001/control-001/cores/collection1/data/index' doesn't exist. Creating new index...
   [junit4]   2> 986470 INFO  (coreLoadExecutor-3425-thread-1) [    ] o.a.s.c.CachingDirectoryFactory return new directory for /home/jenkins/workspace/Lucene-Solr-trunk-Linux/solr/build/solr-core/test/J0/temp/solr.cloud.CollectionsAPIDistributedZkTest_F46F9DBF2A70DB9A-001/control-001/cores/collection1/data/index
   [junit4]   2> 986470 INFO  (coreLoadExecutor-3425-thread-1) [    ] o.a.s.u.RandomMergePolicy RandomMergePolicy wrapping class org.apache.lucene.index.TieredMergePolicy: [TieredMergePolicy: maxMergeAtOnce=40, maxMergeAtOnceExplicit=28, maxMergedSegmentMB=45.7353515625, floorSegmentMB=0.953125, forceMergeDeletesPctAllowed=3.080536926998443, segmentsPerTier=43.0, maxCFSSegmentSizeMB=8.796093022207999E12, noCFSRatio=0.0
   [junit4]   2> 986471 INFO  (coreLoadExecutor-3425-thread-1) [    ] o.a.s.c.SolrDeletionPolicy SolrDeletionPolicy.onCommit: commits: num=1
   [junit4]   2> 	commit{dir=MockDirectoryWrapper(RAMDirectory@49f59304 lockFactory=org.apache.lucene.store.SingleInstanceLockFactory@5c5d3e2f),segFN=segments_1,generation=1}
   [junit4]   2> 986471 INFO  (coreLoadExecutor-3425-thread-1) [    ] o.a.s.c.SolrDeletionPolicy newest commit generation = 1
   [junit4]   2> 986471 INFO  (OldIndexDirectoryCleanupThreadForCore-collection1) [    ] o.a.s.c.SolrCore Looking for old index directories to cleanup for core collection1 in /home/jenkins/workspace/Lucene-Solr-trunk-Linux/solr/build/solr-core/test/J0/temp/solr.cloud.CollectionsAPIDistributedZkTest_F46F9DBF2A70DB9A-001/control-001/cores/collection1/data/
   [junit4]   2> 986471 WARN  (OldIndexDirectoryCleanupThreadForCore-collection1) [    ] o.a.s.c.DirectoryFactory /home/jenkins/workspace/Lucene-Solr-trunk-Linux/solr/build/solr-core/test/J0/temp/solr.cloud.CollectionsAPIDistributedZkTest_F46F9DBF2A70DB9A-001/control-001/cores/collection1/data/ does not point to a valid data directory; skipping clean-up of old index directories.
   [junit4]   2> 986473 INFO  (coreLoadExecutor-3425-thread-1) [    ] o.a.s.u.p.UpdateRequestProcessorChain creating updateRequestProcessorChain "nodistrib"
   [junit4]   2> 986473 INFO  (coreLoadExecutor-3425-thread-1) [    ] o.a.s.u.p.UpdateRequestProcessorChain creating updateRequestProcessorChain "dedupe"
   [junit4]   2> 986473 INFO  (coreLoadExecutor-3425-thread-1) [    ] o.a.s.u.p.UpdateRequestProcessorChain inserting DistributedUpdateProcessorFactory into updateRequestProcessorChain "dedupe"
   [junit4]   2> 986473 INFO  (coreLoadExecutor-3425-thread-1) [    ] o.a.s.u.p.UpdateRequestProcessorChain creating updateRequestProcessorChain "stored_sig"
   [junit4]   2> 986473 INFO  (coreLoadExecutor-3425-thread-1) [    ] o.a.s.u.p.UpdateRequestProcessorChain inserting DistributedUpdateProcessorFactory into updateRequestProcessorChain "stored_sig"
   [junit4]   2> 986474 INFO  (coreLoadExecutor-3425-thread-1) [    ] o.a.s.u.p.UpdateRequestProcessorChain creating updateRequestProcessorChain "distrib-dup-test-chain-explicit"
   [junit4]   2> 986474 INFO  (coreLoadExecutor-3425-thread-1) [    ] o.a.s.u.p.UpdateRequestProcessorChain creating updateRequestProcessorChain "distrib-dup-test-chain-implicit"
   [junit4]   2> 986474 INFO  (coreLoadExecutor-3425-thread-1) [    ] o.a.s.u.p.UpdateRequestProcessorChain inserting DistributedUpdateProcessorFactory into updateRequestProcessorChain "distrib-dup-test-chain-implicit"
   [junit4]   2> 986474 INFO  (coreLoadExecutor-3425-thread-1) [    ] o.a.s.c.SolrCore no updateRequestProcessorChain defined as default, creating implicit default
   [junit4]   2> 986474 WARN  (coreLoadExecutor-3425-thread-1) [    ] o.a.s.c.RequestHandlers INVALID paramSet a in requestHandler {type = requestHandler,name = /dump,class = DumpRequestHandler,args = {defaults={a=A,b=B}}}
   [junit4]   2> 986475 INFO  (coreLoadExecutor-3425-thread-1) [    ] o.a.s.h.l.XMLLoader xsltCacheLifetimeSeconds=60
   [junit4]   2> 986476 INFO  (coreLoadExecutor-3425-thread-1) [    ] o.a.s.h.l.XMLLoader xsltCacheLifetimeSeconds=60
   [junit4]   2> 986476 INFO  (coreLoadExecutor-3425-thread-1) [    ] o.a.s.h.l.XMLLoader xsltCacheLifetimeSeconds=60
   [junit4]   2> 986477 INFO  (coreLoadExecutor-3425-thread-1) [    ] o.a.s.h.l.XMLLoader xsltCacheLifetimeSeconds=60
   [junit4]   2> 986478 INFO  (coreLoadExecutor-3425-thread-1) [    ] o.a.s.c.RequestHandlers Registered paths: /admin/mbeans,standard,/dump,/update/csv,/sql,/update/json/docs,/admin/luke,/export,/admin/segments,/get,/admin/system,/replication,/admin/properties,/config,/stream,/schema,/admin/plugins,/admin/logging,/update/json,/admin/threads,/admin/ping,/update,/admin/file
   [junit4]   2> 986479 INFO  (coreLoadExecutor-3425-thread-1) [    ] o.a.s.c.SolrCore Using default statsCache cache: org.apache.solr.search.stats.LocalStatsCache
   [junit4]   2> 986479 INFO  (coreLoadExecutor-3425-thread-1) [    ] o.a.s.u.UpdateHandler Using UpdateLog implementation: org.apache.solr.update.UpdateLog
   [junit4]   2> 986479 INFO  (coreLoadExecutor-3425-thread-1) [    ] o.a.s.u.UpdateLog Initializing UpdateLog: dataDir= defaultSyncLevel=FLUSH numRecordsToKeep=100 maxNumLogsToKeep=10 numVersionBuckets=65536
   [junit4]   2> 986492 INFO  (coreLoadExecutor-3425-thread-1) [    ] o.a.s.u.CommitTracker Hard AutoCommit: disabled
   [junit4]   2> 986492 INFO  (coreLoadExecutor-3425-thread-1) [    ] o.a.s.u.CommitTracker Soft AutoCommit: disabled
   [junit4]   2> 986493 INFO  (coreLoadExecutor-3425-thread-1) [    ] o.a.s.u.RandomMergePolicy RandomMergePolicy wrapping class org.apache.lucene.index.LogByteSizeMergePolicy: [LogByteSizeMergePolicy: minMergeSize=1677721, mergeFactor=31, maxMergeSize=2147483648, maxMergeSizeForForcedMerge=9223372036854775807, calibrateSizeByDeletes=false, maxMergeDocs=2147483647, maxCFSSegmentSizeMB=8.796093022207999E12, noCFSRatio=0.23370784110350354]
   [junit4]   2> 986493 INFO  (coreLoadExecutor-3425-thread-1) [    ] o.a.s.c.SolrDeletionPolicy SolrDeletionPolicy.onInit: commits: num=1
   [junit4]   2> 	commit{dir=MockDirectoryWrapper(RAMDirectory@49f59304 lockFactory=org.apache.lucene.store.SingleInstanceLockFactory@5c5d3e2f),segFN=segments_1,generation=1}
   [junit4]   2> 986493 INFO  (coreLoadExecutor-3425-thread-1) [    ] o.a.s.c.SolrDeletionPolicy newest commit generation = 1
   [junit4]   2> 986493 INFO  (coreLoadExecutor-3425-thread-1) [    ] o.a.s.s.SolrIndexSearcher Opening [Searcher@14edb007[collection1] main]
   [junit4]   2> 986493 INFO  (coreLoadExecutor-3425-thread-1) [    ] o.a.s.c.c.ZkStateReader Load collection config from: [/collections/control_collection]
   [junit4]   2> 986493 INFO  (coreLoadExecutor-3425-thread-1) [    ] o.a.s.c.c.ZkStateReader path=[/collections/control_collection] [configName]=[conf1] specified config exists in ZooKeeper
   [junit4]   2> 986493 INFO  (coreLoadExecutor-3425-thread-1) [    ] o.a.s.r.ManagedResourceStorage Setting up ZooKeeper-based storage for the RestManager with znodeBase: /configs/conf1
   [junit4]   2> 986494 INFO  (coreLoadExecutor-3425-thread-1) [    ] o.a.s.r.ManagedResourceStorage Configured ZooKeeperStorageIO with znodeBase: /configs/conf1
   [junit4]   2> 986494 INFO  (coreLoadExecutor-3425-thread-1) [    ] o.a.s.r.RestManager Initializing RestManager with initArgs: {}
   [junit4]   2> 986494 INFO  (coreLoadExecutor-3425-thread-1) [    ] o.a.s.r.ManagedResourceStorage Reading _rest_managed.json using ZooKeeperStorageIO:path=/configs/conf1
   [junit4]   2> 986494 INFO  (coreLoadExecutor-3425-thread-1) [    ] o.a.s.r.ManagedResourceStorage No data found for znode /configs/conf1/_rest_managed.json
   [junit4]   2> 986494 INFO  (coreLoadExecutor-3425-thread-1) [    ] o.a.s.r.ManagedResourceStorage Loaded null at path _rest_managed.json using ZooKeeperStorageIO:path=/configs/conf1
   [junit4]   2> 986494 INFO  (coreLoadExecutor-3425-thread-1) [    ] o.a.s.r.RestManager Initializing 0 registered ManagedResources
   [junit4]   2> 986494 INFO  (coreLoadExecutor-3425-thread-1) [    ] o.a.s.h.ReplicationHandler Commits will be reserved for  10000
   [junit4]   2> 986495 INFO  (searcherExecutor-3426-thread-1) [    ] o.a.s.c.SolrCore [collection1] Registered new searcher Searcher@14edb007[collection1] main{ExitableDirectoryReader(UninvertingDirectoryReader())}
   [junit4]   2> 986509 INFO  (coreLoadExecutor-3425-thread-1) [    ] o.a.s.u.UpdateLog Looking up max value of version field to seed version buckets
   [junit4]   2> 986509 INFO  (coreLoadExecutor-3425-thread-1) [    ] o.a.s.u.VersionInfo Refreshing highest value of _version_ for 65536 version buckets from index
   [junit4]   2> 986509 INFO  (coreLoadExecutor-3425-thread-1) [    ] o.a.s.u.VersionInfo No terms found for _version_, cannot seed version bucket highest value from index
   [junit4]   2> 986509 INFO  (coreLoadExecutor-3425-thread-1) [    ] o.a.s.u.UpdateLog Could not find max version in index or recent updates, using new clock 1525704152673419264
   [junit4]   2> 986511 INFO  (coreLoadExecutor-3425-thread-1) [    ] o.a.s.u.UpdateLog Took 1.0ms to seed version buckets with highest version 1525704152673419264
   [junit4]   2> 986511 INFO  (coreLoadExecutor-3425-thread-1) [    ] o.a.s.c.ZkController watch zkdir /configs/conf1
   [junit4]   2> 986511 INFO  (coreLoadExecutor-3425-thread-1) [    ] o.a.s.c.CoreContainer registering core: collection1
   [junit4]   2> 986512 INFO  (coreZkRegister-3419-thread-1) [    ] o.a.s.c.ZkController Register replica - core:collection1 address:http://127.0.0.1:56488 collection:control_collection shard:shard1
   [junit4]   2> 986512 INFO  (coreZkRegister-3419-thread-1) [    ] o.a.s.c.c.SolrZkClient makePath: /collections/control_collection/leader_elect/shard1/election
   [junit4]   2> 986514 INFO  (coreZkRegister-3419-thread-1) [    ] o.a.s.c.LeaderElector Joined leadership election with path: /collections/control_collection/leader_elect/shard1/election/95356509452828676-core_node1-n_0000000000
   [junit4]   2> 986514 INFO  (coreZkRegister-3419-thread-1) [    ] o.a.s.c.ShardLeaderElectionContext Running the leader process for shard=shard1 and weAreReplacement=false and leaderVoteWait=180000
   [junit4]   2> 986515 INFO  (coreZkRegister-3419-thread-1) [    ] o.a.s.c.ShardLeaderElectionContext Enough replicas found to continue.
   [junit4]   2> 986515 INFO  (coreZkRegister-3419-thread-1) [    ] o.a.s.c.ShardLeaderElectionContext I may be the new leader - try and sync
   [junit4]   2> 986515 INFO  (coreZkRegister-3419-thread-1) [    ] o.a.s.c.SyncStrategy Sync replicas to http://127.0.0.1:56488/collection1/
   [junit4]   2> 986515 INFO  (coreZkRegister-3419-thread-1) [    ] o.a.s.c.SyncStrategy Sync Success - now sync replicas to me
   [junit4]   2> 986515 INFO  (OverseerStateUpdate-95356509452828676-127.0.0.1:56488_-n_0000000000) [    ] o.a.s.c.Overseer processMessage: queueSize: 1, message = {
   [junit4]   2>   "operation":"leader",
   [junit4]   2>   "shard":"shard1",
   [junit4]   2>   "collection":"control_collection"} current state version: 1
   [junit4]   2> 986515 INFO  (coreZkRegister-3419-thread-1) [    ] o.a.s.c.SyncStrategy http://127.0.0.1:56488/collection1/ has no replicas
   [junit4]   2> 986515 INFO  (coreZkRegister-3419-thread-1) [    ] o.a.s.c.c.SolrZkClient makePath: /collections/control_collection/leaders/shard1
   [junit4]   2> 986516 INFO  (coreZkRegister-3419-thread-1) [    ] o.a.s.c.ShardLeaderElectionContextBase Creating leader registration node
   [junit4]   2> 986517 INFO  (coreZkRegister-3419-thread-1) [    ] o.a.s.c.ShardLeaderElectionContext I am the new leader: http://127.0.0.1:56488/collection1/ shard1
   [junit4]   2> 986573 INFO  (OverseerStateUpdate-95356509452828676-127.0.0.1:56488_-n_0000000000) [    ] o.a.s.c.Overseer processMessage: queueSize: 1, message = {
   [junit4]   2>   "operation":"leader",
   [junit4]   2>   "shard":"shard1",
   [junit4]   2>   "collection":"control_collection",
   [junit4]   2>   "base_url":"http://127.0.0.1:56488",
   [junit4]   2>   "core":"collection1",
   [junit4]   2>   "state":"active"} current state version: 1
   [junit4]   2> 986675 INFO  (zkCallback-1277-thread-1) [    ] o.a.s.c.c.ZkStateReader A cluster state change: [WatchedEvent state:SyncConnected type:NodeDataChanged path:/clusterstate.json], has occurred - updating... (live nodes size: [1])
   [junit4]   2> 986724 INFO  (coreZkRegister-3419-thread-1) [    ] o.a.s.c.ZkController We are http://127.0.0.1:56488/collection1/ and leader is http://127.0.0.1:56488/collection1/
   [junit4]   2> 986724 INFO  (coreZkRegister-3419-thread-1) [    ] o.a.s.c.ZkController No LogReplay needed for core=collection1 baseURL=http://127.0.0.1:56488
   [junit4]   2> 986724 INFO  (coreZkRegister-3419-thread-1) [    ] o.a.s.c.ZkController I am the leader, no recovery necessary
   [junit4]   2> 986724 INFO  (coreZkRegister-3419-thread-1) [    ] o.a.s.c.ZkController publishing state=active
   [junit4]   2> 986724 INFO  (coreZkRegister-3419-thread-1) [    ] o.a.s.c.ZkController numShards not found on descriptor - reading it from system property
   [junit4]   2> 986725 INFO  (OverseerStateUpdate-95356509452828676-127.0.0.1:56488_-n_0000000000) [    ] o.a.s.c.Overseer processMessage: queueSize: 1, message = {
   [junit4]   2>   "core":"collection1",
   [junit4]   2>   "core_node_name":"core_node1",
   [junit4]   2>   "roles":null,
   [junit4]   2>   "base_url":"http://127.0.0.1:56488",
   [junit4]   2>   "node_name":"127.0.0.1:56488_",
   [junit4]   2>   "numShards":"1",
   [junit4]   2>   "state":"active",
   [junit4]   2>   "shard":"shard1",
   [junit4]   2>   "collection":"control_collection",
   [junit4]   2>   "operation":"state"} current state version: 2
   [junit4]   2> 986725 INFO  (OverseerStateUpdate-95356509452828676-127.0.0.1:56488_-n_0000000000) [    ] o.a.s.c.o.ReplicaMutator Update state numShards=1 message={
   [junit4]   2>   "core":"collection1",
   [junit4]   2>   "core_node_name":"core_node1",
   [junit4]   2>   "roles":null,
   [junit4]   2>   "base_url":"http://127.0.0.1:56488",
   [junit4]   2>   "node_name":"127.0.0.1:56488_",
   [junit4]   2>   "numShards":"1",
   [junit4]   2>   "state":"active",
   [junit4]   2>   "shard":"shard1",
   [junit4]   2>   "collection":"control_collection",
   [junit4]   2>   "operation":"state"}
   [junit4]   2> 986826 INFO  (zkCallback-1277-thread-1) [    ] o.a.s.c.c.ZkStateReader A cluster state change: [WatchedEvent state:SyncConnected type:NodeDataChanged path:/clusterstate.json], has occurred - updating... (live nodes size: [1])
   [junit4]   2> 986848 INFO  (TEST-CollectionsAPIDistributedZkTest.test-seed#[F46F9DBF2A70DB9A]) [    ] o.a.s.c.c.SolrZkClient Using default ZkCredentialsProvider
   [junit4]   2> 986848 INFO  (TEST-CollectionsAPIDistributedZkTest.test-seed#[F46F9DBF2A70DB9A]) [    ] o.a.s.c.c.ConnectionManager Waiting for client to connect to ZooKeeper
   [junit4]   2> 986849 INFO  (zkCallback-1279-thread-1) [    ] o.a.s.c.c.ConnectionManager Watcher org.apache.solr.common.cloud.ConnectionManager@3fd40761 name:ZooKeeperConnection Watcher:127.0.0.1:38220/solr got event WatchedEvent state:SyncConnected type:None path:null path:null type:None
   [junit4]   2> 986849 INFO  (TEST-CollectionsAPIDistributedZkTest.test-seed#[F46F9DBF2A70DB9A]) [    ] o.a.s.c.c.ConnectionManager Client is connected to ZooKeeper
   [junit4]   2> 986849 INFO  (TEST-CollectionsAPIDistributedZkTest.test-seed#[F46F9DBF2A70DB9A]) [    ] o.a.s.c.c.SolrZkClient Using default ZkACLProvider
   [junit4]   2> 986849 INFO  (TEST-CollectionsAPIDistributedZkTest.test-seed#[F46F9DBF2A70DB9A]) [    ] o.a.s.c.c.ZkStateReader Updating cluster state from ZooKeeper... 
   [junit4]   2> 986850 INFO  (TEST-CollectionsAPIDistributedZkTest.test-seed#[F46F9DBF2A70DB9A]) [    ] o.a.s.c.ChaosMonkey monkey: init - expire sessions:false cause connection loss:false
   [junit4]   2> 986925 INFO  (TEST-CollectionsAPIDistributedZkTest.test-seed#[F46F9DBF2A70DB9A]) [    ] o.a.s.SolrTestCaseJ4 Writing core.properties file to /home/jenkins/workspace/Lucene-Solr-trunk-Linux/solr/build/solr-core/test/J0/temp/solr.cloud.CollectionsAPIDistributedZkTest_F46F9DBF2A70DB9A-001/shard-1-001/cores/collection1
   [junit4]   2> 986925 INFO  (TEST-CollectionsAPIDistributedZkTest.test-seed#[F46F9DBF2A70DB9A]) [    ] o.a.s.c.AbstractFullDistribZkTestBase create jetty 1 in directory /home/jenkins/workspace/Lucene-Solr-trunk-Linux/solr/build/solr-core/test/J0/temp/solr.cloud.CollectionsAPIDistributedZkTest_F46F9DBF2A70DB9A-001/shard-1-001
   [junit4]   2> 986926 INFO  (TEST-CollectionsAPIDistributedZkTest.test-seed#[F46F9DBF2A70DB9A]) [    ] o.e.j.s.Server jetty-9.2.13.v20150730
   [junit4]   2> 986927 INFO  (TEST-CollectionsAPIDistributedZkTest.test-seed#[F46F9DBF2A70DB9A]) [    ] o.e.j.s.h.ContextHandler Started o.e.j.s.ServletContextHandler@395cbb8c{/,null,AVAILABLE}
   [junit4]   2> 986927 INFO  (TEST-CollectionsAPIDistributedZkTest.test-seed#[F46F9DBF2A70DB9A]) [    ] o.e.j.s.ServerConnector Started ServerConnector@4bc375c5{HTTP/1.1}{127.0.0.1:۵۳۵۷۲}
   [junit4]   2> 986927 INFO  (TEST-CollectionsAPIDistributedZkTest.test-seed#[F46F9DBF2A70DB9A]) [    ] o.e.j.s.Server Started @۹۸۸۷۵۲ms
   [junit4]   2> 986927 INFO  (TEST-CollectionsAPIDistributedZkTest.test-seed#[F46F9DBF2A70DB9A]) [    ] o.a.s.c.s.e.JettySolrRunner Jetty properties: {solr.data.dir=/home/jenkins/workspace/Lucene-Solr-trunk-Linux/solr/build/solr-core/test/J0/temp/solr.cloud.CollectionsAPIDistributedZkTest_F46F9DBF2A70DB9A-001/tempDir-001/jetty1, solrconfig=solrconfig.xml, hostContext=/, hostPort=53572, coreRootDirectory=/home/jenkins/workspace/Lucene-Solr-trunk-Linux/solr/build/solr-core/test/J0/temp/solr.cloud.CollectionsAPIDistributedZkTest_F46F9DBF2A70DB9A-001/shard-1-001/cores}
   [junit4]   2> 986927 INFO  (TEST-CollectionsAPIDistributedZkTest.test-seed#[F46F9DBF2A70DB9A]) [    ] o.a.s.s.SolrDispatchFilter SolrDispatchFilter.init(): sun.misc.Launcher$AppClassLoader@6996db8
   [junit4]   2> 986927 INFO  (TEST-CollectionsAPIDistributedZkTest.test-seed#[F46F9DBF2A70DB9A]) [    ] o.a.s.c.SolrResourceLoader new SolrResourceLoader for directory: '/home/jenkins/workspace/Lucene-Solr-trunk-Linux/solr/build/solr-core/test/J0/temp/solr.cloud.CollectionsAPIDistributedZkTest_F46F9DBF2A70DB9A-001/shard-1-001'
   [junit4]   2> 986927 INFO  (TEST-CollectionsAPIDistributedZkTest.test-seed#[F46F9DBF2A70DB9A]) [    ] o.a.s.c.SolrResourceLoader JNDI not configured for solr (NoInitialContextEx)
   [junit4]   2> 986927 INFO  (TEST-CollectionsAPIDistributedZkTest.test-seed#[F46F9DBF2A70DB9A]) [    ] o.a.s.c.SolrResourceLoader solr home defaulted to 'solr/' (could not find system property or JNDI)
   [junit4]   2> 986928 INFO  (TEST-CollectionsAPIDistributedZkTest.test-seed#[F46F9DBF2A70DB9A]) [    ] o.a.s.c.c.SolrZkClient Using default ZkCredentialsProvider
   [junit4]   2> 986928 INFO  (TEST-CollectionsAPIDistributedZkTest.test-seed#[F46F9DBF2A70DB9A]) [    ] o.a.s.c.c.ConnectionManager Waiting for client to connect to ZooKeeper
   [junit4]   2> 986929 INFO  (zkCallback-1280-thread-1) [    ] o.a.s.c.c.ConnectionManager Watcher org.apache.solr.common.cloud.ConnectionManager@22f22036 name:ZooKeeperConnection Watcher:127.0.0.1:38220/solr got event WatchedEvent state:SyncConnected type:None path:null path:null type:None
   [junit4]   2> 986929 INFO  (TEST-CollectionsAPIDistributedZkTest.test-seed#[F46F9DBF2A70DB9A]) [    ] o.a.s.c.c.ConnectionManager Client is connected to ZooKeeper
   [junit4]   2> 986929 INFO  (TEST-CollectionsAPIDistributedZkTest.test-seed#[F46F9DBF2A70DB9A]) [    ] o.a.s.c.c.SolrZkClient Using default ZkACLProvider
   [junit4]   2> 986930 INFO  (TEST-CollectionsAPIDistributedZkTest.test-seed#[F46F9DBF2A70DB9A]) [    ] o.a.s.s.SolrDispatchFilter Loading solr.xml from SolrHome (not found in ZooKeeper)
   [junit4]   2> 986930 INFO  (TEST-CollectionsAPIDistributedZkTest.test-seed#[F46F9DBF2A70DB9A]) [    ] o.a.s.c.SolrXmlConfig Loading container configuration from /home/jenkins/workspace/Lucene-Solr-trunk-Linux/solr/build/solr-core/test/J0/temp/solr.cloud.CollectionsAPIDistributedZkTest_F46F9DBF2A70DB9A-001/shard-1-001/solr.xml
   [junit4]   2> 986933 INFO  (TEST-CollectionsAPIDistributedZkTest.test-seed#[F46F9DBF2A70DB9A]) [    ] o.a.s.c.CorePropertiesLocator Config-defined core root directory: /home/jenkins/workspace/Lucene-Solr-trunk-Linux/solr/build/solr-core/test/J0/temp/solr.cloud.CollectionsAPIDistributedZkTest_F46F9DBF2A70DB9A-001/shard-1-001/cores
   [junit4]   2> 986933 INFO  (TEST-CollectionsAPIDistributedZkTest.test-seed#[F46F9DBF2A70DB9A]) [    ] o.a.s.c.CoreContainer New CoreContainer 1914562213
   [junit4]   2> 986933 INFO  (TEST-CollectionsAPIDistributedZkTest.test-seed#[F46F9DBF2A70DB9A]) [    ] o.a.s.c.CoreContainer Loading cores into CoreContainer [instanceDir=/home/jenkins/workspace/Lucene-Solr-trunk-Linux/solr/build/solr-core/test/J0/temp/solr.cloud.CollectionsAPIDistributedZkTest_F46F9DBF2A70DB9A-001/shard-1-001]
   [junit4]   2> 986933 WARN  (TEST-CollectionsAPIDistributedZkTest.test-seed#[F46F9DBF2A70DB9A]) [    ] o.a.s.c.CoreContainer Couldn't add files from /home/jenkins/workspace/Lucene-Solr-trunk-Linux/solr/build/solr-core/test/J0/temp/solr.cloud.CollectionsAPIDistributedZkTest_F46F9DBF2A70DB9A-001/shard-1-001/lib to classpath: /home/jenkins/workspace/Lucene-Solr-trunk-Linux/solr/build/solr-core/test/J0/temp/solr.cloud.CollectionsAPIDistributedZkTest_F46F9DBF2A70DB9A-001/shard-1-001/lib
   [junit4]   2> 986933 INFO  (TEST-CollectionsAPIDistributedZkTest.test-seed#[F46F9DBF2A70DB9A]) [    ] o.a.s.h.c.HttpShardHandlerFactory created with socketTimeout : 90000,urlScheme : ,connTimeout : 15000,maxConnectionsPerHost : 20,maxConnections : 10000,corePoolSize : 0,maximumPoolSize : 2147483647,maxThreadIdleTime : 5,sizeOfQueue : -1,fairnessPolicy : false,useRetries : false,
   [junit4]   2> 986934 INFO  (TEST-CollectionsAPIDistributedZkTest.test-seed#[F46F9DBF2A70DB9A]) [    ] o.a.s.u.UpdateShardHandler Creating UpdateShardHandler HTTP client with params: socketTimeout=340000&connTimeout=45000&retry=true
   [junit4]   2> 986934 INFO  (TEST-CollectionsAPIDistributedZkTest.test-seed#[F46F9DBF2A70DB9A]) [    ] o.a.s.l.LogWatcher SLF4J impl is org.slf4j.impl.Log4jLoggerFactory
   [junit4]   2> 986934 INFO  (TEST-CollectionsAPIDistributedZkTest.test-seed#[F46F9DBF2A70DB9A]) [    ] o.a.s.l.LogWatcher Registering Log Listener [Log4j (org.slf4j.impl.Log4jLoggerFactory)]
   [junit4]   2> 986935 INFO  (TEST-CollectionsAPIDistributedZkTest.test-seed#[F46F9DBF2A70DB9A]) [    ] o.a.s.c.ZkContainer Zookeeper client=127.0.0.1:38220/solr
   [junit4]   2> 986935 INFO  (TEST-CollectionsAPIDistributedZkTest.test-seed#[F46F9DBF2A70DB9A]) [    ] o.a.s.c.ZkController zkHost includes chroot
   [junit4]   2> 986935 INFO  (TEST-CollectionsAPIDistributedZkTest.test-seed#[F46F9DBF2A70DB9A]) [    ] o.a.s.c.c.SolrZkClient Using default ZkCredentialsProvider
   [junit4]   2> 986935 INFO  (TEST-CollectionsAPIDistributedZkTest.test-seed#[F46F9DBF2A70DB9A]) [    ] o.a.s.c.c.ConnectionManager Waiting for client to connect to ZooKeeper
   [junit4]   2> 986936 INFO  (zkCallback-1283-thread-1) [    ] o.a.s.c.c.ConnectionManager Watcher org.apache.solr.common.cloud.ConnectionManager@7a75f2e6 name:ZooKeeperConnection Watcher:127.0.0.1:38220 got event WatchedEvent state:SyncConnected type:None path:null path:null type:None
   [junit4]   2> 986936 INFO  (TEST-CollectionsAPIDistributedZkTest.test-seed#[F46F9DBF2A70DB9A]) [    ] o.a.s.c.c.ConnectionManager Client is connected to ZooKeeper
   [junit4]   2> 986936 INFO  (TEST-CollectionsAPIDistributedZkTest.test-seed#[F46F9DBF2A70DB9A]) [    ] o.a.s.c.c.SolrZkClient Using default ZkACLProvider
   [junit4]   2> 986936 INFO  (TEST-CollectionsAPIDistributedZkTest.test-seed#[F46F9DBF2A70DB9A]) [    ] o.a.s.c.c.ConnectionManager Waiting for client to connect to ZooKeeper
   [junit4]   2> 986937 INFO  (zkCallback-1284-thread-1) [    ] o.a.s.c.c.ConnectionManager Watcher org.apache.solr.common.cloud.ConnectionManager@69470bdd name:ZooKeeperConnection Watcher:127.0.0.1:38220/solr got event WatchedEvent state:SyncConnected type:None path:null path:null type:None
   [junit4]   2> 986937 INFO  (TEST-CollectionsAPIDistributedZkTest.test-seed#[F46F9DBF2A70DB9A]) [    ] o.a.s.c.c.ConnectionManager Client is connected to ZooKeeper
   [junit4]   2> 986939 INFO  (TEST-CollectionsAPIDistributedZkTest.test-seed#[F46F9DBF2A70DB9A]) [    ] o.a.s.c.c.ZkStateReader Updating cluster state from ZooKeeper... 
   [junit4]   2> 987942 INFO  (TEST-CollectionsAPIDistributedZkTest.test-seed#[F46F9DBF2A70DB9A]) [    ] o.a.s.c.ZkController Register node as live in ZooKeeper:/live_nodes/127.0.0.1:53572_
   [junit4]   2> 987942 INFO  (TEST-CollectionsAPIDistributedZkTest.test-seed#[F46F9DBF2A70DB9A]) [    ] o.a.s.c.c.SolrZkClient makePath: /live_nodes/127.0.0.1:53572_
   [junit4]   2> 987942 INFO  (zkCallback-1277-thread-1) [    ] o.a.s.c.c.ZkStateReader A live node change: [WatchedEvent state:SyncConnected type:NodeChildrenChanged path:/live_nodes], has occurred - updating... (live nodes size: [1])
   [junit4]   2> 987942 INFO  (zkCallback-1279-thread-1) [    ] o.a.s.c.c.ZkStateReader A live node change: [WatchedEvent state:SyncConnected type:NodeChildrenChanged path:/live_nodes], has occurred - updating... (live nodes size: [1])
   [junit4]   2> 987942 INFO  (zkCallback-1284-thread-1) [    ] o.a.s.c.c.ZkStateReader A live node change: [WatchedEvent state:SyncConnected type:NodeChildrenChanged path:/live_nodes], has occurred - updating... (live nodes size: [1])
   [junit4]   2> 987944 INFO  (TEST-CollectionsAPIDistributedZkTest.test-seed#[F46F9DBF2A70DB9A]) [    ] o.a.s.c.Overseer Overseer (id=null) closing
   [junit4]   2> 987944 INFO  (TEST-CollectionsAPIDistributedZkTest.test-seed#[F46F9DBF2A70DB9A]) [    ] o.a.s.c.LeaderElector Joined leadership election with path: /overseer_elect/election/95356509452828680-127.0.0.1:53572_-n_0000000001
   [junit4]   2> 987945 INFO  (TEST-CollectionsAPIDistributedZkTest.test-seed#[F46F9DBF2A70DB9A]) [    ] o.a.s.c.LeaderElector Watching path /overseer_elect/election/95356509452828676-127.0.0.1:56488_-n_0000000000 to know if I could be the leader
   [junit4]   2> 987954 INFO  (TEST-CollectionsAPIDistributedZkTest.test-seed#[F46F9DBF2A70DB9A]) [    ] o.a.s.c.CoreContainer Security conf doesn't exist. Skipping setup for authorization module.
   [junit4]   2> 987954 INFO  (TEST-CollectionsAPIDistributedZkTest.test-seed#[F46F9DBF2A70DB9A]) [    ] o.a.s.c.CoreContainer No authentication plugin used.
   [junit4]   2> 987955 INFO  (TEST-CollectionsAPIDistributedZkTest.test-seed#[F46F9DBF2A70DB9A]) [    ] o.a.s.c.CorePropertiesLocator Looking for core definitions underneath /home/jenkins/workspace/Lucene-Solr-trunk-Linux/solr/build/solr-core/test/J0/temp/solr.cloud.CollectionsAPIDistributedZkTest_F46F9DBF2A70DB9A-001/shard-1-001/cores
   [junit4]   2> 987955 INFO  (TEST-CollectionsAPIDistributedZkTest.test-seed#[F46F9DBF2A70DB9A]) [    ] o.a.s.c.CoreDescriptor Created CoreDescriptor: {name=collection1, config=solrconfig.xml, transient=false, schema=schema.xml, loadOnStartup=true, configSetProperties=configsetprops.json, collection=collection1, coreNodeName=, dataDir=data/, shard=}
   [junit4]   2> 987955 INFO  (TEST-CollectionsAPIDistributedZkTest.test-seed#[F46F9DBF2A70DB9A]) [    ] o.a.s.c.CorePropertiesLocator Found core collection1 in /home/jenkins/workspace/Lucene-Solr-trunk-Linux/solr/build/solr-core/test/J0/temp/solr.cloud.CollectionsAPIDistributedZkTest_F46F9DBF2A70DB9A-001/shard-1-001/cores/collection1
   [junit4]   2> 987955 INFO  (TEST-CollectionsAPIDistributedZkTest.test-seed#[F46F9DBF2A70DB9A]) [    ] o.a.s.c.CorePropertiesLocator Found 1 core definitions
   [junit4]   2> 987956 INFO  (TEST-CollectionsAPIDistributedZkTest.test-seed#[F46F9DBF2A70DB9A]) [    ] o.a.s.s.SolrDispatchFilter user.dir=/home/jenkins/workspace/Lucene-Solr-trunk-Linux/solr/build/solr-core/test/J0
   [junit4]   2> 987956 INFO  (TEST-CollectionsAPIDistributedZkTest.test-seed#[F46F9DBF2A70DB9A]) [    ] o.a.s.s.SolrDispatchFilter SolrDispatchFilter.init() done
   [junit4]   2> 987956 INFO  (coreLoadExecutor-3436-thread-1) [    ] o.a.s.c.ZkController publishing state=down
   [junit4]   2> 987956 INFO  (coreLoadExecutor-3436-thread-1) [    ] o.a.s.c.ZkController numShards not found on descriptor - reading it from system property
   [junit4]   2> 987957 INFO  (OverseerStateUpdate-95356509452828676-127.0.0.1:56488_-n_0000000000) [    ] o.a.s.c.Overseer processMessage: queueSize: 1, message = {
   [junit4]   2>   "core":"collection1",
   [junit4]   2>   "roles":null,
   [junit4]   2>   "base_url":"http://127.0.0.1:53572",
   [junit4]   2>   "node_name":"127.0.0.1:53572_",
   [junit4]   2>   "numShards":"2",
   [junit4]   2>   "state":"down",
   [junit4]   2>   "shard":null,
   [junit4]   2>   "collection":"collection1",
   [junit4]   2>   "operation":"state"} current state version: 3
   [junit4]   2> 987957 INFO  (coreLoadExecutor-3436-thread-1) [    ] o.a.s.c.ZkController look for our core node name
   [junit4]   2> 987957 INFO  (OverseerStateUpdate-95356509452828676-127.0.0.1:56488_-n_0000000000) [    ] o.a.s.c.o.ReplicaMutator Update state numShards=2 message={
   [junit4]   2>   "core":"collection1",
   [junit4]   2>   "roles":null,
   [junit4]   2>   "base_url":"http://127.0.0.1:53572",
   [junit4]   2>   "node_name":"127.0.0.1:53572_",
   [junit4]   2>   "numShards":"2",
   [junit4]   2>   "state":"down",
   [junit4]   2>   "shard":null,
   [junit4]   2>   "collection":"collection1",
   [junit4]   2>   "operation":"state"}
   [junit4]   2> 987957 INFO  (OverseerStateUpdate-95356509452828676-127.0.0.1:56488_-n_0000000000) [    ] o.a.s.c.o.ClusterStateMutator building a new cName: collection1
   [junit4]   2> 987957 INFO  (OverseerStateUpdate-95356509452828676-127.0.0.1:56488_-n_0000000000) [    ] o.a.s.c.o.ReplicaMutator Assigning new node to shard shard=shard2
   [junit4]   2> 988065 INFO  (zkCallback-1277-thread-1) [    ] o.a.s.c.c.ZkStateReader A cluster state change: [WatchedEvent state:SyncConnected type:NodeDataChanged path:/clusterstate.json], has occurred - updating... (live nodes size: [2])
   [junit4]   2> 988065 INFO  (zkCallback-1284-thread-1) [    ] o.a.s.c.c.ZkStateReader A cluster state change: [WatchedEvent state:SyncConnected type:NodeDataChanged path:/clusterstate.json], has occurred - updating... (live nodes size: [2])
   [junit4]   2> 988066 INFO  (zkCallback-1279-thread-1) [    ] o.a.s.c.c.ZkStateReader A cluster state change: [WatchedEvent state:SyncConnected type:NodeDataChanged path:/clusterstate.json], has occurred - updating... (live nodes size: [2])
   [junit4]   2> 988957 INFO  (coreLoadExecutor-3436-thread-1) [    ] o.a.s.c.ZkController waiting to find shard id in clusterstate for collection1
   [junit4]   2> 988957 INFO  (coreLoadExecutor-3436-thread-1) [    ] o.a.s.c.ZkController Check for collection zkNode:collection1
   [junit4]   2> 988958 INFO  (coreLoadExecutor-3436-thread-1) [    ] o.a.s.c.ZkController Collection zkNode exists
   [junit4]   2> 988958 INFO  (coreLoadExecutor-3436-thread-1) [    ] o.a.s.c.c.ZkStateReader Load collection config from: [/collections/collection1]
   [junit4]   2> 988958 INFO  (coreLoadExecutor-3436-thread-1) [    ] o.a.s.c.c.ZkStateReader path=[/collections/collection1] [configName]=[conf1] specified config exists in ZooKeeper
   [junit4]   2> 988958 INFO  (coreLoadExecutor-3436-thread-1) [    ] o.a.s.c.SolrResourceLoader new SolrResourceLoader for directory: '/home/jenkins/workspace/Lucene-Solr-trunk-Linux/solr/build/solr-core/test/J0/temp/solr.cloud.CollectionsAPIDistributedZkTest_F46F9DBF2A70DB9A-001/shard-1-001/cores/collection1'
   [junit4]   2> 988958 INFO  (coreLoadExecutor-3436-thread-1) [    ] o.a.s.c.SolrResourceLoader JNDI not configured for solr (NoInitialContextEx)
   [junit4]   2> 988958 INFO  (coreLoadExecutor-3436-thread-1) [    ] o.a.s.c.SolrResourceLoader solr home defaulted to 'solr/' (could not find system property or JNDI)
   [junit4]   2> 988959 INFO  (coreLoadExecutor-3436-thread-1) [    ] o.a.s.c.Config loaded config solrconfig.xml with version 0 
   [junit4]   2> 988963 INFO  (coreLoadExecutor-3436-thread-1) [    ] o.a.s.c.SolrConfig current version of requestparams : -1
   [junit4]   2> 988967 INFO  (coreLoadExecutor-3436-thread-1) [    ] o.a.s.c.SolrConfig Using Lucene MatchVersion: 6.0.0
   [junit4]   2> 988976 INFO  (coreLoadExecutor-3436-thread-1) [    ] o.a.s.c.SolrConfig Loaded SolrConfig: solrconfig.xml
   [junit4]   2> 988981 INFO  (coreLoadExecutor-3436-thread-1) [    ] o.a.s.s.IndexSchema [collection1] Schema name=test
   [junit4]   2> 989064 INFO  (coreLoadExecutor-3436-thread-1) [    ] o.a.s.s.OpenExchangeRatesOrgProvider Initialized with rates=open-exchange-rates.json, refreshInterval=1440.
   [junit4]   2> 989069 INFO  (coreLoadExecutor-3436-thread-1) [    ] o.a.s.s.IndexSchema default search field in schema is text
   [junit4]   2> 989071 INFO  (coreLoadExecutor-3436-thread-1) [    ] o.a.s.s.IndexSchema unique key field: id
   [junit4]   2> 989076 INFO  (coreLoadExecutor-3436-thread-1) [    ] o.a.s.s.FileExchangeRateProvider Reloading exchange rates from file currency.xml
   [junit4]   2> 989078 INFO  (coreLoadExecutor-3436-thread-1) [    ] o.a.s.s.FileExchangeRateProvider Reloading exchange rates from file currency.xml
   [junit4]   2> 989079 INFO  (coreLoadExecutor-3436-thread-1) [    ] o.a.s.s.OpenExchangeRatesOrgProvider Reloading exchange rates from open-exchange-rates.json
   [junit4]   2> 989079 INFO  (coreLoadExecutor-3436-thread-1) [    ] o.a.s.s.OpenExchangeRatesOrgProvider Reloading exchange rates from open-exchange-rates.json
   [junit4]   2> 989080 INFO  (coreLoadExecutor-3436-thread-1) [    ] o.a.s.c.ConfigSetProperties Did not find ConfigSet properties, assuming default properties: Can't find resource 'configsetprops.json' in classpath or '/configs/conf1', cwd=/home/jenkins/workspace/Lucene-Solr-trunk-Linux/solr/build/solr-core/test/J0
   [junit4]   2> 989080 INFO  (coreLoadExecutor-3436-thread-1) [    ] o.a.s.c.CoreContainer Creating SolrCore 'collection1' using configuration from collection collection1
   [junit4]   2> 989081 INFO  (coreLoadExecutor-3436-thread-1) [    ] o.a.s.c.SolrCore org.apache.solr.core.MockDirectoryFactory
   [junit4]   2> 989081 INFO  (coreLoadExecutor-3436-thread-1) [    ] o.a.s.c.SolrCore [[collection1] ] Opening new SolrCore at [/home/jenkins/workspace/Lucene-Solr-trunk-Linux/solr/build/solr-core/test/J0/temp/solr.cloud.CollectionsAPIDistributedZkTest_F46F9DBF2A70DB9A-001/shard-1-001/cores/collection1], dataDir=[/home/jenkins/workspace/Lucene-Solr-trunk-Linux/solr/build/solr-core/test/J0/temp/solr.cloud.CollectionsAPIDistributedZkTest_F46F9DBF2A70DB9A-001/shard-1-001/cores/collection1/data/]
   [junit4]   2> 989081 INFO  (coreLoadExecutor-3436-thread-1) [    ] o.a.s.c.JmxMonitoredMap JMX monitoring is enabled. Adding Solr mbeans to JMX Server: com.sun.jmx.mbeanserver.JmxMBeanServer@3ac80386
   [junit4]   2> 989081 INFO  (coreLoadExecutor-3436-thread-1) [    ] o.a.s.c.CachingDirectoryFactory return new directory for /home/jenkins/workspace/Lucene-Solr-trunk-Linux/solr/build/solr-core/test/J0/temp/solr.cloud.CollectionsAPIDistributedZkTest_F46F9DBF2A70DB9A-001/shard-1-001/cores/collection1/data
   [junit4]   2> 989081 INFO  (coreLoadExecutor-3436-thread-1) [    ] o.a.s.c.SolrCore New index directory detected: old=null new=/home/jenkins/workspace/Lucene-Solr-trunk-Linux/solr/build/solr-core/test/J0/temp/solr.cloud.CollectionsAPIDistributedZkTest_F46F9DBF2A70DB9A-001/shard-1-001/cores/collection1/data/index/
   [junit4]   2> 989081 WARN  (coreLoadExecutor-3436-thread-1) [    ] o.a.s.c.SolrCore [collection1] Solr index directory '/home/jenkins/workspace/Lucene-Solr-trunk-Linux/solr/build/solr-core/test/J0/temp/solr.cloud.CollectionsAPIDistributedZkTest_F46F9DBF2A70DB9A-001/shard-1-001/cores/collection1/data/index' doesn't exist. Creating new index...
   [junit4]   2> 989082 INFO  (coreLoadExecutor-3436-thread-1) [    ] o.a.s.c.CachingDirectoryFactory return new directory for /home/jenkins/workspace/Lucene-Solr-trunk-Linux/solr/build/solr-core/test/J0/temp/solr.cloud.CollectionsAPIDistributedZkTest_F46F9DBF2A70DB9A-001/shard-1-001/cores/collection1/data/index
   [junit4]   2> 989082 INFO  (coreLoadExecutor-3436-thread-1) [    ] o.a.s.u.RandomMergePolicy RandomMergePolicy wrapping class org.apache.lucene.index.TieredMergePolicy: [TieredMergePolicy: maxMergeAtOnce=40, maxMergeAtOnceExplicit=28, maxMergedSegmentMB=45.7353515625, floorSegmentMB=0.953125, forceMergeDeletesPctAllowed=3.080536926998443, segmentsPerTier=43.0, maxCFSSegmentSizeMB=8.796093022207999E12, noCFSRatio=0.0
   [junit4]   2> 989082 INFO  (coreLoadExecutor-3436-thread-1) [    ] o.a.s.c.SolrDeletionPolicy SolrDeletionPolicy.onCommit: commits: num=1
   [junit4]   2> 	commit{dir=MockDirectoryWrapper(RAMDirectory@68f537b2 lockFactory=org.apache.lucene.store.SingleInstanceLockFactory@8e526e0),segFN=segments_1,generation=1}
   [junit4]   2> 989082 INFO  (coreLoadExecutor-3436-thread-1) [    ] o.a.s.c.SolrDeletionPolicy newest commit generation = 1
   [junit4]   2> 989083 INFO  (OldIndexDirectoryCleanupThreadForCore-collection1) [    ] o.a.s.c.SolrCore Looking for old index directories to cleanup for core collection1 in /home/jenkins/workspace/Lucene-Solr-trunk-Linux/solr/build/solr-core/test/J0/temp/solr.cloud.CollectionsAPIDistributedZkTest_F46F9DBF2A70DB9A-001/shard-1-001/cores/collection1/data/
   [junit4]   2> 989083 WARN  (OldIndexDirectoryCleanupThreadForCore-collection1) [    ] o.a.s.c.DirectoryFactory /home/jenkins/workspace/Lucene-Solr-trunk-Linux/solr/build/solr-core/test/J0/temp/solr.cloud.CollectionsAPIDistributedZkTest_F46F9DBF2A70DB9A-001/shard-1-001/cores/collection1/data/ does not point to a valid data directory; skipping clean-up of old index directories.
   [junit4]   2> 989085 INFO  (coreLoadExecutor-3436-thread-1) [    ] o.a.s.u.p.UpdateRequestProcessorChain creating updateRequestProcessorChain "nodistrib"
   [junit4]   2> 989085 INFO  (coreLoadExecutor-3436-thread-1) [    ] o.a.s.u.p.UpdateRequestProcessorChain creating updateRequestProcessorChain "dedupe"
   [junit4]   2> 989085 INFO  (coreLoadExecutor-3436-thread-1) [    ] o.a.s.u.p.UpdateRequestProcessorChain inserting DistributedUpdateProcessorFactory into updateRequestProcessorChain "dedupe"
   [junit4]   2> 989085 INFO  (coreLoadExecutor-3436-thread-1) [    ] o.a.s.u.p.UpdateRequestProcessorChain creating updateRequestProcessorChain "stored_sig"
   [junit4]   2> 989085 INFO  (coreLoadExecutor-3436-thread-1) [    ] o.a.s.u.p.UpdateRequestProcessorChain inserting DistributedUpdateProcessorFactory into updateRequestProcessorChain "stored_sig"
   [junit4]   2> 989085 INFO  (coreLoadExecutor-3436-thread-1) [    ] o.a.s.u.p.UpdateRequestProcessorChain creating updateRequestProcessorChain "distrib-dup-test-chain-explicit"
   [junit4]   2> 989086 INFO  (coreLoadExecutor-3436-thread-1) [    ] o.a.s.u.p.UpdateRequestProcessorChain creating updateRequestProcessorChain "distrib-dup-test-chain-implicit"
   [junit4]   2> 989086 INFO  (coreLoadExecutor-3436-thread-1) [    ] o.a.s.u.p.UpdateRequestProcessorChain inserting DistributedUpdateProcessorFactory into updateRequestProcessorChain "distrib-dup-test-chain-implicit"
   [junit4]   2> 989086 INFO  (coreLoadExecutor-3436-thread-1) [    ] o.a.s.c.SolrCore no updateRequestProcessorChain defined as default, creating implicit default
   [junit4]   2> 989086 WARN  (coreLoadExecutor-3436-thread-1) [    ] o.a.s.c.RequestHandlers INVALID paramSet a in requestHandler {type = requestHandler,name = /dump,class = DumpRequestHandler,args = {defaults={a=A,b=B}}}
   [junit4]   2> 989087 INFO  (coreLoadExecutor-3436-thread-1) [    ] o.a.s.h.l.XMLLoader xsltCacheLifetimeSeconds=60
   [junit4]   2> 989088 INFO  (coreLoadExecutor-3436-thread-1) [    ] o.a.s.h.l.XMLLoader xsltCacheLifetimeSeconds=60
   [junit4]   2> 989089 INFO  (coreLoadExecutor-3436-thread-1) [    ] o.a.s.h.l.XMLLoader xsltCacheLifetimeSeconds=60
   [junit4]   2> 989089 INFO  (coreLoadExecutor-3436-thread-1) [    ] o.a.s.h.l.XMLLoader xsltCacheLifetimeSeconds=60
   [junit4]   2> 989093 INFO  (coreLoadExecutor-3436-thread-1) [    ] o.a.s.c.RequestHandlers Registered paths: /admin/mbeans,standard,/dump,/update/csv,/sql,/update/json/docs,/admin/luke,/export,/admin/segments,/get,/admin/system,/replication,/admin/properties,/config,/stream,/schema,/admin/plugins,/admin/logging,/update/json,/admin/threads,/admin/ping,/update,/admin/file
   [junit4]   2> 989093 INFO  (coreLoadExecutor-3436-thread-1) [    ] o.a.s.c.SolrCore Using default statsCache cache: org.apache.solr.search.stats.LocalStatsCache
   [junit4]   2> 989094 INFO  (coreLoadExecutor-3436-thread-1) [    ] o.a.s.u.UpdateHandler Using UpdateLog implementation: org.apache.solr.update.UpdateLog
   [junit4]   2> 989094 INFO  (coreLoadExecutor-3436-thread-1) [    ] o.a.s.u.UpdateLog Initializing UpdateLog: dataDir= defaultSyncLevel=FLUSH numRecordsToKeep=100 maxNumLogsToKeep=10 numVersionBuckets=65536
   [junit4]   2> 989095 INFO  (coreLoadExecutor-3436-thread-1) [    ] o.a.s.u.CommitTracker Hard AutoCommit: disabled
   [junit4]   2> 989095 INFO  (coreLoadExecutor-3436-thread-1) [    ] o.a.s.u.CommitTracker Soft AutoCommit: disabled
   [junit4]   2> 989096 INFO  (coreLoadExecutor-3436-thread-1) [    ] o.a.s.u.RandomMergePolicy RandomMergePolicy wrapping class org.apache.lucene.index.LogByteSizeMergePolicy: [LogByteSizeMergePolicy: minMergeSize=1677721, mergeFactor=31, maxMergeSize=2147483648, maxMergeSizeForForcedMerge=9223372036854775807, calibrateSizeByDeletes=false, maxMergeDocs=2147483647, maxCFSSegmentSizeMB=8.796093022207999E12, noCFSRatio=0.23370784110350354]
   [junit4]   2> 989096 INFO  (coreLoadExecutor-3436-thread-1) [    ] o.a.s.c.SolrDeletionPolicy SolrDeletionPolicy.onInit: commits: num=1
   [junit4]   2> 	commit{dir=MockDirectoryWrapper(RAMDirectory@68f537b2 lockFactory=org.apache.lucene.store.SingleInstanceLockFactory@8e526e0),segFN=segments_1,generation=1}
   [junit4]   2> 989096 INFO  (coreLoadExecutor-3436-thread-1) [    ] o.a.s.c.SolrDeletionPolicy newest commit generation = 1
   [junit4]   2> 989097 INFO  (coreLoadExecutor-3436-thread-1) [    ] o.a.s.s.SolrIndexSearcher Opening [Searcher@3b8ae336[collection1] main]
   [junit4]   2> 989097 INFO  (coreLoadExecutor-3436-thread-1) [    ] o.a.s.c.c.ZkStateReader Load collection config from: [/collections/collection1]
   [junit4]   2> 989097 INFO  (coreLoadExecutor-3436-thread-1) [    ] o.a.s.c.c.ZkStateReader path=[/collections/collection1] [configName]=[conf1] specified config exists in ZooKeeper
   [junit4]   2> 989097 INFO  (coreLoadExecutor-3436-thread-1) [    ] o.a.s.r.ManagedResourceStorage Setting up ZooKeeper-based storage for the RestManager with znodeBase: /configs/conf1
   [junit4]   2> 989097 INFO  (coreLoadExecutor-3436-thread-1) [    ] o.a.s.r.ManagedResourceStorage Configured ZooKeeperStorageIO with znodeBase: /configs/conf1
   [junit4]   2> 989097 INFO  (coreLoadExecutor-3436-thread-1) [    ] o.a.s.r.RestManager Initializing RestManager with initArgs: {}
   [junit4]   2> 989098 INFO  (coreLoadExecutor-3436-thread-1) [    ] o.a.s.r.ManagedResourceStorage Reading _rest_managed.json using ZooKeeperStorageIO:path=/configs/conf1
   [junit4]   2> 989098 INFO  (coreLoadExecutor-3436-thread-1) [    ] o.a.s.r.ManagedResourceStorage No data found for znode /configs/conf1/_rest_managed.json
   [junit4]   2> 989098 INFO  (coreLoadExecutor-3436-thread-1) [    ] o.a.s.r.ManagedResourceStorage Loaded null at path _rest_managed.json using ZooKeeperStorageIO:path=/configs/conf1
   [junit4]   2> 989098 INFO  (coreLoadExecutor-3436-thread-1) [    ] o.a.s.r.RestManager Initializing 0 registered ManagedResources
   [junit4]   2> 989098 INFO  (coreLoadExecutor-3436-thread-1) [    ] o.a.s.h.ReplicationHandler Commits will be reserved for  10000
   [junit4]   2> 989099 INFO  (searcherExecutor-3437-thread-1) [    ] o.a.s.c.SolrCore [collection1] Registered new searcher Searcher@3b8ae336[collection1] main{ExitableDirectoryReader(UninvertingDirectoryReader())}
   [junit4]   2> 989099 INFO  (coreLoadExecutor-3436-thread-1) [    ] o.a.s.u.UpdateLog Looking up max value of version field to seed version buckets
   [junit4]   2> 989099 INFO  (coreLoadExecutor-3436-thread-1) [    ] o.a.s.u.VersionInfo Refreshing highest value of _version_ for 65536 version buckets from index
   [junit4]   2> 989099 INFO  (coreLoadExecutor-3436-thread-1) [    ] o.a.s.u.VersionInfo No terms found for _version_, cannot seed version bucket highest value from index
   [junit4]   2> 989099 INFO  (coreLoadExecutor-3436-thread-1) [    ] o.a.s.u.UpdateLog Could not find max version in index or recent updates, using new clock 1525704155389231104
   [junit4]   2> 989101 INFO  (coreLoadExecutor-3436-thread-1) [    ] o.a.s.u.UpdateLog Took 1.0ms to seed version buckets with highest version 1525704155389231104
   [junit4]   2> 989101 INFO  (coreLoadExecutor-3436-thread-1) [    ] o.a.s.c.ZkController watch zkdir /configs/conf1
   [junit4]   2> 989101 INFO  (coreLoadExecutor-3436-thread-1) [    ] o.a.s.c.CoreContainer registering core: collection1
   [junit4]   2> 989101 INFO  (coreZkRegister-3431-thread-1) [    ] o.a.s.c.ZkController Register replica - core:collection1 address:http://127.0.0.1:53572 collection:collection1 shard:shard2
   [junit4]   2> 989102 INFO  (coreZkRegister-3431-thread-1) [    ] o.a.s.c.c.SolrZkClient makePath: /collections/collection1/leader_elect/shard2/election
   [junit4]   2> 989103 INFO  (coreZkRegister-3431-thread-1) [    ] o.a.s.c.LeaderElector Joined leadership election with path: /collections/collection1/leader_elect/shard2/election/95356509452828680-core_node1-n_0000000000
   [junit4]   2> 989103 INFO  (coreZkRegister-3431-thread-1) [    ] o.a.s.c.ShardLeaderElectionContext Running the leader process for shard=shard2 and weAreReplacement=false and leaderVoteWait=180000
   [junit4]   2> 989103 INFO  (coreZkRegister-3431-thread-1) [    ] o.a.s.c.ShardLeaderElectionContext Enough replicas found to continue.
   [junit4]   2> 989103 INFO  (coreZkRegister-3431-thread-1) [    ] o.a.s.c.ShardLeaderElectionContext I may be the new leader - try and sync
   [junit4]   2> 989103 INFO  (coreZkRegister-3431-thread-1) [    ] o.a.s.c.SyncStrategy Sync replicas to http://127.0.0.1:53572/collection1/
   [junit4]   2> 989103 INFO  (coreZkRegister-3431-thread-1) [    ] o.a.s.c.SyncStrategy Sync Success - now sync replicas to me
   [junit4]   2> 989103 INFO  (coreZkRegister-3431-thread-1) [    ] o.a.s.c.SyncStrategy http://127.0.0.1:53572/collection1/ has no replicas
   [junit4]   2> 989104 INFO  (OverseerStateUpdate-95356509452828676-127.0.0.1:56488_-n_0000000000) [    ] o.a.s.c.Overseer processMessage: queueSize: 1, message = {
   [junit4]   2>   "operation":"leader",
   [junit4]   2>   "shard":"shard2",
   [junit4]   2>   "collection":"collection1"} current state version: 4
   [junit4]   2> 989104 INFO  (coreZkRegister-3431-thread-1) [    ] o.a.s.c.c.SolrZkClient makePath: /collections/collection1/leaders/shard2
   [junit4]   2> 989104 INFO  (coreZkRegister-3431-thread-1) [    ] o.a.s.c.ShardLeaderElectionContextBase Creating leader registration node
   [junit4]   2> 989105 INFO  (coreZkRegister-3431-thread-1) [    ] o.a.s.c.ShardLeaderElectionContext I am the new leader: http://127.0.0.1:53572/collection1/ shard2
   [junit4]   2> 989106 INFO  (OverseerStateUpdate-95356509452828676-127.0.0.1:56488_-n_0000000000) [    ] o.a.s.c.Overseer processMessage: queueSize: 1, message = {
   [junit4]   2>   "operation":"leader",
   [junit4]   2>   "shard":"shard2",
   [junit4]   2>   "collection":"collection1",
   [junit4]   2>   "base_url":"http://127.0.0.1:53572",
   [junit4]   2>   "core":"collection1",
   [junit4]   2>   "state":"active"} current state version: 4
   [junit4]   2> 989206 INFO  (zkCallback-1279-thread-1) [    ] o.a.s.c.c.ZkStateReader A cluster state change: [WatchedEvent state:SyncConnected type:NodeDataChanged path:/clusterstate.json], has occurred - updating... (live nodes size: [2])
   [junit4]   2> 989206 INFO  (zkCallback-1284-thread-1) [    ] o.a.s.c.c.ZkStateReader A cluster state change: [WatchedEvent state:SyncConnected type:NodeDataChanged path:/clusterstate.json], has occurred - updating... (live nodes size: [2])
   [junit4]   2> 989206 INFO  (zkCallback-1277-thread-1) [    ] o.a.s.c.c.ZkStateReader A cluster state change: [WatchedEvent state:SyncConnected type:NodeDataChanged path:/clusterstate.json], has occurred - updating... (live nodes size: [2])
   [junit4]   2> 989256 INFO  (coreZkRegister-3431-thread-1) [    ] o.a.s.c.ZkController We are http://127.0.0.1:53572/collection1/ and leader is http://127.0.0.1:53572/collection1/
   [junit4]   2> 989256 INFO  (coreZkRegister-3431-thread-1) [    ] o.a.s.c.ZkController No LogReplay needed for core=collection1 baseURL=http://127.0.0.1:53572
   [junit4]   2> 989256 INFO  (coreZkRegister-3431-thread-1) [    ] o.a.s.c.ZkController I am the leader, no recovery necessary
   [junit4]   2> 989256 INFO  (coreZkRegister-3431-thread-1) [    ] o.a.s.c.ZkController publishing state=active
   [junit4]   2> 989256 INFO  (coreZkRegister-3431-thread-1) [    ] o.a.s.c.ZkController numShards not found on descriptor - reading it from system property
   [junit4]   2> 989257 INFO  (OverseerStateUpdate-95356509452828676-127.0.0.1:56488_-n_0000000000) [    ] o.a.s.c.Overseer processMessage: queueSize: 1, message = {
   [junit4]   2>   "core":"collection1",
   [junit4]   2>   "core_node_name":"core_node1",
   [junit4]   2>   "roles":null,
   [junit4]   2>   "base_url":"http://127.0.0.1:53572",
   [junit4]   2>   "node_name":"127.0.0.1:53572_",
   [junit4]   2>   "numShards":"2",
   [junit4]   2>   "state":"active",
   [junit4]   2>   "shard":"shard2",
   [junit4]   2>   "collection":"collection1",
   [junit4]   2>   "operation":"state"} current state version: 5
   [junit4]   2> 989257 INFO  (OverseerStateUpdate-95356509452828676-127.0.0.1:56488_-n_0000000000) [    ] o.a.s.c.o.ReplicaMutator Update state numShards=2 message={
   [junit4]   2>   "core":"collection1",
   [junit4]   2>   "core_node_name":"core_node1",
   [junit4]   2>   "roles":null,
   [junit4]   2>   "base_url":"http://127.0.0.1:53572",
   [junit4]   2>   "node_name":"127.0.0.1:53572_",
   [junit4]   2>   "numShards":"2",
   [junit4]   2>   "state":"active",
   [junit4]   2>   "shard":"shard2",
   [junit4]   2>   "collection":"collection1",
   [junit4]   2>   "operation":"state"}
   [junit4]   2> 989358 INFO  (zkCallback-1277-thread-1) [    ] o.a.s.c.c.ZkStateReader A cluster state change: [WatchedEvent state:SyncConnected type:NodeDataChanged path:/clusterstate.json], has occurred - updating... (live nodes size: [2])
   [junit4]   2> 989358 INFO  (zkCallback-1279-thread-1) [    ] o.a.s.c.c.ZkStateReader A cluster state change: [WatchedEvent state:SyncConnected type:NodeDataChanged path:/clusterstate.json], has occurred - updating... (live nodes size: [2])
   [junit4]   2> 989358 INFO  (zkCallback-1284-thread-1) [    ] o.a.s.c.c.ZkStateReader A cluster state change: [WatchedEvent state:SyncConnected type:NodeDataChanged path:/clusterstate.json], has occurred - updating... (live nodes size: [2])
   [junit4]   2> 989504 INFO  (TEST-CollectionsAPIDistributedZkTest.test-seed#[F46F9DBF2A70DB9A]) [    ] o.a.s.SolrTestCaseJ4 Writing core.properties file to /home/jenkins/workspace/Lucene-Solr-trunk-Linux/solr/build/solr-core/test/J0/temp/solr.cloud.CollectionsAPIDistributedZkTest_F46F9DBF2A70DB9A-001/shard-2-001/cores/collection1
   [junit4]   2> 989505 INFO  (TEST-CollectionsAPIDistributedZkTest.test-seed#[F46F9DBF2A70DB9A]) [    ] o.a.s.c.AbstractFullDistribZkTestBase create jetty 2 in directory /home/jenkins/workspace/Lucene-Solr-trunk-Linux/solr/build/solr-core/test/J0/temp/solr.cloud.CollectionsAPIDistributedZkTest_F46F9DBF2A70DB9A-001/shard-2-001
   [junit4]   2> 989505 INFO  (TEST-CollectionsAPIDistributedZkTest.test-seed#[F46F9DBF2A70DB9A]) [    ] o.e.j.s.Server jetty-9.2.13.v20150730
   [junit4]   2> 989506 INFO  (TEST-CollectionsAPIDistributedZkTest.test-seed#[F46F9DBF2A70DB9A]) [    ] o.e.j.s.h.ContextHandler Started o.e.j.s.ServletContextHandler@2cd86294{/,null,AVAILABLE}
   [junit4]   2> 989506 INFO  (TEST-CollectionsAPIDistributedZkTest.test-seed#[F46F9DBF2A70DB9A]) [    ] o.e.j.s.ServerConnector Started ServerConnector@2c2f39fc{HTTP/1.1}{127.0.0.1:۴۵۵۶۷}
   [junit4]   2> 989506 INFO  (TEST-CollectionsAPIDistributedZkTest.test-seed#[F46F9DBF2A70DB9A]) [    ] o.e.j.s.Server Started @۹۹۱۳۳۱ms
   [junit4]   2> 989506 INFO  (TEST-CollectionsAPIDistributedZkTest.test-seed#[F46F9DBF2A70DB9A]) [    ] o.a.s.c.s.e.JettySolrRunner Jetty properties: {solr.data.dir=/home/jenkins/workspace/Lucene-Solr-trunk-Linux/solr/build/solr-core/test/J0/temp/solr.cloud.CollectionsAPIDistributedZkTest_F46F9DBF2A70DB9A-001/tempDir-001/jetty2, solrconfig=solrconfig.xml, hostContext=/, hostPort=45567, coreRootDirectory=/home/jenkins/workspace/Lucene-Solr-trunk-Linux/solr/build/solr-core/test/J0/../../../../../../../../../home/jenkins/workspace/Lucene-Solr-trunk-Linux/solr/build/solr-core/test/J0/temp/solr.cloud.CollectionsAPIDistributedZkTest_F46F9DBF2A70DB9A-001/shard-2-001/cores}
   [junit4]   2> 989507 INFO  (TEST-CollectionsAPIDistributedZkTest.test-seed#[F46F9DBF2A70DB9A]) [    ] o.a.s.s.SolrDispatchFilter SolrDispatchFilter.init(): sun.misc.Launcher$AppClassLoader@6996db8
   [junit4]   2> 989507 INFO  (TEST-CollectionsAPIDistributedZkTest.test-seed#[F46F9DBF2A70DB9A]) [    ] o.a.s.c.SolrResourceLoader new SolrResourceLoader for directory: '/home/jenkins/workspace/Lucene-Solr-trunk-Linux/solr/build/solr-core/test/J0/temp/solr.cloud.CollectionsAPIDistributedZkTest_F46F9DBF2A70DB9A-001/shard-2-001'
   [junit4]   2> 989507 INFO  (TEST-CollectionsAPIDistributedZkTest.test-seed#[F46F9DBF2A70DB9A]) [    ] o.a.s.c.SolrResourceLoader JNDI not 

[...truncated too long message...]

ector.runIamLeaderProcess(LeaderElector.java:197)
   [junit4]   2> 	at org.apache.solr.cloud.LeaderElector.checkIfIamLeader(LeaderElector.java:157)
   [junit4]   2> 	at org.apache.solr.cloud.LeaderElector.access$200(LeaderElector.java:58)
   [junit4]   2> 	at org.apache.solr.cloud.LeaderElector$ElectionWatcher.process(LeaderElector.java:388)
   [junit4]   2> 	at org.apache.solr.common.cloud.SolrZkClient$3$1.run(SolrZkClient.java:269)
   [junit4]   2> 	at java.util.concurrent.Executors$RunnableAdapter.call(Executors.java:514)
   [junit4]   2> 	at java.util.concurrent.FutureTask.run(FutureTask.java:266)
   [junit4]   2> 	at org.apache.solr.common.util.ExecutorUtil$MDCAwareThreadPoolExecutor$1.run(ExecutorUtil.java:231)
   [junit4]   2> 	at java.util.concurrent.ThreadPoolExecutor.runWorker(ThreadPoolExecutor.java:1158)
   [junit4]   2> 	at java.util.concurrent.ThreadPoolExecutor$Worker.run(ThreadPoolExecutor.java:632)
   [junit4]   2> 	at java.lang.Thread.run(Thread.java:804)
   [junit4]   2> Caused by: org.apache.zookeeper.KeeperException$SessionExpiredException: KeeperErrorCode = Session expired for /overseer
   [junit4]   2> 	at org.apache.zookeeper.KeeperException.create(KeeperException.java:127)
   [junit4]   2> 	at org.apache.zookeeper.KeeperException.create(KeeperException.java:51)
   [junit4]   2> 	at org.apache.zookeeper.ZooKeeper.create(ZooKeeper.java:783)
   [junit4]   2> 	at org.apache.solr.common.cloud.SolrZkClient$9.execute(SolrZkClient.java:388)
   [junit4]   2> 	at org.apache.solr.common.cloud.SolrZkClient$9.execute(SolrZkClient.java:385)
   [junit4]   2> 	at org.apache.solr.common.cloud.ZkCmdExecutor.retryOperation(ZkCmdExecutor.java:60)
   [junit4]   2> 	at org.apache.solr.common.cloud.SolrZkClient.create(SolrZkClient.java:385)
   [junit4]   2> 	at org.apache.solr.cloud.Overseer.createOverseerNode(Overseer.java:954)
   [junit4]   2> 	... 26 more
   [junit4]   2> 1012989 INFO  (TEST-CollectionsAPIDistributedZkTest.test-seed#[F46F9DBF2A70DB9A]) [    ] o.e.j.s.ServerConnector Stopped ServerConnector@64c840e9{HTTP/1.1}{127.0.0.1:۰}
   [junit4]   2> 1012989 INFO  (TEST-CollectionsAPIDistributedZkTest.test-seed#[F46F9DBF2A70DB9A]) [    ] o.e.j.s.h.ContextHandler Stopped o.e.j.s.ServletContextHandler@30aa0b39{/,null,UNAVAILABLE}
   [junit4]   2> 1012990 INFO  (TEST-CollectionsAPIDistributedZkTest.test-seed#[F46F9DBF2A70DB9A]) [    ] o.a.s.c.ZkTestServer connecting to 127.0.0.1:38220 38220
   [junit4]   2> 1013014 INFO  (Thread-3021) [    ] o.a.s.c.ZkTestServer connecting to 127.0.0.1:38220 38220
   [junit4]   2> 1013014 WARN  (Thread-3021) [    ] o.a.s.c.ZkTestServer Watch limit violations: 
   [junit4]   2> Maximum concurrent create/delete watches above limit:
   [junit4]   2> 
   [junit4]   2> 	8	/solr/aliases.json
   [junit4]   2> 	5	/solr/security.json
   [junit4]   2> 	5	/solr/configs/conf1
   [junit4]   2> 
   [junit4]   2> Maximum concurrent data watches above limit:
   [junit4]   2> 
   [junit4]   2> 	8	/solr/clusterstate.json
   [junit4]   2> 	4	/solr/collections/nodes_used_collection/state.json
   [junit4]   2> 
   [junit4]   2> Maximum concurrent children watches above limit:
   [junit4]   2> 
   [junit4]   2> 	8	/solr/live_nodes
   [junit4]   2> 	8	/solr/collections
   [junit4]   2> 	5	/solr/overseer/collection-queue-work
   [junit4]   2> 	4	/solr/overseer/queue
   [junit4]   2> 	2	/solr/overseer/queue-work
   [junit4]   2> 
   [junit4]   2> NOTE: reproduce with: ant test  -Dtestcase=CollectionsAPIDistributedZkTest -Dtests.method=test -Dtests.seed=F46F9DBF2A70DB9A -Dtests.multiplier=3 -Dtests.slow=true -Dtests.locale=uz-Latn-UZ -Dtests.timezone=America/Toronto -Dtests.asserts=true -Dtests.file.encoding=UTF-8
   [junit4] ERROR   27.9s J0 | CollectionsAPIDistributedZkTest.test <<<
   [junit4]    > Throwable #1: org.apache.solr.client.solrj.impl.HttpSolrClient$RemoteSolrException: Error from server at http://127.0.0.1:53572/awholynewcollection_0: non ok status: 500, message:Server Error
   [junit4]    > 	at __randomizedtesting.SeedInfo.seed([F46F9DBF2A70DB9A:7C3BA265848CB662]:0)
   [junit4]    > 	at org.apache.solr.client.solrj.impl.HttpSolrClient.executeMethod(HttpSolrClient.java:511)
   [junit4]    > 	at org.apache.solr.client.solrj.impl.HttpSolrClient.request(HttpSolrClient.java:240)
   [junit4]    > 	at org.apache.solr.client.solrj.impl.HttpSolrClient.request(HttpSolrClient.java:229)
   [junit4]    > 	at org.apache.solr.client.solrj.SolrRequest.process(SolrRequest.java:149)
   [junit4]    > 	at org.apache.solr.client.solrj.SolrClient.query(SolrClient.java:942)
   [junit4]    > 	at org.apache.solr.client.solrj.SolrClient.query(SolrClient.java:957)
   [junit4]    > 	at org.apache.solr.cloud.AbstractFullDistribZkTestBase.waitForNon403or404or503(AbstractFullDistribZkTestBase.java:1773)
   [junit4]    > 	at org.apache.solr.cloud.CollectionsAPIDistributedZkTest.testCollectionsAPI(CollectionsAPIDistributedZkTest.java:723)
   [junit4]    > 	at org.apache.solr.cloud.CollectionsAPIDistributedZkTest.test(CollectionsAPIDistributedZkTest.java:160)
   [junit4]    > 	at org.apache.solr.BaseDistributedSearchTestCase$ShardsRepeatRule$ShardsFixedStatement.callStatement(BaseDistributedSearchTestCase.java:964)
   [junit4]    > 	at org.apache.solr.BaseDistributedSearchTestCase$ShardsRepeatRule$ShardsStatement.evaluate(BaseDistributedSearchTestCase.java:939)
   [junit4]    > 	at java.lang.Thread.run(Thread.java:804)
   [junit4]   2> 1013016 INFO  (SUITE-CollectionsAPIDistributedZkTest-seed#[F46F9DBF2A70DB9A]-worker) [    ] o.a.s.SolrTestCaseJ4 ###deleteCore
   [junit4]   2> NOTE: leaving temporary files on disk at: /home/jenkins/workspace/Lucene-Solr-trunk-Linux/solr/build/solr-core/test/J0/temp/solr.cloud.CollectionsAPIDistributedZkTest_F46F9DBF2A70DB9A-001
   [junit4]   2> Feb 09, 2016 1:34:51 PM com.carrotsearch.randomizedtesting.ThreadLeakControl checkThreadLeaks
   [junit4]   2> WARNING: Will linger awaiting termination of 1 leaked thread(s).
   [junit4]   2> NOTE: test params are: codec=Asserting(Lucene60), sim=RandomSimilarity(queryNorm=false,coord=crazy): {}, locale=uz-Latn-UZ, timezone=America/Toronto
   [junit4]   2> NOTE: Linux 3.19.0-47-generic amd64/Oracle Corporation 9-ea (64-bit)/cpus=12,threads=1,free=401829896,total=536870912
   [junit4]   2> NOTE: All tests run in this JVM: [TestManagedSchemaDynamicFieldResource, TestCrossCoreJoin, TestSolr4Spatial2, HdfsRecoverLeaseTest, HdfsChaosMonkeySafeLeaderTest, StandardRequestHandlerTest, AtomicUpdatesTest, RemoteQueryErrorTest, TestIBSimilarityFactory, TestQueryWrapperFilter, TestFoldingMultitermQuery, TestLRUCache, TestTestInjection, DeleteShardTest, PolyFieldTest, TestCloudManagedSchema, CdcrReplicationDistributedZkTest, TestIntervalFaceting, DateFieldTest, TestNamedUpdateProcessors, FileBasedSpellCheckerTest, SignatureUpdateProcessorFactoryTest, TestManagedStopFilterFactory, ExternalFileFieldSortTest, TestFunctionQuery, QueryResultKeyTest, LeaderFailoverAfterPartitionTest, BlockJoinFacetSimpleTest, RankQueryTest, TestUseDocValuesAsStored, TestSolr4Spatial, TestAuthenticationFramework, TestOmitPositions, TestCSVLoader, AddBlockUpdateTest, TestRemoteStreaming, TestLMDirichletSimilarityFactory, UUIDFieldTest, SystemInfoHandlerTest, ResponseLogComponentTest, OverseerStatusTest, PathHierarchyTokenizerFactoryTest, TestValueSourceCache, CdcrVersionReplicationTest, CopyFieldTest, DistributedDebugComponentTest, BitVectorTest, TestImplicitCoreProperties, TestCollectionAPI, AlternateDirectoryTest, DeleteInactiveReplicaTest, ChangedSchemaMergeTest, RAMDirectoryFactoryTest, EnumFieldTest, TestJoin, BufferStoreTest, BasicAuthIntegrationTest, IndexSchemaRuntimeFieldTest, RequestLoggingTest, SolrRequestParserTest, QueryEqualityTest, TestRangeQuery, LeaderElectionIntegrationTest, SimpleCollectionCreateDeleteTest, DataDrivenBlockJoinTest, BasicDistributedZkTest, HdfsUnloadDistributedZkTest, DocumentAnalysisRequestHandlerTest, CollectionTooManyReplicasTest, TestDownShardTolerantSearch, CoreAdminCreateDiscoverTest, ReturnFieldsTest, CacheHeaderTest, TlogReplayBufferedWhileIndexingTest, ConnectionReuseTest, CloudExitableDirectoryReaderTest, DistributedFacetPivotLongTailTest, TestScoreJoinQPScore, DefaultValueUpdateProcessorTest, SimpleMLTQParserTest, DistributedSpellCheckComponentTest, TestArbitraryIndexDir, TestFieldResource, EchoParamsTest, TestCustomDocTransformer, TestNRTOpen, QueryElevationComponentTest, DisMaxRequestHandlerTest, TestExpandComponent, PingRequestHandlerTest, DistributedVersionInfoTest, TestReRankQParserPlugin, JsonLoaderTest, TestLuceneMatchVersion, ChaosMonkeySafeLeaderTest, BasicDistributedZk2Test, CollectionsAPIDistributedZkTest]
   [junit4] Completed [294/579 (1!)] on J0 in 28.64s, 1 test, 1 error <<< FAILURES!

[...truncated 923 lines...]
BUILD FAILED
/home/jenkins/workspace/Lucene-Solr-trunk-Linux/build.xml:740: The following error occurred while executing this line:
/home/jenkins/workspace/Lucene-Solr-trunk-Linux/build.xml:684: The following error occurred while executing this line:
/home/jenkins/workspace/Lucene-Solr-trunk-Linux/build.xml:59: The following error occurred while executing this line:
/home/jenkins/workspace/Lucene-Solr-trunk-Linux/solr/build.xml:233: The following error occurred while executing this line:
/home/jenkins/workspace/Lucene-Solr-trunk-Linux/solr/common-build.xml:524: The following error occurred while executing this line:
/home/jenkins/workspace/Lucene-Solr-trunk-Linux/lucene/common-build.xml:1457: The following error occurred while executing this line:
/home/jenkins/workspace/Lucene-Solr-trunk-Linux/lucene/common-build.xml:1014: There were test failures: 579 suites (8 ignored), 2323 tests, 1 error, 117 ignored (72 assumptions) [seed: F46F9DBF2A70DB9A]

Total time: 49 minutes 6 seconds
Build step 'Invoke Ant' marked build as failure
Archiving artifacts
[WARNINGS] Skipping publisher since build result is FAILURE
Recording test results
Email was triggered for: Failure - Any
Sending email for trigger: Failure - Any



Mime
View raw message