lucene-dev mailing list archives

Site index · List index
Message view « Date » · « Thread »
Top « Date » · « Thread »
From Policeman Jenkins Server <jenk...@thetaphi.de>
Subject [JENKINS] Lucene-Solr-5.x-Linux (64bit/jdk1.7.0_80) - Build # 15584 - Failure!
Date Mon, 15 Feb 2016 10:04:43 GMT
Build: http://jenkins.thetaphi.de/job/Lucene-Solr-5.x-Linux/15584/
Java: 64bit/jdk1.7.0_80 -XX:+UseCompressedOops -XX:+UseSerialGC

2 tests failed.
FAILED:  junit.framework.TestSuite.org.apache.solr.security.BasicAuthIntegrationTest

Error Message:
Suite timeout exceeded (>= 7200000 msec).

Stack Trace:
java.lang.Exception: Suite timeout exceeded (>= 7200000 msec).
	at __randomizedtesting.SeedInfo.seed([9225C74068803365]:0)


FAILED:  org.apache.solr.security.BasicAuthIntegrationTest.testBasics

Error Message:
Test abandoned because suite timeout was reached.

Stack Trace:
java.lang.Exception: Test abandoned because suite timeout was reached.
	at __randomizedtesting.SeedInfo.seed([9225C74068803365]:0)




Build Log:
[...truncated 12446 lines...]
   [junit4] Suite: org.apache.solr.security.BasicAuthIntegrationTest
   [junit4]   2> 584632 INFO  (TEST-BasicAuthIntegrationTest.testBasics-seed#[9225C74068803365]) [    ] o.a.s.c.ZkTestServer STARTING ZK TEST SERVER
   [junit4]   2> 584633 INFO  (Thread-2064) [    ] o.a.s.c.ZkTestServer client port:0.0.0.0/0.0.0.0:0
   [junit4]   2> 584633 INFO  (Thread-2064) [    ] o.a.s.c.ZkTestServer Starting server
   [junit4]   2> 584733 INFO  (TEST-BasicAuthIntegrationTest.testBasics-seed#[9225C74068803365]) [    ] o.a.s.c.ZkTestServer start zk server on port:41093
   [junit4]   2> 584733 INFO  (TEST-BasicAuthIntegrationTest.testBasics-seed#[9225C74068803365]) [    ] o.a.s.c.c.SolrZkClient Using default ZkCredentialsProvider
   [junit4]   2> 584733 INFO  (TEST-BasicAuthIntegrationTest.testBasics-seed#[9225C74068803365]) [    ] o.a.s.c.c.ConnectionManager Waiting for client to connect to ZooKeeper
   [junit4]   2> 584754 INFO  (zkCallback-609-thread-1) [    ] o.a.s.c.c.ConnectionManager Watcher org.apache.solr.common.cloud.ConnectionManager@65d791cf name:ZooKeeperConnection Watcher:127.0.0.1:41093 got event WatchedEvent state:SyncConnected type:None path:null path:null type:None
   [junit4]   2> 584755 INFO  (TEST-BasicAuthIntegrationTest.testBasics-seed#[9225C74068803365]) [    ] o.a.s.c.c.ConnectionManager Client is connected to ZooKeeper
   [junit4]   2> 584755 INFO  (TEST-BasicAuthIntegrationTest.testBasics-seed#[9225C74068803365]) [    ] o.a.s.c.c.SolrZkClient Using default ZkACLProvider
   [junit4]   2> 584755 INFO  (TEST-BasicAuthIntegrationTest.testBasics-seed#[9225C74068803365]) [    ] o.a.s.c.c.SolrZkClient makePath: /solr/solr.xml
   [junit4]   2> 584763 INFO  (jetty-launcher-608-thread-1) [    ] o.e.j.s.Server jetty-9.2.13.v20150730
   [junit4]   2> 584763 INFO  (jetty-launcher-608-thread-3) [    ] o.e.j.s.Server jetty-9.2.13.v20150730
   [junit4]   2> 584763 INFO  (jetty-launcher-608-thread-4) [    ] o.e.j.s.Server jetty-9.2.13.v20150730
   [junit4]   2> 584763 INFO  (jetty-launcher-608-thread-2) [    ] o.e.j.s.Server jetty-9.2.13.v20150730
   [junit4]   2> 584763 INFO  (jetty-launcher-608-thread-5) [    ] o.e.j.s.Server jetty-9.2.13.v20150730
   [junit4]   2> 584766 INFO  (jetty-launcher-608-thread-4) [    ] o.e.j.s.h.ContextHandler Started o.e.j.s.ServletContextHandler@961944f{/solr,null,AVAILABLE}
   [junit4]   2> 584766 INFO  (jetty-launcher-608-thread-3) [    ] o.e.j.s.h.ContextHandler Started o.e.j.s.ServletContextHandler@654fd358{/solr,null,AVAILABLE}
   [junit4]   2> 584766 INFO  (jetty-launcher-608-thread-5) [    ] o.e.j.s.h.ContextHandler Started o.e.j.s.ServletContextHandler@2eeb705f{/solr,null,AVAILABLE}
   [junit4]   2> 584766 INFO  (jetty-launcher-608-thread-1) [    ] o.e.j.s.h.ContextHandler Started o.e.j.s.ServletContextHandler@631e8509{/solr,null,AVAILABLE}
   [junit4]   2> 584766 INFO  (jetty-launcher-608-thread-2) [    ] o.e.j.s.h.ContextHandler Started o.e.j.s.ServletContextHandler@68b044b5{/solr,null,AVAILABLE}
   [junit4]   2> 584766 INFO  (jetty-launcher-608-thread-4) [    ] o.e.j.s.ServerConnector Started ServerConnector@3620b408{HTTP/1.1}{127.0.0.1:34147}
   [junit4]   2> 584766 INFO  (jetty-launcher-608-thread-5) [    ] o.e.j.s.ServerConnector Started ServerConnector@6361f9a2{HTTP/1.1}{127.0.0.1:35879}
   [junit4]   2> 584766 INFO  (jetty-launcher-608-thread-4) [    ] o.e.j.s.Server Started @586254ms
   [junit4]   2> 584766 INFO  (jetty-launcher-608-thread-5) [    ] o.e.j.s.Server Started @586254ms
   [junit4]   2> 584766 INFO  (jetty-launcher-608-thread-2) [    ] o.e.j.s.ServerConnector Started ServerConnector@fab89d3{HTTP/1.1}{127.0.0.1:55620}
   [junit4]   2> 584766 INFO  (jetty-launcher-608-thread-5) [    ] o.a.s.c.s.e.JettySolrRunner Jetty properties: {hostPort=35879, hostContext=/solr}
   [junit4]   2> 584766 INFO  (jetty-launcher-608-thread-1) [    ] o.e.j.s.ServerConnector Started ServerConnector@1c494a47{HTTP/1.1}{127.0.0.1:47728}
   [junit4]   2> 584767 INFO  (jetty-launcher-608-thread-1) [    ] o.e.j.s.Server Started @586255ms
   [junit4]   2> 584766 INFO  (jetty-launcher-608-thread-2) [    ] o.e.j.s.Server Started @586254ms
   [junit4]   2> 584767 INFO  (jetty-launcher-608-thread-1) [    ] o.a.s.c.s.e.JettySolrRunner Jetty properties: {hostPort=47728, hostContext=/solr}
   [junit4]   2> 584767 INFO  (jetty-launcher-608-thread-2) [    ] o.a.s.c.s.e.JettySolrRunner Jetty properties: {hostContext=/solr, hostPort=55620}
   [junit4]   2> 584766 INFO  (jetty-launcher-608-thread-3) [    ] o.e.j.s.ServerConnector Started ServerConnector@46e583ae{HTTP/1.1}{127.0.0.1:34468}
   [junit4]   2> 584767 INFO  (jetty-launcher-608-thread-5) [    ] o.a.s.s.SolrDispatchFilter SolrDispatchFilter.init(): sun.misc.Launcher$AppClassLoader@3b756db3
   [junit4]   2> 584767 INFO  (jetty-launcher-608-thread-3) [    ] o.e.j.s.Server Started @586255ms
   [junit4]   2> 584766 INFO  (jetty-launcher-608-thread-4) [    ] o.a.s.c.s.e.JettySolrRunner Jetty properties: {hostContext=/solr, hostPort=34147}
   [junit4]   2> 584767 INFO  (jetty-launcher-608-thread-3) [    ] o.a.s.c.s.e.JettySolrRunner Jetty properties: {hostContext=/solr, hostPort=34468}
   [junit4]   2> 584767 INFO  (jetty-launcher-608-thread-2) [    ] o.a.s.s.SolrDispatchFilter SolrDispatchFilter.init(): sun.misc.Launcher$AppClassLoader@3b756db3
   [junit4]   2> 584767 INFO  (jetty-launcher-608-thread-1) [    ] o.a.s.s.SolrDispatchFilter SolrDispatchFilter.init(): sun.misc.Launcher$AppClassLoader@3b756db3
   [junit4]   2> 584767 INFO  (jetty-launcher-608-thread-2) [    ] o.a.s.c.SolrResourceLoader new SolrResourceLoader for directory: '/home/jenkins/workspace/Lucene-Solr-5.x-Linux/solr/build/solr-core/test/J0/temp/solr.security.BasicAuthIntegrationTest_9225C74068803365-001/tempDir-001/node2'
   [junit4]   2> 584767 INFO  (jetty-launcher-608-thread-1) [    ] o.a.s.c.SolrResourceLoader new SolrResourceLoader for directory: '/home/jenkins/workspace/Lucene-Solr-5.x-Linux/solr/build/solr-core/test/J0/temp/solr.security.BasicAuthIntegrationTest_9225C74068803365-001/tempDir-001/node1'
   [junit4]   2> 584767 INFO  (jetty-launcher-608-thread-4) [    ] o.a.s.s.SolrDispatchFilter SolrDispatchFilter.init(): sun.misc.Launcher$AppClassLoader@3b756db3
   [junit4]   2> 584767 INFO  (jetty-launcher-608-thread-3) [    ] o.a.s.s.SolrDispatchFilter SolrDispatchFilter.init(): sun.misc.Launcher$AppClassLoader@3b756db3
   [junit4]   2> 584767 INFO  (jetty-launcher-608-thread-2) [    ] o.a.s.c.SolrResourceLoader JNDI not configured for solr (NoInitialContextEx)
   [junit4]   2> 584767 INFO  (jetty-launcher-608-thread-4) [    ] o.a.s.c.SolrResourceLoader new SolrResourceLoader for directory: '/home/jenkins/workspace/Lucene-Solr-5.x-Linux/solr/build/solr-core/test/J0/temp/solr.security.BasicAuthIntegrationTest_9225C74068803365-001/tempDir-001/node4'
   [junit4]   2> 584767 INFO  (jetty-launcher-608-thread-3) [    ] o.a.s.c.SolrResourceLoader new SolrResourceLoader for directory: '/home/jenkins/workspace/Lucene-Solr-5.x-Linux/solr/build/solr-core/test/J0/temp/solr.security.BasicAuthIntegrationTest_9225C74068803365-001/tempDir-001/node3'
   [junit4]   2> 584767 INFO  (jetty-launcher-608-thread-4) [    ] o.a.s.c.SolrResourceLoader JNDI not configured for solr (NoInitialContextEx)
   [junit4]   2> 584767 INFO  (jetty-launcher-608-thread-5) [    ] o.a.s.c.SolrResourceLoader new SolrResourceLoader for directory: '/home/jenkins/workspace/Lucene-Solr-5.x-Linux/solr/build/solr-core/test/J0/temp/solr.security.BasicAuthIntegrationTest_9225C74068803365-001/tempDir-001/node5'
   [junit4]   2> 584767 INFO  (jetty-launcher-608-thread-3) [    ] o.a.s.c.SolrResourceLoader JNDI not configured for solr (NoInitialContextEx)
   [junit4]   2> 584767 INFO  (jetty-launcher-608-thread-4) [    ] o.a.s.c.SolrResourceLoader solr home defaulted to 'solr/' (could not find system property or JNDI)
   [junit4]   2> 584767 INFO  (jetty-launcher-608-thread-3) [    ] o.a.s.c.SolrResourceLoader solr home defaulted to 'solr/' (could not find system property or JNDI)
   [junit4]   2> 584767 INFO  (jetty-launcher-608-thread-5) [    ] o.a.s.c.SolrResourceLoader JNDI not configured for solr (NoInitialContextEx)
   [junit4]   2> 584767 INFO  (jetty-launcher-608-thread-2) [    ] o.a.s.c.SolrResourceLoader solr home defaulted to 'solr/' (could not find system property or JNDI)
   [junit4]   2> 584767 INFO  (jetty-launcher-608-thread-5) [    ] o.a.s.c.SolrResourceLoader solr home defaulted to 'solr/' (could not find system property or JNDI)
   [junit4]   2> 584767 INFO  (jetty-launcher-608-thread-4) [    ] o.a.s.c.c.SolrZkClient Using default ZkCredentialsProvider
   [junit4]   2> 584767 INFO  (jetty-launcher-608-thread-1) [    ] o.a.s.c.SolrResourceLoader JNDI not configured for solr (NoInitialContextEx)
   [junit4]   2> 584767 INFO  (jetty-launcher-608-thread-1) [    ] o.a.s.c.SolrResourceLoader solr home defaulted to 'solr/' (could not find system property or JNDI)
   [junit4]   2> 584767 INFO  (jetty-launcher-608-thread-2) [    ] o.a.s.c.c.SolrZkClient Using default ZkCredentialsProvider
   [junit4]   2> 584767 INFO  (jetty-launcher-608-thread-3) [    ] o.a.s.c.c.SolrZkClient Using default ZkCredentialsProvider
   [junit4]   2> 584768 INFO  (jetty-launcher-608-thread-5) [    ] o.a.s.c.c.SolrZkClient Using default ZkCredentialsProvider
   [junit4]   2> 584768 INFO  (jetty-launcher-608-thread-1) [    ] o.a.s.c.c.SolrZkClient Using default ZkCredentialsProvider
   [junit4]   2> 584768 INFO  (jetty-launcher-608-thread-4) [    ] o.a.s.c.c.ConnectionManager Waiting for client to connect to ZooKeeper
   [junit4]   2> 584768 INFO  (jetty-launcher-608-thread-2) [    ] o.a.s.c.c.ConnectionManager Waiting for client to connect to ZooKeeper
   [junit4]   2> 584768 INFO  (jetty-launcher-608-thread-1) [    ] o.a.s.c.c.ConnectionManager Waiting for client to connect to ZooKeeper
   [junit4]   2> 584768 INFO  (jetty-launcher-608-thread-3) [    ] o.a.s.c.c.ConnectionManager Waiting for client to connect to ZooKeeper
   [junit4]   2> 584768 INFO  (jetty-launcher-608-thread-5) [    ] o.a.s.c.c.ConnectionManager Waiting for client to connect to ZooKeeper
   [junit4]   2> 584780 INFO  (zkCallback-610-thread-1) [    ] o.a.s.c.c.ConnectionManager Watcher org.apache.solr.common.cloud.ConnectionManager@2f1c3807 name:ZooKeeperConnection Watcher:127.0.0.1:41093/solr got event WatchedEvent state:SyncConnected type:None path:null path:null type:None
   [junit4]   2> 584780 INFO  (jetty-launcher-608-thread-4) [    ] o.a.s.c.c.ConnectionManager Client is connected to ZooKeeper
   [junit4]   2> 584780 INFO  (jetty-launcher-608-thread-4) [    ] o.a.s.c.c.SolrZkClient Using default ZkACLProvider
   [junit4]   2> 584783 INFO  (zkCallback-612-thread-1) [    ] o.a.s.c.c.ConnectionManager Watcher org.apache.solr.common.cloud.ConnectionManager@2b3d8635 name:ZooKeeperConnection Watcher:127.0.0.1:41093/solr got event WatchedEvent state:SyncConnected type:None path:null path:null type:None
   [junit4]   2> 584783 INFO  (jetty-launcher-608-thread-2) [    ] o.a.s.c.c.ConnectionManager Client is connected to ZooKeeper
   [junit4]   2> 584783 INFO  (zkCallback-614-thread-1) [    ] o.a.s.c.c.ConnectionManager Watcher org.apache.solr.common.cloud.ConnectionManager@73b08a9d name:ZooKeeperConnection Watcher:127.0.0.1:41093/solr got event WatchedEvent state:SyncConnected type:None path:null path:null type:None
   [junit4]   2> 584783 INFO  (jetty-launcher-608-thread-1) [    ] o.a.s.c.c.ConnectionManager Client is connected to ZooKeeper
   [junit4]   2> 584783 INFO  (jetty-launcher-608-thread-2) [    ] o.a.s.c.c.SolrZkClient Using default ZkACLProvider
   [junit4]   2> 584783 INFO  (zkCallback-611-thread-1) [    ] o.a.s.c.c.ConnectionManager Watcher org.apache.solr.common.cloud.ConnectionManager@725a56f7 name:ZooKeeperConnection Watcher:127.0.0.1:41093/solr got event WatchedEvent state:SyncConnected type:None path:null path:null type:None
   [junit4]   2> 584783 INFO  (jetty-launcher-608-thread-3) [    ] o.a.s.c.c.ConnectionManager Client is connected to ZooKeeper
   [junit4]   2> 584783 INFO  (jetty-launcher-608-thread-1) [    ] o.a.s.c.c.SolrZkClient Using default ZkACLProvider
   [junit4]   2> 584783 INFO  (jetty-launcher-608-thread-4) [    ] o.a.s.s.SolrDispatchFilter solr.xml found in ZooKeeper. Loading...
   [junit4]   2> 584783 INFO  (jetty-launcher-608-thread-3) [    ] o.a.s.c.c.SolrZkClient Using default ZkACLProvider
   [junit4]   2> 584783 INFO  (zkCallback-613-thread-1) [    ] o.a.s.c.c.ConnectionManager Watcher org.apache.solr.common.cloud.ConnectionManager@6b7629ae name:ZooKeeperConnection Watcher:127.0.0.1:41093/solr got event WatchedEvent state:SyncConnected type:None path:null path:null type:None
   [junit4]   2> 584783 INFO  (jetty-launcher-608-thread-5) [    ] o.a.s.c.c.ConnectionManager Client is connected to ZooKeeper
   [junit4]   2> 584783 INFO  (jetty-launcher-608-thread-2) [    ] o.a.s.s.SolrDispatchFilter solr.xml found in ZooKeeper. Loading...
   [junit4]   2> 584783 INFO  (jetty-launcher-608-thread-1) [    ] o.a.s.s.SolrDispatchFilter solr.xml found in ZooKeeper. Loading...
   [junit4]   2> 584783 INFO  (jetty-launcher-608-thread-3) [    ] o.a.s.s.SolrDispatchFilter solr.xml found in ZooKeeper. Loading...
   [junit4]   2> 584783 INFO  (jetty-launcher-608-thread-5) [    ] o.a.s.c.c.SolrZkClient Using default ZkACLProvider
   [junit4]   2> 584784 INFO  (jetty-launcher-608-thread-5) [    ] o.a.s.s.SolrDispatchFilter solr.xml found in ZooKeeper. Loading...
   [junit4]   2> 584802 INFO  (jetty-launcher-608-thread-5) [    ] o.a.s.c.CorePropertiesLocator Config-defined core root directory: /home/jenkins/workspace/Lucene-Solr-5.x-Linux/solr/build/solr-core/test/J0/temp/solr.security.BasicAuthIntegrationTest_9225C74068803365-001/tempDir-001/node5/.
   [junit4]   2> 584802 INFO  (jetty-launcher-608-thread-5) [    ] o.a.s.c.CoreContainer New CoreContainer 1916791778
   [junit4]   2> 584802 INFO  (jetty-launcher-608-thread-5) [    ] o.a.s.c.CoreContainer Loading cores into CoreContainer [instanceDir=/home/jenkins/workspace/Lucene-Solr-5.x-Linux/solr/build/solr-core/test/J0/temp/solr.security.BasicAuthIntegrationTest_9225C74068803365-001/tempDir-001/node5]
   [junit4]   2> 584803 WARN  (jetty-launcher-608-thread-5) [    ] o.a.s.c.CoreContainer Couldn't add files from /home/jenkins/workspace/Lucene-Solr-5.x-Linux/solr/build/solr-core/test/J0/temp/solr.security.BasicAuthIntegrationTest_9225C74068803365-001/tempDir-001/node5/lib to classpath: /home/jenkins/workspace/Lucene-Solr-5.x-Linux/solr/build/solr-core/test/J0/temp/solr.security.BasicAuthIntegrationTest_9225C74068803365-001/tempDir-001/node5/lib
   [junit4]   2> 584803 INFO  (jetty-launcher-608-thread-5) [    ] o.a.s.h.c.HttpShardHandlerFactory created with socketTimeout : 90000,urlScheme : ,connTimeout : 15000,maxConnectionsPerHost : 20,maxConnections : 10000,corePoolSize : 0,maximumPoolSize : 2147483647,maxThreadIdleTime : 5,sizeOfQueue : -1,fairnessPolicy : false,useRetries : false,
   [junit4]   2> 584805 INFO  (jetty-launcher-608-thread-5) [    ] o.a.s.u.UpdateShardHandler Creating UpdateShardHandler HTTP client with params: socketTimeout=340000&connTimeout=45000&retry=true
   [junit4]   2> 584805 INFO  (jetty-launcher-608-thread-5) [    ] o.a.s.l.LogWatcher SLF4J impl is org.slf4j.impl.Log4jLoggerFactory
   [junit4]   2> 584805 INFO  (jetty-launcher-608-thread-5) [    ] o.a.s.l.LogWatcher Registering Log Listener [Log4j (org.slf4j.impl.Log4jLoggerFactory)]
   [junit4]   2> 584805 INFO  (jetty-launcher-608-thread-5) [    ] o.a.s.c.ZkContainer Zookeeper client=127.0.0.1:41093/solr
   [junit4]   2> 584805 INFO  (jetty-launcher-608-thread-5) [    ] o.a.s.c.ZkController zkHost includes chroot
   [junit4]   2> 584806 INFO  (jetty-launcher-608-thread-5) [    ] o.a.s.c.c.SolrZkClient Using default ZkCredentialsProvider
   [junit4]   2> 584806 INFO  (jetty-launcher-608-thread-5) [    ] o.a.s.c.c.ConnectionManager Waiting for client to connect to ZooKeeper
   [junit4]   2> 584811 INFO  (jetty-launcher-608-thread-3) [    ] o.a.s.c.CorePropertiesLocator Config-defined core root directory: /home/jenkins/workspace/Lucene-Solr-5.x-Linux/solr/build/solr-core/test/J0/temp/solr.security.BasicAuthIntegrationTest_9225C74068803365-001/tempDir-001/node3/.
   [junit4]   2> 584811 INFO  (jetty-launcher-608-thread-4) [    ] o.a.s.c.CorePropertiesLocator Config-defined core root directory: /home/jenkins/workspace/Lucene-Solr-5.x-Linux/solr/build/solr-core/test/J0/temp/solr.security.BasicAuthIntegrationTest_9225C74068803365-001/tempDir-001/node4/.
   [junit4]   2> 584811 INFO  (jetty-launcher-608-thread-3) [    ] o.a.s.c.CoreContainer New CoreContainer 641455939
   [junit4]   2> 584811 INFO  (jetty-launcher-608-thread-1) [    ] o.a.s.c.CorePropertiesLocator Config-defined core root directory: /home/jenkins/workspace/Lucene-Solr-5.x-Linux/solr/build/solr-core/test/J0/temp/solr.security.BasicAuthIntegrationTest_9225C74068803365-001/tempDir-001/node1/.
   [junit4]   2> 584811 INFO  (jetty-launcher-608-thread-4) [    ] o.a.s.c.CoreContainer New CoreContainer 582058833
   [junit4]   2> 584811 INFO  (jetty-launcher-608-thread-2) [    ] o.a.s.c.CorePropertiesLocator Config-defined core root directory: /home/jenkins/workspace/Lucene-Solr-5.x-Linux/solr/build/solr-core/test/J0/temp/solr.security.BasicAuthIntegrationTest_9225C74068803365-001/tempDir-001/node2/.
   [junit4]   2> 584811 INFO  (jetty-launcher-608-thread-4) [    ] o.a.s.c.CoreContainer Loading cores into CoreContainer [instanceDir=/home/jenkins/workspace/Lucene-Solr-5.x-Linux/solr/build/solr-core/test/J0/temp/solr.security.BasicAuthIntegrationTest_9225C74068803365-001/tempDir-001/node4]
   [junit4]   2> 584811 INFO  (jetty-launcher-608-thread-2) [    ] o.a.s.c.CoreContainer New CoreContainer 992164460
   [junit4]   2> 584811 INFO  (jetty-launcher-608-thread-1) [    ] o.a.s.c.CoreContainer New CoreContainer 874794146
   [junit4]   2> 584811 INFO  (jetty-launcher-608-thread-2) [    ] o.a.s.c.CoreContainer Loading cores into CoreContainer [instanceDir=/home/jenkins/workspace/Lucene-Solr-5.x-Linux/solr/build/solr-core/test/J0/temp/solr.security.BasicAuthIntegrationTest_9225C74068803365-001/tempDir-001/node2]
   [junit4]   2> 584811 WARN  (jetty-launcher-608-thread-4) [    ] o.a.s.c.CoreContainer Couldn't add files from /home/jenkins/workspace/Lucene-Solr-5.x-Linux/solr/build/solr-core/test/J0/temp/solr.security.BasicAuthIntegrationTest_9225C74068803365-001/tempDir-001/node4/lib to classpath: /home/jenkins/workspace/Lucene-Solr-5.x-Linux/solr/build/solr-core/test/J0/temp/solr.security.BasicAuthIntegrationTest_9225C74068803365-001/tempDir-001/node4/lib
   [junit4]   2> 584811 WARN  (jetty-launcher-608-thread-2) [    ] o.a.s.c.CoreContainer Couldn't add files from /home/jenkins/workspace/Lucene-Solr-5.x-Linux/solr/build/solr-core/test/J0/temp/solr.security.BasicAuthIntegrationTest_9225C74068803365-001/tempDir-001/node2/lib to classpath: /home/jenkins/workspace/Lucene-Solr-5.x-Linux/solr/build/solr-core/test/J0/temp/solr.security.BasicAuthIntegrationTest_9225C74068803365-001/tempDir-001/node2/lib
   [junit4]   2> 584811 INFO  (jetty-launcher-608-thread-3) [    ] o.a.s.c.CoreContainer Loading cores into CoreContainer [instanceDir=/home/jenkins/workspace/Lucene-Solr-5.x-Linux/solr/build/solr-core/test/J0/temp/solr.security.BasicAuthIntegrationTest_9225C74068803365-001/tempDir-001/node3]
   [junit4]   2> 584811 INFO  (jetty-launcher-608-thread-4) [    ] o.a.s.h.c.HttpShardHandlerFactory created with socketTimeout : 90000,urlScheme : ,connTimeout : 15000,maxConnectionsPerHost : 20,maxConnections : 10000,corePoolSize : 0,maximumPoolSize : 2147483647,maxThreadIdleTime : 5,sizeOfQueue : -1,fairnessPolicy : false,useRetries : false,
   [junit4]   2> 584812 INFO  (jetty-launcher-608-thread-2) [    ] o.a.s.h.c.HttpShardHandlerFactory created with socketTimeout : 90000,urlScheme : ,connTimeout : 15000,maxConnectionsPerHost : 20,maxConnections : 10000,corePoolSize : 0,maximumPoolSize : 2147483647,maxThreadIdleTime : 5,sizeOfQueue : -1,fairnessPolicy : false,useRetries : false,
   [junit4]   2> 584812 WARN  (jetty-launcher-608-thread-3) [    ] o.a.s.c.CoreContainer Couldn't add files from /home/jenkins/workspace/Lucene-Solr-5.x-Linux/solr/build/solr-core/test/J0/temp/solr.security.BasicAuthIntegrationTest_9225C74068803365-001/tempDir-001/node3/lib to classpath: /home/jenkins/workspace/Lucene-Solr-5.x-Linux/solr/build/solr-core/test/J0/temp/solr.security.BasicAuthIntegrationTest_9225C74068803365-001/tempDir-001/node3/lib
   [junit4]   2> 584811 INFO  (jetty-launcher-608-thread-1) [    ] o.a.s.c.CoreContainer Loading cores into CoreContainer [instanceDir=/home/jenkins/workspace/Lucene-Solr-5.x-Linux/solr/build/solr-core/test/J0/temp/solr.security.BasicAuthIntegrationTest_9225C74068803365-001/tempDir-001/node1]
   [junit4]   2> 584812 INFO  (jetty-launcher-608-thread-3) [    ] o.a.s.h.c.HttpShardHandlerFactory created with socketTimeout : 90000,urlScheme : ,connTimeout : 15000,maxConnectionsPerHost : 20,maxConnections : 10000,corePoolSize : 0,maximumPoolSize : 2147483647,maxThreadIdleTime : 5,sizeOfQueue : -1,fairnessPolicy : false,useRetries : false,
   [junit4]   2> 584812 WARN  (jetty-launcher-608-thread-1) [    ] o.a.s.c.CoreContainer Couldn't add files from /home/jenkins/workspace/Lucene-Solr-5.x-Linux/solr/build/solr-core/test/J0/temp/solr.security.BasicAuthIntegrationTest_9225C74068803365-001/tempDir-001/node1/lib to classpath: /home/jenkins/workspace/Lucene-Solr-5.x-Linux/solr/build/solr-core/test/J0/temp/solr.security.BasicAuthIntegrationTest_9225C74068803365-001/tempDir-001/node1/lib
   [junit4]   2> 584812 INFO  (jetty-launcher-608-thread-1) [    ] o.a.s.h.c.HttpShardHandlerFactory created with socketTimeout : 90000,urlScheme : ,connTimeout : 15000,maxConnectionsPerHost : 20,maxConnections : 10000,corePoolSize : 0,maximumPoolSize : 2147483647,maxThreadIdleTime : 5,sizeOfQueue : -1,fairnessPolicy : false,useRetries : false,
   [junit4]   2> 584812 INFO  (jetty-launcher-608-thread-4) [    ] o.a.s.u.UpdateShardHandler Creating UpdateShardHandler HTTP client with params: socketTimeout=340000&connTimeout=45000&retry=true
   [junit4]   2> 584812 INFO  (jetty-launcher-608-thread-2) [    ] o.a.s.u.UpdateShardHandler Creating UpdateShardHandler HTTP client with params: socketTimeout=340000&connTimeout=45000&retry=true
   [junit4]   2> 584812 INFO  (zkCallback-617-thread-1) [    ] o.a.s.c.c.ConnectionManager Watcher org.apache.solr.common.cloud.ConnectionManager@21e0a7b2 name:ZooKeeperConnection Watcher:127.0.0.1:41093 got event WatchedEvent state:SyncConnected type:None path:null path:null type:None
   [junit4]   2> 584812 INFO  (jetty-launcher-608-thread-3) [    ] o.a.s.u.UpdateShardHandler Creating UpdateShardHandler HTTP client with params: socketTimeout=340000&connTimeout=45000&retry=true
   [junit4]   2> 584812 INFO  (jetty-launcher-608-thread-5) [    ] o.a.s.c.c.ConnectionManager Client is connected to ZooKeeper
   [junit4]   2> 584812 INFO  (jetty-launcher-608-thread-4) [    ] o.a.s.l.LogWatcher SLF4J impl is org.slf4j.impl.Log4jLoggerFactory
   [junit4]   2> 584812 INFO  (jetty-launcher-608-thread-4) [    ] o.a.s.l.LogWatcher Registering Log Listener [Log4j (org.slf4j.impl.Log4jLoggerFactory)]
   [junit4]   2> 584812 INFO  (jetty-launcher-608-thread-2) [    ] o.a.s.l.LogWatcher SLF4J impl is org.slf4j.impl.Log4jLoggerFactory
   [junit4]   2> 584812 INFO  (jetty-launcher-608-thread-4) [    ] o.a.s.c.ZkContainer Zookeeper client=127.0.0.1:41093/solr
   [junit4]   2> 584812 INFO  (jetty-launcher-608-thread-5) [    ] o.a.s.c.c.SolrZkClient Using default ZkACLProvider
   [junit4]   2> 584813 INFO  (jetty-launcher-608-thread-4) [    ] o.a.s.c.ZkController zkHost includes chroot
   [junit4]   2> 584812 INFO  (jetty-launcher-608-thread-2) [    ] o.a.s.l.LogWatcher Registering Log Listener [Log4j (org.slf4j.impl.Log4jLoggerFactory)]
   [junit4]   2> 584813 INFO  (jetty-launcher-608-thread-1) [    ] o.a.s.u.UpdateShardHandler Creating UpdateShardHandler HTTP client with params: socketTimeout=340000&connTimeout=45000&retry=true
   [junit4]   2> 584813 INFO  (jetty-launcher-608-thread-3) [    ] o.a.s.l.LogWatcher SLF4J impl is org.slf4j.impl.Log4jLoggerFactory
   [junit4]   2> 584813 INFO  (jetty-launcher-608-thread-2) [    ] o.a.s.c.ZkContainer Zookeeper client=127.0.0.1:41093/solr
   [junit4]   2> 584813 INFO  (jetty-launcher-608-thread-4) [    ] o.a.s.c.c.SolrZkClient Using default ZkCredentialsProvider
   [junit4]   2> 584813 INFO  (jetty-launcher-608-thread-2) [    ] o.a.s.c.ZkController zkHost includes chroot
   [junit4]   2> 584813 INFO  (jetty-launcher-608-thread-3) [    ] o.a.s.l.LogWatcher Registering Log Listener [Log4j (org.slf4j.impl.Log4jLoggerFactory)]
   [junit4]   2> 584813 INFO  (jetty-launcher-608-thread-2) [    ] o.a.s.c.c.SolrZkClient Using default ZkCredentialsProvider
   [junit4]   2> 584813 INFO  (jetty-launcher-608-thread-3) [    ] o.a.s.c.ZkContainer Zookeeper client=127.0.0.1:41093/solr
   [junit4]   2> 584813 INFO  (jetty-launcher-608-thread-3) [    ] o.a.s.c.ZkController zkHost includes chroot
   [junit4]   2> 584813 INFO  (jetty-launcher-608-thread-3) [    ] o.a.s.c.c.SolrZkClient Using default ZkCredentialsProvider
   [junit4]   2> 584813 INFO  (jetty-launcher-608-thread-4) [    ] o.a.s.c.c.ConnectionManager Waiting for client to connect to ZooKeeper
   [junit4]   2> 584814 INFO  (jetty-launcher-608-thread-1) [    ] o.a.s.l.LogWatcher SLF4J impl is org.slf4j.impl.Log4jLoggerFactory
   [junit4]   2> 584814 INFO  (jetty-launcher-608-thread-2) [    ] o.a.s.c.c.ConnectionManager Waiting for client to connect to ZooKeeper
   [junit4]   2> 584814 INFO  (jetty-launcher-608-thread-1) [    ] o.a.s.l.LogWatcher Registering Log Listener [Log4j (org.slf4j.impl.Log4jLoggerFactory)]
   [junit4]   2> 584814 INFO  (jetty-launcher-608-thread-3) [    ] o.a.s.c.c.ConnectionManager Waiting for client to connect to ZooKeeper
   [junit4]   2> 584814 INFO  (jetty-launcher-608-thread-1) [    ] o.a.s.c.ZkContainer Zookeeper client=127.0.0.1:41093/solr
   [junit4]   2> 584814 INFO  (jetty-launcher-608-thread-1) [    ] o.a.s.c.ZkController zkHost includes chroot
   [junit4]   2> 584814 INFO  (jetty-launcher-608-thread-1) [    ] o.a.s.c.c.SolrZkClient Using default ZkCredentialsProvider
   [junit4]   2> 584814 INFO  (jetty-launcher-608-thread-1) [    ] o.a.s.c.c.ConnectionManager Waiting for client to connect to ZooKeeper
   [junit4]   2> 584815 INFO  (jetty-launcher-608-thread-5) [n:127.0.0.1:35879_solr    ] o.a.s.c.c.ConnectionManager Waiting for client to connect to ZooKeeper
   [junit4]   2> 584817 INFO  (zkCallback-626-thread-1) [    ] o.a.s.c.c.ConnectionManager Watcher org.apache.solr.common.cloud.ConnectionManager@6d760c36 name:ZooKeeperConnection Watcher:127.0.0.1:41093 got event WatchedEvent state:SyncConnected type:None path:null path:null type:None
   [junit4]   2> 584817 INFO  (jetty-launcher-608-thread-4) [    ] o.a.s.c.c.ConnectionManager Client is connected to ZooKeeper
   [junit4]   2> 584817 INFO  (zkCallback-627-thread-1) [    ] o.a.s.c.c.ConnectionManager Watcher org.apache.solr.common.cloud.ConnectionManager@53db357c name:ZooKeeperConnection Watcher:127.0.0.1:41093 got event WatchedEvent state:SyncConnected type:None path:null path:null type:None
   [junit4]   2> 584817 INFO  (jetty-launcher-608-thread-4) [    ] o.a.s.c.c.SolrZkClient Using default ZkACLProvider
   [junit4]   2> 584817 INFO  (jetty-launcher-608-thread-2) [    ] o.a.s.c.c.ConnectionManager Client is connected to ZooKeeper
   [junit4]   2> 584817 INFO  (zkCallback-628-thread-1) [    ] o.a.s.c.c.ConnectionManager Watcher org.apache.solr.common.cloud.ConnectionManager@179a8686 name:ZooKeeperConnection Watcher:127.0.0.1:41093 got event WatchedEvent state:SyncConnected type:None path:null path:null type:None
   [junit4]   2> 584817 INFO  (jetty-launcher-608-thread-3) [    ] o.a.s.c.c.ConnectionManager Client is connected to ZooKeeper
   [junit4]   2> 584817 INFO  (jetty-launcher-608-thread-2) [    ] o.a.s.c.c.SolrZkClient Using default ZkACLProvider
   [junit4]   2> 584817 INFO  (jetty-launcher-608-thread-3) [    ] o.a.s.c.c.SolrZkClient Using default ZkACLProvider
   [junit4]   2> 584817 INFO  (zkCallback-629-thread-1) [    ] o.a.s.c.c.ConnectionManager Watcher org.apache.solr.common.cloud.ConnectionManager@66ba19be name:ZooKeeperConnection Watcher:127.0.0.1:41093 got event WatchedEvent state:SyncConnected type:None path:null path:null type:None
   [junit4]   2> 584817 INFO  (jetty-launcher-608-thread-1) [    ] o.a.s.c.c.ConnectionManager Client is connected to ZooKeeper
   [junit4]   2> 584818 INFO  (jetty-launcher-608-thread-1) [    ] o.a.s.c.c.SolrZkClient Using default ZkACLProvider
   [junit4]   2> 584819 INFO  (zkCallback-630-thread-1-processing-n:127.0.0.1:35879_solr) [n:127.0.0.1:35879_solr    ] o.a.s.c.c.ConnectionManager Watcher org.apache.solr.common.cloud.ConnectionManager@34421e60 name:ZooKeeperConnection Watcher:127.0.0.1:41093/solr got event WatchedEvent state:SyncConnected type:None path:null path:null type:None
   [junit4]   2> 584819 INFO  (jetty-launcher-608-thread-5) [n:127.0.0.1:35879_solr    ] o.a.s.c.c.ConnectionManager Client is connected to ZooKeeper
   [junit4]   2> 584820 WARN  (NIOServerCxn.Factory:0.0.0.0/0.0.0.0:0) [    ] o.a.z.s.NIOServerCnxn caught end of stream exception
   [junit4]   2> EndOfStreamException: Unable to read additional data from client sessionid 0x152e3f530000008, likely client has closed socket
   [junit4]   2> 	at org.apache.zookeeper.server.NIOServerCnxn.doIO(NIOServerCnxn.java:228)
   [junit4]   2> 	at org.apache.zookeeper.server.NIOServerCnxnFactory.run(NIOServerCnxnFactory.java:208)
   [junit4]   2> 	at java.lang.Thread.run(Thread.java:745)
   [junit4]   2> 584821 INFO  (jetty-launcher-608-thread-4) [n:127.0.0.1:34147_solr    ] o.a.s.c.c.ConnectionManager Waiting for client to connect to ZooKeeper
   [junit4]   2> 584821 INFO  (jetty-launcher-608-thread-2) [n:127.0.0.1:55620_solr    ] o.a.s.c.c.ConnectionManager Waiting for client to connect to ZooKeeper
   [junit4]   2> 584822 INFO  (jetty-launcher-608-thread-3) [n:127.0.0.1:34468_solr    ] o.a.s.c.c.ConnectionManager Waiting for client to connect to ZooKeeper
   [junit4]   2> 584822 INFO  (jetty-launcher-608-thread-1) [n:127.0.0.1:47728_solr    ] o.a.s.c.c.ConnectionManager Waiting for client to connect to ZooKeeper
   [junit4]   2> 584824 INFO  (zkCallback-631-thread-1-processing-n:127.0.0.1:34147_solr) [n:127.0.0.1:34147_solr    ] o.a.s.c.c.ConnectionManager Watcher org.apache.solr.common.cloud.ConnectionManager@696d8aa name:ZooKeeperConnection Watcher:127.0.0.1:41093/solr got event WatchedEvent state:SyncConnected type:None path:null path:null type:None
   [junit4]   2> 584824 INFO  (jetty-launcher-608-thread-5) [n:127.0.0.1:35879_solr    ] o.a.s.c.c.SolrZkClient makePath: /overseer/queue
   [junit4]   2> 584824 INFO  (jetty-launcher-608-thread-4) [n:127.0.0.1:34147_solr    ] o.a.s.c.c.ConnectionManager Client is connected to ZooKeeper
   [junit4]   2> 584824 INFO  (zkCallback-632-thread-1-processing-n:127.0.0.1:55620_solr) [n:127.0.0.1:55620_solr    ] o.a.s.c.c.ConnectionManager Watcher org.apache.solr.common.cloud.ConnectionManager@5e1f2fff name:ZooKeeperConnection Watcher:127.0.0.1:41093/solr got event WatchedEvent state:SyncConnected type:None path:null path:null type:None
   [junit4]   2> 584824 INFO  (jetty-launcher-608-thread-2) [n:127.0.0.1:55620_solr    ] o.a.s.c.c.ConnectionManager Client is connected to ZooKeeper
   [junit4]   2> 584825 INFO  (zkCallback-633-thread-1-processing-n:127.0.0.1:34468_solr) [n:127.0.0.1:34468_solr    ] o.a.s.c.c.ConnectionManager Watcher org.apache.solr.common.cloud.ConnectionManager@54a1f566 name:ZooKeeperConnection Watcher:127.0.0.1:41093/solr got event WatchedEvent state:SyncConnected type:None path:null path:null type:None
   [junit4]   2> 584825 INFO  (jetty-launcher-608-thread-3) [n:127.0.0.1:34468_solr    ] o.a.s.c.c.ConnectionManager Client is connected to ZooKeeper
   [junit4]   2> 584825 INFO  (zkCallback-634-thread-1-processing-n:127.0.0.1:47728_solr) [n:127.0.0.1:47728_solr    ] o.a.s.c.c.ConnectionManager Watcher org.apache.solr.common.cloud.ConnectionManager@3e0222fe name:ZooKeeperConnection Watcher:127.0.0.1:41093/solr got event WatchedEvent state:SyncConnected type:None path:null path:null type:None
   [junit4]   2> 584826 INFO  (jetty-launcher-608-thread-1) [n:127.0.0.1:47728_solr    ] o.a.s.c.c.ConnectionManager Client is connected to ZooKeeper
   [junit4]   2> 584828 INFO  (jetty-launcher-608-thread-4) [n:127.0.0.1:34147_solr    ] o.a.s.c.c.SolrZkClient makePath: /overseer/queue
   [junit4]   2> 584828 INFO  (jetty-launcher-608-thread-2) [n:127.0.0.1:55620_solr    ] o.a.s.c.c.SolrZkClient makePath: /overseer/queue
   [junit4]   2> 584833 INFO  (jetty-launcher-608-thread-1) [n:127.0.0.1:47728_solr    ] o.a.s.c.c.SolrZkClient makePath: /overseer/collection-queue-work
   [junit4]   2> 584833 INFO  (jetty-launcher-608-thread-3) [n:127.0.0.1:34468_solr    ] o.a.s.c.c.SolrZkClient makePath: /overseer/collection-queue-work
   [junit4]   2> 584833 INFO  (jetty-launcher-608-thread-5) [n:127.0.0.1:35879_solr    ] o.a.s.c.c.SolrZkClient makePath: /overseer/collection-queue-work
   [junit4]   2> 584835 INFO  (jetty-launcher-608-thread-4) [n:127.0.0.1:34147_solr    ] o.a.s.c.c.SolrZkClient makePath: /overseer/collection-queue-work
   [junit4]   2> 584858 INFO  (jetty-launcher-608-thread-5) [n:127.0.0.1:35879_solr    ] o.a.s.c.c.SolrZkClient makePath: /overseer/collection-map-running
   [junit4]   2> 584860 INFO  (jetty-launcher-608-thread-1) [n:127.0.0.1:47728_solr    ] o.a.s.c.c.SolrZkClient makePath: /overseer/collection-map-running
   [junit4]   2> 584860 INFO  (jetty-launcher-608-thread-2) [n:127.0.0.1:55620_solr    ] o.a.s.c.c.SolrZkClient makePath: /overseer/collection-map-running
   [junit4]   2> 584860 INFO  (jetty-launcher-608-thread-3) [n:127.0.0.1:34468_solr    ] o.a.s.c.c.SolrZkClient makePath: /overseer/collection-map-running
   [junit4]   2> 584862 INFO  (jetty-launcher-608-thread-4) [n:127.0.0.1:34147_solr    ] o.a.s.c.c.SolrZkClient makePath: /overseer/collection-map-running
   [junit4]   2> 584870 INFO  (jetty-launcher-608-thread-2) [n:127.0.0.1:55620_solr    ] o.a.s.c.c.SolrZkClient makePath: /overseer/collection-map-completed
   [junit4]   2> 584870 INFO  (jetty-launcher-608-thread-1) [n:127.0.0.1:47728_solr    ] o.a.s.c.c.SolrZkClient makePath: /overseer/collection-map-completed
   [junit4]   2> 584870 INFO  (jetty-launcher-608-thread-5) [n:127.0.0.1:35879_solr    ] o.a.s.c.c.SolrZkClient makePath: /overseer/collection-map-completed
   [junit4]   2> 584871 INFO  (jetty-launcher-608-thread-3) [n:127.0.0.1:34468_solr    ] o.a.s.c.c.SolrZkClient makePath: /overseer/collection-map-completed
   [junit4]   2> 584879 INFO  (jetty-launcher-608-thread-4) [n:127.0.0.1:34147_solr    ] o.a.s.c.c.SolrZkClient makePath: /overseer/collection-map-completed
   [junit4]   2> 584892 INFO  (jetty-launcher-608-thread-1) [n:127.0.0.1:47728_solr    ] o.a.s.c.c.SolrZkClient makePath: /overseer/collection-map-failure
   [junit4]   2> 584893 INFO  (jetty-launcher-608-thread-2) [n:127.0.0.1:55620_solr    ] o.a.s.c.c.SolrZkClient makePath: /overseer/collection-map-failure
   [junit4]   2> 584894 INFO  (jetty-launcher-608-thread-3) [n:127.0.0.1:34468_solr    ] o.a.s.c.c.SolrZkClient makePath: /overseer/collection-map-failure
   [junit4]   2> 584894 INFO  (jetty-launcher-608-thread-5) [n:127.0.0.1:35879_solr    ] o.a.s.c.c.SolrZkClient makePath: /overseer/collection-map-failure
   [junit4]   2> 584908 INFO  (jetty-launcher-608-thread-3) [n:127.0.0.1:34468_solr    ] o.a.s.c.c.SolrZkClient makePath: /live_nodes
   [junit4]   2> 584908 INFO  (jetty-launcher-608-thread-2) [n:127.0.0.1:55620_solr    ] o.a.s.c.c.SolrZkClient makePath: /live_nodes
   [junit4]   2> 584908 INFO  (jetty-launcher-608-thread-5) [n:127.0.0.1:35879_solr    ] o.a.s.c.c.SolrZkClient makePath: /live_nodes
   [junit4]   2> 584908 INFO  (jetty-launcher-608-thread-4) [n:127.0.0.1:34147_solr    ] o.a.s.c.c.SolrZkClient makePath: /live_nodes
   [junit4]   2> 584908 INFO  (jetty-launcher-608-thread-1) [n:127.0.0.1:47728_solr    ] o.a.s.c.c.SolrZkClient makePath: /live_nodes
   [junit4]   2> 584918 INFO  (jetty-launcher-608-thread-3) [n:127.0.0.1:34468_solr    ] o.a.s.c.c.SolrZkClient makePath: /collections
   [junit4]   2> 584920 INFO  (jetty-launcher-608-thread-5) [n:127.0.0.1:35879_solr    ] o.a.s.c.c.SolrZkClient makePath: /collections
   [junit4]   2> 584921 INFO  (jetty-launcher-608-thread-2) [n:127.0.0.1:55620_solr    ] o.a.s.c.c.SolrZkClient makePath: /collections
   [junit4]   2> 584921 INFO  (jetty-launcher-608-thread-4) [n:127.0.0.1:34147_solr    ] o.a.s.c.c.SolrZkClient makePath: /collections
   [junit4]   2> 584922 INFO  (jetty-launcher-608-thread-1) [n:127.0.0.1:47728_solr    ] o.a.s.c.c.SolrZkClient makePath: /collections
   [junit4]   2> 584926 INFO  (jetty-launcher-608-thread-5) [n:127.0.0.1:35879_solr    ] o.a.s.c.c.SolrZkClient makePath: /aliases.json
   [junit4]   2> 584928 INFO  (jetty-launcher-608-thread-3) [n:127.0.0.1:34468_solr    ] o.a.s.c.c.SolrZkClient makePath: /aliases.json
   [junit4]   2> 584928 INFO  (jetty-launcher-608-thread-2) [n:127.0.0.1:55620_solr    ] o.a.s.c.c.SolrZkClient makePath: /aliases.json
   [junit4]   2> 584928 INFO  (jetty-launcher-608-thread-4) [n:127.0.0.1:34147_solr    ] o.a.s.c.c.SolrZkClient makePath: /aliases.json
   [junit4]   2> 584928 INFO  (jetty-launcher-608-thread-1) [n:127.0.0.1:47728_solr    ] o.a.s.c.c.SolrZkClient makePath: /aliases.json
   [junit4]   2> 584933 INFO  (jetty-launcher-608-thread-2) [n:127.0.0.1:55620_solr    ] o.a.s.c.c.SolrZkClient makePath: /clusterstate.json
   [junit4]   2> 584933 INFO  (jetty-launcher-608-thread-5) [n:127.0.0.1:35879_solr    ] o.a.s.c.c.SolrZkClient makePath: /clusterstate.json
   [junit4]   2> 584933 INFO  (jetty-launcher-608-thread-3) [n:127.0.0.1:34468_solr    ] o.a.s.c.c.SolrZkClient makePath: /clusterstate.json
   [junit4]   2> 584933 INFO  (jetty-launcher-608-thread-4) [n:127.0.0.1:34147_solr    ] o.a.s.c.c.SolrZkClient makePath: /clusterstate.json
   [junit4]   2> 584933 INFO  (jetty-launcher-608-thread-1) [n:127.0.0.1:47728_solr    ] o.a.s.c.c.SolrZkClient makePath: /clusterstate.json
   [junit4]   2> 584938 INFO  (jetty-launcher-608-thread-5) [n:127.0.0.1:35879_solr    ] o.a.s.c.c.SolrZkClient makePath: /security.json
   [junit4]   2> 584938 INFO  (jetty-launcher-608-thread-2) [n:127.0.0.1:55620_solr    ] o.a.s.c.c.SolrZkClient makePath: /security.json
   [junit4]   2> 584938 INFO  (jetty-launcher-608-thread-3) [n:127.0.0.1:34468_solr    ] o.a.s.c.c.SolrZkClient makePath: /security.json
   [junit4]   2> 584938 INFO  (jetty-launcher-608-thread-1) [n:127.0.0.1:47728_solr    ] o.a.s.c.c.SolrZkClient makePath: /security.json
   [junit4]   2> 584938 INFO  (jetty-launcher-608-thread-4) [n:127.0.0.1:34147_solr    ] o.a.s.c.c.SolrZkClient makePath: /security.json
   [junit4]   2> 584941 INFO  (jetty-launcher-608-thread-2) [n:127.0.0.1:55620_solr    ] o.a.s.c.ZkController Register node as live in ZooKeeper:/live_nodes/127.0.0.1:55620_solr
   [junit4]   2> 584941 INFO  (jetty-launcher-608-thread-5) [n:127.0.0.1:35879_solr    ] o.a.s.c.ZkController Register node as live in ZooKeeper:/live_nodes/127.0.0.1:35879_solr
   [junit4]   2> 584941 INFO  (jetty-launcher-608-thread-1) [n:127.0.0.1:47728_solr    ] o.a.s.c.ZkController Register node as live in ZooKeeper:/live_nodes/127.0.0.1:47728_solr
   [junit4]   2> 584941 INFO  (jetty-launcher-608-thread-3) [n:127.0.0.1:34468_solr    ] o.a.s.c.ZkController Register node as live in ZooKeeper:/live_nodes/127.0.0.1:34468_solr
   [junit4]   2> 584942 INFO  (jetty-launcher-608-thread-4) [n:127.0.0.1:34147_solr    ] o.a.s.c.ZkController Register node as live in ZooKeeper:/live_nodes/127.0.0.1:34147_solr
   [junit4]   2> 584944 INFO  (jetty-launcher-608-thread-2) [n:127.0.0.1:55620_solr    ] o.a.s.c.c.SolrZkClient makePath: /live_nodes/127.0.0.1:55620_solr
   [junit4]   2> 584944 INFO  (jetty-launcher-608-thread-5) [n:127.0.0.1:35879_solr    ] o.a.s.c.c.SolrZkClient makePath: /live_nodes/127.0.0.1:35879_solr
   [junit4]   2> 584944 INFO  (jetty-launcher-608-thread-1) [n:127.0.0.1:47728_solr    ] o.a.s.c.c.SolrZkClient makePath: /live_nodes/127.0.0.1:47728_solr
   [junit4]   2> 584944 INFO  (jetty-launcher-608-thread-3) [n:127.0.0.1:34468_solr    ] o.a.s.c.c.SolrZkClient makePath: /live_nodes/127.0.0.1:34468_solr
   [junit4]   2> 584945 INFO  (jetty-launcher-608-thread-4) [n:127.0.0.1:34147_solr    ] o.a.s.c.c.SolrZkClient makePath: /live_nodes/127.0.0.1:34147_solr
   [junit4]   2> 584950 INFO  (jetty-launcher-608-thread-2) [n:127.0.0.1:55620_solr    ] o.a.s.c.c.SolrZkClient makePath: /overseer_elect
   [junit4]   2> 584950 INFO  (jetty-launcher-608-thread-5) [n:127.0.0.1:35879_solr    ] o.a.s.c.c.SolrZkClient makePath: /overseer_elect
   [junit4]   2> 584950 INFO  (jetty-launcher-608-thread-1) [n:127.0.0.1:47728_solr    ] o.a.s.c.c.SolrZkClient makePath: /overseer_elect
   [junit4]   2> 584951 INFO  (jetty-launcher-608-thread-3) [n:127.0.0.1:34468_solr    ] o.a.s.c.c.SolrZkClient makePath: /overseer_elect
   [junit4]   2> 584951 INFO  (jetty-launcher-608-thread-4) [n:127.0.0.1:34147_solr    ] o.a.s.c.c.SolrZkClient makePath: /overseer_elect
   [junit4]   2> 584968 INFO  (jetty-launcher-608-thread-2) [n:127.0.0.1:55620_solr    ] o.a.s.c.c.SolrZkClient makePath: /overseer_elect/election
   [junit4]   2> 584968 INFO  (jetty-launcher-608-thread-3) [n:127.0.0.1:34468_solr    ] o.a.s.c.c.SolrZkClient makePath: /overseer_elect/election
   [junit4]   2> 584968 INFO  (jetty-launcher-608-thread-1) [n:127.0.0.1:47728_solr    ] o.a.s.c.c.SolrZkClient makePath: /overseer_elect/election
   [junit4]   2> 584969 INFO  (jetty-launcher-608-thread-5) [n:127.0.0.1:35879_solr    ] o.a.s.c.c.SolrZkClient makePath: /overseer_elect/election
   [junit4]   2> 584969 INFO  (jetty-launcher-608-thread-4) [n:127.0.0.1:34147_solr    ] o.a.s.c.c.SolrZkClient makePath: /overseer_elect/election
   [junit4]   2> 584973 INFO  (jetty-launcher-608-thread-1) [n:127.0.0.1:47728_solr    ] o.a.s.c.Overseer Overseer (id=null) closing
   [junit4]   2> 584973 INFO  (jetty-launcher-608-thread-2) [n:127.0.0.1:55620_solr    ] o.a.s.c.Overseer Overseer (id=null) closing
   [junit4]   2> 584973 INFO  (jetty-launcher-608-thread-3) [n:127.0.0.1:34468_solr    ] o.a.s.c.Overseer Overseer (id=null) closing
   [junit4]   2> 584974 INFO  (jetty-launcher-608-thread-5) [n:127.0.0.1:35879_solr    ] o.a.s.c.Overseer Overseer (id=null) closing
   [junit4]   2> 584976 INFO  (jetty-launcher-608-thread-1) [n:127.0.0.1:47728_solr    ] o.a.s.c.LeaderElector Joined leadership election with path: /overseer_elect/election/95389184340000783-127.0.0.1:47728_solr-n_0000000000
   [junit4]   2> 584976 INFO  (jetty-launcher-608-thread-2) [n:127.0.0.1:55620_solr    ] o.a.s.c.LeaderElector Joined leadership election with path: /overseer_elect/election/95389184340000781-127.0.0.1:55620_solr-n_0000000001
   [junit4]   2> 584976 INFO  (jetty-launcher-608-thread-3) [n:127.0.0.1:34468_solr    ] o.a.s.c.LeaderElector Joined leadership election with path: /overseer_elect/election/95389184340000782-127.0.0.1:34468_solr-n_0000000002
   [junit4]   2> 584977 INFO  (jetty-launcher-608-thread-4) [n:127.0.0.1:34147_solr    ] o.a.s.c.Overseer Overseer (id=null) closing
   [junit4]   2> 584977 INFO  (jetty-launcher-608-thread-5) [n:127.0.0.1:35879_solr    ] o.a.s.c.LeaderElector Joined leadership election with path: /overseer_elect/election/95389184340000779-127.0.0.1:35879_solr-n_0000000003
   [junit4]   2> 584977 INFO  (jetty-launcher-608-thread-1) [n:127.0.0.1:47728_solr    ] o.a.s.c.OverseerElectionContext I am going to be the leader 127.0.0.1:47728_solr
   [junit4]   2> 584977 INFO  (jetty-launcher-608-thread-1) [n:127.0.0.1:47728_solr    ] o.a.s.c.c.SolrZkClient makePath: /overseer_elect/leader
   [junit4]   2> 584979 INFO  (jetty-launcher-608-thread-4) [n:127.0.0.1:34147_solr    ] o.a.s.c.LeaderElector Joined leadership election with path: /overseer_elect/election/95389184340000780-127.0.0.1:34147_solr-n_0000000004
   [junit4]   2> 584979 INFO  (jetty-launcher-608-thread-2) [n:127.0.0.1:55620_solr    ] o.a.s.c.LeaderElector Watching path /overseer_elect/election/95389184340000783-127.0.0.1:47728_solr-n_0000000000 to know if I could be the leader
   [junit4]   2> 584979 INFO  (jetty-launcher-608-thread-3) [n:127.0.0.1:34468_solr    ] o.a.s.c.LeaderElector Watching path /overseer_elect/election/95389184340000781-127.0.0.1:55620_solr-n_0000000001 to know if I could be the leader
   [junit4]   2> 584979 INFO  (jetty-launcher-608-thread-2) [n:127.0.0.1:55620_solr    ] o.a.s.c.c.ZkStateReader Updating cluster state from ZooKeeper... 
   [junit4]   2> 584979 INFO  (jetty-launcher-608-thread-3) [n:127.0.0.1:34468_solr    ] o.a.s.c.c.ZkStateReader Updating cluster state from ZooKeeper... 
   [junit4]   2> 584979 INFO  (jetty-launcher-608-thread-5) [n:127.0.0.1:35879_solr    ] o.a.s.c.LeaderElector Watching path /overseer_elect/election/95389184340000782-127.0.0.1:34468_solr-n_0000000002 to know if I could be the leader
   [junit4]   2> 584979 INFO  (jetty-launcher-608-thread-5) [n:127.0.0.1:35879_solr    ] o.a.s.c.c.ZkStateReader Updating cluster state from ZooKeeper... 
   [junit4]   2> 584987 INFO  (jetty-launcher-608-thread-4) [n:127.0.0.1:34147_solr    ] o.a.s.c.LeaderElector Watching path /overseer_elect/election/95389184340000779-127.0.0.1:35879_solr-n_0000000003 to know if I could be the leader
   [junit4]   2> 584987 INFO  (jetty-launcher-608-thread-4) [n:127.0.0.1:34147_solr    ] o.a.s.c.c.ZkStateReader Updating cluster state from ZooKeeper... 
   [junit4]   2> 584988 INFO  (jetty-launcher-608-thread-1) [n:127.0.0.1:47728_solr    ] o.a.s.c.Overseer Overseer (id=95389184340000783-127.0.0.1:47728_solr-n_0000000000) starting
   [junit4]   2> 585000 INFO  (jetty-launcher-608-thread-1) [n:127.0.0.1:47728_solr    ] o.a.s.c.c.SolrZkClient makePath: /overseer/queue-work
   [junit4]   2> 585011 INFO  (jetty-launcher-608-thread-5) [n:127.0.0.1:35879_solr    ] o.a.s.c.CoreContainer Security conf doesn't exist. Skipping setup for authorization module.
   [junit4]   2> 585011 INFO  (jetty-launcher-608-thread-5) [n:127.0.0.1:35879_solr    ] o.a.s.c.CoreContainer No authentication plugin used.
   [junit4]   2> 585012 INFO  (jetty-launcher-608-thread-5) [n:127.0.0.1:35879_solr    ] o.a.s.c.CorePropertiesLocator Looking for core definitions underneath /home/jenkins/workspace/Lucene-Solr-5.x-Linux/solr/build/solr-core/test/J0/temp/solr.security.BasicAuthIntegrationTest_9225C74068803365-001/tempDir-001/node5/.
   [junit4]   2> 585012 INFO  (jetty-launcher-608-thread-5) [n:127.0.0.1:35879_solr    ] o.a.s.c.CorePropertiesLocator Found 0 core definitions
   [junit4]   2> 585013 INFO  (jetty-launcher-608-thread-5) [n:127.0.0.1:35879_solr    ] o.a.s.s.SolrDispatchFilter user.dir=/home/jenkins/workspace/Lucene-Solr-5.x-Linux/solr/build/solr-core/test/J0
   [junit4]   2> 585013 INFO  (jetty-launcher-608-thread-5) [n:127.0.0.1:35879_solr    ] o.a.s.s.SolrDispatchFilter SolrDispatchFilter.init() done
   [junit4]   2> 585014 INFO  (jetty-launcher-608-thread-4) [n:127.0.0.1:34147_solr    ] o.a.s.c.CoreContainer Security conf doesn't exist. Skipping setup for authorization module.
   [junit4]   2> 585014 INFO  (jetty-launcher-608-thread-4) [n:127.0.0.1:34147_solr    ] o.a.s.c.CoreContainer No authentication plugin used.
   [junit4]   2> 585014 INFO  (jetty-launcher-608-thread-3) [n:127.0.0.1:34468_solr    ] o.a.s.c.CoreContainer Security conf doesn't exist. Skipping setup for authorization module.
   [junit4]   2> 585014 INFO  (jetty-launcher-608-thread-3) [n:127.0.0.1:34468_solr    ] o.a.s.c.CoreContainer No authentication plugin used.
   [junit4]   2> 585014 INFO  (jetty-launcher-608-thread-4) [n:127.0.0.1:34147_solr    ] o.a.s.c.CorePropertiesLocator Looking for core definitions underneath /home/jenkins/workspace/Lucene-Solr-5.x-Linux/solr/build/solr-core/test/J0/temp/solr.security.BasicAuthIntegrationTest_9225C74068803365-001/tempDir-001/node4/.
   [junit4]   2> 585014 INFO  (jetty-launcher-608-thread-4) [n:127.0.0.1:34147_solr    ] o.a.s.c.CorePropertiesLocator Found 0 core definitions
   [junit4]   2> 585014 INFO  (jetty-launcher-608-thread-3) [n:127.0.0.1:34468_solr    ] o.a.s.c.CorePropertiesLocator Looking for core definitions underneath /home/jenkins/workspace/Lucene-Solr-5.x-Linux/solr/build/solr-core/test/J0/temp/solr.security.BasicAuthIntegrationTest_9225C74068803365-001/tempDir-001/node3/.
   [junit4]   2> 585014 INFO  (jetty-launcher-608-thread-3) [n:127.0.0.1:34468_solr    ] o.a.s.c.CorePropertiesLocator Found 0 core definitions
   [junit4]   2> 585015 INFO  (jetty-launcher-608-thread-2) [n:127.0.0.1:55620_solr    ] o.a.s.c.CoreContainer Security conf doesn't exist. Skipping setup for authorization module.
   [junit4]   2> 585015 INFO  (jetty-launcher-608-thread-4) [n:127.0.0.1:34147_solr    ] o.a.s.s.SolrDispatchFilter user.dir=/home/jenkins/workspace/Lucene-Solr-5.x-Linux/solr/build/solr-core/test/J0
   [junit4]   2> 585015 INFO  (jetty-launcher-608-thread-3) [n:127.0.0.1:34468_solr    ] o.a.s.s.SolrDispatchFilter user.dir=/home/jenkins/workspace/Lucene-Solr-5.x-Linux/solr/build/solr-core/test/J0
   [junit4]   2> 585015 INFO  (jetty-launcher-608-thread-3) [n:127.0.0.1:34468_solr    ] o.a.s.s.SolrDispatchFilter SolrDispatchFilter.init() done
   [junit4]   2> 585015 INFO  (jetty-launcher-608-thread-4) [n:127.0.0.1:34147_solr    ] o.a.s.s.SolrDispatchFilter SolrDispatchFilter.init() done
   [junit4]   2> 585015 INFO  (jetty-launcher-608-thread-2) [n:127.0.0.1:55620_solr    ] o.a.s.c.CoreContainer No authentication plugin used.
   [junit4]   2> 585016 INFO  (jetty-launcher-608-thread-2) [n:127.0.0.1:55620_solr    ] o.a.s.c.CorePropertiesLocator Looking for core definitions underneath /home/jenkins/workspace/Lucene-Solr-5.x-Linux/solr/build/solr-core/test/J0/temp/solr.security.BasicAuthIntegrationTest_9225C74068803365-001/tempDir-001/node2/.
   [junit4]   2> 585016 INFO  (jetty-launcher-608-thread-2) [n:127.0.0.1:55620_solr    ] o.a.s.c.CorePropertiesLocator Found 0 core definitions
   [junit4]   2> 585017 INFO  (jetty-launcher-608-thread-2) [n:127.0.0.1:55620_solr    ] o.a.s.s.SolrDispatchFilter user.dir=/home/jenkins/workspace/Lucene-Solr-5.x-Linux/solr/build/solr-core/test/J0
   [junit4]   2> 585017 INFO  (jetty-launcher-608-thread-2) [n:127.0.0.1:55620_solr    ] o.a.s.s.SolrDispatchFilter SolrDispatchFilter.init() done
   [junit4]   2> 585019 INFO  (jetty-launcher-608-thread-1) [n:127.0.0.1:47728_solr    ] o.a.s.c.OverseerAutoReplicaFailoverThread Starting OverseerAutoReplicaFailoverThread autoReplicaFailoverWorkLoopDelay=10000 autoReplicaFailoverWaitAfterExpiration=30000 autoReplicaFailoverBadNodeExpiration=60000
   [junit4]   2> 585019 INFO  (jetty-launcher-608-thread-1) [n:127.0.0.1:47728_solr    ] o.a.s.c.c.ZkStateReader Updating cluster state from ZooKeeper... 
   [junit4]   2> 585019 INFO  (OverseerCollectionConfigSetProcessor-95389184340000783-127.0.0.1:47728_solr-n_0000000000) [n:127.0.0.1:47728_solr    ] o.a.s.c.OverseerTaskProcessor Process current queue of overseer operations
   [junit4]   2> 585019 INFO  (OverseerStateUpdate-95389184340000783-127.0.0.1:47728_solr-n_0000000000) [n:127.0.0.1:47728_solr    ] o.a.s.c.Overseer Starting to work on the main queue
   [junit4]   2> 585036 INFO  (jetty-launcher-608-thread-1) [n:127.0.0.1:47728_solr    ] o.a.s.c.CoreContainer Security conf doesn't exist. Skipping setup for authorization module.
   [junit4]   2> 585036 INFO  (jetty-launcher-608-thread-1) [n:127.0.0.1:47728_solr    ] o.a.s.c.CoreContainer No authentication plugin used.
   [junit4]   2> 585037 INFO  (jetty-launcher-608-thread-1) [n:127.0.0.1:47728_solr    ] o.a.s.c.CorePropertiesLocator Looking for core definitions underneath /home/jenkins/workspace/Lucene-Solr-5.x-Linux/solr/build/solr-core/test/J0/temp/solr.security.BasicAuthIntegrationTest_9225C74068803365-001/tempDir-001/node1/.
   [junit4]   2> 585037 INFO  (jetty-launcher-608-thread-1) [n:127.0.0.1:47728_solr    ] o.a.s.c.CorePropertiesLocator Found 0 core definitions
   [junit4]   2> 585038 INFO  (jetty-launcher-608-thread-1) [n:127.0.0.1:47728_solr    ] o.a.s.s.SolrDispatchFilter user.dir=/home/jenkins/workspace/Lucene-Solr-5.x-Linux/solr/build/solr-core/test/J0
   [junit4]   2> 585038 INFO  (jetty-launcher-608-thread-1) [n:127.0.0.1:47728_solr    ] o.a.s.s.SolrDispatchFilter SolrDispatchFilter.init() done
   [junit4]   2> 585038 INFO  (TEST-BasicAuthIntegrationTest.testBasics-seed#[9225C74068803365]) [    ] o.a.s.c.c.SolrZkClient Using default ZkCredentialsProvider
   [junit4]   2> 585038 INFO  (TEST-BasicAuthIntegrationTest.testBasics-seed#[9225C74068803365]) [    ] o.a.s.c.c.ConnectionManager Waiting for client to connect to ZooKeeper
   [junit4]   2> 585041 INFO  (zkCallback-635-thread-1) [    ] o.a.s.c.c.ConnectionManager Watcher org.apache.solr.common.cloud.ConnectionManager@4279f3a3 name:ZooKeeperConnection Watcher:127.0.0.1:41093 got event WatchedEvent state:SyncConnected type:None path:null path:null type:None
   [junit4]   2> 585041 INFO  (TEST-BasicAuthIntegrationTest.testBasics-seed#[9225C74068803365]) [    ] o.a.s.c.c.ConnectionManager Client is connected to ZooKeeper
   [junit4]   2> 585041 INFO  (TEST-BasicAuthIntegrationTest.testBasics-seed#[9225C74068803365]) [    ] o.a.s.c.c.SolrZkClient Using default ZkACLProvider
   [junit4]   2> 585044 INFO  (TEST-BasicAuthIntegrationTest.testBasics-seed#[9225C74068803365]) [    ] o.e.j.s.ServerConnector Stopped ServerConnector@6361f9a2{HTTP/1.1}{127.0.0.1:0}
   [junit4]   2> 585044 INFO  (TEST-BasicAuthIntegrationTest.testBasics-seed#[9225C74068803365]) [    ] o.a.s.c.CoreContainer Shutting down CoreContainer instance=1916791778
   [junit4]   2> 585045 INFO  (TEST-BasicAuthIntegrationTest.testBasics-seed#[9225C74068803365]) [    ] o.a.s.c.ZkController Publish node=127.0.0.1:35879_solr as DOWN
   [junit4]   2> 585049 INFO  (OverseerStateUpdate-95389184340000783-127.0.0.1:47728_solr-n_0000000000) [n:127.0.0.1:47728_solr    ] o.a.s.c.Overseer processMessage: queueSize: 1, message = {
   [junit4]   2>   "operation":"downnode",
   [junit4]   2>   "node_name":"127.0.0.1:35879_solr"} current state version: 0
   [junit4]   2> 585050 INFO  (OverseerStateUpdate-95389184340000783-127.0.0.1:47728_solr-n_0000000000) [n:127.0.0.1:47728_solr    ] o.a.s.c.o.NodeMutator DownNode state invoked for node: 127.0.0.1:35879_solr
   [junit4]   2> 585051 INFO  (zkCallback-632-thread-1-processing-n:127.0.0.1:55620_solr) [n:127.0.0.1:55620_solr    ] o.a.s.c.c.ZkStateReader A live node change: [WatchedEvent state:SyncConnected type:NodeChildrenChanged path:/live_nodes], has occurred - updating... (live nodes size: [5])
   [junit4]   2> 585051 INFO  (zkCallback-634-thread-1-processing-n:127.0.0.1:47728_solr) [n:127.0.0.1:47728_solr    ] o.a.s.c.c.ZkStateReader A live node change: [WatchedEvent state:SyncConnected type:NodeChildrenChanged path:/live_nodes], has occurred - updating... (live nodes size: [5])
   [junit4]   2> 585051 INFO  (zkCallback-630-thread-1-processing-n:127.0.0.1:35879_solr) [n:127.0.0.1:35879_solr    ] o.a.s.c.c.ZkStateReader A live node change: [WatchedEvent state:SyncConnected type:NodeChildrenChanged path:/live_nodes], has occurred - updating... (live nodes size: [5])
   [junit4]   2> 585051 WARN  (zkCallback-630-thread-1-processing-n:127.0.0.1:35879_solr) [n:127.0.0.1:35879_solr    ] o.a.s.c.c.ZkStateReader ZooKeeper watch triggered, but Solr cannot talk to ZK: [KeeperErrorCode = Session expired for /live_nodes]
   [junit4]   2> 585052 INFO  (zkCallback-631-thread-2-processing-n:127.0.0.1:34147_solr) [n:127.0.0.1:34147_solr    ] o.a.s.c.c.ZkStateReader A live node change: [WatchedEvent state:SyncConnected type:NodeChildrenChanged path:/live_nodes], has occurred - updating... (live nodes size: [5])
   [junit4]   2> 585051 INFO  (zkCallback-633-thread-1-processing-n:127.0.0.1:34468_solr) [n:127.0.0.1:34468_solr    ] o.a.s.c.c.ZkStateReader A live node change: [WatchedEvent state:SyncConnected type:NodeChildrenChanged path:/live_nodes], has occurred - updating... (live nodes size: [5])
   [junit4]   2> 585053 INFO  (TEST-BasicAuthIntegrationTest.testBasics-seed#[9225C74068803365]) [    ] o.e.j.s.h.ContextHandler Stopped o.e.j.s.ServletContextHandler@2eeb705f{/solr,null,UNAVAILABLE}
   [junit4]   2> 585054 INFO  (TEST-BasicAuthIntegrationTest.testBasics-seed#[9225C74068803365]) [    ] o.e.j.s.Server jetty-9.2.13.v20150730
   [junit4]   2> 585054 INFO  (zkCallback-631-thread-1-processing-n:127.0.0.1:34147_solr) [n:127.0.0.1:34147_solr    ] o.a.s.c.LeaderElector Watching path /overseer_elect/election/95389184340000782-127.0.0.1:34468_solr-n_0000000002 to know if I could be the leader
   [junit4]   2> 585055 INFO  (TEST-BasicAuthIntegrationTest.testBasics-seed#[9225C74068803365]) [    ] o.e.j.s.h.ContextHandler Started o.e.j.s.ServletContextHandler@6c377d6{/solr,null,AVAILABLE}
   [junit4]   2> 585055 INFO  (TEST-BasicAuthIntegrationTest.testBasics-seed#[9225C74068803365]) [    ] o.e.j.s.ServerConnector Started ServerConnector@34f20d5a{HTTP/1.1}{127.0.0.1:41182}
   [junit4]   2> 585055 INFO  (TEST-BasicAuthIntegrationTest.testBasics-seed#[9225C74068803365]) [    ] o.e.j.s.Server Started @586543ms
   [junit4]   2> 585055 INFO  (TEST-BasicAuthIntegrationTest.testBasics-seed#[9225C74068803365]) [    ] o.a.s.c.s.e.JettySolrRunner Jetty properties: {hostContext=/solr, hostPort=41182}
   [junit4]   2> 585056 INFO  (TEST-BasicAuthIntegrationTest.testBasics-seed#[9225C74068803365]) [    ] o.a.s.s.SolrDispatchFilter SolrDispatchFilter.init(): sun.misc.Launcher$AppClassLoader@3b756db3
   [junit4]   2> 585056 INFO  (TEST-BasicAuthIntegrationTest.testBasics-seed#[9225C74068803365]) [    ] o.a.s.c.SolrResourceLoader new SolrResourceLoader for directory: '/home/jenkins/workspace/Lucene-Solr-5.x-Linux/solr/build/solr-core/test/J0/temp/solr.security.BasicAuthIntegrationTest_9225C74068803365-001/tempDir-001/node6'
   [junit4]   2> 585056 INFO  (TEST-BasicAuthIntegrationTest.testBasics-seed#[9225C74068803365]) [    ] o.a.s.c.SolrResourceLoader JNDI not configured for solr (NoInitialContextEx)
   [junit4]   2> 585056 INFO  (TEST-BasicAuthIntegrationTest.testBasics-seed#[9225C74068803365]) [    ] o.a.s.c.SolrResourceLoader solr home defaulted to 'solr/' (could not find system property or JNDI)
   [junit4]   2> 585056 INFO  (TEST-BasicAuthIntegrationTest.testBasics-seed#[9225C74068803365]) [    ] o.a.s.c.c.SolrZkClient Using default ZkCredentialsProvider
   [junit4]   2> 585056 INFO  (TEST-BasicAuthIntegrationTest.testBasics-seed#[9225C74068803365]) [    ] o.a.s.c.c.ConnectionManager Waiting for client to connect to ZooKeeper
   [junit4]   2> 585059 INFO  (zkCallback-637-thread-1) [    ] o.a.s.c.c.ConnectionManager Watcher org.apache.solr.common.cloud.ConnectionManager@5ae85f0d name:ZooKeeperConnection Watcher:127.0.0.1:41093/solr got event WatchedEvent state:SyncConnected type:None path:null path:null type:None
   [junit4]   2> 585059 INFO  (TEST-BasicAuthIntegrationTest.testBasics-seed#[9225C74068803365]) [    ] o.a.s.c.c.ConnectionManager Client is connected to ZooKeeper
   [junit4]   2> 585059 INFO  (TEST-BasicAuthIntegrationTest.testBasics-seed#[9225C74068803365]) [    ] o.a.s.c.c.SolrZkClient Using default ZkACLProvider
   [junit4]   2> 585059 INFO  (TEST-BasicAuthIntegrationTest.testBasics-seed#[9225C74068803365]) [    ] o.a.s.s.SolrDispatchFilter solr.xml found in ZooKeeper. Loading...
   [junit4]   2> 585069 INFO  (TEST-BasicAuthIntegrationTest.testBasics-seed#[9225C74068803365]) [    ] o.a.s.c.CorePropertiesLocator Config-defined core root directory: /home/jenkins/workspace/Lucene-Solr-5.x-Linux/solr/build/solr-core/test/J0/temp/solr.security.BasicAuthIntegrationTest_9225C74068803365-001/tempDir-001/node6/.
   [junit4]   2> 585069 INFO  (TEST-BasicAuthIntegrationTest.testBasics-seed#[9225C74068803365]) [    ] o.a.s.c.CoreContainer New CoreContainer 955426889
   [junit4]   2> 585069 INFO  (TEST-BasicAuthIntegrationTest.testBasics-seed#[9225C74068803365]) [    ] o.a.s.c.CoreContainer Loading cores into CoreContainer [instanceDir=/home/jenkins/workspace/Lucene-Solr-5.x-Linux/solr/build/solr-core/test/J0/temp/solr.security.BasicAuthIntegrationTest_9225C74068803365-001/tempDir-001/node6]
   [junit4]   2> 585069 WARN  (TEST-BasicAuthIntegrationTest.testBasics-seed#[9225C74068803365]) [    ] o.a.s.c.CoreContainer Couldn't add files from /home/jenkins/workspace/Lucene-Solr-5.x-Linux/solr/build/solr-core/test/J0/temp/solr.security.BasicAuthIntegrationTest_9225C74068803365-001/tempDir-001/node6/lib to classpath: /home/jenkins/workspace/Lucene-Solr-5.x-Linux/solr/build/solr-core/test/J0/temp/solr.security.BasicAuthIntegrationTest_9225C74068803365-001/tempDir-001/node6/lib
   [junit4]   2> 585069 INFO  (TEST-BasicAuthIntegrationTest.testBasics-seed#[9225C74068803365]) [    ] o.a.s.h.c.HttpShardHandlerFactory created with socketTimeout : 90000,urlScheme : ,connTimeout : 15000,maxConnectionsPerHost : 20,maxConnections : 10000,corePoolSize : 0,maximumPoolSize : 2147483647,maxThreadIdleTime : 5,sizeOfQueue : -1,fairnessPolicy : false,useRetries : false,
   [junit4]   2> 585070 INFO  (TEST-BasicAuthIntegrationTest.testBasics-seed#[9225C74068803365]) [    ] o.a.s.u.UpdateShardHandler Creating UpdateShardHandler HTTP client with params: socketTimeout=340000&connTimeout=45000&retry=true
   [junit4]   2> 585070 INFO  (TEST-BasicAuthIntegrationTest.testBasics-seed#[9225C74068803365]) [    ] o.a.s.l.LogWatcher SLF4J impl is org.slf4j.impl.Log4jLoggerFactory
   [junit4]   2> 585070 INFO  (TEST-BasicAuthIntegrationTest.testBasics-seed#[9225C74068803365]) [    ] o.a.s.l.LogWatcher Registering Log Listener [Log4j (org.slf4j.impl.Log4jLoggerFactory)]
   [junit4]   2> 585070 INFO  (TEST-BasicAuthIntegrationTest.testBasics-seed#[9225C74068803365]) [    ] o.a.s.c.ZkContainer Zookeeper client=127.0.0.1:41093/solr
   [junit4]   2> 585070 INFO  (TEST-BasicAuthIntegrationTest.testBasics-seed#[9225C74068803365]) [    ] o.a.s.c.ZkController zkHost includes chroot
   [junit4]   2> 585070 INFO  (TEST-BasicAuthIntegrationTest.testBasics-seed#[9225C74068803365]) [    ] o.a.s.c.c.SolrZkClient Using default ZkCredentialsProvider
   [junit4]   2> 585070 INFO  (TEST-BasicAuthIntegrationTest.testBasics-seed#[9225C74068803365]) [    ] o.a.s.c.c.ConnectionManager Waiting for client to connect to ZooKeeper
   [junit4]   2> 585073 INFO  (zkCallback-640-thread-1) [    ] o.a.s.c.c.ConnectionManager Watcher org.apache.solr.common.cloud.ConnectionManager@6913ac8e name:ZooKeeperConnection Watcher:127.0.0.1:41093 got event WatchedEvent state:SyncConnected type:None path:null path:null type:None
   [junit4]   2> 585074 INFO  (TEST-BasicAuthIntegrationTest.testBasics-seed#[9225C74068803365]) [    ] o.a.s.c.c.ConnectionManager Client is connected to ZooKeeper
   [junit4]   2> 585074 INFO  (TEST-BasicAuthIntegrationTest.testBasics-seed#[9225C74068803365]) [    ] o.a.s.c.c.SolrZkClient Using default ZkACLProvider
   [junit4]   2> 585076 INFO  (TEST-BasicAuthIntegrationTest.testBasics-seed#[9225C74068803365]) [n:127.0.0.1:41182_solr    ] o.a.s.c.c.ConnectionManager Waiting for client to connect to ZooKeeper
   [junit4]   2> 585079 INFO  (zkCallback-641-thread-1-processing-n:127.0.0.1:41182_solr) [n:127.0.0.1:41182_solr    ] o.a.s.c.c.ConnectionManager Watcher org.apache.solr.common.cloud.ConnectionManager@8875908 name:ZooKeeperConnection Watcher:127.0.0.1:41093/solr got event WatchedEvent state:SyncConnected type:None path:null path:null type:None
   [junit4]   2> 585079 INFO  (TEST-BasicAuthIntegrationTest.testBasics-seed#[9225C74068803365]) [n:127.0.0.1:41182_solr    ] o.a.s.c.c.ConnectionManager Client is connected to ZooKeeper
   [junit4]   2> 585105 INFO  (TEST-BasicAuthIntegrationTest.testBasics-seed#[9225C74068803365]) [n:127.0.0.1:41182_solr    ] o.a.s.c.c.ZkStateReader Updating cluster state from ZooKeeper... 
   [junit4]   2> 586107 INFO  (TEST-BasicAuthIntegrationTest.testBasics-seed#[9225C74068803365]) [n:127.0.0.1:41182_solr    ] o.a.s.c.ZkController Register node as live in ZooKeeper:/live_nodes/127.0.0.1:41182_solr
   [junit4]   2> 586125 INFO  (TEST-BasicAuthIntegrationTest.testBasics-seed#[9225C74068803365]) [n:127.0.0.1:41182_solr    ] o.a.s.c.c.SolrZkClient makePath: /live_nodes/127.0.0.1:41182_solr
   [junit4]   2> 586134 INFO  (zkCallback-641-thread-1-processing-n:127.0.0.1:41182_solr) [n:127.0.0.1:41182_solr    ] o.a.s.c.c.ZkStateReader A live node change: [WatchedEvent state:SyncConnected type:NodeChildrenChanged path:/live_nodes], has occurred - updating... (live nodes size: [4])
   [junit4]   2> 586134 INFO  (zkCallback-632-thread-1-processing-n:127.0.0.1:55620_solr) [n:127.0.0.1:55620_solr    ] o.a.s.c.c.ZkStateReader A live node change: [WatchedEvent state:SyncConnected type:NodeChildrenChanged path:/live_nodes], has occurred - updating... (live nodes size: [4])
   [junit4]   2> 586134 INFO  (zkCallback-631-thread-1-processing-n:127.0.0.1:34147_solr) [n:127.0.0.1:34147_solr    ] o.a.s.c.c.ZkStateReader A live node change: [WatchedEvent state:SyncConnected type:NodeChildrenChanged path:/live_nodes], has occurred - updating... (live nodes size: [4])
   [junit4]   2> 586134 INFO  (zkCallback-633-thread-1-processing-n:127.0.0.1:34468_solr) [n:127.0.0.1:34468_solr    ] o.a.s.c.c.ZkStateReader A live node change: [WatchedEvent state:SyncConnected type:NodeChildrenChanged path:/live_nodes], has occurred - updating... (live nodes size: [4])
   [junit4]   2> 586134 INFO  (zkCallback-634-thread-2-processing-n:127.0.0.1:47728_solr) [n:127.0.0.1:47728_solr    ] o.a.s.c.c.ZkStateReader A live node change: [WatchedEvent state:SyncConnected type:NodeChildrenChanged path:/live_nodes], has occurred - updating... (live nodes size: [4])
   [junit4]   2> 586135 INFO  (TEST-BasicAuthIntegrationTest.testBasics-seed#[9225C74068803365]) [n:127.0.0.1:41182_solr    ] o.a.s.c.Overseer Overseer (id=null) closing
   [junit4]   2> 586206 INFO  (TEST-BasicAuthIntegrationTest.testBasics-seed#[9225C74068803365]) [n:127.0.0.1:41182_solr    ] o.a.s.c.LeaderElector Joined leadership election with path: /overseer_elect/election/95389184340000787-127.0.0.1:41182_solr-n_0000000005
   [junit4]   2> 586207 INFO  (TEST-BasicAuthIntegrationTest.testBasics-seed#[9225C74068803365]) [n:127.0.0.1:41182_solr    ] o.a.s.c.LeaderElector Watching path /overseer_elect/election/95389184340000780-127.0.0.1:34147_solr-n_0000000004 to know if I could be the leader
   [junit4]   2> 586216 INFO  (TEST-BasicAuthIntegrationTest.testBasics-seed#[9225C74068803365]) [n:127.0.0.1:41182_solr    ] o.a.s.c.CoreContainer Security conf doesn't exist. Skipping setup for authorization module.
   [junit4]   2> 586216 INFO  (TEST-BasicAuthIntegrationTest.testBasics-seed#[9225C74068803365]) [n:127.0.0.1:41182_solr    ] o.a.s.c.CoreContainer No authentication plugin used.
   [junit4]   2> 586217 INFO  (TEST-BasicAuthIntegrationTest.testBasics-seed#[9225C74068803365]) [n:127.0.0.1:41182_solr    ] o.a.s.c.CorePropertiesLocator Looking for core definitions underneath /home/jenkins/workspace/Lucene-Solr-5.x-Linux/solr/build/solr-core/test/J0/temp/solr.security.BasicAuthIntegrationTest_9225C74068803365-001/tempDir-001/node6/.
   [junit4]   2> 586217 INFO  (TEST-BasicAuthIntegrationTest.testBasics-seed#[9225C74068803365]) [n:127.0.0.1:41182_solr    ] o.a.s.c.CorePropertiesLocator Found 0 core definitions
   [junit4]   2> 586218 INFO  (TEST-BasicAuthIntegrationTest.testBasics-seed#[9225C74068803365]) [n:127.0.0.1:41182_solr    ] o.a.s.s.SolrDispatchFilter user.dir=/home/jenkins/workspace/Lucene-Solr-5.x-Linux/solr/build/solr-core/test/J0
   [junit4]   2> 586218 INFO  (TEST-BasicAuthIntegrationTest.testBasics-seed#[9225C74068803365]) [n:127.0.0.1:41182_solr    ] o.a.s.s.SolrDispatchFilter SolrDispatchFilter.init() done
   [junit4]   2> 586218 INFO  (TEST-BasicAuthIntegrationTest.testBasics-seed#[9225C74068803365]) [    ] o.a.s.c.c.SolrZkClient Using default ZkCredentialsProvider
   [junit4]   2> 586218 INFO  (TEST-BasicAuthIntegrationTest.testBasics-seed#[9225C74068803365]) [    ] o.a.s.c.c.ConnectionManager Waiting for client to connect to ZooKeeper
   [junit4]   2> 586234 INFO  (zkCallback-642-thread-1) [    ] o.a.s.c.c.ConnectionManager Watcher org.apache.solr.common.cloud.ConnectionManager@2f94a47c name:ZooKeeperConnection Watcher:127.0.0.1:41093/solr got event WatchedEvent state:SyncConnected type:None path:null path:null type:None
   [junit4]   2> 586234 INFO  (TEST-BasicAuthIntegrationTest.testBasics-seed#[9225C74068803365]) [    ] o.a.s.c.c.ConnectionManager Client is connected to ZooKeeper
   [junit4]   2> 586234 INFO  (TEST-BasicAuthIntegrationTest.testBasics-seed#[9225C74068803365]) [    ] o.a.s.c.c.SolrZkClient Using default ZkACLProvider
   [junit4]   2> 586235 INFO  (TEST-BasicAuthIntegrationTest.testBasics-seed#[9225C74068803365]) [    ] o.a.s.c.c.SolrZkClient makePath: /configs/solrCloudCollectionConfig/protwords.txt
   [junit4]   2> 586296 INFO  (TEST-BasicAuthIntegrationTest.testBasics-seed#[9225C74068803365]) [    ] o.a.s.c.c.SolrZkClient makePath: /configs/solrCloudCollectionConfig/solrconfig-delaying-component.xml
   [junit4]   2> 586323 INFO  (TEST-BasicAuthIntegrationTest.testBasics-seed#[9225C74068803365]) [    ] o.a.s.c.c.SolrZkClient makePath: /configs/solrCloudCollectionConfig/bad_solrconfig.xml
   [junit4]   2> 586376 INFO  (TEST-BasicAuthIntegrationTest.testBasics-seed#[9225C74068803365]) [    ] o.a.s.c.c.SolrZkClient makePath: /configs/solrCloudCollectionConfig/solrconfig-sortingmergepolicyfactory.xml
   [junit4]   2> 586413 INFO  (TEST-BasicAuthIntegrationTest.testBasics-seed#[9225C74068803365]) [    ] o.a.s.c.c.SolrZkClient makePath: /configs/solrCloudCollectionConfig/solrconfig-nocache.xml
   [junit4]   2> 586440 INFO  (TEST-BasicAuthIntegrationTest.testBasics-seed#[9225C74068803365]) [    ] o.a.s.c.c.SolrZkClient makePath: /configs/solrCloudCollectionConfig/solrconfig-implicitproperties.xml
   [junit4]   2> 586466 INFO  (TEST-BasicAuthIntegrationTest.testBasics-seed#[9225C74068803365]) [    ] o.a.s.c.c.SolrZkClient makePath: /configs/solrCloudCollectionConfig/solrconfig-mergepolicy-legacy.xml
   [junit4]   2> 586475 INFO  (TEST-BasicAuthIntegrationTest.testBasics-seed#[9225C74068803365]) [    ] o.a.s.c.c.SolrZkClient makePath: /configs/solrCloudCollectionConfig/bad-schema-uniquekey-uses-default.xml
   [junit4]   2> 586509 INFO  (TEST-BasicAuthIntegrationTest.testBasics-seed#[9225C74068803365]) [    ] o.a.s.c.c.SolrZkClient makePath: /configs/solrCloudCollectionConfig/bad-schema-sim-default-has-no-explicit-sim.xml
   [junit4]   2> 586526 INFO  (TEST-BasicAuthIntegrationTest.testBasics-seed#[9225C74068803365]) [    ] o.a.s.c.c.SolrZkClient makePath: /configs/solrCloudCollectionConfig/bad-schema-uniquekey-multivalued.xml
   [junit4]   2> 586573 INFO  (TEST-BasicAuthIntegrationTest.testBasics-seed#[9225C74068803365]) [    ] o.a.s.c.c.SolrZkClient makePath: /configs/solrCloudCollectionConfig/analyzingInfixSuggest.txt
   [junit4]   2> 586594 INFO  (TEST-BasicAuthIntegrationTest.testBasics-seed#[9225C74068803365]) [    ] o.a.s.c.c.SolrZkClient makePath: /configs/solrCloudCollectionConfig/missleading.extension.updateprocessor.js.txt
   [junit4]   2> 586657 INFO  (TEST-BasicAuthIntegrationTest.testBasics-seed#[9225C74068803365]) [    ] o.a.s.c.c.SolrZkClient makePath: /configs/solrCloudCollectionConfig/bad-schema-multiple-asterisk-copyfield-source-should-fail-test.xml
   [junit4]   2> 586682 INFO  (TEST-BasicAuthIntegrationTest.testBasics-seed#[9225C74068803365]) [    ] o.a.s.c.c.SolrZkClient makePath: /configs/solrCloudCollectionConfig/schema-replication2.xml
   [junit4]   2> 586765 INFO  (TEST-BasicAuthIntegrationTest.testBasics-seed#[9225C74068803365]) [    ] o.a.s.c.c.SolrZkClient makePath: /configs/solrCloudCollectionConfig/solrconfig-infostream-logging.xml
   [junit4]   2> 586776 INFO  (TEST-BasicAuthIntegrationTest.testBasics-seed#[9225C74068803365]) [    ] o.a.s.c.c.SolrZkClient makePath: /configs/solrCloudCollectionConfig/solrconfig-collapseqparser.xml
   [junit4]   2> 586809 INFO  (TEST-BasicAuthIntegrationTest.testBasics-seed#[9225C74068803365]) [    ] o.a.s.c.c.SolrZkClient makePath: /configs/solrCloudCollectionConfig/bad-schema-currency-ft-bogus-code-in-xml.xml
   [junit4]   2> 586841 INFO  (TEST-BasicAuthIntegrationTest.testBasics-seed#[9225C74068803365]) [    ] o.a.s.c.c.SolrZkClient makePath: /configs/solrCloudCollectionConfig/old_synonyms.txt
   [junit4]   2> 586850 INFO  (TEST-BasicAuthIntegrationTest.testBasics-seed#[9225C74068803365]) [    ] o.a.s.c.c.SolrZkClient makePath: /configs/solrCloudCollectionConfig/enumsConfig.xml
   [junit4]   2> 586861 INFO  (TEST-BasicAuthIntegrationTest.testBasics-seed#[9225C74068803365]) [    ] o.a.s.c.c.SolrZkClient makePath: /configs/solrCloudCollectionConfig/solrconfig-script-updateprocessor.xml
   [junit4]   2> 586895 INFO  (TEST-BasicAuthIntegrationTest.testBasics-seed#[9225C74068803365]) [    ] o.a.s.c.c.SolrZkClient makePath: /configs/solrCloudCollectionConfig/schema-add-schema-fields-update-processor.xml
   [junit4]   2> 586924 INFO  (TEST-BasicAuthIntegrationTest.testBasics-seed#[9225C74068803365]) [    ] o.a.s.c.c.SolrZkClient makePath: /configs/solrCloudCollectionConfig/solrconfig-mergepolicyfactory-nocfs.xml
   [junit4]   2> 586950 INFO  (TEST-BasicAuthIntegrationTest.testBasics-seed#[9225C74068803365]) [    ] o.a.s.c.c.SolrZkClient makePath: /configs/solrCloudCollectionConfig/bad-schema-sweetspot-both-tf.xml
   [junit4]   2> 586961 INFO  (TEST-BasicAuthIntegrationTest.testBasics-seed#[9225C74068803365]) [    ] o.a.s.c.c.SolrZkClient makePath: /configs/solrCloudCollectionConfig/schema-phrasesuggest.xml
   [junit4]   2> 587003 INFO  (TEST-BasicAuthIntegrationTest.testBasics-seed#[9225C74068803365]) [    ] o.a.s.c.c.SolrZkClient makePath: /configs/solrCloudCollectionConfig/solrconfig.xml
   [junit4]   2> 587044 INFO  (TEST-BasicAuthIntegrationTest.testBasics-seed#[9225C74068803365]) [    ] o.a.s.c.c.SolrZkClient makePath: /configs/solrCloudCollectionConfig/solrconfig-delpolicy1.xml
   [junit4]   2> 587067 INFO  (TEST-BasicAuthIntegrationTest.testBasics-seed#[9225C74068803365]) [    ] o.a.s.c.c.SolrZkClient makePath: /configs/solrCloudCollectionConfig/schema-sim.xml
   [junit4]   2> 587078 INFO  (TEST-BasicAuthIntegrationTest.testBasics-seed#[9225C74068803365]) [    ] o.a.s.c.c.SolrZkClient makePath: /configs/solrCloudCollectionConfig/schema15.xml
   [junit4]   2> 587110 INFO  (TEST-BasicAuthIntegrationTest.testBasics-seed#[9225C74068803365]) [    ] o.a.s.c.c.SolrZkClient makePath: /configs/solrCloudCollectionConfig/bad-schema-misplaced-asterisk-copyfield-source-should-fail-test.xml
   [junit4]   2> 587151 INFO  (TEST-BasicAuthIntegrationTest.testBasics-seed#[9225C74068803365]) [    ] o.a.s.c.c.SolrZkClient makePath: /configs/solrCloudCollectionConfig/stemdict.txt
   [junit4]   2> 587162 INFO  (TEST-BasicAuthIntegrationTest.testBasics-seed#[9225C74068803365]) [    ] o.a.s.c.c.SolrZkClient makePath: /configs/solrCloudCollectionConfig/hunspell-test.aff
   [junit4]   2> 587174 INFO  (TEST-BasicAuthIntegrationTest.testBasics-seed#[9225C74068803365]) [    ] o.a.s.c.c.SolrZkClient makePath: /configs/solrCloudCollectionConfig/solrconfig-spatial.xml
   [junit4]   2> 587206 INFO  (TEST-BasicAuthIntegrationTest.testBasics-seed#[9225C74068803365]) [    ] o.a.s.c.c.SolrZkClient makePath: /configs/solrCloudCollectionConfig/solrconfig-slave1.xml
   [junit4]   2> 587220 INFO  (TEST-BasicAuthIntegrationTest.testBasics-seed#[9225C74068803365]) [    ] o.a.s.c.c.SolrZkClient makePath: /configs/solrCloudCollectionConfig/bad-schema-dup-fieldType.xml
   [junit4]   2> 587250 INFO  (TEST-BasicAuthIntegrationTest.testBasics-seed#[9225C74068803365]) [    ] o.a.s.c.c.SolrZkClient makePath: /configs/solrCloudCollectionConfig/bad-schema-external-filefield.xml
   [junit4]   2> 587265 INFO  (TEST-BasicAuthIntegrationTest.testBasics-seed#[9225C74068803365]) [    ] o.a.s.c.c.SolrZkClient makePath: /configs/solrCloudCollectionConfig/solrconfig-query-parser-init.xml
   [junit4]   2> 587281 INFO  (TEST-BasicAuthIntegrationTest.testBasics-seed#[9225C74068803365]) [    ] o.a.s.c.c.SolrZkClient makePath: /configs/solrCloudCollectionConfig/schema-complex-phrase.xml
   [junit4]   2> 587308 INFO  (TEST-BasicAuthIntegrationTest.testBasics-seed#[9225C74068803365]) [    ] o.a.s.c.c.SolrZkClient makePath: /configs/solrCloudCollectionConfig/conditional.updateprocessor.js
   [junit4]   2> 587324 INFO  (TEST-BasicAuthIntegrationTest.testBasics-seed#[9225C74068803365]) [    ] o.a.s.c.c.SolrZkClient makePath: /configs/solrCloudCollectionConfig/bad-schema-analyzer-class-and-nested.xml
   [junit4]   2> 587341 INFO  (TEST-BasicAuthIntegrationTest.testBasics-seed#[9225C74068803365]) [    ] o.a.s.c.c.SolrZkClient makePath: /configs/solrCloudCollectionConfig/schema-eff.xml
   [junit4]   2> 587373 INFO  (TEST-BasicAuthIntegrationTest.testBasics-seed#[9225C74068803365]) [    ] o.a.s.c.c.SolrZkClient makePath: /configs/solrCloudCollectionConfig/schema-folding.xml
   [junit4]   2> 587410 INFO  (TEST-BasicAuthIntegrationTest.testBasics-seed#[9225C74068803365]) [    ] o.a.s.c.c.SolrZkClient makePath: /configs/solrCloudCollectionConfig/solrconfig-tieredmergepolicyfactory.xml
   [junit4]   2> 587438 INFO  (TEST-BasicAuthIntegrationTest.testBasics-seed#[9225C74068803365]) [    ] o.a.s.c.c.SolrZkClient makePath: /configs/solrCloudCollectionConfig/schema-simpleqpplugin.xml
   [junit4]   2> 587473 INFO  (TEST-BasicAuthIntegrationTest.testBasics-seed#[9225C74068803365]) [    ] o.a.s.c.c.SolrZkClient makePath: /configs/solrCloudCollectionConfig/solrconfig-hash.xml
   [junit4]   2> 587478 INFO  (TEST-BasicAuthIntegrationTest.testBasics-seed#[9225C74068803365]) [    ] o.a.s.c.c.SolrZkClient makePath: /configs/solrCloudCollectionConfig/stopwords.txt
   [junit4]   2> 587488 INFO  (TEST-BasicAuthIntegrationTest.testBasics-seed#[9225C74068803365]) [    ] o.a.s.c.c.SolrZkClient makePath: /configs/solrCloudCollectionConfig/bad-schema-dynamicfield-required.xml
   [junit4]   2> 587524 INFO  (TEST-BasicAuthIntegrationTest.testBasics-seed#[9225C74068803365]) [    ] o.a.s.c.c.SolrZkClient makePath: /configs/solrCloudCollectionConfig/solrconfig-mergepolicy-nocfs.xml
   [junit4]   2> 587546 INFO  (TEST-BasicAuthIntegrationTest.testBasics-seed#[9225C74068803365]) [    ] o.a.s.c.c.SolrZkClient makePath: /configs/solrCloudCollectionConfig/bad-solrconfig-bogus-scriptengine-name.xml
   [junit4]   2> 587603 INFO  (TEST-BasicAuthIntegrationTest.testBasics-seed#[9225C74068803365]) [    ] o.a.s.c.c.SolrZkClient makePath: /configs/solrCloudCollectionConfig/throw.error.on.add.updateprocessor.js
   [junit4]   2> 587617 INFO  (TEST-BasicAuthIntegrationTest.testBasics-seed#[9225C74068803365]) [    ] o.a.s.c.c.SolrZkClient makePath: /configs/solrCloudCollectionConfig/solrconfig-minimal.xml
   [junit4]   2> 587629 INFO  (TEST-BasicAuthIntegrationTest.testBasics-seed#[9225C74068803365]) [    ] o.a.s.c.c.SolrZkClient makePath: /configs/solrCloudCollectionConfig/solrconfig-defaults.xml
   [junit4]   2> 587663 INFO  (TEST-BasicAuthIntegrationTest.testBasics-seed#[9225C74068803365]) [    ] o.a.s.c.c.SolrZkClient makePath: /configs/solrCloudCollectionConfig/blendedInfixSuggest.txt
   [junit4]   2> 587678 INFO  (TEST-BasicAuthIntegrationTest.testBasics-seed#[9225C74068803365]) [    ] o.a.s.c.c.SolrZkClient makePath: /configs/solrCloudCollectionConfig/solrconfig-postingshighlight.xml
   [junit4]   2> 587688 INFO  (TEST-BasicAuthIntegrationTest.testBasics-seed#[9225C74068803365]) [    ] o.a.s.c.c.SolrZkClient makePath: /configs/solrCloudCollectionConfig/schema-docValuesJoin.xml
   [junit4]   2> 587718 INFO  (TEST-BasicAuthIntegrationTest.testBasics-seed#[9225C74068803365]) [    ] o.a.s.c.c.SolrZkClient makePath: /configs/solrCloudCollectionConfig/schema-docValues.xml
   [junit4]   2> 587739 INFO  (TEST-BasicAuthIntegrationTest.testBasics-seed#[9225C74068803365]) [    ] o.a.s.c.c.SolrZkClient makePath: /configs/solrCloudCollectionConfig/bad-schema-misplaced-asterisk-copyfield-dest-should-fail-test.xml
   [junit4]   2> 587751 INFO  (TEST-BasicAuthIntegrationTest.testBasics-seed#[9225C74068803365]) [    ] o.a.s.c.c.SolrZkClient makePath: /configs/solrCloudCollectionConfig/schema-snippet-types.incl
   [junit4]   2> 587762 INFO  (TEST-BasicAuthIntegrationTest.testBasics-seed#[9225C74068803365]) [    ] o.a.s.c.c.SolrZkClient makePath: /configs/solrCloudCollectionConfig/schema-minimal.xml
   [junit4]   2> 587772 INFO  (TEST-BasicAuthIntegrationTest.testBasics-seed#[9225C74068803365]) [    ] o.a.s.c.c.SolrZkClient makePath: /configs/solrCloudCollectionConfig/solrconfig.snippet.randomindexconfig.xml
   [junit4]   2> 587800 INFO  (TEST-BasicAuthIntegrationTest.testBasics-seed#[9225C74068803365]) [    ] o.a.s.c.c.SolrZkClient makePath: /configs/solrCloudCollectionConfig/schema-collate.xml
   [junit4]   2> 587835 INFO  (TEST-BasicAuthIntegrationTest.testBasics-seed#[9225C74068803365]) [    ] o.a.s.c.c.SolrZkClient makePath: /configs/solrCloudCollectionConfig/schema-rest.xml
   [junit4]   2> 587861 INFO  (TEST-BasicAuthIntegrationTest.testBasics-seed#[9225C74068803365]) [    ] o.a.s.c.c.SolrZkClient makePath: /configs/solrCloudCollectionConfig/bad-schema-codec-global-vs-ft-mismatch.xml
   [junit4]   2> 587870 INFO  (TEST-BasicAuthIntegrationTest.testBasics-seed#[9225C74068803365]) [    ] o.a.s.c.c.SolrZkClient makePath: /configs/solrCloudCollectionConfig/bad-schema-not-indexed-but-norms.xml
   [junit4]   2> 587904 INFO  (TEST-BasicAuthIntegrationTest.testBasics-seed#[9225C74068803365]) [    ] o.a.s.c.c.SolrZkClient makePath: /configs/solrCloudCollectionConfig/phrasesuggest.txt
   [junit4]   2> 587916 INFO  (TEST-BasicAuthIntegrationTest.testBasics-seed#[9225C74068803365]) [    ] o.a.s.c.c.SolrZkClient makePath: /configs/solrCloudCollectionConfig/stopwordsWrongEncoding.txt
   [junit4]   2> 587926 INFO  (TEST-BasicAuthIntegrationTest.testBasics-seed#[9225C74068803365]) [    ] o.a.s.c.c.SolrZkClient makePath: /configs/solrCloudCollectionConfig/solrconfig-logmergepolicy.xml
   [junit4]   2> 587936 INFO  (TEST-BasicAuthIntegrationTest.testBasics-seed#[9225C74068803365]) [    ] o.a.s.c.c.SolrZkClient makePath: /configs/solrCloudCollectionConfig/solrconfig-plugcollector.xml
   [junit4]   2> 587973 INFO  (TEST-BasicAuthIntegrationTest.testBasics-seed#[9225C74068803365]) [    ] o.a.s.c.c.SolrZkClient makePath: /configs/solrCloudCollectionConfig/solrconfig-noopregen.xml
   [junit4]   2> 587984 INFO  (TEST-BasicAuthIntegrationTest.testBasics-seed#[9225C74068803365]) [    ] o.a.s.c.c.SolrZkClient makePath: /configs/solrCloudCollectionConfig/solrconfig-analytics-query.xml
   [junit4]   2> 588017 INFO  (TEST-BasicAuthIntegrationTest.testBasics-seed#[9225C74068803365]) [    ] o.a.s.c.c.SolrZkClient makePath: /configs/solrCloudCollectionConfig/stoptypes-1.txt
   [junit4]   2> 588031 INFO  (TEST-BasicAuthIntegrationTest.testBasics-seed#[9225C74068803365]) [    ] o.a.s.c.c.SolrZkClient makePath: /configs/solrCloudCollectionConfig/solrconfig-warmer-randommergepolicyfactory.xml
   [junit4]   2> 588062 INFO  (TEST-BasicAuthIntegrationTest.testBasics-seed#[9225C74068803365]) [    ] o.a.s.c.c.SolrZkClient makePath: /configs/solrCloudCollectionConfig/schema-spatial.xml
   [junit4]   2> 588089 INFO  (TEST-BasicAuthIntegrationTest.testBasics-seed#[9225C74068803365]) [    ] o.a.s.c.c.SolrZkClient makePath: /configs/solrCloudCollectionConfig/schema-spellchecker.xml
   [junit4]   2> 588125 INFO  (TEST-BasicAuthIntegrationTest.testBasics-seed#[9225C74068803365]) [    ] o.a.s.c.c.SolrZkClient makePath: /configs/solrCloudCollectionConfig/schema-non-stored-docvalues.xml
   [junit4]   2> 588159 INFO  (TEST-BasicAuthIntegrationTest.testBasics-seed#[9225C74068803365]) [    ] o.a.s.c.c.SolrZkClient makePath: /configs/solrCloudCollectionConfig/schema-distrib-interval-faceting.xml
   [junit4]   2> 588201 INFO  (TEST-BasicAuthIntegrationTest.testBasics-seed#[9225C74068803365]) [    ] o.a.s.c.c.SolrZkClient makePath: /configs/solrCloudCollectionConfig/stop-1.txt
   [junit4]   2> 588215 INFO  (TEST-BasicAuthIntegrationTest.testBasics-seed#[9225C74068803365]) [    ] o.a.s.c.c.SolrZkClient makePath: /configs/solrCloudCollectionConfig/schema-docValuesMissing.xml
   [junit4]   2> 588244 INFO  (TEST-BasicAuthIntegrationTest.testBasics-seed#[9225C74068803365]) [    ] o.a.s.c.c.SolrZkClient makePath: /configs/solrCloudCollectionConfig/solrconfig-caching.xml
   [junit4]   2> 588256 INFO  (TEST-BasicAuthIntegrationTest.testBasics-seed#[9225C74068803365]) [    ] o.a.s.c.c.SolrZkClient makePath: /configs/solrCloudCollectionConfig/solrconfig-doctransformers.xml
   [junit4]   2> 588281 INFO  (TEST-BasicAuthIntegrationTest.testBasics-seed#[9225C74068803365]) [    ] o.a.s.c.c.SolrZkClient makePath: /configs/solrCloudCollectionConfig/freeTextSuggest.txt
   [junit4]   2> 588295 INFO  (TEST-BasicAuthIntegrationTest.testBasics-seed#[9225C74068803365]) [    ] o.a.s.c.c.SolrZkClient makePath: /configs/solrCloudCollectionConfig/schema.xml
   [junit4]   2> 588347 INFO  (TEST-BasicAuthIntegrationTest.testBasics-seed#[9225C74068803365]) [    ] o.a.s.c.c.SolrZkClient makePath: /configs/solrCloudCollectionConfig/solrconfig-querysender-noquery.xml
   [junit4]   2> 588369 INFO  (TEST-BasicAuthIntegrationTest.testBasics-seed#[9225C74068803365]) [    ] o.a.s.c.c.SolrZkClient makePath: /configs/solrCloudCollectionConfig/schema-sortingresponse.xml
   [junit4]   2> 588419 INFO  (TEST-BasicAuthIntegrationTest.testBasics-seed#[9225C74068803365]) [    ] o.a.s.c.c.SolrZkClient makePath: /configs/solrCloudCollectionConfig/trivial.updateprocessor1.js
   [junit4]   2> 588434 INFO  (TEST-BasicAuthIntegrationTest.testBasics-seed#[9225C74068803365]) [    ] o.a.s.c.c.SolrZkClient makePath: /configs/solrCloudCollectionConfig/bad-solrconfig-managed-schema-named-schema.xml.xml
   [junit4]   2> 588454 INFO  (TEST-BasicAuthIntegrationTest.testBasics-seed#[9225C74068803365]) [    ] o.a.s.c.c.SolrZkClient makePath: /configs/solrCloudCollectionConfig/solrconfig-paramset.xml
   [junit4]   2> 588465 INFO  (TEST-BasicAuthIntegrationTest.testBasics-seed#[9225C74068803365]) [    ] o.a.s.c.c.SolrZkClient makePath: /configs/solrCloudCollectionConfig/schema-lmdirichlet.xml
   [junit4]   2> 588496 INFO  (TEST-BasicAuthIntegrationTest.testBasics-seed#[9225C74068803365]) [    ] o.a.s.c.c.SolrZkClient makePath: /configs/solrCloudCollectionConfig/bad-solrconfig-multiple-dirfactory.xml
   [junit4]   2> 588505 INFO  (TEST-BasicAuthIntegrationTest.testBasics-seed#[9225C74068803365]) [    ] o.a.s.c.c.SolrZkClient makePath: /configs/solrCloudCollectionConfig/bad-schema-init-error.xml
   [junit4]   2> 588517 INFO  (TEST-BasicAuthIntegrationTest.testBasics-seed#[9225C74068803365]) [    ] o.a.s.c.c.SolrZkClient makePath: /configs/solrCloudCollectionConfig/solrconfig-altdirectory.xml
   [junit4]   2> 588550 INFO  (TEST-BasicAuthIntegrationTest.testBasics-seed#[9225C74068803365]) [    ] o.a.s.c.c.SolrZkClient makePath: /configs/solrCloudCollectionConfig/solrconfig-tlog.xml
   [junit4]   2> 588600 INFO  (TEST-BasicAuthIntegrationTest.testBasics-seed#[9225C74068803365]) [    ] o.a.s.c.c.SolrZkClient makePath: /configs/solrCloudCollectionConfig/hyphenation.dtd
   [junit4]   2> 588646 INFO  (TEST-BasicAuthIntegrationTest.testBasics-seed#[9225C74068803365]) [    ] o.a.s.c.c.SolrZkClient makePath: /configs/solrCloudCollectionConfig/schema-sweetspot.xml
   [junit4]   2> 588723 INFO  (TEST-BasicAuthIntegrationTest.testBasics-seed#[9225C74068803365]) [    ] o.a.s.c.c.SolrZkClient makePath: /configs/solrCloudCollectionConfig/solrconfig-xinclude.xml
   [junit4]   2> 588734 INFO  (TEST-BasicAuthIntegrationTest.testBasics-seed#[9225C74068803365]) [    ] o.a.s.c.c.SolrZkClient makePath: /configs/solrCloudCollectionConfig/solrconfig-schemaless.xml
   [junit4]   2> 588776 INFO  (TEST-BasicAuthIntegrationTest.testBasics-seed#[9225C74068803365]) [    ] o.a.s.c.c.SolrZkClient makePath: /configs/solrCloudCollectionConfig/schemasurround.xml
   [junit4]   2> 588882 INFO  (TEST-BasicAuthIntegrationTest.testBasics-seed#[9225C74068803365]) [    ] o.a.s.c.c.SolrZkClient makePath: /configs/solrCloudCollectionConfig/schema-binaryfield.xml
   [junit4]   2> 588909 INFO  (TEST-BasicAuthIntegrationTest.testBasics-seed#[9225C74068803365]) [    ] o.a.s.c.c.SolrZkClient makePath: /configs/solrCloudCollectionConfig/solrconfig-SOLR-749.xml
   [junit4]   2> 588981 INFO  (TEST-BasicAuthIntegrationTest.testBasics-seed#[9225C74068803365]) [    ] o.a.s.c.c.SolrZkClient makePath: /configs/solrCloudCollectionConfig/compoundDictionary.txt
   [junit4]   2> 588994 INFO  (TEST-BasicAuthIntegrationTest.testBasics-seed#[9225C74068803365]) [    ] o.a.s.c.c.SolrZkClient makePath: /configs/solrCloudCollectionConfig/fuzzysuggest.txt
   [junit4]   2> 589016 INFO  (TEST-BasicAuthIntegrationTest.testBasics-seed#[9225C74068803365]) [    ] o.a.s.c.c.SolrZkClient m

[...truncated too long message...]

bstractQueuedSynchronizer$ConditionObject.await(AbstractQueuedSynchronizer.java:2043)
   [junit4]   2>         at java.util.concurrent.LinkedBlockingQueue.take(LinkedBlockingQueue.java:442)
   [junit4]   2>         at java.util.concurrent.ThreadPoolExecutor.getTask(ThreadPoolExecutor.java:1068)
   [junit4]   2>         at java.util.concurrent.ThreadPoolExecutor.runWorker(ThreadPoolExecutor.java:1130)
   [junit4]   2>         at java.util.concurrent.ThreadPoolExecutor$Worker.run(ThreadPoolExecutor.java:615)
   [junit4]   2>         at java.lang.Thread.run(Thread.java:745)
   [junit4]   2>   24) Thread[id=4898, name=Scheduler-1481878709, state=TIMED_WAITING, group=TGRP-BasicAuthIntegrationTest]
   [junit4]   2>         at sun.misc.Unsafe.park(Native Method)
   [junit4]   2>         at java.util.concurrent.locks.LockSupport.parkNanos(LockSupport.java:226)
   [junit4]   2>         at java.util.concurrent.locks.AbstractQueuedSynchronizer$ConditionObject.awaitNanos(AbstractQueuedSynchronizer.java:2082)
   [junit4]   2>         at java.util.concurrent.ScheduledThreadPoolExecutor$DelayedWorkQueue.take(ScheduledThreadPoolExecutor.java:1090)
   [junit4]   2>         at java.util.concurrent.ScheduledThreadPoolExecutor$DelayedWorkQueue.take(ScheduledThreadPoolExecutor.java:807)
   [junit4]   2>         at java.util.concurrent.ThreadPoolExecutor.getTask(ThreadPoolExecutor.java:1068)
   [junit4]   2>         at java.util.concurrent.ThreadPoolExecutor.runWorker(ThreadPoolExecutor.java:1130)
   [junit4]   2>         at java.util.concurrent.ThreadPoolExecutor$Worker.run(ThreadPoolExecutor.java:615)
   [junit4]   2>         at java.lang.Thread.run(Thread.java:745)
   [junit4]   2>   25) Thread[id=4775, name=jetty-launcher-608-thread-4-SendThread(127.0.0.1:41093), state=TIMED_WAITING, group=TGRP-BasicAuthIntegrationTest]
   [junit4]   2>         at java.lang.Thread.sleep(Native Method)
   [junit4]   2>         at org.apache.zookeeper.client.StaticHostProvider.next(StaticHostProvider.java:101)
   [junit4]   2>         at org.apache.zookeeper.ClientCnxn$SendThread.startConnect(ClientCnxn.java:940)
   [junit4]   2>         at org.apache.zookeeper.ClientCnxn$SendThread.run(ClientCnxn.java:1003)
   [junit4]   2>   26) Thread[id=4899, name=org.eclipse.jetty.server.session.HashSessionManager@304eaaabTimer, state=TIMED_WAITING, group=TGRP-BasicAuthIntegrationTest]
   [junit4]   2>         at sun.misc.Unsafe.park(Native Method)
   [junit4]   2>         at java.util.concurrent.locks.LockSupport.parkNanos(LockSupport.java:226)
   [junit4]   2>         at java.util.concurrent.locks.AbstractQueuedSynchronizer$ConditionObject.awaitNanos(AbstractQueuedSynchronizer.java:2082)
   [junit4]   2>         at java.util.concurrent.ScheduledThreadPoolExecutor$DelayedWorkQueue.take(ScheduledThreadPoolExecutor.java:1090)
   [junit4]   2>         at java.util.concurrent.ScheduledThreadPoolExecutor$DelayedWorkQueue.take(ScheduledThreadPoolExecutor.java:807)
   [junit4]   2>         at java.util.concurrent.ThreadPoolExecutor.getTask(ThreadPoolExecutor.java:1068)
   [junit4]   2>         at java.util.concurrent.ThreadPoolExecutor.runWorker(ThreadPoolExecutor.java:1130)
   [junit4]   2>         at java.util.concurrent.ThreadPoolExecutor$Worker.run(ThreadPoolExecutor.java:615)
   [junit4]   2>         at java.lang.Thread.run(Thread.java:745)
   [junit4]   2>   27) Thread[id=4963, name=searcherExecutor-2360-thread-1, state=WAITING, group=TGRP-BasicAuthIntegrationTest]
   [junit4]   2>         at sun.misc.Unsafe.park(Native Method)
   [junit4]   2>         at java.util.concurrent.locks.LockSupport.park(LockSupport.java:186)
   [junit4]   2>         at java.util.concurrent.locks.AbstractQueuedSynchronizer$ConditionObject.await(AbstractQueuedSynchronizer.java:2043)
   [junit4]   2>         at java.util.concurrent.LinkedBlockingQueue.take(LinkedBlockingQueue.java:442)
   [junit4]   2>         at java.util.concurrent.ThreadPoolExecutor.getTask(ThreadPoolExecutor.java:1068)
   [junit4]   2>         at java.util.concurrent.ThreadPoolExecutor.runWorker(ThreadPoolExecutor.java:1130)
   [junit4]   2>         at java.util.concurrent.ThreadPoolExecutor$Worker.run(ThreadPoolExecutor.java:615)
   [junit4]   2>         at java.lang.Thread.run(Thread.java:745)
   [junit4]   2>   28) Thread[id=4893, name=qtp146938635-4893-selector-ServerConnectorManager@3ea7a343/3, state=RUNNABLE, group=TGRP-BasicAuthIntegrationTest]
   [junit4]   2>         at sun.nio.ch.SelectorImpl.lockAndDoSelect(SelectorImpl.java:82)
   [junit4]   2>         at sun.nio.ch.SelectorImpl.select(SelectorImpl.java:98)
   [junit4]   2>         at sun.nio.ch.SelectorImpl.select(SelectorImpl.java:102)
   [junit4]   2>         at org.eclipse.jetty.io.SelectorManager$ManagedSelector.select(SelectorManager.java:600)
   [junit4]   2>         at org.eclipse.jetty.io.SelectorManager$ManagedSelector.run(SelectorManager.java:549)
   [junit4]   2>         at org.eclipse.jetty.util.thread.NonBlockingThread.run(NonBlockingThread.java:52)
   [junit4]   2>         at org.eclipse.jetty.util.thread.QueuedThreadPool.runJob(QueuedThreadPool.java:635)
   [junit4]   2>         at org.eclipse.jetty.util.thread.QueuedThreadPool$3.run(QueuedThreadPool.java:555)
   [junit4]   2>         at java.lang.Thread.run(Thread.java:745)
   [junit4]   2> NOTE: test params are: codec=Asserting(Lucene54): {range_facet_l_dv=FST50, range_facet_i_dv=PostingsFormat(name=Direct), _version_=PostingsFormat(name=LuceneVarGapDocFreqInterval), intDefault=PostingsFormat(name=LuceneVarGapDocFreqInterval), id=FST50, timestamp=PostingsFormat(name=Direct), range_facet_l=PostingsFormat(name=Direct), multiDefault=PostingsFormat(name=Direct)}, docValues:{range_facet_i_dv=DocValuesFormat(name=Direct), range_facet_l_dv=DocValuesFormat(name=Asserting), timestamp=DocValuesFormat(name=Direct)}, sim=RandomSimilarity(queryNorm=true,coord=yes): {}, locale=es-AR, timezone=Africa/Addis_Ababa
   [junit4]   2> NOTE: Linux 3.19.0-47-generic amd64/Oracle Corporation 1.7.0_80 (64-bit)/cpus=12,threads=79,free=291017224,total=507707392
   [junit4]   2> NOTE: All tests run in this JVM: [TestCrossCoreJoin, DistributedQueueTest, CopyFieldTest, TestReloadAndDeleteDocs, CacheHeaderTest, HdfsChaosMonkeySafeLeaderTest, TestTrackingShardHandlerFactory, CloudMLTQParserTest, TestRandomCollapseQParserPlugin, URLClassifyProcessorTest, TestJoin, AnalyticsMergeStrategyTest, DocValuesMissingTest, TestHashQParserPlugin, ZkStateReaderTest, TestConfigSetsAPIExclusivity, SystemInfoHandlerTest, TestDFISimilarityFactory, OutputWriterTest, HdfsBasicDistributedZk2Test, TestLeaderElectionZkExpiry, ActionThrottleTest, AsyncCallRequestStatusResponseTest, TestSchemaManager, DateFieldTest, UUIDUpdateProcessorFallbackTest, TestBlobHandler, ZkNodePropsTest, FileBasedSpellCheckerTest, TestUniqueKeyFieldResource, HdfsSyncSliceTest, CloneFieldUpdateProcessorFactoryTest, TestInfoStreamLogging, AnalysisAfterCoreReloadTest, TestFoldingMultitermQuery, OverseerRolesTest, SignatureUpdateProcessorFactoryTest, RestartWhileUpdatingTest, TestFieldTypeResource, DefaultValueUpdateProcessorTest, PrimUtilsTest, TestManagedSchemaFieldTypeResource, TestRandomFaceting, TestMissingGroups, TestFastOutputStream, PingRequestHandlerTest, BlockJoinFacetDistribTest, SynonymTokenizerTest, TestIBSimilarityFactory, JSONWriterTest, BadCopyFieldTest, TestDistributedStatsComponentCardinality, TestComponentsName, RAMDirectoryFactoryTest, ParsingFieldUpdateProcessorsTest, SOLR749Test, HdfsWriteToMultipleCollectionsTest, EchoParamsTest, TestSolrDynamicMBean, TestScoreJoinQPNoScore, ResponseLogComponentTest, SegmentsInfoRequestHandlerTest, SolrCoreTest, TestDistribDocBasedVersion, StandardRequestHandlerTest, TestAtomicUpdateErrorCases, TestStressLucene, TestBinaryField, TestRangeQuery, HdfsRecoverLeaseTest, TestAnalyzedSuggestions, TestBadConfig, TestSerializedLuceneMatchVersion, TestPKIAuthenticationPlugin, VersionInfoTest, JsonLoaderTest, BigEndianAscendingWordDeserializerTest, RulesTest, TestSimpleQParserPlugin, TestRawTransformer, SmileWriterTest, UUIDFieldTest, QueryEqualityTest, TestReplicationHandler, BasicAuthIntegrationTest]
   [junit4]   2> NOTE: reproduce with: ant test  -Dtestcase=BasicAuthIntegrationTest -Dtests.seed=9225C74068803365 -Dtests.multiplier=3 -Dtests.slow=true -Dtests.locale=es-AR -Dtests.timezone=Africa/Addis_Ababa -Dtests.asserts=true -Dtests.file.encoding=UTF-8
   [junit4] ERROR   0.00s J0 | BasicAuthIntegrationTest (suite) <<<
   [junit4]    > Throwable #1: java.lang.Exception: Suite timeout exceeded (>= 7200000 msec).
   [junit4]    > 	at __randomizedtesting.SeedInfo.seed([9225C74068803365]:0)
   [junit4] Completed [558/566 (1!)] on J0 in 7223.63s, 1 test, 2 errors <<< FAILURES!

[...truncated 36 lines...]
BUILD FAILED
/home/jenkins/workspace/Lucene-Solr-5.x-Linux/build.xml:750: The following error occurred while executing this line:
/home/jenkins/workspace/Lucene-Solr-5.x-Linux/build.xml:694: The following error occurred while executing this line:
/home/jenkins/workspace/Lucene-Solr-5.x-Linux/build.xml:59: The following error occurred while executing this line:
/home/jenkins/workspace/Lucene-Solr-5.x-Linux/solr/build.xml:233: The following error occurred while executing this line:
/home/jenkins/workspace/Lucene-Solr-5.x-Linux/solr/common-build.xml:534: The following error occurred while executing this line:
/home/jenkins/workspace/Lucene-Solr-5.x-Linux/lucene/common-build.xml:1477: The following error occurred while executing this line:
/home/jenkins/workspace/Lucene-Solr-5.x-Linux/lucene/common-build.xml:1033: There were test failures: 566 suites (7 ignored), 2279 tests, 1 suite-level error, 1 error, 181 ignored (37 assumptions) [seed: 9225C74068803365]

Total time: 150 minutes 42 seconds
Build step 'Invoke Ant' marked build as failure
Archiving artifacts
[WARNINGS] Skipping publisher since build result is FAILURE
Recording test results
Email was triggered for: Failure - Any
Sending email for trigger: Failure - Any



Mime
View raw message