lucene-dev mailing list archives

Site index · List index
Message view « Date » · « Thread »
Top « Date » · « Thread »
From Policeman Jenkins Server <jenk...@thetaphi.de>
Subject [JENKINS] Lucene-Solr-5.x-MacOSX (64bit/jdk1.7.0) - Build # 3033 - Still Failing!
Date Mon, 15 Feb 2016 15:32:11 GMT
Build: http://jenkins.thetaphi.de/job/Lucene-Solr-5.x-MacOSX/3033/
Java: 64bit/jdk1.7.0 -XX:-UseCompressedOops -XX:+UseG1GC

1 tests failed.
FAILED:  org.apache.solr.client.solrj.impl.CloudSolrClientTest.test

Error Message:
There should be one document because overwrite=true expected:<1> but was:<0>

Stack Trace:
java.lang.AssertionError: There should be one document because overwrite=true expected:<1> but was:<0>
	at __randomizedtesting.SeedInfo.seed([AC35F37DB26D83AB:2461CCA71C91EE53]:0)
	at org.junit.Assert.fail(Assert.java:93)
	at org.junit.Assert.failNotEquals(Assert.java:647)
	at org.junit.Assert.assertEquals(Assert.java:128)
	at org.junit.Assert.assertEquals(Assert.java:472)
	at org.apache.solr.client.solrj.impl.CloudSolrClientTest.testOverwriteOption(CloudSolrClientTest.java:156)
	at org.apache.solr.client.solrj.impl.CloudSolrClientTest.test(CloudSolrClientTest.java:120)
	at sun.reflect.NativeMethodAccessorImpl.invoke0(Native Method)
	at sun.reflect.NativeMethodAccessorImpl.invoke(NativeMethodAccessorImpl.java:57)
	at sun.reflect.DelegatingMethodAccessorImpl.invoke(DelegatingMethodAccessorImpl.java:43)
	at java.lang.reflect.Method.invoke(Method.java:606)
	at com.carrotsearch.randomizedtesting.RandomizedRunner.invoke(RandomizedRunner.java:1764)
	at com.carrotsearch.randomizedtesting.RandomizedRunner$8.evaluate(RandomizedRunner.java:871)
	at com.carrotsearch.randomizedtesting.RandomizedRunner$9.evaluate(RandomizedRunner.java:907)
	at com.carrotsearch.randomizedtesting.RandomizedRunner$10.evaluate(RandomizedRunner.java:921)
	at org.junit.rules.ExpectedException$ExpectedExceptionStatement.evaluate(ExpectedException.java:110)
	at org.apache.solr.BaseDistributedSearchTestCase$ShardsRepeatRule$ShardsFixedStatement.callStatement(BaseDistributedSearchTestCase.java:964)
	at org.apache.solr.BaseDistributedSearchTestCase$ShardsRepeatRule$ShardsStatement.evaluate(BaseDistributedSearchTestCase.java:939)
	at com.carrotsearch.randomizedtesting.rules.SystemPropertiesRestoreRule$1.evaluate(SystemPropertiesRestoreRule.java:57)
	at org.apache.lucene.util.TestRuleSetupTeardownChained$1.evaluate(TestRuleSetupTeardownChained.java:49)
	at org.apache.lucene.util.AbstractBeforeAfterRule$1.evaluate(AbstractBeforeAfterRule.java:45)
	at org.apache.lucene.util.TestRuleThreadAndTestName$1.evaluate(TestRuleThreadAndTestName.java:48)
	at org.apache.lucene.util.TestRuleIgnoreAfterMaxFailures$1.evaluate(TestRuleIgnoreAfterMaxFailures.java:64)
	at org.apache.lucene.util.TestRuleMarkFailure$1.evaluate(TestRuleMarkFailure.java:47)
	at com.carrotsearch.randomizedtesting.rules.StatementAdapter.evaluate(StatementAdapter.java:36)
	at com.carrotsearch.randomizedtesting.ThreadLeakControl$StatementRunner.run(ThreadLeakControl.java:367)
	at com.carrotsearch.randomizedtesting.ThreadLeakControl.forkTimeoutingTask(ThreadLeakControl.java:809)
	at com.carrotsearch.randomizedtesting.ThreadLeakControl$3.evaluate(ThreadLeakControl.java:460)
	at com.carrotsearch.randomizedtesting.RandomizedRunner.runSingleTest(RandomizedRunner.java:880)
	at com.carrotsearch.randomizedtesting.RandomizedRunner$5.evaluate(RandomizedRunner.java:781)
	at com.carrotsearch.randomizedtesting.RandomizedRunner$6.evaluate(RandomizedRunner.java:816)
	at com.carrotsearch.randomizedtesting.RandomizedRunner$7.evaluate(RandomizedRunner.java:827)
	at com.carrotsearch.randomizedtesting.rules.StatementAdapter.evaluate(StatementAdapter.java:36)
	at com.carrotsearch.randomizedtesting.rules.SystemPropertiesRestoreRule$1.evaluate(SystemPropertiesRestoreRule.java:57)
	at org.apache.lucene.util.AbstractBeforeAfterRule$1.evaluate(AbstractBeforeAfterRule.java:45)
	at com.carrotsearch.randomizedtesting.rules.StatementAdapter.evaluate(StatementAdapter.java:36)
	at org.apache.lucene.util.TestRuleStoreClassName$1.evaluate(TestRuleStoreClassName.java:41)
	at com.carrotsearch.randomizedtesting.rules.NoShadowingOrOverridesOnMethodsRule$1.evaluate(NoShadowingOrOverridesOnMethodsRule.java:40)
	at com.carrotsearch.randomizedtesting.rules.NoShadowingOrOverridesOnMethodsRule$1.evaluate(NoShadowingOrOverridesOnMethodsRule.java:40)
	at com.carrotsearch.randomizedtesting.rules.StatementAdapter.evaluate(StatementAdapter.java:36)
	at com.carrotsearch.randomizedtesting.rules.StatementAdapter.evaluate(StatementAdapter.java:36)
	at com.carrotsearch.randomizedtesting.rules.StatementAdapter.evaluate(StatementAdapter.java:36)
	at org.apache.lucene.util.TestRuleAssertionsRequired$1.evaluate(TestRuleAssertionsRequired.java:53)
	at org.apache.lucene.util.TestRuleMarkFailure$1.evaluate(TestRuleMarkFailure.java:47)
	at org.apache.lucene.util.TestRuleIgnoreAfterMaxFailures$1.evaluate(TestRuleIgnoreAfterMaxFailures.java:64)
	at org.apache.lucene.util.TestRuleIgnoreTestSuites$1.evaluate(TestRuleIgnoreTestSuites.java:54)
	at com.carrotsearch.randomizedtesting.rules.StatementAdapter.evaluate(StatementAdapter.java:36)
	at com.carrotsearch.randomizedtesting.ThreadLeakControl$StatementRunner.run(ThreadLeakControl.java:367)
	at java.lang.Thread.run(Thread.java:745)




Build Log:
[...truncated 12819 lines...]
   [junit4] Suite: org.apache.solr.client.solrj.impl.CloudSolrClientTest
   [junit4]   2> Creating dataDir: /Users/jenkins/workspace/Lucene-Solr-5.x-MacOSX@2/solr/build/solr-solrj/test/J0/temp/solr.client.solrj.impl.CloudSolrClientTest_AC35F37DB26D83AB-001/init-core-data-001
   [junit4]   2> 25284 INFO  (SUITE-CloudSolrClientTest-seed#[AC35F37DB26D83AB]-worker) [    ] o.a.s.SolrTestCaseJ4 Randomized ssl (false) and clientAuth (false)
   [junit4]   2> 25284 INFO  (SUITE-CloudSolrClientTest-seed#[AC35F37DB26D83AB]-worker) [    ] o.a.s.BaseDistributedSearchTestCase Setting hostContext system property: /oo/
   [junit4]   2> 25288 WARN  (SUITE-CloudSolrClientTest-seed#[AC35F37DB26D83AB]-worker) [    ] o.a.s.c.AbstractZkTestCase TEST_HOME() does not exist - solrj test?
   [junit4]   2> 25319 INFO  (TEST-CloudSolrClientTest.test-seed#[AC35F37DB26D83AB]) [    ] o.a.s.c.ZkTestServer STARTING ZK TEST SERVER
   [junit4]   2> 25323 INFO  (Thread-19) [    ] o.a.s.c.ZkTestServer client port:0.0.0.0/0.0.0.0:0
   [junit4]   2> 25323 INFO  (Thread-19) [    ] o.a.s.c.ZkTestServer Starting server
   [junit4]   2> 25423 INFO  (TEST-CloudSolrClientTest.test-seed#[AC35F37DB26D83AB]) [    ] o.a.s.c.ZkTestServer start zk server on port:59588
   [junit4]   2> 25468 INFO  (TEST-CloudSolrClientTest.test-seed#[AC35F37DB26D83AB]) [    ] o.a.s.c.c.SolrZkClient Using default ZkCredentialsProvider
   [junit4]   2> 25542 INFO  (TEST-CloudSolrClientTest.test-seed#[AC35F37DB26D83AB]) [    ] o.a.s.c.c.ConnectionManager Waiting for client to connect to ZooKeeper
   [junit4]   2> 25593 INFO  (zkCallback-5-thread-1) [    ] o.a.s.c.c.ConnectionManager Watcher org.apache.solr.common.cloud.ConnectionManager@3cb25ec1 name:ZooKeeperConnection Watcher:127.0.0.1:59588 got event WatchedEvent state:SyncConnected type:None path:null path:null type:None
   [junit4]   2> 25594 INFO  (TEST-CloudSolrClientTest.test-seed#[AC35F37DB26D83AB]) [    ] o.a.s.c.c.ConnectionManager Client is connected to ZooKeeper
   [junit4]   2> 25594 INFO  (TEST-CloudSolrClientTest.test-seed#[AC35F37DB26D83AB]) [    ] o.a.s.c.c.SolrZkClient Using default ZkACLProvider
   [junit4]   2> 25597 INFO  (TEST-CloudSolrClientTest.test-seed#[AC35F37DB26D83AB]) [    ] o.a.s.c.c.SolrZkClient makePath: /solr
   [junit4]   2> 25634 INFO  (TEST-CloudSolrClientTest.test-seed#[AC35F37DB26D83AB]) [    ] o.a.s.c.c.SolrZkClient Using default ZkCredentialsProvider
   [junit4]   2> 25635 INFO  (TEST-CloudSolrClientTest.test-seed#[AC35F37DB26D83AB]) [    ] o.a.s.c.c.ConnectionManager Waiting for client to connect to ZooKeeper
   [junit4]   2> 25637 INFO  (zkCallback-6-thread-1) [    ] o.a.s.c.c.ConnectionManager Watcher org.apache.solr.common.cloud.ConnectionManager@a0ba648 name:ZooKeeperConnection Watcher:127.0.0.1:59588/solr got event WatchedEvent state:SyncConnected type:None path:null path:null type:None
   [junit4]   2> 25637 INFO  (TEST-CloudSolrClientTest.test-seed#[AC35F37DB26D83AB]) [    ] o.a.s.c.c.ConnectionManager Client is connected to ZooKeeper
   [junit4]   2> 25638 INFO  (TEST-CloudSolrClientTest.test-seed#[AC35F37DB26D83AB]) [    ] o.a.s.c.c.SolrZkClient Using default ZkACLProvider
   [junit4]   2> 25640 INFO  (TEST-CloudSolrClientTest.test-seed#[AC35F37DB26D83AB]) [    ] o.a.s.c.c.SolrZkClient makePath: /collections/collection1
   [junit4]   2> 25647 INFO  (TEST-CloudSolrClientTest.test-seed#[AC35F37DB26D83AB]) [    ] o.a.s.c.c.SolrZkClient makePath: /collections/collection1/shards
   [junit4]   2> 25653 INFO  (TEST-CloudSolrClientTest.test-seed#[AC35F37DB26D83AB]) [    ] o.a.s.c.c.SolrZkClient makePath: /collections/control_collection
   [junit4]   2> 25657 INFO  (TEST-CloudSolrClientTest.test-seed#[AC35F37DB26D83AB]) [    ] o.a.s.c.c.SolrZkClient makePath: /collections/control_collection/shards
   [junit4]   2> 25666 INFO  (TEST-CloudSolrClientTest.test-seed#[AC35F37DB26D83AB]) [    ] o.a.s.c.AbstractZkTestCase put /Users/jenkins/workspace/Lucene-Solr-5.x-MacOSX@2/solr/solrj/src/test-files/solrj/solr/collection1/conf/solrconfig.xml to /configs/conf1/solrconfig.xml
   [junit4]   2> 25667 INFO  (TEST-CloudSolrClientTest.test-seed#[AC35F37DB26D83AB]) [    ] o.a.s.c.c.SolrZkClient makePath: /configs/conf1/solrconfig.xml
   [junit4]   2> 25675 INFO  (TEST-CloudSolrClientTest.test-seed#[AC35F37DB26D83AB]) [    ] o.a.s.c.AbstractZkTestCase put /Users/jenkins/workspace/Lucene-Solr-5.x-MacOSX@2/solr/solrj/src/test-files/solrj/solr/collection1/conf/schema.xml to /configs/conf1/schema.xml
   [junit4]   2> 25676 INFO  (TEST-CloudSolrClientTest.test-seed#[AC35F37DB26D83AB]) [    ] o.a.s.c.c.SolrZkClient makePath: /configs/conf1/schema.xml
   [junit4]   2> 25682 INFO  (TEST-CloudSolrClientTest.test-seed#[AC35F37DB26D83AB]) [    ] o.a.s.c.AbstractZkTestCase skipping /Users/jenkins/workspace/Lucene-Solr-5.x-MacOSX@2/solr/solrj/src/test-files/solrj/solr/collection1/conf/solrconfig.snippet.randomindexconfig.xml because it doesn't exist
   [junit4]   2> 25682 INFO  (TEST-CloudSolrClientTest.test-seed#[AC35F37DB26D83AB]) [    ] o.a.s.c.AbstractZkTestCase skipping /Users/jenkins/workspace/Lucene-Solr-5.x-MacOSX@2/solr/solrj/src/test-files/solrj/solr/collection1/conf/stopwords.txt because it doesn't exist
   [junit4]   2> 25682 INFO  (TEST-CloudSolrClientTest.test-seed#[AC35F37DB26D83AB]) [    ] o.a.s.c.AbstractZkTestCase skipping /Users/jenkins/workspace/Lucene-Solr-5.x-MacOSX@2/solr/solrj/src/test-files/solrj/solr/collection1/conf/protwords.txt because it doesn't exist
   [junit4]   2> 25682 INFO  (TEST-CloudSolrClientTest.test-seed#[AC35F37DB26D83AB]) [    ] o.a.s.c.AbstractZkTestCase skipping /Users/jenkins/workspace/Lucene-Solr-5.x-MacOSX@2/solr/solrj/src/test-files/solrj/solr/collection1/conf/currency.xml because it doesn't exist
   [junit4]   2> 25682 INFO  (TEST-CloudSolrClientTest.test-seed#[AC35F37DB26D83AB]) [    ] o.a.s.c.AbstractZkTestCase skipping /Users/jenkins/workspace/Lucene-Solr-5.x-MacOSX@2/solr/solrj/src/test-files/solrj/solr/collection1/conf/enumsConfig.xml because it doesn't exist
   [junit4]   2> 25682 INFO  (TEST-CloudSolrClientTest.test-seed#[AC35F37DB26D83AB]) [    ] o.a.s.c.AbstractZkTestCase skipping /Users/jenkins/workspace/Lucene-Solr-5.x-MacOSX@2/solr/solrj/src/test-files/solrj/solr/collection1/conf/open-exchange-rates.json because it doesn't exist
   [junit4]   2> 25683 INFO  (TEST-CloudSolrClientTest.test-seed#[AC35F37DB26D83AB]) [    ] o.a.s.c.AbstractZkTestCase skipping /Users/jenkins/workspace/Lucene-Solr-5.x-MacOSX@2/solr/solrj/src/test-files/solrj/solr/collection1/conf/mapping-ISOLatin1Accent.txt because it doesn't exist
   [junit4]   2> 25683 INFO  (TEST-CloudSolrClientTest.test-seed#[AC35F37DB26D83AB]) [    ] o.a.s.c.AbstractZkTestCase skipping /Users/jenkins/workspace/Lucene-Solr-5.x-MacOSX@2/solr/solrj/src/test-files/solrj/solr/collection1/conf/old_synonyms.txt because it doesn't exist
   [junit4]   2> 25683 INFO  (TEST-CloudSolrClientTest.test-seed#[AC35F37DB26D83AB]) [    ] o.a.s.c.AbstractZkTestCase skipping /Users/jenkins/workspace/Lucene-Solr-5.x-MacOSX@2/solr/solrj/src/test-files/solrj/solr/collection1/conf/synonyms.txt because it doesn't exist
   [junit4]   2> 25859 INFO  (TEST-CloudSolrClientTest.test-seed#[AC35F37DB26D83AB]) [    ] o.a.s.SolrTestCaseJ4 Writing core.properties file to /Users/jenkins/workspace/Lucene-Solr-5.x-MacOSX@2/solr/build/solr-solrj/test/J0/temp/solr.client.solrj.impl.CloudSolrClientTest_AC35F37DB26D83AB-001/control-001/cores/collection1
   [junit4]   2> 25887 INFO  (TEST-CloudSolrClientTest.test-seed#[AC35F37DB26D83AB]) [    ] o.e.j.s.Server jetty-9.2.13.v20150730
   [junit4]   2> 25915 INFO  (TEST-CloudSolrClientTest.test-seed#[AC35F37DB26D83AB]) [    ] o.e.j.s.h.ContextHandler Started o.e.j.s.ServletContextHandler@49676ea0{/oo,null,AVAILABLE}
   [junit4]   2> 25919 INFO  (TEST-CloudSolrClientTest.test-seed#[AC35F37DB26D83AB]) [    ] o.e.j.s.ServerConnector Started ServerConnector@678287aa{HTTP/1.1}{127.0.0.1:59594}
   [junit4]   2> 25919 INFO  (TEST-CloudSolrClientTest.test-seed#[AC35F37DB26D83AB]) [    ] o.e.j.s.Server Started @32187ms
   [junit4]   2> 25920 INFO  (TEST-CloudSolrClientTest.test-seed#[AC35F37DB26D83AB]) [    ] o.a.s.c.s.e.JettySolrRunner Jetty properties: {hostPort=59594, hostContext=/oo, solr.data.dir=/Users/jenkins/workspace/Lucene-Solr-5.x-MacOSX@2/solr/build/solr-solrj/test/J0/temp/solr.client.solrj.impl.CloudSolrClientTest_AC35F37DB26D83AB-001/tempDir-001/control/data, coreRootDirectory=/Users/jenkins/workspace/Lucene-Solr-5.x-MacOSX@2/solr/build/solr-solrj/test/J0/temp/solr.client.solrj.impl.CloudSolrClientTest_AC35F37DB26D83AB-001/control-001/cores}
   [junit4]   2> 25923 INFO  (TEST-CloudSolrClientTest.test-seed#[AC35F37DB26D83AB]) [    ] o.a.s.s.SolrDispatchFilter SolrDispatchFilter.init(): sun.misc.Launcher$AppClassLoader@420a52f
   [junit4]   2> 25924 INFO  (TEST-CloudSolrClientTest.test-seed#[AC35F37DB26D83AB]) [    ] o.a.s.c.SolrResourceLoader new SolrResourceLoader for directory: '/Users/jenkins/workspace/Lucene-Solr-5.x-MacOSX@2/solr/build/solr-solrj/test/J0/temp/solr.client.solrj.impl.CloudSolrClientTest_AC35F37DB26D83AB-001/control-001'
   [junit4]   2> 25924 INFO  (TEST-CloudSolrClientTest.test-seed#[AC35F37DB26D83AB]) [    ] o.a.s.c.SolrResourceLoader JNDI not configured for solr (NoInitialContextEx)
   [junit4]   2> 25924 INFO  (TEST-CloudSolrClientTest.test-seed#[AC35F37DB26D83AB]) [    ] o.a.s.c.SolrResourceLoader solr home defaulted to 'solr/' (could not find system property or JNDI)
   [junit4]   2> 25924 INFO  (TEST-CloudSolrClientTest.test-seed#[AC35F37DB26D83AB]) [    ] o.a.s.c.c.SolrZkClient Using default ZkCredentialsProvider
   [junit4]   2> 25928 INFO  (TEST-CloudSolrClientTest.test-seed#[AC35F37DB26D83AB]) [    ] o.a.s.c.c.ConnectionManager Waiting for client to connect to ZooKeeper
   [junit4]   2> 25929 INFO  (zkCallback-7-thread-1) [    ] o.a.s.c.c.ConnectionManager Watcher org.apache.solr.common.cloud.ConnectionManager@2624fe6b name:ZooKeeperConnection Watcher:127.0.0.1:59588/solr got event WatchedEvent state:SyncConnected type:None path:null path:null type:None
   [junit4]   2> 25929 INFO  (TEST-CloudSolrClientTest.test-seed#[AC35F37DB26D83AB]) [    ] o.a.s.c.c.ConnectionManager Client is connected to ZooKeeper
   [junit4]   2> 25929 INFO  (TEST-CloudSolrClientTest.test-seed#[AC35F37DB26D83AB]) [    ] o.a.s.c.c.SolrZkClient Using default ZkACLProvider
   [junit4]   2> 25945 INFO  (TEST-CloudSolrClientTest.test-seed#[AC35F37DB26D83AB]) [    ] o.a.s.s.SolrDispatchFilter Loading solr.xml from SolrHome (not found in ZooKeeper)
   [junit4]   2> 25945 INFO  (TEST-CloudSolrClientTest.test-seed#[AC35F37DB26D83AB]) [    ] o.a.s.c.SolrXmlConfig Loading container configuration from /Users/jenkins/workspace/Lucene-Solr-5.x-MacOSX@2/solr/build/solr-solrj/test/J0/temp/solr.client.solrj.impl.CloudSolrClientTest_AC35F37DB26D83AB-001/control-001/solr.xml
   [junit4]   2> 25973 INFO  (TEST-CloudSolrClientTest.test-seed#[AC35F37DB26D83AB]) [    ] o.a.s.c.CorePropertiesLocator Config-defined core root directory: /Users/jenkins/workspace/Lucene-Solr-5.x-MacOSX@2/solr/build/solr-solrj/test/J0/temp/solr.client.solrj.impl.CloudSolrClientTest_AC35F37DB26D83AB-001/control-001/cores
   [junit4]   2> 25973 INFO  (TEST-CloudSolrClientTest.test-seed#[AC35F37DB26D83AB]) [    ] o.a.s.c.CoreContainer New CoreContainer 1588411475
   [junit4]   2> 25973 INFO  (TEST-CloudSolrClientTest.test-seed#[AC35F37DB26D83AB]) [    ] o.a.s.c.CoreContainer Loading cores into CoreContainer [instanceDir=/Users/jenkins/workspace/Lucene-Solr-5.x-MacOSX@2/solr/build/solr-solrj/test/J0/temp/solr.client.solrj.impl.CloudSolrClientTest_AC35F37DB26D83AB-001/control-001]
   [junit4]   2> 25973 WARN  (TEST-CloudSolrClientTest.test-seed#[AC35F37DB26D83AB]) [    ] o.a.s.c.CoreContainer Couldn't add files from /Users/jenkins/workspace/Lucene-Solr-5.x-MacOSX@2/solr/build/solr-solrj/test/J0/temp/solr.client.solrj.impl.CloudSolrClientTest_AC35F37DB26D83AB-001/control-001/lib to classpath: /Users/jenkins/workspace/Lucene-Solr-5.x-MacOSX@2/solr/build/solr-solrj/test/J0/temp/solr.client.solrj.impl.CloudSolrClientTest_AC35F37DB26D83AB-001/control-001/lib
   [junit4]   2> 25973 INFO  (TEST-CloudSolrClientTest.test-seed#[AC35F37DB26D83AB]) [    ] o.a.s.h.c.HttpShardHandlerFactory created with socketTimeout : 90000,urlScheme : ,connTimeout : 15000,maxConnectionsPerHost : 20,maxConnections : 10000,corePoolSize : 0,maximumPoolSize : 2147483647,maxThreadIdleTime : 5,sizeOfQueue : -1,fairnessPolicy : false,useRetries : false,
   [junit4]   2> 25976 INFO  (TEST-CloudSolrClientTest.test-seed#[AC35F37DB26D83AB]) [    ] o.a.s.u.UpdateShardHandler Creating UpdateShardHandler HTTP client with params: socketTimeout=340000&connTimeout=45000&retry=true
   [junit4]   2> 25976 INFO  (TEST-CloudSolrClientTest.test-seed#[AC35F37DB26D83AB]) [    ] o.a.s.l.LogWatcher SLF4J impl is org.slf4j.impl.Log4jLoggerFactory
   [junit4]   2> 25977 INFO  (TEST-CloudSolrClientTest.test-seed#[AC35F37DB26D83AB]) [    ] o.a.s.l.LogWatcher Registering Log Listener [Log4j (org.slf4j.impl.Log4jLoggerFactory)]
   [junit4]   2> 25977 INFO  (TEST-CloudSolrClientTest.test-seed#[AC35F37DB26D83AB]) [    ] o.a.s.c.ZkContainer Zookeeper client=127.0.0.1:59588/solr
   [junit4]   2> 26050 INFO  (TEST-CloudSolrClientTest.test-seed#[AC35F37DB26D83AB]) [    ] o.a.s.c.ZkController zkHost includes chroot
   [junit4]   2> 26050 INFO  (TEST-CloudSolrClientTest.test-seed#[AC35F37DB26D83AB]) [    ] o.a.s.c.c.SolrZkClient Using default ZkCredentialsProvider
   [junit4]   2> 26052 INFO  (TEST-CloudSolrClientTest.test-seed#[AC35F37DB26D83AB]) [    ] o.a.s.c.c.ConnectionManager Waiting for client to connect to ZooKeeper
   [junit4]   2> 26056 INFO  (zkCallback-10-thread-1) [    ] o.a.s.c.c.ConnectionManager Watcher org.apache.solr.common.cloud.ConnectionManager@7665ed1c name:ZooKeeperConnection Watcher:127.0.0.1:59588 got event WatchedEvent state:SyncConnected type:None path:null path:null type:None
   [junit4]   2> 26056 INFO  (TEST-CloudSolrClientTest.test-seed#[AC35F37DB26D83AB]) [    ] o.a.s.c.c.ConnectionManager Client is connected to ZooKeeper
   [junit4]   2> 26056 INFO  (TEST-CloudSolrClientTest.test-seed#[AC35F37DB26D83AB]) [    ] o.a.s.c.c.SolrZkClient Using default ZkACLProvider
   [junit4]   2> 26063 WARN  (NIOServerCxn.Factory:0.0.0.0/0.0.0.0:0) [    ] o.a.z.s.NIOServerCnxn caught end of stream exception
   [junit4]   2> EndOfStreamException: Unable to read additional data from client sessionid 0x152e58c8b0d0003, likely client has closed socket
   [junit4]   2> 	at org.apache.zookeeper.server.NIOServerCnxn.doIO(NIOServerCnxn.java:228)
   [junit4]   2> 	at org.apache.zookeeper.server.NIOServerCnxnFactory.run(NIOServerCnxnFactory.java:208)
   [junit4]   2> 	at java.lang.Thread.run(Thread.java:745)
   [junit4]   2> 26147 INFO  (zkCallback-11-thread-1-processing-n:127.0.0.1:59594_oo) [n:127.0.0.1:59594_oo    ] o.a.s.c.c.ConnectionManager Watcher org.apache.solr.common.cloud.ConnectionManager@1a2d3ed5 name:ZooKeeperConnection Watcher:127.0.0.1:59588/solr got event WatchedEvent state:SyncConnected type:None path:null path:null type:None
   [junit4]   2> 26142 INFO  (TEST-CloudSolrClientTest.test-seed#[AC35F37DB26D83AB]) [n:127.0.0.1:59594_oo    ] o.a.s.c.c.ConnectionManager Waiting for client to connect to ZooKeeper
   [junit4]   2> 26147 INFO  (TEST-CloudSolrClientTest.test-seed#[AC35F37DB26D83AB]) [n:127.0.0.1:59594_oo    ] o.a.s.c.c.ConnectionManager Client is connected to ZooKeeper
   [junit4]   2> 26189 INFO  (TEST-CloudSolrClientTest.test-seed#[AC35F37DB26D83AB]) [n:127.0.0.1:59594_oo    ] o.a.s.c.c.SolrZkClient makePath: /overseer/queue
   [junit4]   2> 26221 INFO  (TEST-CloudSolrClientTest.test-seed#[AC35F37DB26D83AB]) [n:127.0.0.1:59594_oo    ] o.a.s.c.c.SolrZkClient makePath: /overseer/collection-queue-work
   [junit4]   2> 26238 INFO  (TEST-CloudSolrClientTest.test-seed#[AC35F37DB26D83AB]) [n:127.0.0.1:59594_oo    ] o.a.s.c.c.SolrZkClient makePath: /overseer/collection-map-running
   [junit4]   2> 26248 INFO  (TEST-CloudSolrClientTest.test-seed#[AC35F37DB26D83AB]) [n:127.0.0.1:59594_oo    ] o.a.s.c.c.SolrZkClient makePath: /overseer/collection-map-completed
   [junit4]   2> 26261 INFO  (TEST-CloudSolrClientTest.test-seed#[AC35F37DB26D83AB]) [n:127.0.0.1:59594_oo    ] o.a.s.c.c.SolrZkClient makePath: /overseer/collection-map-failure
   [junit4]   2> 26328 INFO  (TEST-CloudSolrClientTest.test-seed#[AC35F37DB26D83AB]) [n:127.0.0.1:59594_oo    ] o.a.s.c.c.SolrZkClient makePath: /live_nodes
   [junit4]   2> 26358 INFO  (TEST-CloudSolrClientTest.test-seed#[AC35F37DB26D83AB]) [n:127.0.0.1:59594_oo    ] o.a.s.c.c.SolrZkClient makePath: /aliases.json
   [junit4]   2> 26362 INFO  (TEST-CloudSolrClientTest.test-seed#[AC35F37DB26D83AB]) [n:127.0.0.1:59594_oo    ] o.a.s.c.c.SolrZkClient makePath: /clusterstate.json
   [junit4]   2> 26365 INFO  (TEST-CloudSolrClientTest.test-seed#[AC35F37DB26D83AB]) [n:127.0.0.1:59594_oo    ] o.a.s.c.c.SolrZkClient makePath: /security.json
   [junit4]   2> 26375 INFO  (TEST-CloudSolrClientTest.test-seed#[AC35F37DB26D83AB]) [n:127.0.0.1:59594_oo    ] o.a.s.c.ZkController Register node as live in ZooKeeper:/live_nodes/127.0.0.1:59594_oo
   [junit4]   2> 26382 INFO  (TEST-CloudSolrClientTest.test-seed#[AC35F37DB26D83AB]) [n:127.0.0.1:59594_oo    ] o.a.s.c.c.SolrZkClient makePath: /live_nodes/127.0.0.1:59594_oo
   [junit4]   2> 26394 INFO  (TEST-CloudSolrClientTest.test-seed#[AC35F37DB26D83AB]) [n:127.0.0.1:59594_oo    ] o.a.s.c.c.SolrZkClient makePath: /overseer_elect
   [junit4]   2> 26398 INFO  (TEST-CloudSolrClientTest.test-seed#[AC35F37DB26D83AB]) [n:127.0.0.1:59594_oo    ] o.a.s.c.c.SolrZkClient makePath: /overseer_elect/election
   [junit4]   2> 26403 INFO  (TEST-CloudSolrClientTest.test-seed#[AC35F37DB26D83AB]) [n:127.0.0.1:59594_oo    ] o.a.s.c.Overseer Overseer (id=null) closing
   [junit4]   2> 26405 INFO  (TEST-CloudSolrClientTest.test-seed#[AC35F37DB26D83AB]) [n:127.0.0.1:59594_oo    ] o.a.s.c.LeaderElector Joined leadership election with path: /overseer_elect/election/95390933919268868-127.0.0.1:59594_oo-n_0000000000
   [junit4]   2> 26427 INFO  (TEST-CloudSolrClientTest.test-seed#[AC35F37DB26D83AB]) [n:127.0.0.1:59594_oo    ] o.a.s.c.OverseerElectionContext I am going to be the leader 127.0.0.1:59594_oo
   [junit4]   2> 26427 INFO  (TEST-CloudSolrClientTest.test-seed#[AC35F37DB26D83AB]) [n:127.0.0.1:59594_oo    ] o.a.s.c.c.SolrZkClient makePath: /overseer_elect/leader
   [junit4]   2> 26432 INFO  (TEST-CloudSolrClientTest.test-seed#[AC35F37DB26D83AB]) [n:127.0.0.1:59594_oo    ] o.a.s.c.Overseer Overseer (id=95390933919268868-127.0.0.1:59594_oo-n_0000000000) starting
   [junit4]   2> 26448 INFO  (TEST-CloudSolrClientTest.test-seed#[AC35F37DB26D83AB]) [n:127.0.0.1:59594_oo    ] o.a.s.c.c.SolrZkClient makePath: /overseer/queue-work
   [junit4]   2> 26533 INFO  (TEST-CloudSolrClientTest.test-seed#[AC35F37DB26D83AB]) [n:127.0.0.1:59594_oo    ] o.a.s.c.OverseerAutoReplicaFailoverThread Starting OverseerAutoReplicaFailoverThread autoReplicaFailoverWorkLoopDelay=10000 autoReplicaFailoverWaitAfterExpiration=30000 autoReplicaFailoverBadNodeExpiration=60000
   [junit4]   2> 26540 INFO  (OverseerCollectionConfigSetProcessor-95390933919268868-127.0.0.1:59594_oo-n_0000000000) [n:127.0.0.1:59594_oo    ] o.a.s.c.OverseerTaskProcessor Process current queue of overseer operations
   [junit4]   2> 26541 INFO  (TEST-CloudSolrClientTest.test-seed#[AC35F37DB26D83AB]) [n:127.0.0.1:59594_oo    ] o.a.s.c.c.ZkStateReader Updating cluster state from ZooKeeper... 
   [junit4]   2> 26551 INFO  (OverseerStateUpdate-95390933919268868-127.0.0.1:59594_oo-n_0000000000) [n:127.0.0.1:59594_oo    ] o.a.s.c.Overseer Starting to work on the main queue
   [junit4]   2> 26770 INFO  (TEST-CloudSolrClientTest.test-seed#[AC35F37DB26D83AB]) [n:127.0.0.1:59594_oo    ] o.a.s.c.CoreContainer Security conf doesn't exist. Skipping setup for authorization module.
   [junit4]   2> 26770 INFO  (TEST-CloudSolrClientTest.test-seed#[AC35F37DB26D83AB]) [n:127.0.0.1:59594_oo    ] o.a.s.c.CoreContainer No authentication plugin used.
   [junit4]   2> 26783 INFO  (TEST-CloudSolrClientTest.test-seed#[AC35F37DB26D83AB]) [n:127.0.0.1:59594_oo    ] o.a.s.c.CorePropertiesLocator Looking for core definitions underneath /Users/jenkins/workspace/Lucene-Solr-5.x-MacOSX@2/solr/build/solr-solrj/test/J0/temp/solr.client.solrj.impl.CloudSolrClientTest_AC35F37DB26D83AB-001/control-001/cores
   [junit4]   2> 26816 INFO  (TEST-CloudSolrClientTest.test-seed#[AC35F37DB26D83AB]) [n:127.0.0.1:59594_oo    ] o.a.s.c.CoreDescriptor Created CoreDescriptor: {collection=control_collection, shard=, transient=false, loadOnStartup=true, dataDir=data/, schema=schema.xml, configSetProperties=configsetprops.json, config=solrconfig.xml, coreNodeName=, name=collection1}
   [junit4]   2> 26816 INFO  (TEST-CloudSolrClientTest.test-seed#[AC35F37DB26D83AB]) [n:127.0.0.1:59594_oo    ] o.a.s.c.CorePropertiesLocator Found core collection1 in /Users/jenkins/workspace/Lucene-Solr-5.x-MacOSX@2/solr/build/solr-solrj/test/J0/temp/solr.client.solrj.impl.CloudSolrClientTest_AC35F37DB26D83AB-001/control-001/cores/collection1
   [junit4]   2> 26816 INFO  (TEST-CloudSolrClientTest.test-seed#[AC35F37DB26D83AB]) [n:127.0.0.1:59594_oo    ] o.a.s.c.CorePropertiesLocator Found 1 core definitions
   [junit4]   2> 26818 INFO  (TEST-CloudSolrClientTest.test-seed#[AC35F37DB26D83AB]) [n:127.0.0.1:59594_oo    ] o.a.s.s.SolrDispatchFilter user.dir=/Users/jenkins/workspace/Lucene-Solr-5.x-MacOSX@2/solr/build/solr-solrj/test/J0
   [junit4]   2> 26818 INFO  (TEST-CloudSolrClientTest.test-seed#[AC35F37DB26D83AB]) [n:127.0.0.1:59594_oo    ] o.a.s.s.SolrDispatchFilter SolrDispatchFilter.init() done
   [junit4]   2> 26820 INFO  (coreLoadExecutor-32-thread-1-processing-n:127.0.0.1:59594_oo) [n:127.0.0.1:59594_oo c:control_collection   x:collection1] o.a.s.c.ZkController publishing state=down
   [junit4]   2> 26820 INFO  (coreLoadExecutor-32-thread-1-processing-n:127.0.0.1:59594_oo) [n:127.0.0.1:59594_oo c:control_collection   x:collection1] o.a.s.c.ZkController numShards not found on descriptor - reading it from system property
   [junit4]   2> 26843 INFO  (OverseerStateUpdate-95390933919268868-127.0.0.1:59594_oo-n_0000000000) [n:127.0.0.1:59594_oo    ] o.a.s.c.Overseer processMessage: queueSize: 1, message = {
   [junit4]   2>   "node_name":"127.0.0.1:59594_oo",
   [junit4]   2>   "collection":"control_collection",
   [junit4]   2>   "roles":null,
   [junit4]   2>   "core":"collection1",
   [junit4]   2>   "numShards":"1",
   [junit4]   2>   "state":"down",
   [junit4]   2>   "base_url":"http://127.0.0.1:59594/oo",
   [junit4]   2>   "shard":null,
   [junit4]   2>   "operation":"state"} current state version: 0
   [junit4]   2> 26843 INFO  (coreLoadExecutor-32-thread-1-processing-n:127.0.0.1:59594_oo) [n:127.0.0.1:59594_oo c:control_collection   x:collection1] o.a.s.c.ZkController look for our core node name
   [junit4]   2> 26934 INFO  (OverseerStateUpdate-95390933919268868-127.0.0.1:59594_oo-n_0000000000) [n:127.0.0.1:59594_oo    ] o.a.s.c.o.ReplicaMutator Update state numShards=1 message={
   [junit4]   2>   "node_name":"127.0.0.1:59594_oo",
   [junit4]   2>   "collection":"control_collection",
   [junit4]   2>   "roles":null,
   [junit4]   2>   "core":"collection1",
   [junit4]   2>   "numShards":"1",
   [junit4]   2>   "state":"down",
   [junit4]   2>   "base_url":"http://127.0.0.1:59594/oo",
   [junit4]   2>   "shard":null,
   [junit4]   2>   "operation":"state"}
   [junit4]   2> 26944 INFO  (OverseerStateUpdate-95390933919268868-127.0.0.1:59594_oo-n_0000000000) [n:127.0.0.1:59594_oo    ] o.a.s.c.o.ClusterStateMutator building a new cName: control_collection
   [junit4]   2> 26987 INFO  (OverseerStateUpdate-95390933919268868-127.0.0.1:59594_oo-n_0000000000) [n:127.0.0.1:59594_oo    ] o.a.s.c.o.ReplicaMutator Assigning new node to shard shard=shard1
   [junit4]   2> 26997 INFO  (zkCallback-11-thread-1-processing-n:127.0.0.1:59594_oo) [n:127.0.0.1:59594_oo    ] o.a.s.c.c.ZkStateReader A cluster state change: [WatchedEvent state:SyncConnected type:NodeDataChanged path:/clusterstate.json], has occurred - updating... (live nodes size: [1])
   [junit4]   2> 27846 INFO  (coreLoadExecutor-32-thread-1-processing-n:127.0.0.1:59594_oo) [n:127.0.0.1:59594_oo c:control_collection   x:collection1] o.a.s.c.ZkController waiting to find shard id in clusterstate for collection1
   [junit4]   2> 27847 INFO  (coreLoadExecutor-32-thread-1-processing-n:127.0.0.1:59594_oo) [n:127.0.0.1:59594_oo c:control_collection   x:collection1] o.a.s.c.ZkController Check for collection zkNode:control_collection
   [junit4]   2> 27848 INFO  (coreLoadExecutor-32-thread-1-processing-n:127.0.0.1:59594_oo) [n:127.0.0.1:59594_oo c:control_collection   x:collection1] o.a.s.c.ZkController Collection zkNode exists
   [junit4]   2> 27848 INFO  (coreLoadExecutor-32-thread-1-processing-n:127.0.0.1:59594_oo) [n:127.0.0.1:59594_oo c:control_collection   x:collection1] o.a.s.c.c.ZkStateReader Load collection config from: [/collections/control_collection]
   [junit4]   2> 27850 INFO  (coreLoadExecutor-32-thread-1-processing-n:127.0.0.1:59594_oo) [n:127.0.0.1:59594_oo c:control_collection   x:collection1] o.a.s.c.c.ZkStateReader path=[/collections/control_collection] [configName]=[conf1] specified config exists in ZooKeeper
   [junit4]   2> 27851 INFO  (coreLoadExecutor-32-thread-1-processing-n:127.0.0.1:59594_oo) [n:127.0.0.1:59594_oo c:control_collection   x:collection1] o.a.s.c.SolrResourceLoader new SolrResourceLoader for directory: '/Users/jenkins/workspace/Lucene-Solr-5.x-MacOSX@2/solr/build/solr-solrj/test/J0/temp/solr.client.solrj.impl.CloudSolrClientTest_AC35F37DB26D83AB-001/control-001/cores/collection1'
   [junit4]   2> 27851 INFO  (coreLoadExecutor-32-thread-1-processing-n:127.0.0.1:59594_oo) [n:127.0.0.1:59594_oo c:control_collection   x:collection1] o.a.s.c.SolrResourceLoader JNDI not configured for solr (NoInitialContextEx)
   [junit4]   2> 27851 INFO  (coreLoadExecutor-32-thread-1-processing-n:127.0.0.1:59594_oo) [n:127.0.0.1:59594_oo c:control_collection   x:collection1] o.a.s.c.SolrResourceLoader solr home defaulted to 'solr/' (could not find system property or JNDI)
   [junit4]   2> 27858 INFO  (coreLoadExecutor-32-thread-1-processing-n:127.0.0.1:59594_oo) [n:127.0.0.1:59594_oo c:control_collection   x:collection1] o.a.s.c.Config loaded config solrconfig.xml with version 0 
   [junit4]   2> 27871 INFO  (coreLoadExecutor-32-thread-1-processing-n:127.0.0.1:59594_oo) [n:127.0.0.1:59594_oo c:control_collection   x:collection1] o.a.s.c.SolrConfig current version of requestparams : -1
   [junit4]   2> 27884 WARN  (coreLoadExecutor-32-thread-1-processing-n:127.0.0.1:59594_oo) [n:127.0.0.1:59594_oo c:control_collection   x:collection1] o.a.s.c.Config Beginning with Solr 5.5, <maxMergeDocs> is deprecated, configure it on the relevant <mergePolicyFactory> instead.
   [junit4]   2> 27884 WARN  (coreLoadExecutor-32-thread-1-processing-n:127.0.0.1:59594_oo) [n:127.0.0.1:59594_oo c:control_collection   x:collection1] o.a.s.c.Config Beginning with Solr 5.5, <mergeFactor> is deprecated, configure it on the relevant <mergePolicyFactory> instead.
   [junit4]   2> 27887 INFO  (coreLoadExecutor-32-thread-1-processing-n:127.0.0.1:59594_oo) [n:127.0.0.1:59594_oo c:control_collection   x:collection1] o.a.s.c.SolrConfig Using Lucene MatchVersion: 5.6.0
   [junit4]   2> 27919 INFO  (coreLoadExecutor-32-thread-1-processing-n:127.0.0.1:59594_oo) [n:127.0.0.1:59594_oo c:control_collection   x:collection1] o.a.s.c.SolrConfig Loaded SolrConfig: solrconfig.xml
   [junit4]   2> 27961 INFO  (coreLoadExecutor-32-thread-1-processing-n:127.0.0.1:59594_oo) [n:127.0.0.1:59594_oo c:control_collection   x:collection1] o.a.s.s.IndexSchema [collection1] Schema name=test
   [junit4]   2> 28346 INFO  (coreLoadExecutor-32-thread-1-processing-n:127.0.0.1:59594_oo) [n:127.0.0.1:59594_oo c:control_collection   x:collection1] o.a.s.s.IndexSchema default search field in schema is text
   [junit4]   2> 28347 INFO  (coreLoadExecutor-32-thread-1-processing-n:127.0.0.1:59594_oo) [n:127.0.0.1:59594_oo c:control_collection   x:collection1] o.a.s.s.IndexSchema unique key field: id
   [junit4]   2> 28349 WARN  (coreLoadExecutor-32-thread-1-processing-n:127.0.0.1:59594_oo) [n:127.0.0.1:59594_oo c:control_collection   x:collection1] o.a.s.s.IndexSchema Field text is not multivalued and destination for multiple copyFields (3)
   [junit4]   2> 28349 WARN  (coreLoadExecutor-32-thread-1-processing-n:127.0.0.1:59594_oo) [n:127.0.0.1:59594_oo c:control_collection   x:collection1] o.a.s.s.IndexSchema Field lowerfilt1and2 is not multivalued and destination for multiple copyFields (2)
   [junit4]   2> 28358 INFO  (coreLoadExecutor-32-thread-1-processing-n:127.0.0.1:59594_oo) [n:127.0.0.1:59594_oo c:control_collection   x:collection1] o.a.s.c.ConfigSetProperties Did not find ConfigSet properties, assuming default properties: Can't find resource 'configsetprops.json' in classpath or '/configs/conf1', cwd=/Users/jenkins/workspace/Lucene-Solr-5.x-MacOSX@2/solr/build/solr-solrj/test/J0
   [junit4]   2> 28359 INFO  (coreLoadExecutor-32-thread-1-processing-n:127.0.0.1:59594_oo) [n:127.0.0.1:59594_oo c:control_collection   x:collection1] o.a.s.c.CoreContainer Creating SolrCore 'collection1' using configuration from collection control_collection
   [junit4]   2> 28359 INFO  (coreLoadExecutor-32-thread-1-processing-n:127.0.0.1:59594_oo) [n:127.0.0.1:59594_oo c:control_collection s:shard1 r:core_node1 x:collection1] o.a.s.c.SolrCore org.apache.solr.core.MockDirectoryFactory
   [junit4]   2> 28359 INFO  (coreLoadExecutor-32-thread-1-processing-n:127.0.0.1:59594_oo) [n:127.0.0.1:59594_oo c:control_collection s:shard1 r:core_node1 x:collection1] o.a.s.c.SolrCore [[collection1] ] Opening new SolrCore at [/Users/jenkins/workspace/Lucene-Solr-5.x-MacOSX@2/solr/build/solr-solrj/test/J0/temp/solr.client.solrj.impl.CloudSolrClientTest_AC35F37DB26D83AB-001/control-001/cores/collection1], dataDir=[/Users/jenkins/workspace/Lucene-Solr-5.x-MacOSX@2/solr/build/solr-solrj/test/J0/temp/solr.client.solrj.impl.CloudSolrClientTest_AC35F37DB26D83AB-001/control-001/cores/collection1/data/]
   [junit4]   2> 28359 INFO  (coreLoadExecutor-32-thread-1-processing-n:127.0.0.1:59594_oo) [n:127.0.0.1:59594_oo c:control_collection s:shard1 r:core_node1 x:collection1] o.a.s.c.SolrCore JMX monitoring not detected for core: collection1
   [junit4]   2> 28360 INFO  (coreLoadExecutor-32-thread-1-processing-n:127.0.0.1:59594_oo) [n:127.0.0.1:59594_oo c:control_collection s:shard1 r:core_node1 x:collection1] o.a.s.c.CachingDirectoryFactory return new directory for /Users/jenkins/workspace/Lucene-Solr-5.x-MacOSX@2/solr/build/solr-solrj/test/J0/temp/solr.client.solrj.impl.CloudSolrClientTest_AC35F37DB26D83AB-001/control-001/cores/collection1/data
   [junit4]   2> 28360 INFO  (coreLoadExecutor-32-thread-1-processing-n:127.0.0.1:59594_oo) [n:127.0.0.1:59594_oo c:control_collection s:shard1 r:core_node1 x:collection1] o.a.s.c.SolrCore New index directory detected: old=null new=/Users/jenkins/workspace/Lucene-Solr-5.x-MacOSX@2/solr/build/solr-solrj/test/J0/temp/solr.client.solrj.impl.CloudSolrClientTest_AC35F37DB26D83AB-001/control-001/cores/collection1/data/index/
   [junit4]   2> 28361 WARN  (coreLoadExecutor-32-thread-1-processing-n:127.0.0.1:59594_oo) [n:127.0.0.1:59594_oo c:control_collection s:shard1 r:core_node1 x:collection1] o.a.s.c.SolrCore [collection1] Solr index directory '/Users/jenkins/workspace/Lucene-Solr-5.x-MacOSX@2/solr/build/solr-solrj/test/J0/temp/solr.client.solrj.impl.CloudSolrClientTest_AC35F37DB26D83AB-001/control-001/cores/collection1/data/index' doesn't exist. Creating new index...
   [junit4]   2> 28361 INFO  (coreLoadExecutor-32-thread-1-processing-n:127.0.0.1:59594_oo) [n:127.0.0.1:59594_oo c:control_collection s:shard1 r:core_node1 x:collection1] o.a.s.c.CachingDirectoryFactory return new directory for /Users/jenkins/workspace/Lucene-Solr-5.x-MacOSX@2/solr/build/solr-solrj/test/J0/temp/solr.client.solrj.impl.CloudSolrClientTest_AC35F37DB26D83AB-001/control-001/cores/collection1/data/index
   [junit4]   2> 28362 INFO  (coreLoadExecutor-32-thread-1-processing-n:127.0.0.1:59594_oo) [n:127.0.0.1:59594_oo c:control_collection s:shard1 r:core_node1 x:collection1] o.a.s.c.SolrDeletionPolicy SolrDeletionPolicy.onCommit: commits: num=1
   [junit4]   2> 	commit{dir=MockDirectoryWrapper(RAMDirectory@77e4fb43 lockFactory=org.apache.lucene.store.SingleInstanceLockFactory@5a2c2933),segFN=segments_1,generation=1}
   [junit4]   2> 28362 INFO  (coreLoadExecutor-32-thread-1-processing-n:127.0.0.1:59594_oo) [n:127.0.0.1:59594_oo c:control_collection s:shard1 r:core_node1 x:collection1] o.a.s.c.SolrDeletionPolicy newest commit generation = 1
   [junit4]   2> 28362 INFO  (OldIndexDirectoryCleanupThreadForCore-collection1) [n:127.0.0.1:59594_oo c:control_collection s:shard1 r:core_node1 x:collection1] o.a.s.c.SolrCore Looking for old index directories to cleanup for core collection1 in /Users/jenkins/workspace/Lucene-Solr-5.x-MacOSX@2/solr/build/solr-solrj/test/J0/temp/solr.client.solrj.impl.CloudSolrClientTest_AC35F37DB26D83AB-001/control-001/cores/collection1/data/
   [junit4]   2> 28363 WARN  (OldIndexDirectoryCleanupThreadForCore-collection1) [n:127.0.0.1:59594_oo c:control_collection s:shard1 r:core_node1 x:collection1] o.a.s.c.DirectoryFactory /Users/jenkins/workspace/Lucene-Solr-5.x-MacOSX@2/solr/build/solr-solrj/test/J0/temp/solr.client.solrj.impl.CloudSolrClientTest_AC35F37DB26D83AB-001/control-001/cores/collection1/data/ does not point to a valid data directory; skipping clean-up of old index directories.
   [junit4]   2> 28364 INFO  (coreLoadExecutor-32-thread-1-processing-n:127.0.0.1:59594_oo) [n:127.0.0.1:59594_oo c:control_collection s:shard1 r:core_node1 x:collection1] o.a.s.c.SolrCore no updateRequestProcessorChain defined as default, creating implicit default
   [junit4]   2> 28370 INFO  (coreLoadExecutor-32-thread-1-processing-n:127.0.0.1:59594_oo) [n:127.0.0.1:59594_oo c:control_collection s:shard1 r:core_node1 x:collection1] o.a.s.h.l.XMLLoader xsltCacheLifetimeSeconds=60
   [junit4]   2> 28372 INFO  (coreLoadExecutor-32-thread-1-processing-n:127.0.0.1:59594_oo) [n:127.0.0.1:59594_oo c:control_collection s:shard1 r:core_node1 x:collection1] o.a.s.h.l.XMLLoader xsltCacheLifetimeSeconds=60
   [junit4]   2> 28373 INFO  (coreLoadExecutor-32-thread-1-processing-n:127.0.0.1:59594_oo) [n:127.0.0.1:59594_oo c:control_collection s:shard1 r:core_node1 x:collection1] o.a.s.h.l.XMLLoader xsltCacheLifetimeSeconds=60
   [junit4]   2> 28373 INFO  (coreLoadExecutor-32-thread-1-processing-n:127.0.0.1:59594_oo) [n:127.0.0.1:59594_oo c:control_collection s:shard1 r:core_node1 x:collection1] o.a.s.h.l.XMLLoader xsltCacheLifetimeSeconds=60
   [junit4]   2> 28394 INFO  (coreLoadExecutor-32-thread-1-processing-n:127.0.0.1:59594_oo) [n:127.0.0.1:59594_oo c:control_collection s:shard1 r:core_node1 x:collection1] o.a.s.c.RequestHandlers Registered paths: /update,/admin/plugins,/update/json,/admin/system,/replication,/admin/logging,/admin/mbeans,/admin/luke,/update/json/docs,/admin/ping,/schema,/admin/threads,,/admin/segments,/admin/properties,/admin/file,/get,/update/csv,/config,standard
   [junit4]   2> 28397 INFO  (coreLoadExecutor-32-thread-1-processing-n:127.0.0.1:59594_oo) [n:127.0.0.1:59594_oo c:control_collection s:shard1 r:core_node1 x:collection1] o.a.s.c.SolrCore Using default statsCache cache: org.apache.solr.search.stats.LocalStatsCache
   [junit4]   2> 28398 INFO  (coreLoadExecutor-32-thread-1-processing-n:127.0.0.1:59594_oo) [n:127.0.0.1:59594_oo c:control_collection s:shard1 r:core_node1 x:collection1] o.a.s.u.UpdateHandler Using UpdateLog implementation: org.apache.solr.update.UpdateLog
   [junit4]   2> 28398 INFO  (coreLoadExecutor-32-thread-1-processing-n:127.0.0.1:59594_oo) [n:127.0.0.1:59594_oo c:control_collection s:shard1 r:core_node1 x:collection1] o.a.s.u.UpdateLog Initializing UpdateLog: dataDir= defaultSyncLevel=FLUSH numRecordsToKeep=100 maxNumLogsToKeep=10 numVersionBuckets=65536
   [junit4]   2> 28402 INFO  (coreLoadExecutor-32-thread-1-processing-n:127.0.0.1:59594_oo) [n:127.0.0.1:59594_oo c:control_collection s:shard1 r:core_node1 x:collection1] o.a.s.u.CommitTracker Hard AutoCommit: disabled
   [junit4]   2> 28403 INFO  (coreLoadExecutor-32-thread-1-processing-n:127.0.0.1:59594_oo) [n:127.0.0.1:59594_oo c:control_collection s:shard1 r:core_node1 x:collection1] o.a.s.u.CommitTracker Soft AutoCommit: disabled
   [junit4]   2> 28403 INFO  (coreLoadExecutor-32-thread-1-processing-n:127.0.0.1:59594_oo) [n:127.0.0.1:59594_oo c:control_collection s:shard1 r:core_node1 x:collection1] o.a.s.c.SolrDeletionPolicy SolrDeletionPolicy.onInit: commits: num=1
   [junit4]   2> 	commit{dir=MockDirectoryWrapper(RAMDirectory@77e4fb43 lockFactory=org.apache.lucene.store.SingleInstanceLockFactory@5a2c2933),segFN=segments_1,generation=1}
   [junit4]   2> 28403 INFO  (coreLoadExecutor-32-thread-1-processing-n:127.0.0.1:59594_oo) [n:127.0.0.1:59594_oo c:control_collection s:shard1 r:core_node1 x:collection1] o.a.s.c.SolrDeletionPolicy newest commit generation = 1
   [junit4]   2> 28404 INFO  (coreLoadExecutor-32-thread-1-processing-n:127.0.0.1:59594_oo) [n:127.0.0.1:59594_oo c:control_collection s:shard1 r:core_node1 x:collection1] o.a.s.s.SolrIndexSearcher Opening Searcher@29b4d632[collection1] main
   [junit4]   2> 28404 INFO  (coreLoadExecutor-32-thread-1-processing-n:127.0.0.1:59594_oo) [n:127.0.0.1:59594_oo c:control_collection s:shard1 r:core_node1 x:collection1] o.a.s.c.c.ZkStateReader Load collection config from: [/collections/control_collection]
   [junit4]   2> 28406 INFO  (coreLoadExecutor-32-thread-1-processing-n:127.0.0.1:59594_oo) [n:127.0.0.1:59594_oo c:control_collection s:shard1 r:core_node1 x:collection1] o.a.s.c.c.ZkStateReader path=[/collections/control_collection] [configName]=[conf1] specified config exists in ZooKeeper
   [junit4]   2> 28407 INFO  (coreLoadExecutor-32-thread-1-processing-n:127.0.0.1:59594_oo) [n:127.0.0.1:59594_oo c:control_collection s:shard1 r:core_node1 x:collection1] o.a.s.r.ManagedResourceStorage Setting up ZooKeeper-based storage for the RestManager with znodeBase: /configs/conf1
   [junit4]   2> 28413 INFO  (coreLoadExecutor-32-thread-1-processing-n:127.0.0.1:59594_oo) [n:127.0.0.1:59594_oo c:control_collection s:shard1 r:core_node1 x:collection1] o.a.s.r.ManagedResourceStorage Configured ZooKeeperStorageIO with znodeBase: /configs/conf1
   [junit4]   2> 28413 INFO  (coreLoadExecutor-32-thread-1-processing-n:127.0.0.1:59594_oo) [n:127.0.0.1:59594_oo c:control_collection s:shard1 r:core_node1 x:collection1] o.a.s.r.RestManager Initializing RestManager with initArgs: {}
   [junit4]   2> 28413 INFO  (coreLoadExecutor-32-thread-1-processing-n:127.0.0.1:59594_oo) [n:127.0.0.1:59594_oo c:control_collection s:shard1 r:core_node1 x:collection1] o.a.s.r.ManagedResourceStorage Reading _rest_managed.json using ZooKeeperStorageIO:path=/configs/conf1
   [junit4]   2> 28414 INFO  (coreLoadExecutor-32-thread-1-processing-n:127.0.0.1:59594_oo) [n:127.0.0.1:59594_oo c:control_collection s:shard1 r:core_node1 x:collection1] o.a.s.r.ManagedResourceStorage No data found for znode /configs/conf1/_rest_managed.json
   [junit4]   2> 28414 INFO  (coreLoadExecutor-32-thread-1-processing-n:127.0.0.1:59594_oo) [n:127.0.0.1:59594_oo c:control_collection s:shard1 r:core_node1 x:collection1] o.a.s.r.ManagedResourceStorage Loaded null at path _rest_managed.json using ZooKeeperStorageIO:path=/configs/conf1
   [junit4]   2> 28414 INFO  (coreLoadExecutor-32-thread-1-processing-n:127.0.0.1:59594_oo) [n:127.0.0.1:59594_oo c:control_collection s:shard1 r:core_node1 x:collection1] o.a.s.r.RestManager Initializing 0 registered ManagedResources
   [junit4]   2> 28415 INFO  (coreLoadExecutor-32-thread-1-processing-n:127.0.0.1:59594_oo) [n:127.0.0.1:59594_oo c:control_collection s:shard1 r:core_node1 x:collection1] o.a.s.h.ReplicationHandler Commits will be reserved for  10000
   [junit4]   2> 28415 INFO  (coreLoadExecutor-32-thread-1-processing-n:127.0.0.1:59594_oo) [n:127.0.0.1:59594_oo c:control_collection s:shard1 r:core_node1 x:collection1] o.a.s.u.UpdateLog Looking up max value of version field to seed version buckets
   [junit4]   2> 28415 INFO  (coreLoadExecutor-32-thread-1-processing-n:127.0.0.1:59594_oo) [n:127.0.0.1:59594_oo c:control_collection s:shard1 r:core_node1 x:collection1] o.a.s.u.VersionInfo Refreshing highest value of _version_ for 65536 version buckets from index
   [junit4]   2> 28415 INFO  (coreLoadExecutor-32-thread-1-processing-n:127.0.0.1:59594_oo) [n:127.0.0.1:59594_oo c:control_collection s:shard1 r:core_node1 x:collection1] o.a.s.u.VersionInfo No terms found for _version_, cannot seed version bucket highest value from index
   [junit4]   2> 28415 INFO  (searcherExecutor-33-thread-1-processing-n:127.0.0.1:59594_oo c:control_collection x:collection1 s:shard1 r:core_node1) [n:127.0.0.1:59594_oo c:control_collection s:shard1 r:core_node1 x:collection1] o.a.s.c.SolrCore [collection1] Registered new searcher Searcher@29b4d632[collection1] main{ExitableDirectoryReader(UninvertingDirectoryReader())}
   [junit4]   2> 28415 INFO  (coreLoadExecutor-32-thread-1-processing-n:127.0.0.1:59594_oo) [n:127.0.0.1:59594_oo c:control_collection s:shard1 r:core_node1 x:collection1] o.a.s.u.UpdateLog Could not find max version in index or recent updates, using new clock 1526254945850884096
   [junit4]   2> 28417 INFO  (coreLoadExecutor-32-thread-1-processing-n:127.0.0.1:59594_oo) [n:127.0.0.1:59594_oo c:control_collection s:shard1 r:core_node1 x:collection1] o.a.s.u.UpdateLog Took 1.0ms to seed version buckets with highest version 1526254945850884096
   [junit4]   2> 28421 INFO  (coreLoadExecutor-32-thread-1-processing-n:127.0.0.1:59594_oo) [n:127.0.0.1:59594_oo c:control_collection s:shard1 r:core_node1 x:collection1] o.a.s.c.ZkController watch zkdir /configs/conf1
   [junit4]   2> 28424 INFO  (coreLoadExecutor-32-thread-1-processing-n:127.0.0.1:59594_oo) [n:127.0.0.1:59594_oo c:control_collection s:shard1 r:core_node1 x:collection1] o.a.s.c.CoreContainer registering core: collection1
   [junit4]   2> 28425 INFO  (coreZkRegister-26-thread-1-processing-n:127.0.0.1:59594_oo c:control_collection x:collection1 s:shard1 r:core_node1) [n:127.0.0.1:59594_oo c:control_collection s:shard1 r:core_node1 x:collection1] o.a.s.c.ZkController Register replica - core:collection1 address:http://127.0.0.1:59594/oo collection:control_collection shard:shard1
   [junit4]   2> 28440 INFO  (coreZkRegister-26-thread-1-processing-n:127.0.0.1:59594_oo c:control_collection x:collection1 s:shard1 r:core_node1) [n:127.0.0.1:59594_oo c:control_collection s:shard1 r:core_node1 x:collection1] o.a.s.c.c.SolrZkClient makePath: /collections/control_collection/leader_elect/shard1/election
   [junit4]   2> 28451 INFO  (coreZkRegister-26-thread-1-processing-n:127.0.0.1:59594_oo c:control_collection x:collection1 s:shard1 r:core_node1) [n:127.0.0.1:59594_oo c:control_collection s:shard1 r:core_node1 x:collection1] o.a.s.c.LeaderElector Joined leadership election with path: /collections/control_collection/leader_elect/shard1/election/95390933919268868-core_node1-n_0000000000
   [junit4]   2> 28452 INFO  (coreZkRegister-26-thread-1-processing-n:127.0.0.1:59594_oo c:control_collection x:collection1 s:shard1 r:core_node1) [n:127.0.0.1:59594_oo c:control_collection s:shard1 r:core_node1 x:collection1] o.a.s.c.ShardLeaderElectionContext Running the leader process for shard=shard1 and weAreReplacement=false and leaderVoteWait=0
   [junit4]   2> 28458 INFO  (coreZkRegister-26-thread-1-processing-n:127.0.0.1:59594_oo c:control_collection x:collection1 s:shard1 r:core_node1) [n:127.0.0.1:59594_oo c:control_collection s:shard1 r:core_node1 x:collection1] o.a.s.c.ShardLeaderElectionContext Enough replicas found to continue.
   [junit4]   2> 28458 INFO  (coreZkRegister-26-thread-1-processing-n:127.0.0.1:59594_oo c:control_collection x:collection1 s:shard1 r:core_node1) [n:127.0.0.1:59594_oo c:control_collection s:shard1 r:core_node1 x:collection1] o.a.s.c.ShardLeaderElectionContext I may be the new leader - try and sync
   [junit4]   2> 28459 INFO  (OverseerStateUpdate-95390933919268868-127.0.0.1:59594_oo-n_0000000000) [n:127.0.0.1:59594_oo    ] o.a.s.c.Overseer processMessage: queueSize: 1, message = {
   [junit4]   2>   "operation":"leader",
   [junit4]   2>   "shard":"shard1",
   [junit4]   2>   "collection":"control_collection"} current state version: 1
   [junit4]   2> 28460 INFO  (coreZkRegister-26-thread-1-processing-n:127.0.0.1:59594_oo c:control_collection x:collection1 s:shard1 r:core_node1) [n:127.0.0.1:59594_oo c:control_collection s:shard1 r:core_node1 x:collection1] o.a.s.c.SyncStrategy Sync replicas to http://127.0.0.1:59594/oo/collection1/
   [junit4]   2> 28460 INFO  (coreZkRegister-26-thread-1-processing-n:127.0.0.1:59594_oo c:control_collection x:collection1 s:shard1 r:core_node1) [n:127.0.0.1:59594_oo c:control_collection s:shard1 r:core_node1 x:collection1] o.a.s.c.SyncStrategy Sync Success - now sync replicas to me
   [junit4]   2> 28461 INFO  (coreZkRegister-26-thread-1-processing-n:127.0.0.1:59594_oo c:control_collection x:collection1 s:shard1 r:core_node1) [n:127.0.0.1:59594_oo c:control_collection s:shard1 r:core_node1 x:collection1] o.a.s.c.SyncStrategy http://127.0.0.1:59594/oo/collection1/ has no replicas
   [junit4]   2> 28469 INFO  (coreZkRegister-26-thread-1-processing-n:127.0.0.1:59594_oo c:control_collection x:collection1 s:shard1 r:core_node1) [n:127.0.0.1:59594_oo c:control_collection s:shard1 r:core_node1 x:collection1] o.a.s.c.c.SolrZkClient makePath: /collections/control_collection/leaders/shard1
   [junit4]   2> 28480 INFO  (coreZkRegister-26-thread-1-processing-n:127.0.0.1:59594_oo c:control_collection x:collection1 s:shard1 r:core_node1) [n:127.0.0.1:59594_oo c:control_collection s:shard1 r:core_node1 x:collection1] o.a.s.c.ShardLeaderElectionContextBase Creating leader registration node
   [junit4]   2> 28503 INFO  (coreZkRegister-26-thread-1-processing-n:127.0.0.1:59594_oo c:control_collection x:collection1 s:shard1 r:core_node1) [n:127.0.0.1:59594_oo c:control_collection s:shard1 r:core_node1 x:collection1] o.a.s.c.ShardLeaderElectionContext I am the new leader: http://127.0.0.1:59594/oo/collection1/ shard1
   [junit4]   2> 28505 INFO  (OverseerStateUpdate-95390933919268868-127.0.0.1:59594_oo-n_0000000000) [n:127.0.0.1:59594_oo    ] o.a.s.c.Overseer processMessage: queueSize: 1, message = {
   [junit4]   2>   "operation":"leader",
   [junit4]   2>   "shard":"shard1",
   [junit4]   2>   "collection":"control_collection",
   [junit4]   2>   "base_url":"http://127.0.0.1:59594/oo",
   [junit4]   2>   "core":"collection1",
   [junit4]   2>   "state":"active"} current state version: 1
   [junit4]   2> 28508 INFO  (zkCallback-11-thread-1-processing-n:127.0.0.1:59594_oo) [n:127.0.0.1:59594_oo    ] o.a.s.c.c.ZkStateReader A cluster state change: [WatchedEvent state:SyncConnected type:NodeDataChanged path:/clusterstate.json], has occurred - updating... (live nodes size: [1])
   [junit4]   2> 28563 INFO  (coreZkRegister-26-thread-1-processing-n:127.0.0.1:59594_oo c:control_collection x:collection1 s:shard1 r:core_node1) [n:127.0.0.1:59594_oo c:control_collection s:shard1 r:core_node1 x:collection1] o.a.s.c.ZkController We are http://127.0.0.1:59594/oo/collection1/ and leader is http://127.0.0.1:59594/oo/collection1/
   [junit4]   2> 28563 INFO  (coreZkRegister-26-thread-1-processing-n:127.0.0.1:59594_oo c:control_collection x:collection1 s:shard1 r:core_node1) [n:127.0.0.1:59594_oo c:control_collection s:shard1 r:core_node1 x:collection1] o.a.s.c.ZkController No LogReplay needed for core=collection1 baseURL=http://127.0.0.1:59594/oo
   [junit4]   2> 28563 INFO  (coreZkRegister-26-thread-1-processing-n:127.0.0.1:59594_oo c:control_collection x:collection1 s:shard1 r:core_node1) [n:127.0.0.1:59594_oo c:control_collection s:shard1 r:core_node1 x:collection1] o.a.s.c.ZkController I am the leader, no recovery necessary
   [junit4]   2> 28563 INFO  (coreZkRegister-26-thread-1-processing-n:127.0.0.1:59594_oo c:control_collection x:collection1 s:shard1 r:core_node1) [n:127.0.0.1:59594_oo c:control_collection s:shard1 r:core_node1 x:collection1] o.a.s.c.ZkController publishing state=active
   [junit4]   2> 28563 INFO  (coreZkRegister-26-thread-1-processing-n:127.0.0.1:59594_oo c:control_collection x:collection1 s:shard1 r:core_node1) [n:127.0.0.1:59594_oo c:control_collection s:shard1 r:core_node1 x:collection1] o.a.s.c.ZkController numShards not found on descriptor - reading it from system property
   [junit4]   2> 28589 INFO  (OverseerStateUpdate-95390933919268868-127.0.0.1:59594_oo-n_0000000000) [n:127.0.0.1:59594_oo    ] o.a.s.c.Overseer processMessage: queueSize: 1, message = {
   [junit4]   2>   "core_node_name":"core_node1",
   [junit4]   2>   "node_name":"127.0.0.1:59594_oo",
   [junit4]   2>   "collection":"control_collection",
   [junit4]   2>   "roles":null,
   [junit4]   2>   "core":"collection1",
   [junit4]   2>   "numShards":"1",
   [junit4]   2>   "state":"active",
   [junit4]   2>   "base_url":"http://127.0.0.1:59594/oo",
   [junit4]   2>   "shard":"shard1",
   [junit4]   2>   "operation":"state"} current state version: 2
   [junit4]   2> 28603 INFO  (OverseerStateUpdate-95390933919268868-127.0.0.1:59594_oo-n_0000000000) [n:127.0.0.1:59594_oo    ] o.a.s.c.o.ReplicaMutator Update state numShards=1 message={
   [junit4]   2>   "core_node_name":"core_node1",
   [junit4]   2>   "node_name":"127.0.0.1:59594_oo",
   [junit4]   2>   "collection":"control_collection",
   [junit4]   2>   "roles":null,
   [junit4]   2>   "core":"collection1",
   [junit4]   2>   "numShards":"1",
   [junit4]   2>   "state":"active",
   [junit4]   2>   "base_url":"http://127.0.0.1:59594/oo",
   [junit4]   2>   "shard":"shard1",
   [junit4]   2>   "operation":"state"}
   [junit4]   2> 28734 INFO  (zkCallback-11-thread-1-processing-n:127.0.0.1:59594_oo) [n:127.0.0.1:59594_oo    ] o.a.s.c.c.ZkStateReader A cluster state change: [WatchedEvent state:SyncConnected type:NodeDataChanged path:/clusterstate.json], has occurred - updating... (live nodes size: [1])
   [junit4]   2> 28859 INFO  (TEST-CloudSolrClientTest.test-seed#[AC35F37DB26D83AB]) [    ] o.a.s.c.c.SolrZkClient Using default ZkCredentialsProvider
   [junit4]   2> 28860 INFO  (TEST-CloudSolrClientTest.test-seed#[AC35F37DB26D83AB]) [    ] o.a.s.c.c.ConnectionManager Waiting for client to connect to ZooKeeper
   [junit4]   2> 28862 INFO  (zkCallback-13-thread-1) [    ] o.a.s.c.c.ConnectionManager Watcher org.apache.solr.common.cloud.ConnectionManager@37220156 name:ZooKeeperConnection Watcher:127.0.0.1:59588/solr got event WatchedEvent state:SyncConnected type:None path:null path:null type:None
   [junit4]   2> 28862 INFO  (TEST-CloudSolrClientTest.test-seed#[AC35F37DB26D83AB]) [    ] o.a.s.c.c.ConnectionManager Client is connected to ZooKeeper
   [junit4]   2> 28863 INFO  (TEST-CloudSolrClientTest.test-seed#[AC35F37DB26D83AB]) [    ] o.a.s.c.c.SolrZkClient Using default ZkACLProvider
   [junit4]   2> 28863 INFO  (TEST-CloudSolrClientTest.test-seed#[AC35F37DB26D83AB]) [    ] o.a.s.c.c.ZkStateReader Updating cluster state from ZooKeeper... 
   [junit4]   2> 28874 INFO  (TEST-CloudSolrClientTest.test-seed#[AC35F37DB26D83AB]) [    ] o.a.s.c.ChaosMonkey monkey: init - expire sessions:false cause connection loss:false
   [junit4]   2> 28907 INFO  (TEST-CloudSolrClientTest.test-seed#[AC35F37DB26D83AB]) [    ] o.a.s.SolrTestCaseJ4 Writing core.properties file to /Users/jenkins/workspace/Lucene-Solr-5.x-MacOSX@2/solr/build/solr-solrj/test/J0/temp/solr.client.solrj.impl.CloudSolrClientTest_AC35F37DB26D83AB-001/shard-1-001/cores/collection1
   [junit4]   2> 28909 INFO  (TEST-CloudSolrClientTest.test-seed#[AC35F37DB26D83AB]) [    ] o.a.s.c.AbstractFullDistribZkTestBase create jetty 1 in directory /Users/jenkins/workspace/Lucene-Solr-5.x-MacOSX@2/solr/build/solr-solrj/test/J0/temp/solr.client.solrj.impl.CloudSolrClientTest_AC35F37DB26D83AB-001/shard-1-001
   [junit4]   2> 28910 INFO  (TEST-CloudSolrClientTest.test-seed#[AC35F37DB26D83AB]) [    ] o.e.j.s.Server jetty-9.2.13.v20150730
   [junit4]   2> 28913 INFO  (TEST-CloudSolrClientTest.test-seed#[AC35F37DB26D83AB]) [    ] o.e.j.s.h.ContextHandler Started o.e.j.s.ServletContextHandler@41c8252c{/oo,null,AVAILABLE}
   [junit4]   2> 28913 INFO  (TEST-CloudSolrClientTest.test-seed#[AC35F37DB26D83AB]) [    ] o.e.j.s.ServerConnector Started ServerConnector@3b008d71{HTTP/1.1}{127.0.0.1:59608}
   [junit4]   2> 28914 INFO  (TEST-CloudSolrClientTest.test-seed#[AC35F37DB26D83AB]) [    ] o.e.j.s.Server Started @35181ms
   [junit4]   2> 28914 INFO  (TEST-CloudSolrClientTest.test-seed#[AC35F37DB26D83AB]) [    ] o.a.s.c.s.e.JettySolrRunner Jetty properties: {hostPort=59608, solrconfig=solrconfig.xml, coreRootDirectory=/Users/jenkins/workspace/Lucene-Solr-5.x-MacOSX@2/solr/build/solr-solrj/test/J0/temp/solr.client.solrj.impl.CloudSolrClientTest_AC35F37DB26D83AB-001/shard-1-001/cores, solr.data.dir=/Users/jenkins/workspace/Lucene-Solr-5.x-MacOSX@2/solr/build/solr-solrj/test/J0/temp/solr.client.solrj.impl.CloudSolrClientTest_AC35F37DB26D83AB-001/tempDir-001/jetty1, hostContext=/oo}
   [junit4]   2> 28914 INFO  (TEST-CloudSolrClientTest.test-seed#[AC35F37DB26D83AB]) [    ] o.a.s.s.SolrDispatchFilter SolrDispatchFilter.init(): sun.misc.Launcher$AppClassLoader@420a52f
   [junit4]   2> 28914 INFO  (TEST-CloudSolrClientTest.test-seed#[AC35F37DB26D83AB]) [    ] o.a.s.c.SolrResourceLoader new SolrResourceLoader for directory: '/Users/jenkins/workspace/Lucene-Solr-5.x-MacOSX@2/solr/build/solr-solrj/test/J0/temp/solr.client.solrj.impl.CloudSolrClientTest_AC35F37DB26D83AB-001/shard-1-001'
   [junit4]   2> 28914 INFO  (TEST-CloudSolrClientTest.test-seed#[AC35F37DB26D83AB]) [    ] o.a.s.c.SolrResourceLoader JNDI not configured for solr (NoInitialContextEx)
   [junit4]   2> 28914 INFO  (TEST-CloudSolrClientTest.test-seed#[AC35F37DB26D83AB]) [    ] o.a.s.c.SolrResourceLoader solr home defaulted to 'solr/' (could not find system property or JNDI)
   [junit4]   2> 28915 INFO  (TEST-CloudSolrClientTest.test-seed#[AC35F37DB26D83AB]) [    ] o.a.s.c.c.SolrZkClient Using default ZkCredentialsProvider
   [junit4]   2> 28915 INFO  (TEST-CloudSolrClientTest.test-seed#[AC35F37DB26D83AB]) [    ] o.a.s.c.c.ConnectionManager Waiting for client to connect to ZooKeeper
   [junit4]   2> 28918 INFO  (zkCallback-14-thread-1) [    ] o.a.s.c.c.ConnectionManager Watcher org.apache.solr.common.cloud.ConnectionManager@2992fd9d name:ZooKeeperConnection Watcher:127.0.0.1:59588/solr got event WatchedEvent state:SyncConnected type:None path:null path:null type:None
   [junit4]   2> 28918 INFO  (TEST-CloudSolrClientTest.test-seed#[AC35F37DB26D83AB]) [    ] o.a.s.c.c.ConnectionManager Client is connected to ZooKeeper
   [junit4]   2> 28918 INFO  (TEST-CloudSolrClientTest.test-seed#[AC35F37DB26D83AB]) [    ] o.a.s.c.c.SolrZkClient Using default ZkACLProvider
   [junit4]   2> 28921 INFO  (TEST-CloudSolrClientTest.test-seed#[AC35F37DB26D83AB]) [    ] o.a.s.s.SolrDispatchFilter Loading solr.xml from SolrHome (not found in ZooKeeper)
   [junit4]   2> 28922 INFO  (TEST-CloudSolrClientTest.test-seed#[AC35F37DB26D83AB]) [    ] o.a.s.c.SolrXmlConfig Loading container configuration from /Users/jenkins/workspace/Lucene-Solr-5.x-MacOSX@2/solr/build/solr-solrj/test/J0/temp/solr.client.solrj.impl.CloudSolrClientTest_AC35F37DB26D83AB-001/shard-1-001/solr.xml
   [junit4]   2> 28944 INFO  (TEST-CloudSolrClientTest.test-seed#[AC35F37DB26D83AB]) [    ] o.a.s.c.CorePropertiesLocator Config-defined core root directory: /Users/jenkins/workspace/Lucene-Solr-5.x-MacOSX@2/solr/build/solr-solrj/test/J0/temp/solr.client.solrj.impl.CloudSolrClientTest_AC35F37DB26D83AB-001/shard-1-001/cores
   [junit4]   2> 28944 INFO  (TEST-CloudSolrClientTest.test-seed#[AC35F37DB26D83AB]) [    ] o.a.s.c.CoreContainer New CoreContainer 1610590633
   [junit4]   2> 28944 INFO  (TEST-CloudSolrClientTest.test-seed#[AC35F37DB26D83AB]) [    ] o.a.s.c.CoreContainer Loading cores into CoreContainer [instanceDir=/Users/jenkins/workspace/Lucene-Solr-5.x-MacOSX@2/solr/build/solr-solrj/test/J0/temp/solr.client.solrj.impl.CloudSolrClientTest_AC35F37DB26D83AB-001/shard-1-001]
   [junit4]   2> 28945 WARN  (TEST-CloudSolrClientTest.test-seed#[AC35F37DB26D83AB]) [    ] o.a.s.c.CoreContainer Couldn't add files from /Users/jenkins/workspace/Lucene-Solr-5.x-MacOSX@2/solr/build/solr-solrj/test/J0/temp/solr.client.solrj.impl.CloudSolrClientTest_AC35F37DB26D83AB-001/shard-1-001/lib to classpath: /Users/jenkins/workspace/Lucene-Solr-5.x-MacOSX@2/solr/build/solr-solrj/test/J0/temp/solr.client.solrj.impl.CloudSolrClientTest_AC35F37DB26D83AB-001/shard-1-001/lib
   [junit4]   2> 28945 INFO  (TEST-CloudSolrClientTest.test-seed#[AC35F37DB26D83AB]) [    ] o.a.s.h.c.HttpShardHandlerFactory created with socketTimeout : 90000,urlScheme : ,connTimeout : 15000,maxConnectionsPerHost : 20,maxConnections : 10000,corePoolSize : 0,maximumPoolSize : 2147483647,maxThreadIdleTime : 5,sizeOfQueue : -1,fairnessPolicy : false,useRetries : false,
   [junit4]   2> 28946 INFO  (TEST-CloudSolrClientTest.test-seed#[AC35F37DB26D83AB]) [    ] o.a.s.u.UpdateShardHandler Creating UpdateShardHandler HTTP client with params: socketTimeout=340000&connTimeout=45000&retry=true
   [junit4]   2> 28946 INFO  (TEST-CloudSolrClientTest.test-seed#[AC35F37DB26D83AB]) [    ] o.a.s.l.LogWatcher SLF4J impl is org.slf4j.impl.Log4jLoggerFactory
   [junit4]   2> 28946 INFO  (TEST-CloudSolrClientTest.test-seed#[AC35F37DB26D83AB]) [    ] o.a.s.l.LogWatcher Registering Log Listener [Log4j (org.slf4j.impl.Log4jLoggerFactory)]
   [junit4]   2> 28946 INFO  (TEST-CloudSolrClientTest.test-seed#[AC35F37DB26D83AB]) [    ] o.a.s.c.ZkContainer Zookeeper client=127.0.0.1:59588/solr
   [junit4]   2> 28946 INFO  (TEST-CloudSolrClientTest.test-seed#[AC35F37DB26D83AB]) [    ] o.a.s.c.ZkController zkHost includes chroot
   [junit4]   2> 28946 INFO  (TEST-CloudSolrClientTest.test-seed#[AC35F37DB26D83AB]) [    ] o.a.s.c.c.SolrZkClient Using default ZkCredentialsProvider
   [junit4]   2> 28947 INFO  (TEST-CloudSolrClientTest.test-seed#[AC35F37DB26D83AB]) [    ] o.a.s.c.c.ConnectionManager Waiting for client to connect to ZooKeeper
   [junit4]   2> 28950 INFO  (zkCallback-17-thread-1) [    ] o.a.s.c.c.ConnectionManager Watcher org.apache.solr.common.cloud.ConnectionManager@578a1898 name:ZooKeeperConnection Watcher:127.0.0.1:59588 got event WatchedEvent state:SyncConnected type:None path:null path:null type:None
   [junit4]   2> 28950 INFO  (TEST-CloudSolrClientTest.test-seed#[AC35F37DB26D83AB]) [    ] o.a.s.c.c.ConnectionManager Client is connected to ZooKeeper
   [junit4]   2> 28950 INFO  (TEST-CloudSolrClientTest.test-seed#[AC35F37DB26D83AB]) [    ] o.a.s.c.c.SolrZkClient Using default ZkACLProvider
   [junit4]   2> 28955 INFO  (TEST-CloudSolrClientTest.test-seed#[AC35F37DB26D83AB]) [n:127.0.0.1:59608_oo    ] o.a.s.c.c.ConnectionManager Waiting for client to connect to ZooKeeper
   [junit4]   2> 28957 INFO  (zkCallback-18-thread-1-processing-n:127.0.0.1:59608_oo) [n:127.0.0.1:59608_oo    ] o.a.s.c.c.ConnectionManager Watcher org.apache.solr.common.cloud.ConnectionManager@16b6be78 name:ZooKeeperConnection Watcher:127.0.0.1:59588/solr got event WatchedEvent state:SyncConnected type:None path:null path:null type:None
   [junit4]   2> 28957 INFO  (TEST-CloudSolrClientTest.test-seed#[AC35F37DB26D83AB]) [n:127.0.0.1:59608_oo    ] o.a.s.c.c.ConnectionManager Client is connected to ZooKeeper
   [junit4]   2> 28972 INFO  (TEST-CloudSolrClientTest.test-seed#[AC35F37DB26D83AB]) [n:127.0.0.1:59608_oo    ] o.a.s.c.c.ZkStateReader Updating cluster state from ZooKeeper... 
   [junit4]   2> 30025 INFO  (TEST-CloudSolrClientTest.test-seed#[AC35F37DB26D83AB]) [n:127.0.0.1:59608_oo    ] o.a.s.c.ZkController Register node as live in ZooKeeper:/live_nodes/127.0.0.1:59608_oo
   [junit4]   2> 30027 INFO  (TEST-CloudSolrClientTest.test-seed#[AC35F37DB26D83AB]) [n:127.0.0.1:59608_oo    ] o.a.s.c.c.SolrZkClient makePath: /live_nodes/127.0.0.1:59608_oo
   [junit4]   2> 30030 INFO  (zkCallback-18-thread-1-processing-n:127.0.0.1:59608_oo) [n:127.0.0.1:59608_oo    ] o.a.s.c.c.ZkStateReader A live node change: [WatchedEvent state:SyncConnected type:NodeChildrenChanged path:/live_nodes], has occurred - updating... (live nodes size: [1])
   [junit4]   2> 30030 INFO  (zkCallback-13-thread-1) [    ] o.a.s.c.c.ZkStateReader A live node change: [WatchedEvent state:SyncConnected type:NodeChildrenChanged path:/live_nodes], has occurred - updating... (live nodes size: [1])
   [junit4]   2> 30030 INFO  (zkCallback-11-thread-1-processing-n:127.0.0.1:59594_oo) [n:127.0.0.1:59594_oo    ] o.a.s.c.c.ZkStateReader A live node change: [WatchedEvent state:SyncConnected type:NodeChildrenChanged path:/live_nodes], has occurred - updating... (live nodes size: [1])
   [junit4]   2> 30034 INFO  (TEST-CloudSolrClientTest.test-seed#[AC35F37DB26D83AB]) [n:127.0.0.1:59608_oo    ] o.a.s.c.Overseer Overseer (id=null) closing
   [junit4]   2> 30035 INFO  (TEST-CloudSolrClientTest.test-seed#[AC35F37DB26D83AB]) [n:127.0.0.1:59608_oo    ] o.a.s.c.LeaderElector Joined leadership election with path: /overseer_elect/election/95390933919268872-127.0.0.1:59608_oo-n_0000000001
   [junit4]   2> 30363 INFO  (TEST-CloudSolrClientTest.test-seed#[AC35F37DB26D83AB]) [n:127.0.0.1:59608_oo    ] o.a.s.c.LeaderElector Watching path /overseer_elect/election/95390933919268868-127.0.0.1:59594_oo-n_0000000000 to know if I could be the leader
   [junit4]   2> 30381 INFO  (TEST-CloudSolrClientTest.test-seed#[AC35F37DB26D83AB]) [n:127.0.0.1:59608_oo    ] o.a.s.c.CoreContainer Security conf doesn't exist. Skipping setup for authorization module.
   [junit4]   2> 30381 INFO  (TEST-CloudSolrClientTest.test-seed#[AC35F37DB26D83AB]) [n:127.0.0.1:59608_oo    ] o.a.s.c.CoreContainer No authentication plugin used.
   [junit4]   2> 30382 INFO  (TEST-CloudSolrClientTest.test-seed#[AC35F37DB26D83AB]) [n:127.0.0.1:59608_oo    ] o.a.s.c.CorePropertiesLocator Looking for core definitions underneath /Users/jenkins/workspace/Lucene-Solr-5.x-MacOSX@2/solr/build/solr-solrj/test/J0/temp/solr.client.solrj.impl.CloudSolrClientTest_AC35F37DB26D83AB-001/shard-1-001/cores
   [junit4]   2> 30384 INFO  (TEST-CloudSolrClientTest.test-seed#[AC35F37DB26D83AB]) [n:127.0.0.1:59608_oo    ] o.a.s.c.CoreDescriptor Created CoreDescriptor: {configSetProperties=configsetprops.json, coreNodeName=, name=collection1, config=solrconfig.xml, schema=schema.xml, collection=collection1, dataDir=data/, loadOnStartup=true, shard=, transient=false}
   [junit4]   2> 30384 INFO  (TEST-CloudSolrClientTest.test-seed#[AC35F37DB26D83AB]) [n:127.0.0.1:59608_oo    ] o.a.s.c.CorePropertiesLocator Found core collection1 in /Users/jenkins/workspace/Lucene-Solr-5.x-MacOSX@2/solr/build/solr-solrj/test/J0/temp/solr.client.solrj.impl.CloudSolrClientTest_AC35F37DB26D83AB-001/shard-1-001/cores/collection1
   [junit4]   2> 30384 INFO  (TEST-CloudSolrClientTest.test-seed#[AC35F37DB26D83AB]) [n:127.0.0.1:59608_oo    ] o.a.s.c.CorePropertiesLocator Found 1 core definitions
   [junit4]   2> 30386 INFO  (TEST-CloudSolrClientTest.test-seed#[AC35F37DB26D83AB]) [n:127.0.0.1:59608_oo    ] o.a.s.s.SolrDispatchFilter user.dir=/Users/jenkins/workspace/Lucene-Solr-5.x-MacOSX@2/solr/build/solr-solrj/test/J0
   [junit4]   2> 30386 INFO  (TEST-CloudSolrClientTest.test-seed#[AC35F37DB26D83AB]) [n:127.0.0.1:59608_oo    ] o.a.s.s.SolrDispatchFilter SolrDispatchFilter.init() done
   [junit4]   2> 30387 INFO  (coreLoadExecutor-43-thread-1-processing-n:127.0.0.1:59608_oo) [n:127.0.0.1:59608_oo c:collection1   x:collection1] o.a.s.c.ZkController publishing state=down
   [junit4]   2> 30387 INFO  (coreLoadExecutor-43-thread-1-processing-n:127.0.0.1:59608_oo) [n:127.0.0.1:59608_oo c:collection1   x:collection1] o.a.s.c.ZkController numShards not found on descriptor - reading it from system property
   [junit4]   2> 30393 INFO  (coreLoadExecutor-43-thread-1-processing-n:127.0.0.1:59608_oo) [n:127.0.0.1:59608_oo c:collection1   x:collection1] o.a.s.c.ZkController look for our core node name
   [junit4]   2> 30394 INFO  (OverseerStateUpdate-95390933919268868-127.0.0.1:59594_oo-n_0000000000) [n:127.0.0.1:59594_oo    ] o.a.s.c.Overseer processMessage: queueSize: 1, message = {
   [junit4]   2>   "node_name":"127.0.0.1:59608_oo",
   [junit4]   2>   "collection":"collection1",
   [junit4]   2>   "roles":null,
   [junit4]   2>   "core":"collection1",
   [junit4]   2>   "numShards":"2",
   [junit4]   2>   "state":"down",
   [junit4]   2>   "base_url":"http://127.0.0.1:59608/oo",
   [junit4]   2>   "shard":null,
   [junit4]   2>   "operation":"state"} current state version: 3
   [junit4]   2> 30395 INFO  (OverseerStateUpdate-95390933919268868-127.0.0.1:59594_oo-n_0000000000) [n:127.0.0.1:59594_oo    ] o.a.s.c.o.ReplicaMutator Update state numShards=2 message={
   [junit4]   2>   "node_name":"127.0.0.1:59608_oo",
   [junit4]   2>   "collection":"collection1",
   [junit4]   2>   "roles":null,
   [junit4]   2>   "core":"collection1",
   [junit4]   2>   "numShards":"2",
   [junit4]   2>   "state":"down",
   [junit4]   2>   "base_url":"http://127.0.0.1:59608/oo",
   [junit4]   2>   "shard":null,
   [junit4]   2>   "operation":"state"}
   [junit4]   2> 30395 INFO  (OverseerStateUpdate-95390933919268868-127.0.0.1:59594_oo-n_0000000000) [n:127.0.0.1:59594_oo    ] o.a.s.c.o.ClusterStateMutator building a new cName: collection1
   [junit4]   2> 30395 INFO  (OverseerStateUpdate-95390933919268868-127.0.0.1:59594_oo-n_0000000000) [n:127.0.0.1:59594_oo    ] o.a.s.c.o.ReplicaMutator Assigning new node to shard shard=shard1
   [junit4]   2> 30399 INFO  (zkCallback-11-thread-1-processing-n:127.0.0.1:59594_oo) [n:127.0.0.1:59594_oo    ] o.a.s.c.c.ZkStateReader A cluster state change: [WatchedEvent state:SyncConnected type:NodeDataChanged path:/clusterstate.json], has occurred - updating... (live nodes size: [2])
   [junit4]   2> 30399 INFO  (zkCallback-18-thread-1-processing-n:127.0.0.1:59608_oo) [n:127.0.0.1:59608_oo    ] o.a.s.c.c.ZkStateReader A cluster state change: [WatchedEvent state:SyncConnected type:NodeDataChanged path:/clusterstate.json], has occurred - updating... (live nodes size: [2])
   [junit4]   2> 30399 INFO  (zkCallback-13-thread-1) [    ] o.a.s.c.c.ZkStateReader A cluster state change: [WatchedEvent state:SyncConnected type:NodeDataChanged path:/clusterstate.json], has occurred - updating... (live nodes size: [2])
   [junit4]   2> 31395 INFO  (coreLoadExecutor-43-thread-1-processing-n:127.0.0.1:59608_oo) [n:127.0.0.1:59608_oo c:collection1   x:collection1] o.a.s.c.ZkController waiting to find shard id in clusterstate for collection1
   [junit4]   2> 31395 INFO  (coreLoadExecutor-43-thread-1-processing-n:127.0.0.1:59608_oo) [n:127.0.0.1:59608_oo c:collection1   x:collection1] o.a.s.c.ZkController Check for collection zkNode:collection1
   [junit4]   2> 31396 INFO  (coreLoadExecutor-43-thread-1-processing-n:127.0.0.1:59608_oo) [n:127.0.0.1:59608_oo c:collection1   x:collection1] o.a.s.c.ZkController Collection zkNode exists
   [junit4]   2> 31397 INFO  (coreLoadExecutor-43-thread-1-processing-n:127.0.0.1:59608_oo) [n:127.0.0.1:59608_oo c:collection1   x:collection1] o.a.s.c.c.ZkStateReader Load collection config from: [/collections/collection1]
   [junit4]   2> 31399 INFO  (coreLoadExecutor-43-thread-1-processing-n:127.0.0.1:59608_oo) [n:127.0.0.1:59608_oo c:collection1   x:collection1] o.a.s.c.c.ZkStateReader path=[/collections/collection1] [configName]=[conf1] specified config exists in ZooKeeper
   [junit4]   2> 31399 INFO  (coreLoadExecutor-43-thread-1-processing-n:127.0.0.1:59608_oo) [n:127.0.0.1:59608_oo c:collection1   x:collection1] o.a.s.c.SolrResourceLoader new SolrResourceLoader for directory: '/Users/jenkins/workspace/Lucene-Solr-5.x-MacOSX@2/solr/build/solr-solrj/test/J0/temp/solr.client.solrj.impl.CloudSolrClientTest_AC35F37DB26D83AB-001/shard-1-001/cores/collection1'
   [junit4]   2> 31399 INFO  (coreLoadExecutor-43-thread-1-processing-n:127.0.0.1:59608_oo) [n:127.0.0.1:59608_oo c:collection1   x:collection1] o.a.s.c.SolrResourceLoader JNDI not configured for solr (NoInitialContextEx)
   [junit4]   2> 31399 INFO  (coreLoadExecutor-43-thread-1-processing-n:127.0.0.1:59608_oo) [n:127.0.0.1:59608_oo c:collection1   x:collection1] o.a.s.c.SolrResourceLoader solr home defaulted to 'solr/' (could not find system property or JNDI)
   [junit4]   2> 31402 INFO  (coreLoadExecutor-43-thread-1-processing-n:127.0.0.1:59608_oo) [n:127.0.0.1:59608_oo c:collection1   x:collection1] o.a.s.c.Config loaded config solrconfig.xml with version 0 
   [junit4]   2> 31410 INFO  (coreLoadExecutor-43-thread-1-processing-n:127.0.0.1:59608_oo) [n:127.0.0.1:59608_oo c:collection1   x:collection1] o.a.s.c.SolrConfig current version of requestparams : -1
   [junit4]   2> 31420 WARN  (coreLoadExecutor-43-thread-1-processing-n:127.0.0.1:59608_oo) [n:127.0.0.1:59608_oo c:collection1   x:collection1] o.a.s.c.Config Beginning with Solr 5.5, <maxMergeDocs> is deprecated, configure it on the relevant <mergePolicyFactory> instead.
   [junit4]   2> 31420 WARN  (coreLoadExecutor-43-thread-1-processing-n:127.0.0.1:59608_oo) [n:127.0.0.1:59608_oo c:collection1   x:collection1] o.a.s.c.Config Beginning with Solr 5.5, <mergeFactor> is deprecated, configure it on the relevant <mergePolicyFactory> instead.
   [junit4]   2> 31422 INFO  (coreLoadExecutor-43-thread-1-processing-n:127.0.0.1:59608_oo) [n:127.0.0.1:59608_oo c:collection1   x:collection1] o.a.s.c.SolrConfig Using Lucene MatchVersion: 5.6.0
   [junit4]   2> 31451 INFO  (coreLoadExecutor-43-thread-1-processing-n:127.0.0.1:59608_oo) [n:127.0.0.1:59608_oo c:collection1   x:collection1] o.a.s.c.SolrConfig Loaded SolrConfig: solrconfig.xml
   [junit4]   2> 31484 INFO  (coreLoadExecutor-43-thread-1-processing-n:127.0.0.1:59608_oo) [n:127.0.0.1:59608_oo c:collection1   x:collection1] o.a.s.s.IndexSchema [collection1] Schema name=test
   [junit4]   2> 31750 INFO  (coreLoadExecutor-43-thread-1-processing-n:127.0.0.1:59608_oo) [n:127.0.0.1:59608_oo c:collection1   x:collection1] o.a.s.s.IndexSchema default search field in schema is text
   [junit4]   2> 31752 INFO  (coreLoadExecutor-43-thread-1-processing-n:127.0.0.1:59608_oo) [n:127.0.0.1:59608_oo c:collection1   x:collection1] o.a.s.s.IndexSchema unique key field: id
   [junit4]   2> 31753 WARN  (coreLoadExecutor-43-thread-1-processing-n:127.0.0.1:59608_oo) [n:127.0.0.1:59608_oo c:collection1   x:collection1] o.a.s.s.IndexSchema Field text is not multivalued and destination for multiple copyFields (3)
   [junit4]   2> 31753 WARN  (coreLoadExecutor-43-thread-1-processing-n:127.0.0.1:59608_oo) [n:127.0.0.1:59608_oo c:collection1   x:collection1] o.a.s.s.IndexSchema Field lowerfilt1and2 is not multivalued and destination for multiple copyFields (2)
   [junit4]   2> 31756 INFO  (coreLoadExecutor-43-thread-1-processing-n:127.0.0.1:59608_oo) [n:127.0.0.1:59608_oo c:collection1   x:collection1] o.a.s.c.ConfigSetProperties Did not find ConfigSet properties, assuming default properties: Can't find resource 'configsetprops.json' in classpath or '/configs/conf1', cwd=/Users/jenkins/workspace/Lucene-Solr-5.x-MacOSX@2/solr/build/solr-solrj/test/J0
   [junit4]   2> 31756 INFO  (coreLoadExecutor-43-thread-1-processing-n:127.0.0.1:59608_oo) [n:127.0.0.1:59608_oo c:collection1   x:collection1] o.a.s.c.CoreContainer Creating SolrCore 'collection1' using configuration from collection collection1
   [junit4]   2> 31757 INFO  (coreLoadExecutor-43-thread-1-processing-n:127.0.0.1:59608_oo) [n:127.0.0.1:59608_oo c:collection1 s:shard1 r:core_node1 x:collection1] o.a.s.c.SolrCore org.apache.solr.core.MockDirectoryFactory
   [junit4]   2> 31757 INFO  (coreLoadExecutor-43-thread-1-processing-n:127.0.0.1:59608_oo) [n:127.0.0.1:59608_oo c:collection1 s:shard1 r:core_node1 x:collection1] o.a.s.c.SolrCore [[collection1] ] Opening new SolrCore at [/Users/jenkins/workspace/Lucene-Solr-5.x-MacOSX@2/solr/build/solr-solrj/test/J0/temp/solr.client.solrj.impl.CloudSolrClientTest_AC35F37DB26D83AB-001/shard-1-001/cores/collection1], dataDir=[/Users/jenkins/workspace/Lucene-Solr-5.x-MacOSX@2/solr/build/solr-solrj/test/J0/temp/solr.client.solrj.impl.CloudSolrClientTest_AC35F37DB26D83AB-001/shard-1-001/cores/collection1/data/]
   [junit4]   2> 31757 INFO  (coreLoadExecutor-43-thread-1-processing-n:127.0.0.1:59608_oo) [n:127.0.0.1:59608_oo c:collection1 s:shard1 r:core_node1 x:collection1] o.a.s.c.SolrCore JMX monitoring not detected for core: collection1
   [junit4]   2> 31758 INFO  (coreLoadExecutor-43-thread-1-processing-n:127.0.0.1:59608_oo) [n:127.0.0.1:59608_oo c:collection1 s:shard1 r:core_node1 x:collection1] o.a.s.c.CachingDirectoryFactory return new directory for /Users/jenkins/workspace/Lucene-Solr-5.x-MacOSX@2/solr/build/solr-solrj/test/J0/temp/solr.client.solrj.impl.CloudSolrClientTest_AC35F37DB26D83AB-001/shard-1-001/cores/collection1/data
   [junit4]   2> 31758 INFO  (coreLoadExecutor-43-thread-1-processing-n:127.0.0.1:59608_oo) [n:127.0.0.1:59608_oo c:collection1 s:shard1 r:core_node1 x:collection1] o.a.s.c.SolrCore New index directory detected: old=null new=/Users/jenkins/workspace/Lucene-Solr-5.x-MacOSX@2/solr/build/solr-solrj/test/J0/temp/solr.client.solrj.impl.CloudSolrClientTest_AC35F37DB26D83AB-001/shard-1-001/cores/collection1/data/index/
   [junit4]   2> 31758 WARN  (coreLoadExecutor-43-thread-1-processing-n:127.0.0.1:59608_oo) [n:127.0.0.1:59608_oo c:collection1 s:shard1 r:core_node1 x:collection1] o.a.s.c.SolrCore [collection1] Solr index directory '/Users/jenkins/workspace/Lucene-Solr-5.x-MacOSX@2/solr/build/solr-solrj/test/J0/temp/solr.client.solrj.impl.CloudSolrClientTest_AC35F37DB26D83AB-001/shard-1-001/cores/collection1/data/index' doesn't exist. Creating new index...
   [junit4]   2> 31758 INFO  (coreLoadExecutor-43-thread-1-processing-n:127.0.0.1:59608_oo) [n:127.0.0.1:59608_oo c:collection1 s:shard1 r:core_node1 x:collection1] o.a.s.c.CachingDirectoryFactory return new directory for /Users/jenkins/workspace/Lucene-Solr-5.x-MacOSX@2/solr/build/solr-solrj/test/J0/temp/solr.client.solrj.impl.CloudSolrClientTest_AC35F37DB26D83AB-001/shard-1-001/cores/collection1/data/index
   [junit4]   2> 31759 INFO  (coreLoadExecutor-43-thread-1-processing-n:127.0.0.1:59608_oo) [n:127.0.0.1:59608_oo c:collection1 s:shard1 r:core_node1 x:collection1] o.a.s.c.SolrDeletionPolicy SolrDeletionPolicy.onCommit: commits: num=1
   [junit4]   2> 	commit{dir=MockDirectoryWrapper(RAMDirectory@7f873cca lockFactory=org.apache.lucene.store.SingleInstanceLockFactory@7a8332f),segFN=segments_1,generation=1}
   [junit4]   2> 31759 INFO  (coreLoadExecutor-43-thread-1-processing-n:127.0.0.1:59608_oo) [n:127.0.0.1:59608_oo c:collection1 s:shard1 r:core_node1 x:collection1] o.a.s.c.SolrDeletionPolicy newest commit generation = 1
   [junit4]   2> 31759 INFO  (OldIndexDirectoryCleanupThreadForCore-collection1) [n:127.0.0.1:59608_oo c:collection1 s:shard1 r:core_node1 x:collection1] o.a.s.c.SolrCore Looking for old index directories to cleanup for core collection1 in /Users/jenkins/workspace/Lucene-Solr-5.x-MacOSX@2/solr/build/solr-solrj/test/J0/temp/solr.client.solrj.impl.CloudSolrClientTest_AC35F37DB26D83AB-001/shard-1-001/cores/collection1/data/
   [junit4]   2> 31760 WARN  (OldIndexDirectoryCleanupThreadForCore-collection1) [n:127.0.0.1:59608_oo c:collection1 s:shard1 r:core_node1 x:collection1] o.a.s.c.DirectoryFactory /Users/jenkins/workspace/Lucene-Solr-5.x-MacOSX@2/solr/build/solr-solrj/test/J0/temp/solr.client.solrj.impl.CloudSolrClientTest_AC35F37DB26D83AB-001/shard-1-001/cores/collection1/data/ does not point to a valid data directory; skipping clean-up of old index directories.
   [junit4]   2> 31762 INFO  (coreLoadExecutor-43-thread-1-processing-n:127.0.0.1:59608_oo) [n:127.0.0.1:59608_oo c:collection1 s:shard1 r:core_node1 x:collection1] o.a.s.c.SolrCore no updateRequestProcessorChain defined as default, creating implicit default
   [junit4]   2> 31768 INFO  (coreLoadExecutor-43-thread-1-processing-n:127.0.0.1:59608_oo) [n:127.0.0.1:59608_oo c:collection1 s:shard1 r:core_node1 x:collection1] o.a.s.h.l.XMLLoader xsltCacheLifetimeSeconds=60
   [junit4]   2> 31769 INFO  (coreLoadExecutor-43-thread-1-processing-n:127.0.0.1:59608_oo) [n:127.0.0.1:59608_oo c:collection1 s:shard1 r:core_node1 x:collection1] o.a.s.h.l.XMLLoader xsltCacheLifetimeSeconds=60
   [junit4]   2> 31770 INFO  (coreLoadExecutor-43-thread-1-processing-n:127.0.0.1:59608_oo) [n:127.0.0.1:59608_oo c:collection1 s:shard1 r:core_node1 x:collection1] o.a.s.h.l.XMLLoader xsltCacheLifetimeSeconds=60
   [junit4]   2> 31771 INFO  (coreLoadExecutor-43-thread-1-processing-n:127.0.0.1:59608_oo) [n:127.0.0.1:59608_oo c:collection1 s:shard1 r:core_node1 x:collection1] o.a.s.h.l.XMLLoader xsltCacheLifetimeSeconds=60
   [junit4]   2> 31774 INFO  (coreLoadExecutor-43-thread-1-processing-n:127.0.0.1:59608_oo) [n:127.0.0.1:59608_oo c:collection1 s:shard1 r:core_node1 x:collection1] o.a.s.c.RequestHandlers Registered paths: /update,/admin/plugins,/update/json,/admin/system,/replication,/admin/logging,/admin/mbeans,/admin/luke,/update/json/docs,/admin/ping,/schema,/admin/threads,,/admin/segments,/admin/properties,/admin/file,/get,/update/csv,/config,standard
   [junit4]   2> 31775 INFO  (coreLoadExecutor-43-thread-1-processing-n:127.0.0.1:59608_oo) [n:127.0.0.1:59608_oo c:collection1 s:shard1 r:core_node1 x:collection1] o.a.s.c.SolrCore Using default statsCache cache: org.apache.solr.search.stats.LocalStatsCache
   [junit4]   2> 31776 INFO  (coreLoadExecutor-43-thread-1-processing-n:127.0.0.1:59608_oo) [n:127.0.0.1:59608_oo c:collection1 s:shard1 r:core_node1 x:collection1] o.a.s.u.UpdateHandler Using UpdateLog implementation: org.apache.solr.update.UpdateLog
   [junit4]   2> 31776 INFO  (coreLoadExecutor-43-thread-1-processing-n:127.0.0.1:59608_oo) [n:127.0.0.1:59608_oo c:collection1 s:shard1 r:core_node1 x:collection1] o.a.s.u.UpdateLog Initializing UpdateLog: dataDir= defaultSyncLevel=FLUSH numRecordsToKeep=100 maxNumLogsToKeep=10 numVersionBuckets=65536
   [junit4]   2> 31779 INFO  (coreLoadExecutor-43-thread-1-processing-n:127.0.0.1:59608_oo) [n:127.0.0.1:59608_oo c:collection1 s:shard1 r:core_node1 x:collection1] o.a.s.u.CommitTracker Hard AutoCommit: disabled
   [junit4]   2> 31779 INFO  (coreLoadExecutor-43-thread-1-processing-n:127.0.0.1:59608_oo) [n:127.0.0.1:59608_oo c:collection1 s:shard1 r:core_node1 x:collection1] o.a.s.u.CommitTracker Soft AutoCommit: disabled
   [junit4]   2> 31779 INFO  (coreLoadExecutor-43-thread-1-processing-n:127.0.0.1:59608_oo) [n:127.0.0.1:59608_oo c:collection1 s:shard1 r:core_node1 x:collection1] o.a.s.c.SolrDeletionPolicy SolrDeletionPolicy.onInit: commits: num=1
   [junit4]   2> 	commit{dir=MockDirectoryWrapper(RAMDirectory@7f873cca lockFactory=org.apache.lucene.store.SingleInstanceLockFactory@7a8332f),segFN=segments_1,generation=1}
   [junit4]   2> 31779 INFO  (coreLoadExecutor-43-thread-1-processing-n:127.0.0.1:59608_oo) [n:127.0.0.1:59608_oo c:collection1 s:shard1 r:core_node1 x:collection1] o.a.s.c.SolrDeletionPolicy newest commit generation = 1
   [junit4]   2> 31780 INFO  (coreLoadExecutor-43-thread-1-processing-n:127.0.0.1:59608_oo) [n:127.0.0.1:59608_oo c:collection1 s:shard1 r:core_node1 x:collection1] o.a.s.s.SolrIndexSearcher Opening Searcher@19dd6c23[collection1] main
   [junit4]   2> 31780 INFO  (coreLoadExecutor-43-thread-1-processing-n:127.0.0.1:59608_oo) [n:127.0.0.1:59608_oo c:collection1 s:shard1 r:core_node1 x:collection1] o.a.s.c.c.ZkStateReader Load collection config from: [/collections/collection1]
   [junit4]   2> 31782 INFO  (coreLoadExecutor-43-thread-1-processing-n:127.0.0.1:59608_oo) [n:127.0.0.1:59608_oo c:collection1 s:shard1 r:core_node1 x:collection1] o.a.s.c.c.ZkStateReader path=[/collections/collection1] [configName]=[conf1] specified config exists in ZooKeeper
   [junit4]   2> 31782 INFO  (coreLoadExecutor-43-thread-1-processing-n:127.0.0.1:59608_oo) [n:127.0.0.1:59608_oo c:collection1 s:shard1 r:core_node1 x:collection1] o.a.s.r.ManagedResourceStorage Setting up ZooKeeper-based storage for the RestManager with znodeBase: /configs/conf1
   [junit4]   2> 31783 INFO  (coreLoadExecutor-43-thread-1-processing-n:127.0.0.1:59608_oo) [n:127.0.0.1:59608_oo c:collection1 s:shard1 r:core_node1 x:collection1] o.a.s.r.ManagedResourceStorage Configured ZooKeeperStorageIO with znodeBase: /configs/conf1
   [junit4]   2> 31783 INFO  (coreLoadExecutor-43-thread-1-processing-n:127.0.0.1:59608_oo) [n:127.0.0.1:59608_oo c:collection1 s:shard1 r:core_node1 x:collection1] o.a.s.r.RestManager Initializing RestManager with initArgs: {}
   [junit4]   2> 31783 INFO  (coreLoadExecutor-43-thread-1-processing-n:127.0.0.1:59608_oo) [n:127.0.0.1:59608_oo c:collection1 s:shard1 r:core_node1 x:collection1] o.a.s.r.ManagedResourceStorage Reading _rest_managed.json using ZooKeeperStorageIO:path=/configs/conf1
   [junit4]   2> 31784 INFO  (coreLoadExecutor-43-thread-1-processing-n:127.0.0.1:59608_oo) [n:127.0.0.1:59608_oo c:collection1 s:shard1 r:core_node1 x:collection1] o.a.s.r.ManagedResourceStorage No data found for znode /configs/conf1/_rest_managed.json
   [junit4]   2> 31784 INFO  (coreLoadExecutor-43-thread-1-processing-n:127.0.0.1:59608_oo) [n:127.0.0.1:59608_oo c:collection1 s:shard1 r:core_node1 x:collection1] o.a.s.r.ManagedResourceStorage Loaded null at path _rest_managed.json using ZooKeeperStorageIO:path=/configs/conf1
   [junit4]   2> 31784 INFO  (coreLoadExecutor-43-thread-1-processing-n:127.0.0.1:59608_oo) [n:127.0.0.1:59608_oo c:collection1 s:shard1 r:core_node1 x:collection1] o.a.s.r.RestManager Initializing 0 registered ManagedResources
   [junit4]   2> 31784 INFO  (coreLoadExecutor-43-thread-1-processing-n:127.0.0.1:59608_oo) [n:127.0.0.1:59608_oo c:collection1 s:shard1 r:core_node1 x:collection1] o.a.s.h.ReplicationHandler Commits will be reserved for  10000
   [junit4]   2> 31785 INFO  (coreLoadExecutor-43-thread-1-processing-n:127.0.0.1:59608_oo) [n:127.0.0.1:59608_oo c:collection1 s:shard1 r:core_node1 x:collection1] o.a.s.u.UpdateLog Looking up max value of version field to seed version buckets
   [junit4]   2> 31785 INFO  (searcherExecutor-44-thread-1-processing-n:127.0.0.1:59608_oo c:collection1 x:collection1 s:shard1 r:core_node1) [n:127.0.0.1:59608_oo c:collection1 s:shard1 r:core_node1 x:collection1] o.a.s.c.SolrCore [collection1] Registered new searcher Searcher@19dd6c23[collection1] main{ExitableDirectoryReader(UninvertingDirectoryReader())}
   [junit4]   2> 31785 INFO  (coreLoadExecutor-43-thread-1-processing-n:127.0.0.1:59608_oo) [n:127.0.0.1:59608_oo c:collection1 s:shard1 r:core_node1 x:collection1] o.a.s.u.VersionInfo Refreshing highest value of _version_ for 65536 version buckets from index
   [junit4]   2> 31785 INFO  (coreLoadExecutor-43-thread-1-processing-n:127.0.0.1:59608_oo) [n:127.0.0.1:59608_oo c:collection1 s:shard1 r:core_node1 x:collection1] o.a.s.u.VersionInfo No terms found for _version_, cannot seed version bucket highest value from index
   [junit4]   2> 31785 INFO  (coreLoadExecutor-43-thread-1-processing-n:127.0.0.1:59608_oo) [n:127.0.0.1:59608_oo c:collection1 s:shard1 r:core_node1 x:collection1] o.a.s.u.UpdateLog Could not find max version in index or recent updates, using new clock 1526254949384585216
   [junit4]   2> 31786 INFO  (coreLoadExecutor-43-thread-1-processing-n:127.0.0.1:59608_oo) [n:127.0.0.1:59608_oo c:collection1 s:shard1 r:core_node1 x:collection1] o.a.s.u.UpdateLog Took 1.0ms to seed version buckets with highest version 1526254949384585216
   [junit4]   2> 31786 INFO  (coreLoadExecutor-43-thread-1-processing-n:127.0.0.1:59608_oo) [n:127.0.0.1:59608_oo c:collection1 s:shard1 r:core_node1 x:collection1] o.a.s.c.ZkController watch zkdir /configs/conf1
   [junit4]   2> 31788 INFO  (coreLoadExecutor-43-thread-1-processing-n:127.0.0.1:59608_oo) [n:127.0.0.1:59608_oo c:collection1 s:shard1 r:core_node1 x:collection1] o.a.s.c.CoreContainer registering core: collection1
   [junit4]   2> 31789 INFO  (coreZkRegister-38-thread-1-processing-n:127.0.0.1:59608_oo c:collection1 x:collection1 s:shard1 r:core_node1) [n:127.0.0.1:59608_oo c:collection1 s:shard1 r:core_node1 x:collection1] o.a.s.c.ZkController Register replica - core:collection1 address:http://127.0.0.1:59608/oo collection:collection1 shard:shard1
   [junit4]   2> 31790 INFO  (coreZkRegister-38-thread-1-processing-n:127.0.0.1:59608_oo c:collection1 x:collection1 s:shard1 r:core_node1) [n:127.0.0.1:59608_oo c:collection1 s:shard1 r:core_node1 x:collection1] 

[...truncated too long message...]

junit4]   2> 117438 INFO  (recoveryExecutor-97-thread-1-processing-n:127.0.0.1:59792_oo c:collection1 x:collection1 s:shard1 r:core_node3) [n:127.0.0.1:59792_oo c:collection1 s:shard1 r:core_node3 x:collection1] o.a.s.c.ZkController No more listeners for config directory [/configs/conf1]
   [junit4]   2> 117438 INFO  (recoveryExecutor-97-thread-1-processing-n:127.0.0.1:59792_oo c:collection1 x:collection1 s:shard1 r:core_node3) [n:127.0.0.1:59792_oo c:collection1 s:shard1 r:core_node3 x:collection1] o.a.s.u.DirectUpdateHandler2 closing DirectUpdateHandler2{commits=0,autocommits=0,soft autocommits=0,optimizes=0,rollbacks=0,expungeDeletes=0,docsPending=0,adds=0,deletesById=0,deletesByQuery=0,errors=0,cumulative_adds=0,cumulative_deletesById=0,cumulative_deletesByQuery=0,cumulative_errors=0,transaction_logs_total_size=0,transaction_logs_total_number=0}
   [junit4]   2> 117438 INFO  (recoveryExecutor-97-thread-1-processing-n:127.0.0.1:59792_oo c:collection1 x:collection1 s:shard1 r:core_node3) [n:127.0.0.1:59792_oo c:collection1 s:shard1 r:core_node3 x:collection1] o.a.s.u.SolrCoreState Closing SolrCoreState
   [junit4]   2> 117438 WARN  (recoveryExecutor-97-thread-1-processing-n:127.0.0.1:59792_oo c:collection1 x:collection1 s:shard1 r:core_node3) [n:127.0.0.1:59792_oo c:collection1 s:shard1 r:core_node3 x:collection1] o.a.s.c.RecoveryStrategy Stopping recovery for core=[collection1] coreNodeName=[core_node3]
   [junit4]   2> 117438 INFO  (recoveryExecutor-97-thread-1-processing-n:127.0.0.1:59792_oo c:collection1 x:collection1 s:shard1 r:core_node3) [n:127.0.0.1:59792_oo c:collection1 s:shard1 r:core_node3 x:collection1] o.a.s.u.DefaultSolrCoreState SolrCoreState ref count has reached 0 - closing IndexWriter
   [junit4]   2> 117438 INFO  (recoveryExecutor-97-thread-1-processing-n:127.0.0.1:59792_oo c:collection1 x:collection1 s:shard1 r:core_node3) [n:127.0.0.1:59792_oo c:collection1 s:shard1 r:core_node3 x:collection1] o.a.s.u.DefaultSolrCoreState closing IndexWriter with IndexWriterCloser
   [junit4]   2> 117440 INFO  (recoveryExecutor-97-thread-1-processing-n:127.0.0.1:59792_oo c:collection1 x:collection1 s:shard1 r:core_node3) [n:127.0.0.1:59792_oo c:collection1 s:shard1 r:core_node3 x:collection1] o.a.s.c.SolrCore [collection1] Closing main searcher on request.
   [junit4]   2> 117440 INFO  (recoveryExecutor-97-thread-1-processing-n:127.0.0.1:59792_oo c:collection1 x:collection1 s:shard1 r:core_node3) [n:127.0.0.1:59792_oo c:collection1 s:shard1 r:core_node3 x:collection1] o.a.s.c.CachingDirectoryFactory Closing MockDirectoryFactory - 2 directories currently being tracked
   [junit4]   2> 117441 INFO  (recoveryExecutor-97-thread-1-processing-n:127.0.0.1:59792_oo c:collection1 x:collection1 s:shard1 r:core_node3) [n:127.0.0.1:59792_oo c:collection1 s:shard1 r:core_node3 x:collection1] o.a.s.c.CachingDirectoryFactory looking to close /Users/jenkins/workspace/Lucene-Solr-5.x-MacOSX@2/solr/build/solr-solrj/test/J0/temp/solr.client.solrj.impl.CloudSolrClientTest_AC35F37DB26D83AB-001/shard-3-003/cores/collection1/data/index [CachedDir<<refCount=0;path=/Users/jenkins/workspace/Lucene-Solr-5.x-MacOSX@2/solr/build/solr-solrj/test/J0/temp/solr.client.solrj.impl.CloudSolrClientTest_AC35F37DB26D83AB-001/shard-3-003/cores/collection1/data/index;done=false>>]
   [junit4]   2> 117441 INFO  (recoveryExecutor-97-thread-1-processing-n:127.0.0.1:59792_oo c:collection1 x:collection1 s:shard1 r:core_node3) [n:127.0.0.1:59792_oo c:collection1 s:shard1 r:core_node3 x:collection1] o.a.s.c.CachingDirectoryFactory Closing directory: /Users/jenkins/workspace/Lucene-Solr-5.x-MacOSX@2/solr/build/solr-solrj/test/J0/temp/solr.client.solrj.impl.CloudSolrClientTest_AC35F37DB26D83AB-001/shard-3-003/cores/collection1/data/index
   [junit4]   2> 117441 INFO  (recoveryExecutor-97-thread-1-processing-n:127.0.0.1:59792_oo c:collection1 x:collection1 s:shard1 r:core_node3) [n:127.0.0.1:59792_oo c:collection1 s:shard1 r:core_node3 x:collection1] o.a.s.c.CachingDirectoryFactory looking to close /Users/jenkins/workspace/Lucene-Solr-5.x-MacOSX@2/solr/build/solr-solrj/test/J0/temp/solr.client.solrj.impl.CloudSolrClientTest_AC35F37DB26D83AB-001/shard-3-003/cores/collection1/data [CachedDir<<refCount=0;path=/Users/jenkins/workspace/Lucene-Solr-5.x-MacOSX@2/solr/build/solr-solrj/test/J0/temp/solr.client.solrj.impl.CloudSolrClientTest_AC35F37DB26D83AB-001/shard-3-003/cores/collection1/data;done=false>>]
   [junit4]   2> 117441 INFO  (recoveryExecutor-97-thread-1-processing-n:127.0.0.1:59792_oo c:collection1 x:collection1 s:shard1 r:core_node3) [n:127.0.0.1:59792_oo c:collection1 s:shard1 r:core_node3 x:collection1] o.a.s.c.CachingDirectoryFactory Closing directory: /Users/jenkins/workspace/Lucene-Solr-5.x-MacOSX@2/solr/build/solr-solrj/test/J0/temp/solr.client.solrj.impl.CloudSolrClientTest_AC35F37DB26D83AB-001/shard-3-003/cores/collection1/data
   [junit4]   2> 117442 INFO  (TEST-CloudSolrClientTest.testShutdown-seed#[AC35F37DB26D83AB]) [    ] o.a.s.c.Overseer Overseer (id=95390938744619022-127.0.0.1:59792_oo-n_0000000003) closing
   [junit4]   2> 117442 INFO  (OverseerStateUpdate-95390938744619022-127.0.0.1:59792_oo-n_0000000003) [n:127.0.0.1:59792_oo    ] o.a.s.c.Overseer Overseer Loop exiting : 127.0.0.1:59792_oo
   [junit4]   2> 117447 INFO  (zkCallback-99-thread-2-processing-n:127.0.0.1:59792_oo) [n:127.0.0.1:59792_oo    ] o.a.s.c.c.ZkStateReader A live node change: [WatchedEvent state:SyncConnected type:NodeChildrenChanged path:/live_nodes], has occurred - updating... (live nodes size: [1])
   [junit4]   2> 117448 INFO  (zkCallback-84-thread-2) [    ] o.a.s.c.c.ZkStateReader A live node change: [WatchedEvent state:SyncConnected type:NodeChildrenChanged path:/live_nodes], has occurred - updating... (live nodes size: [1])
   [junit4]   2> 118948 WARN  (zkCallback-99-thread-2-processing-n:127.0.0.1:59792_oo) [n:127.0.0.1:59792_oo    ] o.a.s.c.c.ZkStateReader ZooKeeper watch triggered, but Solr cannot talk to ZK: [KeeperErrorCode = Session expired for /live_nodes]
   [junit4]   2> 118950 INFO  (TEST-CloudSolrClientTest.testShutdown-seed#[AC35F37DB26D83AB]) [    ] o.e.j.s.ServerConnector Stopped ServerConnector@59f247e1{HTTP/1.1}{127.0.0.1:0}
   [junit4]   2> 118950 INFO  (TEST-CloudSolrClientTest.testShutdown-seed#[AC35F37DB26D83AB]) [    ] o.e.j.s.h.ContextHandler Stopped o.e.j.s.ServletContextHandler@3a232770{/oo,null,UNAVAILABLE}
   [junit4]   2> 118953 INFO  (TEST-CloudSolrClientTest.testShutdown-seed#[AC35F37DB26D83AB]) [    ] o.a.s.c.ChaosMonkey monkey: stop shard! 59770
   [junit4]   2> 118954 INFO  (TEST-CloudSolrClientTest.testShutdown-seed#[AC35F37DB26D83AB]) [    ] o.a.s.c.ZkTestServer connecting to 127.0.0.1:59767 59767
   [junit4]   2> 119044 INFO  (Thread-174) [    ] o.a.s.c.ZkTestServer connecting to 127.0.0.1:59767 59767
   [junit4]   2> 120325 WARN  (Thread-174) [    ] o.a.s.c.ZkTestServer Watch limit violations: 
   [junit4]   2> Maximum concurrent create/delete watches above limit:
   [junit4]   2> 
   [junit4]   2> 	5	/solr/aliases.json
   [junit4]   2> 	4	/solr/configs/conf1
   [junit4]   2> 	4	/solr/security.json
   [junit4]   2> 
   [junit4]   2> Maximum concurrent data watches above limit:
   [junit4]   2> 
   [junit4]   2> 	5	/solr/clusterstate.json
   [junit4]   2> 
   [junit4]   2> Maximum concurrent children watches above limit:
   [junit4]   2> 
   [junit4]   2> 	5	/solr/collections
   [junit4]   2> 	5	/solr/live_nodes
   [junit4]   2> 	2	/solr/overseer/collection-queue-work
   [junit4]   2> 	2	/solr/overseer/queue
   [junit4]   2> 
   [junit4]   2> 120328 INFO  (SUITE-CloudSolrClientTest-seed#[AC35F37DB26D83AB]-worker) [    ] o.a.s.SolrTestCaseJ4 ###deleteCore
   [junit4]   2> NOTE: leaving temporary files on disk at: /Users/jenkins/workspace/Lucene-Solr-5.x-MacOSX@2/solr/build/solr-solrj/test/J0/temp/solr.client.solrj.impl.CloudSolrClientTest_AC35F37DB26D83AB-001
   [junit4]   2> NOTE: test params are: codec=Asserting(Lucene54): {multiDefault=TestBloomFilteredLucenePostings(BloomFilteringPostingsFormat(Lucene50(blocksize=128))), text=PostingsFormat(name=Memory doPackFST= false), _version_=FSTOrd50, a_t=FSTOrd50, range_facet_l=FSTOrd50, timestamp=FSTOrd50, id=PostingsFormat(name=Direct), intDefault=FSTOrd50}, docValues:{}, sim=RandomSimilarity(queryNorm=true,coord=no): {}, locale=el-GR, timezone=America/Aruba
   [junit4]   2> NOTE: Mac OS X 10.8.5 x86_64/Oracle Corporation 1.7.0_80 (64-bit)/cpus=3,threads=1,free=112051888,total=266338304
   [junit4]   2> NOTE: All tests run in this JVM: [SolrExampleEmbeddedTest, FieldAnalysisResponseTest, JettyWebappTest, CommonParamsTest, CollectionAdminRequestRequiredParamsTest, CloudSolrClientTest]
   [junit4] Completed [42/71 (1!)] on J0 in 95.20s, 3 tests, 1 failure <<< FAILURES!

[...truncated 97 lines...]
BUILD FAILED
/Users/jenkins/workspace/Lucene-Solr-5.x-MacOSX@2/build.xml:750: The following error occurred while executing this line:
/Users/jenkins/workspace/Lucene-Solr-5.x-MacOSX@2/build.xml:694: The following error occurred while executing this line:
/Users/jenkins/workspace/Lucene-Solr-5.x-MacOSX@2/build.xml:59: The following error occurred while executing this line:
/Users/jenkins/workspace/Lucene-Solr-5.x-MacOSX@2/solr/build.xml:246: The following error occurred while executing this line:
/Users/jenkins/workspace/Lucene-Solr-5.x-MacOSX@2/solr/common-build.xml:534: The following error occurred while executing this line:
/Users/jenkins/workspace/Lucene-Solr-5.x-MacOSX@2/lucene/common-build.xml:1477: The following error occurred while executing this line:
/Users/jenkins/workspace/Lucene-Solr-5.x-MacOSX@2/lucene/common-build.xml:1033: There were test failures: 71 suites, 483 tests, 1 failure [seed: AC35F37DB26D83AB]

Total time: 92 minutes 13 seconds
Build step 'Invoke Ant' marked build as failure
Archiving artifacts
[WARNINGS] Skipping publisher since build result is FAILURE
Recording test results
Email was triggered for: Failure - Any
Sending email for trigger: Failure - Any



Mime
View raw message