lucene-dev mailing list archives

Site index · List index
Message view « Date » · « Thread »
Top « Date » · « Thread »
From Policeman Jenkins Server <jenk...@thetaphi.de>
Subject [JENKINS] Lucene-Solr-trunk-MacOSX (64bit/jdk1.8.0) - Build # 3087 - Failure!
Date Mon, 15 Feb 2016 13:58:57 GMT
Build: http://jenkins.thetaphi.de/job/Lucene-Solr-trunk-MacOSX/3087/
Java: 64bit/jdk1.8.0 -XX:-UseCompressedOops -XX:+UseParallelGC

1 tests failed.
FAILED:  org.apache.solr.TestGroupingSearch.testGroupAPI

Error Message:
mismatch: '2'!='5' @ grouped/id:[2 TO 5]/doclist/docs/[2]/id

Stack Trace:
java.lang.RuntimeException: mismatch: '2'!='5' @ grouped/id:[2 TO 5]/doclist/docs/[2]/id
	at __randomizedtesting.SeedInfo.seed([5926FD11F35274B:98375B9C8C08D761]:0)
	at org.apache.solr.SolrTestCaseJ4.assertJQ(SolrTestCaseJ4.java:842)
	at org.apache.solr.SolrTestCaseJ4.assertJQ(SolrTestCaseJ4.java:789)
	at org.apache.solr.TestGroupingSearch.testGroupAPI(TestGroupingSearch.java:546)
	at sun.reflect.NativeMethodAccessorImpl.invoke0(Native Method)
	at sun.reflect.NativeMethodAccessorImpl.invoke(NativeMethodAccessorImpl.java:62)
	at sun.reflect.DelegatingMethodAccessorImpl.invoke(DelegatingMethodAccessorImpl.java:43)
	at java.lang.reflect.Method.invoke(Method.java:498)
	at com.carrotsearch.randomizedtesting.RandomizedRunner.invoke(RandomizedRunner.java:1764)
	at com.carrotsearch.randomizedtesting.RandomizedRunner$8.evaluate(RandomizedRunner.java:871)
	at com.carrotsearch.randomizedtesting.RandomizedRunner$9.evaluate(RandomizedRunner.java:907)
	at com.carrotsearch.randomizedtesting.RandomizedRunner$10.evaluate(RandomizedRunner.java:921)
	at com.carrotsearch.randomizedtesting.rules.SystemPropertiesRestoreRule$1.evaluate(SystemPropertiesRestoreRule.java:57)
	at org.apache.lucene.util.TestRuleSetupTeardownChained$1.evaluate(TestRuleSetupTeardownChained.java:49)
	at org.apache.lucene.util.AbstractBeforeAfterRule$1.evaluate(AbstractBeforeAfterRule.java:45)
	at org.apache.lucene.util.TestRuleThreadAndTestName$1.evaluate(TestRuleThreadAndTestName.java:48)
	at org.apache.lucene.util.TestRuleIgnoreAfterMaxFailures$1.evaluate(TestRuleIgnoreAfterMaxFailures.java:64)
	at org.apache.lucene.util.TestRuleMarkFailure$1.evaluate(TestRuleMarkFailure.java:47)
	at com.carrotsearch.randomizedtesting.rules.StatementAdapter.evaluate(StatementAdapter.java:36)
	at com.carrotsearch.randomizedtesting.ThreadLeakControl$StatementRunner.run(ThreadLeakControl.java:367)
	at com.carrotsearch.randomizedtesting.ThreadLeakControl.forkTimeoutingTask(ThreadLeakControl.java:809)
	at com.carrotsearch.randomizedtesting.ThreadLeakControl$3.evaluate(ThreadLeakControl.java:460)
	at com.carrotsearch.randomizedtesting.RandomizedRunner.runSingleTest(RandomizedRunner.java:880)
	at com.carrotsearch.randomizedtesting.RandomizedRunner$5.evaluate(RandomizedRunner.java:781)
	at com.carrotsearch.randomizedtesting.RandomizedRunner$6.evaluate(RandomizedRunner.java:816)
	at com.carrotsearch.randomizedtesting.RandomizedRunner$7.evaluate(RandomizedRunner.java:827)
	at com.carrotsearch.randomizedtesting.rules.StatementAdapter.evaluate(StatementAdapter.java:36)
	at com.carrotsearch.randomizedtesting.rules.SystemPropertiesRestoreRule$1.evaluate(SystemPropertiesRestoreRule.java:57)
	at org.apache.lucene.util.AbstractBeforeAfterRule$1.evaluate(AbstractBeforeAfterRule.java:45)
	at com.carrotsearch.randomizedtesting.rules.StatementAdapter.evaluate(StatementAdapter.java:36)
	at org.apache.lucene.util.TestRuleStoreClassName$1.evaluate(TestRuleStoreClassName.java:41)
	at com.carrotsearch.randomizedtesting.rules.NoShadowingOrOverridesOnMethodsRule$1.evaluate(NoShadowingOrOverridesOnMethodsRule.java:40)
	at com.carrotsearch.randomizedtesting.rules.NoShadowingOrOverridesOnMethodsRule$1.evaluate(NoShadowingOrOverridesOnMethodsRule.java:40)
	at com.carrotsearch.randomizedtesting.rules.StatementAdapter.evaluate(StatementAdapter.java:36)
	at com.carrotsearch.randomizedtesting.rules.StatementAdapter.evaluate(StatementAdapter.java:36)
	at com.carrotsearch.randomizedtesting.rules.StatementAdapter.evaluate(StatementAdapter.java:36)
	at org.apache.lucene.util.TestRuleAssertionsRequired$1.evaluate(TestRuleAssertionsRequired.java:53)
	at org.apache.lucene.util.TestRuleMarkFailure$1.evaluate(TestRuleMarkFailure.java:47)
	at org.apache.lucene.util.TestRuleIgnoreAfterMaxFailures$1.evaluate(TestRuleIgnoreAfterMaxFailures.java:64)
	at org.apache.lucene.util.TestRuleIgnoreTestSuites$1.evaluate(TestRuleIgnoreTestSuites.java:54)
	at com.carrotsearch.randomizedtesting.rules.StatementAdapter.evaluate(StatementAdapter.java:36)
	at com.carrotsearch.randomizedtesting.ThreadLeakControl$StatementRunner.run(ThreadLeakControl.java:367)
	at java.lang.Thread.run(Thread.java:745)




Build Log:
[...truncated 11288 lines...]
   [junit4] Suite: org.apache.solr.TestGroupingSearch
   [junit4]   2> Creating dataDir: /Users/jenkins/workspace/Lucene-Solr-trunk-MacOSX/solr/build/solr-core/test/J1/temp/solr.TestGroupingSearch_5926FD11F35274B-001/init-core-data-001
   [junit4]   2> 2044404 INFO  (SUITE-TestGroupingSearch-seed#[5926FD11F35274B]-worker) [    ] o.a.s.SolrTestCaseJ4 Randomized ssl (false) and clientAuth (false)
   [junit4]   2> 2044405 INFO  (SUITE-TestGroupingSearch-seed#[5926FD11F35274B]-worker) [    ] o.a.s.SolrTestCaseJ4 ####initCore
   [junit4]   2> 2044405 INFO  (SUITE-TestGroupingSearch-seed#[5926FD11F35274B]-worker) [    ] o.a.s.c.SolrResourceLoader new SolrResourceLoader for directory: '/Users/jenkins/workspace/Lucene-Solr-trunk-MacOSX/solr/core/src/test-files/solr/collection1'
   [junit4]   2> 2044405 INFO  (SUITE-TestGroupingSearch-seed#[5926FD11F35274B]-worker) [    ] o.a.s.c.SolrResourceLoader JNDI not configured for solr (NoInitialContextEx)
   [junit4]   2> 2044405 INFO  (SUITE-TestGroupingSearch-seed#[5926FD11F35274B]-worker) [    ] o.a.s.c.SolrResourceLoader using system property solr.solr.home: /Users/jenkins/workspace/Lucene-Solr-trunk-MacOSX/solr/core/src/test-files/solr
   [junit4]   2> 2044406 INFO  (SUITE-TestGroupingSearch-seed#[5926FD11F35274B]-worker) [    ] o.a.s.c.SolrResourceLoader Adding 'file:/Users/jenkins/workspace/Lucene-Solr-trunk-MacOSX/solr/core/src/test-files/solr/collection1/lib/classes/' to classloader
   [junit4]   2> 2044406 INFO  (SUITE-TestGroupingSearch-seed#[5926FD11F35274B]-worker) [    ] o.a.s.c.SolrResourceLoader Adding 'file:/Users/jenkins/workspace/Lucene-Solr-trunk-MacOSX/solr/core/src/test-files/solr/collection1/lib/README' to classloader
   [junit4]   2> 2044479 INFO  (SUITE-TestGroupingSearch-seed#[5926FD11F35274B]-worker) [    ] o.a.s.c.SolrConfig current version of requestparams : -1
   [junit4]   2> 2044503 INFO  (SUITE-TestGroupingSearch-seed#[5926FD11F35274B]-worker) [    ] o.a.s.c.SolrConfig Using Lucene MatchVersion: 6.0.0
   [junit4]   2> 2044536 INFO  (SUITE-TestGroupingSearch-seed#[5926FD11F35274B]-worker) [    ] o.a.s.c.SolrConfig Loaded SolrConfig: solrconfig.xml
   [junit4]   2> 2044540 INFO  (SUITE-TestGroupingSearch-seed#[5926FD11F35274B]-worker) [    ] o.a.s.s.IndexSchema [null] Schema name=test
   [junit4]   2> 2044634 INFO  (SUITE-TestGroupingSearch-seed#[5926FD11F35274B]-worker) [    ] o.a.s.s.IndexSchema default search field in schema is text
   [junit4]   2> 2044634 INFO  (SUITE-TestGroupingSearch-seed#[5926FD11F35274B]-worker) [    ] o.a.s.s.IndexSchema unique key field: id
   [junit4]   2> 2044635 WARN  (SUITE-TestGroupingSearch-seed#[5926FD11F35274B]-worker) [    ] o.a.s.s.IndexSchema Field text is not multivalued and destination for multiple copyFields (2)
   [junit4]   2> 2044639 INFO  (SUITE-TestGroupingSearch-seed#[5926FD11F35274B]-worker) [    ] o.a.s.s.FileExchangeRateProvider Reloading exchange rates from file currency.xml
   [junit4]   2> 2044641 INFO  (SUITE-TestGroupingSearch-seed#[5926FD11F35274B]-worker) [    ] o.a.s.s.FileExchangeRateProvider Reloading exchange rates from file currency.xml
   [junit4]   2> 2044642 INFO  (SUITE-TestGroupingSearch-seed#[5926FD11F35274B]-worker) [    ] o.a.s.c.SolrResourceLoader JNDI not configured for solr (NoInitialContextEx)
   [junit4]   2> 2044642 INFO  (SUITE-TestGroupingSearch-seed#[5926FD11F35274B]-worker) [    ] o.a.s.c.SolrResourceLoader using system property solr.solr.home: /Users/jenkins/workspace/Lucene-Solr-trunk-MacOSX/solr/core/src/test-files/solr
   [junit4]   2> 2044642 INFO  (SUITE-TestGroupingSearch-seed#[5926FD11F35274B]-worker) [    ] o.a.s.c.SolrResourceLoader new SolrResourceLoader for directory: '/Users/jenkins/workspace/Lucene-Solr-trunk-MacOSX/solr/core/src/test-files/solr'
   [junit4]   2> 2044642 INFO  (SUITE-TestGroupingSearch-seed#[5926FD11F35274B]-worker) [    ] o.a.s.c.SolrResourceLoader JNDI not configured for solr (NoInitialContextEx)
   [junit4]   2> 2044642 INFO  (SUITE-TestGroupingSearch-seed#[5926FD11F35274B]-worker) [    ] o.a.s.c.SolrResourceLoader using system property solr.solr.home: /Users/jenkins/workspace/Lucene-Solr-trunk-MacOSX/solr/core/src/test-files/solr
   [junit4]   2> 2044643 INFO  (SUITE-TestGroupingSearch-seed#[5926FD11F35274B]-worker) [    ] o.a.s.c.CoreContainer New CoreContainer 2009576236
   [junit4]   2> 2044643 INFO  (SUITE-TestGroupingSearch-seed#[5926FD11F35274B]-worker) [    ] o.a.s.c.CoreContainer Loading cores into CoreContainer [instanceDir=/Users/jenkins/workspace/Lucene-Solr-trunk-MacOSX/solr/core/src/test-files/solr]
   [junit4]   2> 2044643 WARN  (SUITE-TestGroupingSearch-seed#[5926FD11F35274B]-worker) [    ] o.a.s.c.CoreContainer Couldn't add files from /Users/jenkins/workspace/Lucene-Solr-trunk-MacOSX/solr/core/src/test-files/solr/lib to classpath: /Users/jenkins/workspace/Lucene-Solr-trunk-MacOSX/solr/core/src/test-files/solr/lib
   [junit4]   2> 2044643 INFO  (SUITE-TestGroupingSearch-seed#[5926FD11F35274B]-worker) [    ] o.a.s.h.c.HttpShardHandlerFactory created with socketTimeout : 600000,connTimeout : 60000,maxConnectionsPerHost : 20,maxConnections : 10000,corePoolSize : 0,maximumPoolSize : 2147483647,maxThreadIdleTime : 5,sizeOfQueue : -1,fairnessPolicy : false,useRetries : false,
   [junit4]   2> 2044653 INFO  (SUITE-TestGroupingSearch-seed#[5926FD11F35274B]-worker) [    ] o.a.s.u.UpdateShardHandler Creating UpdateShardHandler HTTP client with params: socketTimeout=30000&connTimeout=30000&retry=true
   [junit4]   2> 2044654 INFO  (SUITE-TestGroupingSearch-seed#[5926FD11F35274B]-worker) [    ] o.a.s.l.LogWatcher SLF4J impl is org.slf4j.impl.Log4jLoggerFactory
   [junit4]   2> 2044654 INFO  (SUITE-TestGroupingSearch-seed#[5926FD11F35274B]-worker) [    ] o.a.s.l.LogWatcher Registering Log Listener [Log4j (org.slf4j.impl.Log4jLoggerFactory)]
   [junit4]   2> 2044654 INFO  (SUITE-TestGroupingSearch-seed#[5926FD11F35274B]-worker) [    ] o.a.s.c.CoreContainer Security conf doesn't exist. Skipping setup for authorization module.
   [junit4]   2> 2044654 INFO  (SUITE-TestGroupingSearch-seed#[5926FD11F35274B]-worker) [    ] o.a.s.c.CoreContainer No authentication plugin used.
   [junit4]   2> 2044700 INFO  (SUITE-TestGroupingSearch-seed#[5926FD11F35274B]-worker) [    ] o.a.s.c.CoreDescriptor Created CoreDescriptor: {name=collection1, config=solrconfig.xml, transient=false, schema=schema12.xml, loadOnStartup=true, configSetProperties=configsetprops.json, collection=collection1, dataDir=/Users/jenkins/workspace/Lucene-Solr-trunk-MacOSX/solr/build/solr-core/test/J1/temp/solr.TestGroupingSearch_5926FD11F35274B-001/init-core-data-001, shard=shard1}
   [junit4]   2> 2044707 INFO  (coreLoadExecutor-6637-thread-1) [    ] o.a.s.c.SolrResourceLoader new SolrResourceLoader for directory: '/Users/jenkins/workspace/Lucene-Solr-trunk-MacOSX/solr/core/src/test-files/solr/collection1'
   [junit4]   2> 2044707 INFO  (coreLoadExecutor-6637-thread-1) [    ] o.a.s.c.SolrResourceLoader JNDI not configured for solr (NoInitialContextEx)
   [junit4]   2> 2044707 INFO  (coreLoadExecutor-6637-thread-1) [    ] o.a.s.c.SolrResourceLoader using system property solr.solr.home: /Users/jenkins/workspace/Lucene-Solr-trunk-MacOSX/solr/core/src/test-files/solr
   [junit4]   2> 2044708 INFO  (coreLoadExecutor-6637-thread-1) [    ] o.a.s.c.SolrResourceLoader Adding 'file:/Users/jenkins/workspace/Lucene-Solr-trunk-MacOSX/solr/core/src/test-files/solr/collection1/lib/classes/' to classloader
   [junit4]   2> 2044708 INFO  (coreLoadExecutor-6637-thread-1) [    ] o.a.s.c.SolrResourceLoader Adding 'file:/Users/jenkins/workspace/Lucene-Solr-trunk-MacOSX/solr/core/src/test-files/solr/collection1/lib/README' to classloader
   [junit4]   2> 2044744 INFO  (coreLoadExecutor-6637-thread-1) [    ] o.a.s.c.SolrConfig current version of requestparams : -1
   [junit4]   2> 2044804 INFO  (coreLoadExecutor-6637-thread-1) [    ] o.a.s.c.SolrConfig Using Lucene MatchVersion: 6.0.0
   [junit4]   2> 2044818 INFO  (coreLoadExecutor-6637-thread-1) [    ] o.a.s.c.SolrConfig Loaded SolrConfig: solrconfig.xml
   [junit4]   2> 2044825 INFO  (coreLoadExecutor-6637-thread-1) [    ] o.a.s.s.IndexSchema [collection1] Schema name=test
   [junit4]   2> 2044926 INFO  (coreLoadExecutor-6637-thread-1) [    ] o.a.s.s.IndexSchema default search field in schema is text
   [junit4]   2> 2044927 INFO  (coreLoadExecutor-6637-thread-1) [    ] o.a.s.s.IndexSchema unique key field: id
   [junit4]   2> 2044928 WARN  (coreLoadExecutor-6637-thread-1) [    ] o.a.s.s.IndexSchema Field text is not multivalued and destination for multiple copyFields (2)
   [junit4]   2> 2044933 INFO  (coreLoadExecutor-6637-thread-1) [    ] o.a.s.s.FileExchangeRateProvider Reloading exchange rates from file currency.xml
   [junit4]   2> 2044935 INFO  (coreLoadExecutor-6637-thread-1) [    ] o.a.s.s.FileExchangeRateProvider Reloading exchange rates from file currency.xml
   [junit4]   2> 2044942 INFO  (coreLoadExecutor-6637-thread-1) [    ] o.a.s.c.ConfigSetProperties Did not find ConfigSet properties, assuming default properties: Can't find resource 'configsetprops.json' in classpath or '/Users/jenkins/workspace/Lucene-Solr-trunk-MacOSX/solr/core/src/test-files/solr/collection1'
   [junit4]   2> 2044942 INFO  (coreLoadExecutor-6637-thread-1) [    ] o.a.s.c.CoreContainer Creating SolrCore 'collection1' using configuration from instancedir /Users/jenkins/workspace/Lucene-Solr-trunk-MacOSX/solr/core/src/test-files/solr/collection1
   [junit4]   2> 2044942 INFO  (coreLoadExecutor-6637-thread-1) [    x:collection1] o.a.s.c.SolrCore org.apache.solr.core.MockDirectoryFactory
   [junit4]   2> 2044942 INFO  (coreLoadExecutor-6637-thread-1) [    x:collection1] o.a.s.c.SolrCore [[collection1] ] Opening new SolrCore at [/Users/jenkins/workspace/Lucene-Solr-trunk-MacOSX/solr/core/src/test-files/solr/collection1], dataDir=[/Users/jenkins/workspace/Lucene-Solr-trunk-MacOSX/solr/build/solr-core/test/J1/temp/solr.TestGroupingSearch_5926FD11F35274B-001/init-core-data-001/]
   [junit4]   2> 2044942 INFO  (coreLoadExecutor-6637-thread-1) [    x:collection1] o.a.s.c.JmxMonitoredMap JMX monitoring is enabled. Adding Solr mbeans to JMX Server: com.sun.jmx.mbeanserver.JmxMBeanServer@3611d732
   [junit4]   2> 2044943 INFO  (coreLoadExecutor-6637-thread-1) [    x:collection1] o.a.s.c.CachingDirectoryFactory return new directory for /Users/jenkins/workspace/Lucene-Solr-trunk-MacOSX/solr/build/solr-core/test/J1/temp/solr.TestGroupingSearch_5926FD11F35274B-001/init-core-data-001
   [junit4]   2> 2044943 INFO  (coreLoadExecutor-6637-thread-1) [    x:collection1] o.a.s.c.SolrCore New index directory detected: old=null new=/Users/jenkins/workspace/Lucene-Solr-trunk-MacOSX/solr/build/solr-core/test/J1/temp/solr.TestGroupingSearch_5926FD11F35274B-001/init-core-data-001/index/
   [junit4]   2> 2044943 WARN  (coreLoadExecutor-6637-thread-1) [    x:collection1] o.a.s.c.SolrCore [collection1] Solr index directory '/Users/jenkins/workspace/Lucene-Solr-trunk-MacOSX/solr/build/solr-core/test/J1/temp/solr.TestGroupingSearch_5926FD11F35274B-001/init-core-data-001/index' doesn't exist. Creating new index...
   [junit4]   2> 2044943 INFO  (coreLoadExecutor-6637-thread-1) [    x:collection1] o.a.s.c.CachingDirectoryFactory return new directory for /Users/jenkins/workspace/Lucene-Solr-trunk-MacOSX/solr/build/solr-core/test/J1/temp/solr.TestGroupingSearch_5926FD11F35274B-001/init-core-data-001/index
   [junit4]   2> 2044943 INFO  (coreLoadExecutor-6637-thread-1) [    x:collection1] o.a.s.u.RandomMergePolicy RandomMergePolicy wrapping class org.apache.lucene.index.LogByteSizeMergePolicy: [LogByteSizeMergePolicy: minMergeSize=1677721, mergeFactor=27, maxMergeSize=2147483648, maxMergeSizeForForcedMerge=9223372036854775807, calibrateSizeByDeletes=true, maxMergeDocs=2147483647, maxCFSSegmentSizeMB=8.796093022207999E12, noCFSRatio=1.0]
   [junit4]   2> 2044944 INFO  (coreLoadExecutor-6637-thread-1) [    x:collection1] o.a.s.c.SolrDeletionPolicy SolrDeletionPolicy.onCommit: commits: num=1
   [junit4]   2> 	commit{dir=MockDirectoryWrapper(RAMDirectory@71ff9b33 lockFactory=org.apache.lucene.store.SingleInstanceLockFactory@7adb9861),segFN=segments_1,generation=1}
   [junit4]   2> 2044944 INFO  (coreLoadExecutor-6637-thread-1) [    x:collection1] o.a.s.c.SolrDeletionPolicy newest commit generation = 1
   [junit4]   2> 2044944 INFO  (OldIndexDirectoryCleanupThreadForCore-collection1) [    x:collection1] o.a.s.c.SolrCore Looking for old index directories to cleanup for core collection1 in /Users/jenkins/workspace/Lucene-Solr-trunk-MacOSX/solr/build/solr-core/test/J1/temp/solr.TestGroupingSearch_5926FD11F35274B-001/init-core-data-001/
   [junit4]   2> 2044947 INFO  (coreLoadExecutor-6637-thread-1) [    x:collection1] o.a.s.u.p.UpdateRequestProcessorChain creating updateRequestProcessorChain "dedupe"
   [junit4]   2> 2044947 INFO  (coreLoadExecutor-6637-thread-1) [    x:collection1] o.a.s.u.p.UpdateRequestProcessorChain inserting DistributedUpdateProcessorFactory into updateRequestProcessorChain "dedupe"
   [junit4]   2> 2044947 INFO  (coreLoadExecutor-6637-thread-1) [    x:collection1] o.a.s.u.p.UpdateRequestProcessorChain creating updateRequestProcessorChain "dedupe-allfields"
   [junit4]   2> 2044947 INFO  (coreLoadExecutor-6637-thread-1) [    x:collection1] o.a.s.u.p.UpdateRequestProcessorChain inserting DistributedUpdateProcessorFactory into updateRequestProcessorChain "dedupe-allfields"
   [junit4]   2> 2044947 INFO  (coreLoadExecutor-6637-thread-1) [    x:collection1] o.a.s.u.p.UpdateRequestProcessorChain creating updateRequestProcessorChain "stored_sig"
   [junit4]   2> 2044947 INFO  (coreLoadExecutor-6637-thread-1) [    x:collection1] o.a.s.u.p.UpdateRequestProcessorChain inserting DistributedUpdateProcessorFactory into updateRequestProcessorChain "stored_sig"
   [junit4]   2> 2044948 INFO  (coreLoadExecutor-6637-thread-1) [    x:collection1] o.a.s.u.p.UpdateRequestProcessorChain creating updateRequestProcessorChain "uniq-fields"
   [junit4]   2> 2044948 INFO  (coreLoadExecutor-6637-thread-1) [    x:collection1] o.a.s.u.p.UpdateRequestProcessorChain inserting DistributedUpdateProcessorFactory into updateRequestProcessorChain "uniq-fields"
   [junit4]   2> 2044948 INFO  (coreLoadExecutor-6637-thread-1) [    x:collection1] o.a.s.u.p.UpdateRequestProcessorChain creating updateRequestProcessorChain "distrib-dup-test-chain-explicit"
   [junit4]   2> 2044948 INFO  (coreLoadExecutor-6637-thread-1) [    x:collection1] o.a.s.u.p.UpdateRequestProcessorChain creating updateRequestProcessorChain "distrib-dup-test-chain-implicit"
   [junit4]   2> 2044948 INFO  (coreLoadExecutor-6637-thread-1) [    x:collection1] o.a.s.u.p.UpdateRequestProcessorChain inserting DistributedUpdateProcessorFactory into updateRequestProcessorChain "distrib-dup-test-chain-implicit"
   [junit4]   2> 2044948 INFO  (coreLoadExecutor-6637-thread-1) [    x:collection1] o.a.s.c.SolrCore no updateRequestProcessorChain defined as default, creating implicit default
   [junit4]   2> 2044952 INFO  (coreLoadExecutor-6637-thread-1) [    x:collection1] o.a.s.h.l.XMLLoader xsltCacheLifetimeSeconds=60
   [junit4]   2> 2044955 INFO  (coreLoadExecutor-6637-thread-1) [    x:collection1] o.a.s.h.l.XMLLoader xsltCacheLifetimeSeconds=60
   [junit4]   2> 2044958 INFO  (coreLoadExecutor-6637-thread-1) [    x:collection1] o.a.s.h.l.XMLLoader xsltCacheLifetimeSeconds=60
   [junit4]   2> 2044961 INFO  (coreLoadExecutor-6637-thread-1) [    x:collection1] o.a.s.h.l.XMLLoader xsltCacheLifetimeSeconds=60
   [junit4]   2> 2044968 INFO  (coreLoadExecutor-6637-thread-1) [    x:collection1] o.a.s.c.PluginBag requestHandler : 'lazy' created with startup=lazy 
   [junit4]   2> 2044969 INFO  (coreLoadExecutor-6637-thread-1) [    x:collection1] o.a.s.c.RequestHandlers Registered paths: /admin/mbeans,standard,spellCheckCompRH,lazy,/update/json/docs,/admin/luke,/export,spellCheckWithWordbreak_Direct,tvrh,/get,/admin/properties,/update/json,mltrh,/admin/threads,/search-facet-def,/update/csv,/sql,/search-facet-invariants,/admin/segments,spellCheckCompRH1,/mlt,/admin/system,/replication,dismax,defaults,/config,/stream,/schema,/admin/plugins,/admin/logging,spellCheckWithWordbreak,mock,/admin/ping,/update,/admin/file,/terms,spellCheckCompRH_Direct,/debug/dump
   [junit4]   2> 2044969 WARN  (coreLoadExecutor-6637-thread-1) [    x:collection1] o.a.s.c.SolrCore solrconfig.xml uses deprecated <admin/gettableFiles>, Please update your config to use the ShowFileRequestHandler.
   [junit4]   2> 2044969 INFO  (coreLoadExecutor-6637-thread-1) [    x:collection1] o.a.s.c.SolrCore Using default statsCache cache: org.apache.solr.search.stats.LocalStatsCache
   [junit4]   2> 2044970 INFO  (coreLoadExecutor-6637-thread-1) [    x:collection1] o.a.s.u.CommitTracker Hard AutoCommit: disabled
   [junit4]   2> 2044970 INFO  (coreLoadExecutor-6637-thread-1) [    x:collection1] o.a.s.u.CommitTracker Soft AutoCommit: disabled
   [junit4]   2> 2044970 INFO  (coreLoadExecutor-6637-thread-1) [    x:collection1] o.a.s.u.RandomMergePolicy RandomMergePolicy wrapping class org.apache.lucene.index.TieredMergePolicy: [TieredMergePolicy: maxMergeAtOnce=4, maxMergeAtOnceExplicit=6, maxMergedSegmentMB=39.6650390625, floorSegmentMB=0.935546875, forceMergeDeletesPctAllowed=20.81452322341799, segmentsPerTier=42.0, maxCFSSegmentSizeMB=8.796093022207999E12, noCFSRatio=1.0
   [junit4]   2> 2044970 INFO  (coreLoadExecutor-6637-thread-1) [    x:collection1] o.a.s.c.SolrDeletionPolicy SolrDeletionPolicy.onInit: commits: num=1
   [junit4]   2> 	commit{dir=MockDirectoryWrapper(RAMDirectory@71ff9b33 lockFactory=org.apache.lucene.store.SingleInstanceLockFactory@7adb9861),segFN=segments_1,generation=1}
   [junit4]   2> 2044970 INFO  (coreLoadExecutor-6637-thread-1) [    x:collection1] o.a.s.c.SolrDeletionPolicy newest commit generation = 1
   [junit4]   2> 2044971 INFO  (coreLoadExecutor-6637-thread-1) [    x:collection1] o.a.s.s.SolrIndexSearcher Opening [Searcher@75383809[collection1] main]
   [junit4]   2> 2044971 INFO  (coreLoadExecutor-6637-thread-1) [    x:collection1] o.a.s.r.RestManager Initializing RestManager with initArgs: {storageIO=org.apache.solr.rest.ManagedResourceStorage$InMemoryStorageIO}
   [junit4]   2> 2044971 INFO  (coreLoadExecutor-6637-thread-1) [    x:collection1] o.a.s.r.ManagedResourceStorage Reading _rest_managed.json using InMemoryStorage
   [junit4]   2> 2044971 INFO  (coreLoadExecutor-6637-thread-1) [    x:collection1] o.a.s.r.RestManager Initializing 0 registered ManagedResources
   [junit4]   2> 2044971 INFO  (coreLoadExecutor-6637-thread-1) [    x:collection1] o.a.s.h.c.SpellCheckComponent Initializing spell checkers
   [junit4]   2> 2044984 INFO  (coreLoadExecutor-6637-thread-1) [    x:collection1] o.a.s.s.DirectSolrSpellChecker init: {name=direct,classname=DirectSolrSpellChecker,field=lowerfilt,minQueryLength=3}
   [junit4]   2> 2045024 INFO  (coreLoadExecutor-6637-thread-1) [    x:collection1] o.a.s.h.ReplicationHandler Commits will be reserved for  10000
   [junit4]   2> 2045024 INFO  (searcherExecutor-6638-thread-1-processing-x:collection1) [    x:collection1] o.a.s.h.c.SpellCheckComponent Loading spell index for spellchecker: default
   [junit4]   2> 2045024 INFO  (searcherExecutor-6638-thread-1-processing-x:collection1) [    x:collection1] o.a.s.h.c.SpellCheckComponent Loading spell index for spellchecker: direct
   [junit4]   2> 2045025 INFO  (searcherExecutor-6638-thread-1-processing-x:collection1) [    x:collection1] o.a.s.h.c.SpellCheckComponent Loading spell index for spellchecker: wordbreak
   [junit4]   2> 2045025 INFO  (coreLoadExecutor-6637-thread-1) [    x:collection1] o.a.s.c.CoreContainer registering core: collection1
   [junit4]   2> 2045025 INFO  (searcherExecutor-6638-thread-1-processing-x:collection1) [    x:collection1] o.a.s.h.c.SpellCheckComponent Loading spell index for spellchecker: multipleFields
   [junit4]   2> 2045025 INFO  (searcherExecutor-6638-thread-1-processing-x:collection1) [    x:collection1] o.a.s.h.c.SpellCheckComponent Loading spell index for spellchecker: jarowinkler
   [junit4]   2> 2045026 INFO  (searcherExecutor-6638-thread-1-processing-x:collection1) [    x:collection1] o.a.s.h.c.SpellCheckComponent Loading spell index for spellchecker: external
   [junit4]   2> 2045026 INFO  (searcherExecutor-6638-thread-1-processing-x:collection1) [    x:collection1] o.a.s.h.c.SpellCheckComponent Loading spell index for spellchecker: freq
   [junit4]   2> 2045026 INFO  (searcherExecutor-6638-thread-1-processing-x:collection1) [    x:collection1] o.a.s.h.c.SpellCheckComponent Loading spell index for spellchecker: fqcn
   [junit4]   2> 2045027 INFO  (searcherExecutor-6638-thread-1-processing-x:collection1) [    x:collection1] o.a.s.h.c.SpellCheckComponent Loading spell index for spellchecker: perDict
   [junit4]   2> 2045027 INFO  (searcherExecutor-6638-thread-1-processing-x:collection1) [    x:collection1] o.a.s.c.SolrCore [collection1] Registered new searcher Searcher@75383809[collection1] main{ExitableDirectoryReader(UninvertingDirectoryReader())}
   [junit4]   2> 2045029 INFO  (SUITE-TestGroupingSearch-seed#[5926FD11F35274B]-worker) [    ] o.a.s.SolrTestCaseJ4 ####initCore end
   [junit4]   2> 2045033 INFO  (TEST-TestGroupingSearch.testGroupingSimpleFormatStartBiggerThanRows-seed#[5926FD11F35274B]) [    ] o.a.s.SolrTestCaseJ4 ###Starting testGroupingSimpleFormatStartBiggerThanRows
   [junit4]   2> 2045033 INFO  (TEST-TestGroupingSearch.testGroupingSimpleFormatStartBiggerThanRows-seed#[5926FD11F35274B]) [    ] o.a.s.u.DirectUpdateHandler2 [collection1] REMOVING ALL DOCUMENTS FROM INDEX
   [junit4]   2> 2045033 INFO  (TEST-TestGroupingSearch.testGroupingSimpleFormatStartBiggerThanRows-seed#[5926FD11F35274B]) [    ] o.a.s.u.p.LogUpdateProcessorFactory [collection1]  webapp=null path=null params={}{deleteByQuery=*:*} 0 0
   [junit4]   2> 2045035 INFO  (TEST-TestGroupingSearch.testGroupingSimpleFormatStartBiggerThanRows-seed#[5926FD11F35274B]) [    ] o.a.s.u.DirectUpdateHandler2 start commit{,optimize=false,openSearcher=true,waitSearcher=true,expungeDeletes=false,softCommit=false,prepareCommit=false}
   [junit4]   2> 2045036 INFO  (TEST-TestGroupingSearch.testGroupingSimpleFormatStartBiggerThanRows-seed#[5926FD11F35274B]) [    ] o.a.s.c.SolrDeletionPolicy SolrDeletionPolicy.onCommit: commits: num=2
   [junit4]   2> 	commit{dir=MockDirectoryWrapper(RAMDirectory@71ff9b33 lockFactory=org.apache.lucene.store.SingleInstanceLockFactory@7adb9861),segFN=segments_1,generation=1}
   [junit4]   2> 	commit{dir=MockDirectoryWrapper(RAMDirectory@71ff9b33 lockFactory=org.apache.lucene.store.SingleInstanceLockFactory@7adb9861),segFN=segments_2,generation=2}
   [junit4]   2> 2045038 INFO  (TEST-TestGroupingSearch.testGroupingSimpleFormatStartBiggerThanRows-seed#[5926FD11F35274B]) [    ] o.a.s.c.SolrDeletionPolicy newest commit generation = 2
   [junit4]   2> 2045039 INFO  (TEST-TestGroupingSearch.testGroupingSimpleFormatStartBiggerThanRows-seed#[5926FD11F35274B]) [    ] o.a.s.s.SolrIndexSearcher Opening [Searcher@7aff1f56[collection1] main]
   [junit4]   2> 2045039 INFO  (TEST-TestGroupingSearch.testGroupingSimpleFormatStartBiggerThanRows-seed#[5926FD11F35274B]) [    ] o.a.s.u.DirectUpdateHandler2 end_commit_flush
   [junit4]   2> 2045039 INFO  (searcherExecutor-6638-thread-1) [    ] o.a.s.c.SolrCore [collection1] Registered new searcher Searcher@7aff1f56[collection1] main{ExitableDirectoryReader(UninvertingDirectoryReader())}
   [junit4]   2> 2045040 INFO  (TEST-TestGroupingSearch.testGroupingSimpleFormatStartBiggerThanRows-seed#[5926FD11F35274B]) [    ] o.a.s.u.p.LogUpdateProcessorFactory [collection1]  webapp=null path=null params={}{commit=} 0 4
   [junit4]   2> 2045040 INFO  (TEST-TestGroupingSearch.testGroupingSimpleFormatStartBiggerThanRows-seed#[5926FD11F35274B]) [    ] o.a.s.u.p.LogUpdateProcessorFactory [collection1]  webapp=null path=null params={}{add=[1]} 0 0
   [junit4]   2> 2045040 INFO  (TEST-TestGroupingSearch.testGroupingSimpleFormatStartBiggerThanRows-seed#[5926FD11F35274B]) [    ] o.a.s.u.p.LogUpdateProcessorFactory [collection1]  webapp=null path=null params={}{add=[2]} 0 0
   [junit4]   2> 2045041 INFO  (TEST-TestGroupingSearch.testGroupingSimpleFormatStartBiggerThanRows-seed#[5926FD11F35274B]) [    ] o.a.s.u.p.LogUpdateProcessorFactory [collection1]  webapp=null path=null params={}{add=[3]} 0 0
   [junit4]   2> 2045041 INFO  (TEST-TestGroupingSearch.testGroupingSimpleFormatStartBiggerThanRows-seed#[5926FD11F35274B]) [    ] o.a.s.u.p.LogUpdateProcessorFactory [collection1]  webapp=null path=null params={}{add=[4]} 0 0
   [junit4]   2> 2045041 INFO  (TEST-TestGroupingSearch.testGroupingSimpleFormatStartBiggerThanRows-seed#[5926FD11F35274B]) [    ] o.a.s.u.p.LogUpdateProcessorFactory [collection1]  webapp=null path=null params={}{add=[5]} 0 0
   [junit4]   2> 2045041 INFO  (TEST-TestGroupingSearch.testGroupingSimpleFormatStartBiggerThanRows-seed#[5926FD11F35274B]) [    ] o.a.s.u.DirectUpdateHandler2 start commit{,optimize=false,openSearcher=true,waitSearcher=true,expungeDeletes=false,softCommit=false,prepareCommit=false}
   [junit4]   2> 2045043 INFO  (TEST-TestGroupingSearch.testGroupingSimpleFormatStartBiggerThanRows-seed#[5926FD11F35274B]) [    ] o.a.s.c.SolrDeletionPolicy SolrDeletionPolicy.onCommit: commits: num=2
   [junit4]   2> 	commit{dir=MockDirectoryWrapper(RAMDirectory@71ff9b33 lockFactory=org.apache.lucene.store.SingleInstanceLockFactory@7adb9861),segFN=segments_2,generation=2}
   [junit4]   2> 	commit{dir=MockDirectoryWrapper(RAMDirectory@71ff9b33 lockFactory=org.apache.lucene.store.SingleInstanceLockFactory@7adb9861),segFN=segments_3,generation=3}
   [junit4]   2> 2045043 INFO  (TEST-TestGroupingSearch.testGroupingSimpleFormatStartBiggerThanRows-seed#[5926FD11F35274B]) [    ] o.a.s.c.SolrDeletionPolicy newest commit generation = 3
   [junit4]   2> 2045043 INFO  (TEST-TestGroupingSearch.testGroupingSimpleFormatStartBiggerThanRows-seed#[5926FD11F35274B]) [    ] o.a.s.s.SolrIndexSearcher Opening [Searcher@5580f063[collection1] main]
   [junit4]   2> 2045045 INFO  (TEST-TestGroupingSearch.testGroupingSimpleFormatStartBiggerThanRows-seed#[5926FD11F35274B]) [    ] o.a.s.u.DirectUpdateHandler2 end_commit_flush
   [junit4]   2> 2045045 INFO  (searcherExecutor-6638-thread-1) [    ] o.a.s.c.SolrCore [collection1] Registered new searcher Searcher@5580f063[collection1] main{ExitableDirectoryReader(UninvertingDirectoryReader(Uninverting(_0(6.0.0):c5)))}
   [junit4]   2> 2045046 INFO  (TEST-TestGroupingSearch.testGroupingSimpleFormatStartBiggerThanRows-seed#[5926FD11F35274B]) [    ] o.a.s.u.p.LogUpdateProcessorFactory [collection1]  webapp=null path=null params={}{commit=} 0 4
   [junit4]   2> 2045048 INFO  (TEST-TestGroupingSearch.testGroupingSimpleFormatStartBiggerThanRows-seed#[5926FD11F35274B]) [    ] o.a.s.c.S.Request [collection1]  webapp=null path=null params={q=*:*&group.main=true&start=2&rows=1&wt=xml&group.field=id&group=true} hits=5 status=0 QTime=2
   [junit4]   2> 2045048 INFO  (TEST-TestGroupingSearch.testGroupingSimpleFormatStartBiggerThanRows-seed#[5926FD11F35274B]) [    ] o.a.s.SolrTestCaseJ4 ###Ending testGroupingSimpleFormatStartBiggerThanRows
   [junit4]   2> 2045052 INFO  (TEST-TestGroupingSearch.testGroupingGroupSortingScore_basicWithGroupSortEqualToSort-seed#[5926FD11F35274B]) [    ] o.a.s.SolrTestCaseJ4 ###Starting testGroupingGroupSortingScore_basicWithGroupSortEqualToSort
   [junit4]   2> 2045052 INFO  (TEST-TestGroupingSearch.testGroupingGroupSortingScore_basicWithGroupSortEqualToSort-seed#[5926FD11F35274B]) [    ] o.a.s.u.DirectUpdateHandler2 [collection1] REMOVING ALL DOCUMENTS FROM INDEX
   [junit4]   2> 2045052 INFO  (TEST-TestGroupingSearch.testGroupingGroupSortingScore_basicWithGroupSortEqualToSort-seed#[5926FD11F35274B]) [    ] o.a.s.u.p.LogUpdateProcessorFactory [collection1]  webapp=null path=null params={}{deleteByQuery=*:*} 0 0
   [junit4]   2> 2045052 INFO  (TEST-TestGroupingSearch.testGroupingGroupSortingScore_basicWithGroupSortEqualToSort-seed#[5926FD11F35274B]) [    ] o.a.s.u.DirectUpdateHandler2 start commit{,optimize=false,openSearcher=true,waitSearcher=true,expungeDeletes=false,softCommit=false,prepareCommit=false}
   [junit4]   2> 2045052 INFO  (TEST-TestGroupingSearch.testGroupingGroupSortingScore_basicWithGroupSortEqualToSort-seed#[5926FD11F35274B]) [    ] o.a.s.c.SolrDeletionPolicy SolrDeletionPolicy.onCommit: commits: num=2
   [junit4]   2> 	commit{dir=MockDirectoryWrapper(RAMDirectory@71ff9b33 lockFactory=org.apache.lucene.store.SingleInstanceLockFactory@7adb9861),segFN=segments_3,generation=3}
   [junit4]   2> 	commit{dir=MockDirectoryWrapper(RAMDirectory@71ff9b33 lockFactory=org.apache.lucene.store.SingleInstanceLockFactory@7adb9861),segFN=segments_4,generation=4}
   [junit4]   2> 2045052 INFO  (TEST-TestGroupingSearch.testGroupingGroupSortingScore_basicWithGroupSortEqualToSort-seed#[5926FD11F35274B]) [    ] o.a.s.c.SolrDeletionPolicy newest commit generation = 4
   [junit4]   2> 2045053 INFO  (TEST-TestGroupingSearch.testGroupingGroupSortingScore_basicWithGroupSortEqualToSort-seed#[5926FD11F35274B]) [    ] o.a.s.s.SolrIndexSearcher Opening [Searcher@1f6025b2[collection1] main]
   [junit4]   2> 2045053 INFO  (TEST-TestGroupingSearch.testGroupingGroupSortingScore_basicWithGroupSortEqualToSort-seed#[5926FD11F35274B]) [    ] o.a.s.u.DirectUpdateHandler2 end_commit_flush
   [junit4]   2> 2045054 INFO  (searcherExecutor-6638-thread-1) [    ] o.a.s.c.SolrCore [collection1] Registered new searcher Searcher@1f6025b2[collection1] main{ExitableDirectoryReader(UninvertingDirectoryReader())}
   [junit4]   2> 2045054 INFO  (TEST-TestGroupingSearch.testGroupingGroupSortingScore_basicWithGroupSortEqualToSort-seed#[5926FD11F35274B]) [    ] o.a.s.u.p.LogUpdateProcessorFactory [collection1]  webapp=null path=null params={}{commit=} 0 1
   [junit4]   2> 2045055 INFO  (TEST-TestGroupingSearch.testGroupingGroupSortingScore_basicWithGroupSortEqualToSort-seed#[5926FD11F35274B]) [    ] o.a.s.u.p.LogUpdateProcessorFactory [collection1]  webapp=null path=null params={}{add=[1]} 0 0
   [junit4]   2> 2045056 INFO  (TEST-TestGroupingSearch.testGroupingGroupSortingScore_basicWithGroupSortEqualToSort-seed#[5926FD11F35274B]) [    ] o.a.s.u.p.LogUpdateProcessorFactory [collection1]  webapp=null path=null params={}{add=[2]} 0 0
   [junit4]   2> 2045056 INFO  (TEST-TestGroupingSearch.testGroupingGroupSortingScore_basicWithGroupSortEqualToSort-seed#[5926FD11F35274B]) [    ] o.a.s.u.p.LogUpdateProcessorFactory [collection1]  webapp=null path=null params={}{add=[3]} 0 0
   [junit4]   2> 2045057 INFO  (TEST-TestGroupingSearch.testGroupingGroupSortingScore_basicWithGroupSortEqualToSort-seed#[5926FD11F35274B]) [    ] o.a.s.u.p.LogUpdateProcessorFactory [collection1]  webapp=null path=null params={}{add=[4]} 0 0
   [junit4]   2> 2045057 INFO  (TEST-TestGroupingSearch.testGroupingGroupSortingScore_basicWithGroupSortEqualToSort-seed#[5926FD11F35274B]) [    ] o.a.s.u.p.LogUpdateProcessorFactory [collection1]  webapp=null path=null params={}{add=[5]} 0 0
   [junit4]   2> 2045057 INFO  (TEST-TestGroupingSearch.testGroupingGroupSortingScore_basicWithGroupSortEqualToSort-seed#[5926FD11F35274B]) [    ] o.a.s.u.DirectUpdateHandler2 start commit{,optimize=false,openSearcher=true,waitSearcher=true,expungeDeletes=false,softCommit=false,prepareCommit=false}
   [junit4]   2> 2045064 INFO  (TEST-TestGroupingSearch.testGroupingGroupSortingScore_basicWithGroupSortEqualToSort-seed#[5926FD11F35274B]) [    ] o.a.s.c.SolrDeletionPolicy SolrDeletionPolicy.onCommit: commits: num=2
   [junit4]   2> 	commit{dir=MockDirectoryWrapper(RAMDirectory@71ff9b33 lockFactory=org.apache.lucene.store.SingleInstanceLockFactory@7adb9861),segFN=segments_4,generation=4}
   [junit4]   2> 	commit{dir=MockDirectoryWrapper(RAMDirectory@71ff9b33 lockFactory=org.apache.lucene.store.SingleInstanceLockFactory@7adb9861),segFN=segments_5,generation=5}
   [junit4]   2> 2045064 INFO  (TEST-TestGroupingSearch.testGroupingGroupSortingScore_basicWithGroupSortEqualToSort-seed#[5926FD11F35274B]) [    ] o.a.s.c.SolrDeletionPolicy newest commit generation = 5
   [junit4]   2> 2045066 INFO  (TEST-TestGroupingSearch.testGroupingGroupSortingScore_basicWithGroupSortEqualToSort-seed#[5926FD11F35274B]) [    ] o.a.s.s.SolrIndexSearcher Opening [Searcher@58c5ba58[collection1] main]
   [junit4]   2> 2045066 INFO  (TEST-TestGroupingSearch.testGroupingGroupSortingScore_basicWithGroupSortEqualToSort-seed#[5926FD11F35274B]) [    ] o.a.s.u.DirectUpdateHandler2 end_commit_flush
   [junit4]   2> 2045067 INFO  (searcherExecutor-6638-thread-1) [    ] o.a.s.c.SolrCore [collection1] Registered new searcher Searcher@58c5ba58[collection1] main{ExitableDirectoryReader(UninvertingDirectoryReader(Uninverting(_1(6.0.0):c5)))}
   [junit4]   2> 2045067 INFO  (TEST-TestGroupingSearch.testGroupingGroupSortingScore_basicWithGroupSortEqualToSort-seed#[5926FD11F35274B]) [    ] o.a.s.u.p.LogUpdateProcessorFactory [collection1]  webapp=null path=null params={}{commit=} 0 9
   [junit4]   2> 2045072 INFO  (TEST-TestGroupingSearch.testGroupingGroupSortingScore_basicWithGroupSortEqualToSort-seed#[5926FD11F35274B]) [    ] o.a.s.c.S.Request [collection1]  webapp=null path=null params={q={!func}id_i&group.sort=score+desc&sort=score+desc&wt=xml&group.field=name&group=true} hits=5 status=0 QTime=4
   [junit4]   2> 2045074 INFO  (TEST-TestGroupingSearch.testGroupingGroupSortingScore_basicWithGroupSortEqualToSort-seed#[5926FD11F35274B]) [    ] o.a.s.SolrTestCaseJ4 ###Ending testGroupingGroupSortingScore_basicWithGroupSortEqualToSort
   [junit4]   2> 2045076 INFO  (TEST-TestGroupingSearch.testGroupingWithTimeAllowed-seed#[5926FD11F35274B]) [    ] o.a.s.SolrTestCaseJ4 ###Starting testGroupingWithTimeAllowed
   [junit4]   2> 2045077 INFO  (TEST-TestGroupingSearch.testGroupingWithTimeAllowed-seed#[5926FD11F35274B]) [    ] o.a.s.u.DirectUpdateHandler2 [collection1] REMOVING ALL DOCUMENTS FROM INDEX
   [junit4]   2> 2045077 INFO  (TEST-TestGroupingSearch.testGroupingWithTimeAllowed-seed#[5926FD11F35274B]) [    ] o.a.s.u.p.LogUpdateProcessorFactory [collection1]  webapp=null path=null params={}{deleteByQuery=*:*} 0 0
   [junit4]   2> 2045077 INFO  (TEST-TestGroupingSearch.testGroupingWithTimeAllowed-seed#[5926FD11F35274B]) [    ] o.a.s.u.DirectUpdateHandler2 start commit{,optimize=false,openSearcher=true,waitSearcher=true,expungeDeletes=false,softCommit=false,prepareCommit=false}
   [junit4]   2> 2045077 INFO  (TEST-TestGroupingSearch.testGroupingWithTimeAllowed-seed#[5926FD11F35274B]) [    ] o.a.s.c.SolrDeletionPolicy SolrDeletionPolicy.onCommit: commits: num=2
   [junit4]   2> 	commit{dir=MockDirectoryWrapper(RAMDirectory@71ff9b33 lockFactory=org.apache.lucene.store.SingleInstanceLockFactory@7adb9861),segFN=segments_5,generation=5}
   [junit4]   2> 	commit{dir=MockDirectoryWrapper(RAMDirectory@71ff9b33 lockFactory=org.apache.lucene.store.SingleInstanceLockFactory@7adb9861),segFN=segments_6,generation=6}
   [junit4]   2> 2045078 INFO  (TEST-TestGroupingSearch.testGroupingWithTimeAllowed-seed#[5926FD11F35274B]) [    ] o.a.s.c.SolrDeletionPolicy newest commit generation = 6
   [junit4]   2> 2045078 INFO  (TEST-TestGroupingSearch.testGroupingWithTimeAllowed-seed#[5926FD11F35274B]) [    ] o.a.s.s.SolrIndexSearcher Opening [Searcher@754edb74[collection1] main]
   [junit4]   2> 2045078 INFO  (TEST-TestGroupingSearch.testGroupingWithTimeAllowed-seed#[5926FD11F35274B]) [    ] o.a.s.u.DirectUpdateHandler2 end_commit_flush
   [junit4]   2> 2045078 INFO  (searcherExecutor-6638-thread-1) [    ] o.a.s.c.SolrCore [collection1] Registered new searcher Searcher@754edb74[collection1] main{ExitableDirectoryReader(UninvertingDirectoryReader())}
   [junit4]   2> 2045079 INFO  (TEST-TestGroupingSearch.testGroupingWithTimeAllowed-seed#[5926FD11F35274B]) [    ] o.a.s.u.p.LogUpdateProcessorFactory [collection1]  webapp=null path=null params={}{commit=} 0 1
   [junit4]   2> 2045079 INFO  (TEST-TestGroupingSearch.testGroupingWithTimeAllowed-seed#[5926FD11F35274B]) [    ] o.a.s.u.p.LogUpdateProcessorFactory [collection1]  webapp=null path=null params={}{add=[1]} 0 0
   [junit4]   2> 2045080 INFO  (TEST-TestGroupingSearch.testGroupingWithTimeAllowed-seed#[5926FD11F35274B]) [    ] o.a.s.u.p.LogUpdateProcessorFactory [collection1]  webapp=null path=null params={}{add=[2]} 0 0
   [junit4]   2> 2045080 INFO  (TEST-TestGroupingSearch.testGroupingWithTimeAllowed-seed#[5926FD11F35274B]) [    ] o.a.s.u.p.LogUpdateProcessorFactory [collection1]  webapp=null path=null params={}{add=[3]} 0 0
   [junit4]   2> 2045080 INFO  (TEST-TestGroupingSearch.testGroupingWithTimeAllowed-seed#[5926FD11F35274B]) [    ] o.a.s.u.p.LogUpdateProcessorFactory [collection1]  webapp=null path=null params={}{add=[4]} 0 0
   [junit4]   2> 2045080 INFO  (TEST-TestGroupingSearch.testGroupingWithTimeAllowed-seed#[5926FD11F35274B]) [    ] o.a.s.u.p.LogUpdateProcessorFactory [collection1]  webapp=null path=null params={}{add=[5]} 0 0
   [junit4]   2> 2045080 INFO  (TEST-TestGroupingSearch.testGroupingWithTimeAllowed-seed#[5926FD11F35274B]) [    ] o.a.s.u.DirectUpdateHandler2 start commit{,optimize=false,openSearcher=true,waitSearcher=true,expungeDeletes=false,softCommit=false,prepareCommit=false}
   [junit4]   2> 2045081 INFO  (TEST-TestGroupingSearch.testGroupingWithTimeAllowed-seed#[5926FD11F35274B]) [    ] o.a.s.c.SolrDeletionPolicy SolrDeletionPolicy.onCommit: commits: num=2
   [junit4]   2> 	commit{dir=MockDirectoryWrapper(RAMDirectory@71ff9b33 lockFactory=org.apache.lucene.store.SingleInstanceLockFactory@7adb9861),segFN=segments_6,generation=6}
   [junit4]   2> 	commit{dir=MockDirectoryWrapper(RAMDirectory@71ff9b33 lockFactory=org.apache.lucene.store.SingleInstanceLockFactory@7adb9861),segFN=segments_7,generation=7}
   [junit4]   2> 2045081 INFO  (TEST-TestGroupingSearch.testGroupingWithTimeAllowed-seed#[5926FD11F35274B]) [    ] o.a.s.c.SolrDeletionPolicy newest commit generation = 7
   [junit4]   2> 2045082 INFO  (TEST-TestGroupingSearch.testGroupingWithTimeAllowed-seed#[5926FD11F35274B]) [    ] o.a.s.s.SolrIndexSearcher Opening [Searcher@22f2cbad[collection1] main]
   [junit4]   2> 2045082 INFO  (TEST-TestGroupingSearch.testGroupingWithTimeAllowed-seed#[5926FD11F35274B]) [    ] o.a.s.u.DirectUpdateHandler2 end_commit_flush
   [junit4]   2> 2045083 INFO  (searcherExecutor-6638-thread-1) [    ] o.a.s.c.SolrCore [collection1] Registered new searcher Searcher@22f2cbad[collection1] main{ExitableDirectoryReader(UninvertingDirectoryReader(Uninverting(_2(6.0.0):c5)))}
   [junit4]   2> 2045085 INFO  (TEST-TestGroupingSearch.testGroupingWithTimeAllowed-seed#[5926FD11F35274B]) [    ] o.a.s.u.p.LogUpdateProcessorFactory [collection1]  webapp=null path=null params={}{commit=} 0 4
   [junit4]   2> 2045086 INFO  (TEST-TestGroupingSearch.testGroupingWithTimeAllowed-seed#[5926FD11F35274B]) [    ] o.a.s.c.S.Request [collection1]  webapp=null path=null params={q=*:*&timeAllowed=1&group.query=id:1&group.query=id:2&wt=xml&group=true} hits=5 status=0 QTime=0
   [junit4]   2> 2045086 INFO  (TEST-TestGroupingSearch.testGroupingWithTimeAllowed-seed#[5926FD11F35274B]) [    ] o.a.s.SolrTestCaseJ4 ###Ending testGroupingWithTimeAllowed
   [junit4]   2> 2045090 INFO  (TEST-TestGroupingSearch.testGroupingSimpleFormatArrayIndexOutOfBoundsException-seed#[5926FD11F35274B]) [    ] o.a.s.SolrTestCaseJ4 ###Starting testGroupingSimpleFormatArrayIndexOutOfBoundsException
   [junit4]   2> 2045090 INFO  (TEST-TestGroupingSearch.testGroupingSimpleFormatArrayIndexOutOfBoundsException-seed#[5926FD11F35274B]) [    ] o.a.s.u.DirectUpdateHandler2 [collection1] REMOVING ALL DOCUMENTS FROM INDEX
   [junit4]   2> 2045090 INFO  (TEST-TestGroupingSearch.testGroupingSimpleFormatArrayIndexOutOfBoundsException-seed#[5926FD11F35274B]) [    ] o.a.s.u.p.LogUpdateProcessorFactory [collection1]  webapp=null path=null params={}{deleteByQuery=*:*} 0 0
   [junit4]   2> 2045090 INFO  (TEST-TestGroupingSearch.testGroupingSimpleFormatArrayIndexOutOfBoundsException-seed#[5926FD11F35274B]) [    ] o.a.s.u.DirectUpdateHandler2 start commit{,optimize=false,openSearcher=true,waitSearcher=true,expungeDeletes=false,softCommit=false,prepareCommit=false}
   [junit4]   2> 2045091 INFO  (TEST-TestGroupingSearch.testGroupingSimpleFormatArrayIndexOutOfBoundsException-seed#[5926FD11F35274B]) [    ] o.a.s.c.SolrDeletionPolicy SolrDeletionPolicy.onCommit: commits: num=2
   [junit4]   2> 	commit{dir=MockDirectoryWrapper(RAMDirectory@71ff9b33 lockFactory=org.apache.lucene.store.SingleInstanceLockFactory@7adb9861),segFN=segments_7,generation=7}
   [junit4]   2> 	commit{dir=MockDirectoryWrapper(RAMDirectory@71ff9b33 lockFactory=org.apache.lucene.store.SingleInstanceLockFactory@7adb9861),segFN=segments_8,generation=8}
   [junit4]   2> 2045091 INFO  (TEST-TestGroupingSearch.testGroupingSimpleFormatArrayIndexOutOfBoundsException-seed#[5926FD11F35274B]) [    ] o.a.s.c.SolrDeletionPolicy newest commit generation = 8
   [junit4]   2> 2045091 INFO  (TEST-TestGroupingSearch.testGroupingSimpleFormatArrayIndexOutOfBoundsException-seed#[5926FD11F35274B]) [    ] o.a.s.s.SolrIndexSearcher Opening [Searcher@4d84aabc[collection1] main]
   [junit4]   2> 2045091 INFO  (TEST-TestGroupingSearch.testGroupingSimpleFormatArrayIndexOutOfBoundsException-seed#[5926FD11F35274B]) [    ] o.a.s.u.DirectUpdateHandler2 end_commit_flush
   [junit4]   2> 2045092 INFO  (searcherExecutor-6638-thread-1) [    ] o.a.s.c.SolrCore [collection1] Registered new searcher Searcher@4d84aabc[collection1] main{ExitableDirectoryReader(UninvertingDirectoryReader())}
   [junit4]   2> 2045093 INFO  (TEST-TestGroupingSearch.testGroupingSimpleFormatArrayIndexOutOfBoundsException-seed#[5926FD11F35274B]) [    ] o.a.s.u.p.LogUpdateProcessorFactory [collection1]  webapp=null path=null params={}{commit=} 0 2
   [junit4]   2> 2045094 INFO  (TEST-TestGroupingSearch.testGroupingSimpleFormatArrayIndexOutOfBoundsException-seed#[5926FD11F35274B]) [    ] o.a.s.u.p.LogUpdateProcessorFactory [collection1]  webapp=null path=null params={}{add=[1]} 0 0
   [junit4]   2> 2045095 INFO  (TEST-TestGroupingSearch.testGroupingSimpleFormatArrayIndexOutOfBoundsException-seed#[5926FD11F35274B]) [    ] o.a.s.u.p.LogUpdateProcessorFactory [collection1]  webapp=null path=null params={}{add=[2]} 0 1
   [junit4]   2> 2045095 INFO  (TEST-TestGroupingSearch.testGroupingSimpleFormatArrayIndexOutOfBoundsException-seed#[5926FD11F35274B]) [    ] o.a.s.u.p.LogUpdateProcessorFactory [collection1]  webapp=null path=null params={}{add=[3]} 0 0
   [junit4]   2> 2045096 INFO  (TEST-TestGroupingSearch.testGroupingSimpleFormatArrayIndexOutOfBoundsException-seed#[5926FD11F35274B]) [    ] o.a.s.u.DirectUpdateHandler2 start commit{,optimize=false,openSearcher=true,waitSearcher=true,expungeDeletes=false,softCommit=false,prepareCommit=false}
   [junit4]   2> 2045099 INFO  (TEST-TestGroupingSearch.testGroupingSimpleFormatArrayIndexOutOfBoundsException-seed#[5926FD11F35274B]) [    ] o.a.s.c.SolrDeletionPolicy SolrDeletionPolicy.onCommit: commits: num=2
   [junit4]   2> 	commit{dir=MockDirectoryWrapper(RAMDirectory@71ff9b33 lockFactory=org.apache.lucene.store.SingleInstanceLockFactory@7adb9861),segFN=segments_8,generation=8}
   [junit4]   2> 	commit{dir=MockDirectoryWrapper(RAMDirectory@71ff9b33 lockFactory=org.apache.lucene.store.SingleInstanceLockFactory@7adb9861),segFN=segments_9,generation=9}
   [junit4]   2> 2045099 INFO  (TEST-TestGroupingSearch.testGroupingSimpleFormatArrayIndexOutOfBoundsException-seed#[5926FD11F35274B]) [    ] o.a.s.c.SolrDeletionPolicy newest commit generation = 9
   [junit4]   2> 2045100 INFO  (TEST-TestGroupingSearch.testGroupingSimpleFormatArrayIndexOutOfBoundsException-seed#[5926FD11F35274B]) [    ] o.a.s.s.SolrIndexSearcher Opening [Searcher@1e0d8248[collection1] main]
   [junit4]   2> 2045100 INFO  (TEST-TestGroupingSearch.testGroupingSimpleFormatArrayIndexOutOfBoundsException-seed#[5926FD11F35274B]) [    ] o.a.s.u.DirectUpdateHandler2 end_commit_flush
   [junit4]   2> 2045101 INFO  (searcherExecutor-6638-thread-1) [    ] o.a.s.c.SolrCore [collection1] Registered new searcher Searcher@1e0d8248[collection1] main{ExitableDirectoryReader(UninvertingDirectoryReader(Uninverting(_3(6.0.0):c3)))}
   [junit4]   2> 2045102 INFO  (TEST-TestGroupingSearch.testGroupingSimpleFormatArrayIndexOutOfBoundsException-seed#[5926FD11F35274B]) [    ] o.a.s.u.p.LogUpdateProcessorFactory [collection1]  webapp=null path=null params={}{commit=} 0 5
   [junit4]   2> 2045102 INFO  (TEST-TestGroupingSearch.testGroupingSimpleFormatArrayIndexOutOfBoundsException-seed#[5926FD11F35274B]) [    ] o.a.s.c.S.Request [collection1]  webapp=null path=null params={q=*:*&group.main=true&start=1&wt=xml&group.field=id&group=true} hits=3 status=0 QTime=0
   [junit4]   2> 2045103 INFO  (TEST-TestGroupingSearch.testGroupingSimpleFormatArrayIndexOutOfBoundsException-seed#[5926FD11F35274B]) [    ] o.a.s.c.S.Request [collection1]  webapp=null path=null params={q=*:*&group.main=true&start=1&rows=1&wt=xml&group.field=id&group=true} hits=3 status=0 QTime=0
   [junit4]   2> 2045103 INFO  (TEST-TestGroupingSearch.testGroupingSimpleFormatArrayIndexOutOfBoundsException-seed#[5926FD11F35274B]) [    ] o.a.s.SolrTestCaseJ4 ###Ending testGroupingSimpleFormatArrayIndexOutOfBoundsException
   [junit4]   2> 2045109 INFO  (TEST-TestGroupingSearch.testGroupingGroupedBasedFacetingWithTaggedFilter-seed#[5926FD11F35274B]) [    ] o.a.s.SolrTestCaseJ4 ###Starting testGroupingGroupedBasedFacetingWithTaggedFilter
   [junit4]   2> 2045109 INFO  (TEST-TestGroupingSearch.testGroupingGroupedBasedFacetingWithTaggedFilter-seed#[5926FD11F35274B]) [    ] o.a.s.u.DirectUpdateHandler2 [collection1] REMOVING ALL DOCUMENTS FROM INDEX
   [junit4]   2> 2045110 INFO  (TEST-TestGroupingSearch.testGroupingGroupedBasedFacetingWithTaggedFilter-seed#[5926FD11F35274B]) [    ] o.a.s.u.p.LogUpdateProcessorFactory [collection1]  webapp=null path=null params={}{deleteByQuery=*:*} 0 0
   [junit4]   2> 2045110 INFO  (TEST-TestGroupingSearch.testGroupingGroupedBasedFacetingWithTaggedFilter-seed#[5926FD11F35274B]) [    ] o.a.s.u.DirectUpdateHandler2 start commit{,optimize=false,openSearcher=true,waitSearcher=true,expungeDeletes=false,softCommit=false,prepareCommit=false}
   [junit4]   2> 2045110 INFO  (TEST-TestGroupingSearch.testGroupingGroupedBasedFacetingWithTaggedFilter-seed#[5926FD11F35274B]) [    ] o.a.s.c.SolrDeletionPolicy SolrDeletionPolicy.onCommit: commits: num=2
   [junit4]   2> 	commit{dir=MockDirectoryWrapper(RAMDirectory@71ff9b33 lockFactory=org.apache.lucene.store.SingleInstanceLockFactory@7adb9861),segFN=segments_9,generation=9}
   [junit4]   2> 	commit{dir=MockDirectoryWrapper(RAMDirectory@71ff9b33 lockFactory=org.apache.lucene.store.SingleInstanceLockFactory@7adb9861),segFN=segments_a,generation=10}
   [junit4]   2> 2045111 INFO  (TEST-TestGroupingSearch.testGroupingGroupedBasedFacetingWithTaggedFilter-seed#[5926FD11F35274B]) [    ] o.a.s.c.SolrDeletionPolicy newest commit generation = 10
   [junit4]   2> 2045111 INFO  (TEST-TestGroupingSearch.testGroupingGroupedBasedFacetingWithTaggedFilter-seed#[5926FD11F35274B]) [    ] o.a.s.s.SolrIndexSearcher Opening [Searcher@172a98e[collection1] main]
   [junit4]   2> 2045111 INFO  (TEST-TestGroupingSearch.testGroupingGroupedBasedFacetingWithTaggedFilter-seed#[5926FD11F35274B]) [    ] o.a.s.u.DirectUpdateHandler2 end_commit_flush
   [junit4]   2> 2045112 INFO  (searcherExecutor-6638-thread-1) [    ] o.a.s.c.SolrCore [collection1] Registered new searcher Searcher@172a98e[collection1] main{ExitableDirectoryReader(UninvertingDirectoryReader())}
   [junit4]   2> 2045113 INFO  (TEST-TestGroupingSearch.testGroupingGroupedBasedFacetingWithTaggedFilter-seed#[5926FD11F35274B]) [    ] o.a.s.u.p.LogUpdateProcessorFactory [collection1]  webapp=null path=null params={}{commit=} 0 3
   [junit4]   2> 2045114 INFO  (TEST-TestGroupingSearch.testGroupingGroupedBasedFacetingWithTaggedFilter-seed#[5926FD11F35274B]) [    ] o.a.s.u.p.LogUpdateProcessorFactory [collection1]  webapp=null path=null params={}{add=[1]} 0 0
   [junit4]   2> 2045115 INFO  (TEST-TestGroupingSearch.testGroupingGroupedBasedFacetingWithTaggedFilter-seed#[5926FD11F35274B]) [    ] o.a.s.u.p.LogUpdateProcessorFactory [collection1]  webapp=null path=null params={}{add=[2]} 0 0
   [junit4]   2> 2045115 INFO  (TEST-TestGroupingSearch.testGroupingGroupedBasedFacetingWithTaggedFilter-seed#[5926FD11F35274B]) [    ] o.a.s.u.p.LogUpdateProcessorFactory [collection1]  webapp=null path=null params={}{add=[3]} 0 0
   [junit4]   2> 2045115 INFO  (TEST-TestGroupingSearch.testGroupingGroupedBasedFacetingWithTaggedFilter-seed#[5926FD11F35274B]) [    ] o.a.s.u.p.LogUpdateProcessorFactory [collection1]  webapp=null path=null params={}{add=[4]} 0 0
   [junit4]   2> 2045116 INFO  (TEST-TestGroupingSearch.testGroupingGroupedBasedFacetingWithTaggedFilter-seed#[5926FD11F35274B]) [    ] o.a.s.u.p.LogUpdateProcessorFactory [collection1]  webapp=null path=null params={}{add=[5]} 0 0
   [junit4]   2> 2045116 INFO  (TEST-TestGroupingSearch.testGroupingGroupedBasedFacetingWithTaggedFilter-seed#[5926FD11F35274B]) [    ] o.a.s.u.DirectUpdateHandler2 start commit{,optimize=false,openSearcher=true,waitSearcher=true,expungeDeletes=false,softCommit=false,prepareCommit=false}
   [junit4]   2> 2045120 INFO  (TEST-TestGroupingSearch.testGroupingGroupedBasedFacetingWithTaggedFilter-seed#[5926FD11F35274B]) [    ] o.a.s.c.SolrDeletionPolicy SolrDeletionPolicy.onCommit: commits: num=2
   [junit4]   2> 	commit{dir=MockDirectoryWrapper(RAMDirectory@71ff9b33 lockFactory=org.apache.lucene.store.SingleInstanceLockFactory@7adb9861),segFN=segments_a,generation=10}
   [junit4]   2> 	commit{dir=MockDirectoryWrapper(RAMDirectory@71ff9b33 lockFactory=org.apache.lucene.store.SingleInstanceLockFactory@7adb9861),segFN=segments_b,generation=11}
   [junit4]   2> 2045120 INFO  (TEST-TestGroupingSearch.testGroupingGroupedBasedFacetingWithTaggedFilter-seed#[5926FD11F35274B]) [    ] o.a.s.c.SolrDeletionPolicy newest commit generation = 11
   [junit4]   2> 2045121 INFO  (TEST-TestGroupingSearch.testGroupingGroupedBasedFacetingWithTaggedFilter-seed#[5926FD11F35274B]) [    ] o.a.s.s.SolrIndexSearcher Opening [Searcher@50326a1c[collection1] main]
   [junit4]   2> 2045121 INFO  (TEST-TestGroupingSearch.testGroupingGroupedBasedFacetingWithTaggedFilter-seed#[5926FD11F35274B]) [    ] o.a.s.u.DirectUpdateHandler2 end_commit_flush
   [junit4]   2> 2045122 INFO  (searcherExecutor-6638-thread-1) [    ] o.a.s.c.SolrCore [collection1] Registered new searcher Searcher@50326a1c[collection1] main{ExitableDirectoryReader(UninvertingDirectoryReader(Uninverting(_4(6.0.0):c5)))}
   [junit4]   2> 2045123 INFO  (TEST-TestGroupingSearch.testGroupingGroupedBasedFacetingWithTaggedFilter-seed#[5926FD11F35274B]) [    ] o.a.s.u.p.LogUpdateProcessorFactory [collection1]  webapp=null path=null params={}{commit=} 0 6
   [junit4]   2> 2045155 INFO  (TEST-TestGroupingSearch.testGroupingGroupedBasedFacetingWithTaggedFilter-seed#[5926FD11F35274B]) [    ] o.a.s.c.S.Request [collection1]  webapp=null path=null params={facet.query={!ex%3Dchk+key%3DLW1}bday:[2013-01-11T00:00:00Z+TO+2013-01-17T23:59:59Z]&facet.query={!ex%3Dchk+key%3DLM1}bday:[2012-12-18T00:00:00Z+TO+2013-01-17T23:59:59Z]&facet.query={!ex%3Dchk+key%3DLM3}bday:[2012-10-18T00:00:00Z+TO+2013-01-17T23:59:59Z]&q=*:*&group.sort=bday+desc&group.truncate=true&fl=id&sort=cat_sI+asc&fq={!tag%3Dchk}bday:[2012-12-18T00:00:00Z+TO+2013-01-17T23:59:59Z]&rows=1&facet=true&wt=xml&group.field=cat_sI&group=true} hits=2 status=0 QTime=32
   [junit4]   2> 2045156 INFO  (TEST-TestGroupingSearch.testGroupingGroupedBasedFacetingWithTaggedFilter-seed#[5926FD11F35274B]) [    ] o.a.s.SolrTestCaseJ4 ###Ending testGroupingGroupedBasedFacetingWithTaggedFilter
   [junit4]   2> 2045158 INFO  (TEST-TestGroupingSearch.testGroupAPI-seed#[5926FD11F35274B]) [    ] o.a.s.SolrTestCaseJ4 ###Starting testGroupAPI
   [junit4]   2> 2045159 INFO  (TEST-TestGroupingSearch.testGroupAPI-seed#[5926FD11F35274B]) [    ] o.a.s.u.DirectUpdateHandler2 [collection1] REMOVING ALL DOCUMENTS FROM INDEX
   [junit4]   2> 2045159 INFO  (TEST-TestGroupingSearch.testGroupAPI-seed#[5926FD11F35274B]) [    ] o.a.s.u.p.LogUpdateProcessorFactory [collection1]  webapp=null path=null params={}{deleteByQuery=*:*} 0 0
   [junit4]   2> 2045159 INFO  (TEST-TestGroupingSearch.testGroupAPI-seed#[5926FD11F35274B]) [    ] o.a.s.u.DirectUpdateHandler2 start commit{,optimize=false,openSearcher=true,waitSearcher=true,expungeDeletes=false,softCommit=false,prepareCommit=false}
   [junit4]   2> 2045159 INFO  (TEST-TestGroupingSearch.testGroupAPI-seed#[5926FD11F35274B]) [    ] o.a.s.c.SolrDeletionPolicy SolrDeletionPolicy.onCommit: commits: num=2
   [junit4]   2> 	commit{dir=MockDirectoryWrapper(RAMDirectory@71ff9b33 lockFactory=org.apache.lucene.store.SingleInstanceLockFactory@7adb9861),segFN=segments_b,generation=11}
   [junit4]   2> 	commit{dir=MockDirectoryWrapper(RAMDirectory@71ff9b33 lockFactory=org.apache.lucene.store.SingleInstanceLockFactory@7adb9861),segFN=segments_c,generation=12}
   [junit4]   2> 2045160 INFO  (TEST-TestGroupingSearch.testGroupAPI-seed#[5926FD11F35274B]) [    ] o.a.s.c.SolrDeletionPolicy newest commit generation = 12
   [junit4]   2> 2045160 INFO  (TEST-TestGroupingSearch.testGroupAPI-seed#[5926FD11F35274B]) [    ] o.a.s.s.SolrIndexSearcher Opening [Searcher@7d6b13e8[collection1] main]
   [junit4]   2> 2045160 INFO  (TEST-TestGroupingSearch.testGroupAPI-seed#[5926FD11F35274B]) [    ] o.a.s.u.DirectUpdateHandler2 end_commit_flush
   [junit4]   2> 2045171 INFO  (searcherExecutor-6638-thread-1) [    ] o.a.s.c.SolrCore [collection1] Registered new searcher Searcher@7d6b13e8[collection1] main{ExitableDirectoryReader(UninvertingDirectoryReader())}
   [junit4]   2> 2045177 INFO  (TEST-TestGroupingSearch.testGroupAPI-seed#[5926FD11F35274B]) [    ] o.a.s.u.p.LogUpdateProcessorFactory [collection1]  webapp=null path=null params={}{commit=} 0 17
   [junit4]   2> 2045178 INFO  (TEST-TestGroupingSearch.testGroupAPI-seed#[5926FD11F35274B]) [    ] o.a.s.u.p.LogUpdateProcessorFactory [collection1]  webapp=null path=null params={}{add=[1]} 0 0
   [junit4]   2> 2045179 INFO  (TEST-TestGroupingSearch.testGroupAPI-seed#[5926FD11F35274B]) [    ] o.a.s.u.p.LogUpdateProcessorFactory [collection1]  webapp=null path=null params={}{add=[2]} 0 0
   [junit4]   2> 2045179 INFO  (TEST-TestGroupingSearch.testGroupAPI-seed#[5926FD11F35274B]) [    ] o.a.s.u.p.LogUpdateProcessorFactory [collection1]  webapp=null path=null params={}{add=[3]} 0 0
   [junit4]   2> 2045180 INFO  (TEST-TestGroupingSearch.testGroupAPI-seed#[5926FD11F35274B]) [    ] o.a.s.u.DirectUpdateHandler2 start commit{,optimize=false,openSearcher=true,waitSearcher=true,expungeDeletes=false,softCommit=false,prepareCommit=false}
   [junit4]   2> 2045182 INFO  (TEST-TestGroupingSearch.testGroupAPI-seed#[5926FD11F35274B]) [    ] o.a.s.c.SolrDeletionPolicy SolrDeletionPolicy.onCommit: commits: num=2
   [junit4]   2> 	commit{dir=MockDirectoryWrapper(RAMDirectory@71ff9b33 lockFactory=org.apache.lucene.store.SingleInstanceLockFactory@7adb9861),segFN=segments_c,generation=12}
   [junit4]   2> 	commit{dir=MockDirectoryWrapper(RAMDirectory@71ff9b33 lockFactory=org.apache.lucene.store.SingleInstanceLockFactory@7adb9861),segFN=segments_d,generation=13}
   [junit4]   2> 2045182 INFO  (TEST-TestGroupingSearch.testGroupAPI-seed#[5926FD11F35274B]) [    ] o.a.s.c.SolrDeletionPolicy newest commit generation = 13
   [junit4]   2> 2045183 INFO  (TEST-TestGroupingSearch.testGroupAPI-seed#[5926FD11F35274B]) [    ] o.a.s.s.SolrIndexSearcher Opening [Searcher@4d89a54b[collection1] main]
   [junit4]   2> 2045184 INFO  (TEST-TestGroupingSearch.testGroupAPI-seed#[5926FD11F35274B]) [    ] o.a.s.u.DirectUpdateHandler2 end_commit_flush
   [junit4]   2> 2045191 INFO  (searcherExecutor-6638-thread-1) [    ] o.a.s.c.SolrCore [collection1] Registered new searcher Searcher@4d89a54b[collection1] main{ExitableDirectoryReader(UninvertingDirectoryReader(Uninverting(_5(6.0.0):c3)))}
   [junit4]   2> 2045191 INFO  (TEST-TestGroupingSearch.testGroupAPI-seed#[5926FD11F35274B]) [    ] o.a.s.u.p.LogUpdateProcessorFactory [collection1]  webapp=null path=null params={}{commit=} 0 11
   [junit4]   2> 2045192 INFO  (TEST-TestGroupingSearch.testGroupAPI-seed#[5926FD11F35274B]) [    ] o.a.s.u.p.LogUpdateProcessorFactory [collection1]  webapp=null path=null params={}{add=[4]} 0 0
   [junit4]   2> 2045192 INFO  (TEST-TestGroupingSearch.testGroupAPI-seed#[5926FD11F35274B]) [    ] o.a.s.u.p.LogUpdateProcessorFactory [collection1]  webapp=null path=null params={}{add=[5]} 0 0
   [junit4]   2> 2045192 INFO  (TEST-TestGroupingSearch.testGroupAPI-seed#[5926FD11F35274B]) [    ] o.a.s.u.p.LogUpdateProcessorFactory [collection1]  webapp=null path=null params={}{add=[6]} 0 0
   [junit4]   2> 2045192 INFO  (TEST-TestGroupingSearch.testGroupAPI-seed#[5926FD11F35274B]) [    ] o.a.s.u.p.LogUpdateProcessorFactory [collection1]  webapp=null path=null params={}{add=[7]} 0 0
   [junit4]   2> 2045193 INFO  (TEST-TestGroupingSearch.testGroupAPI-seed#[5926FD11F35274B]) [    ] o.a.s.u.DirectUpdateHandler2 start commit{,optimize=false,openSearcher=true,waitSearcher=true,expungeDeletes=false,softCommit=false,prepareCommit=false}
   [junit4]   2> 2045196 INFO  (TEST-TestGroupingSearch.testGroupAPI-seed#[5926FD11F35274B]) [    ] o.a.s.c.SolrDeletionPolicy SolrDeletionPolicy.onCommit: commits: num=2
   [junit4]   2> 	commit{dir=MockDirectoryWrapper(RAMDirectory@71ff9b33 lockFactory=org.apache.lucene.store.SingleInstanceLockFactory@7adb9861),segFN=segments_d,generation=13}
   [junit4]   2> 	commit{dir=MockDirectoryWrapper(RAMDirectory@71ff9b33 lockFactory=org.apache.lucene.store.SingleInstanceLockFactory@7adb9861),segFN=segments_e,generation=14}
   [junit4]   2> 2045196 INFO  (TEST-TestGroupingSearch.testGroupAPI-seed#[5926FD11F35274B]) [    ] o.a.s.c.SolrDeletionPolicy newest commit generation = 14
   [junit4]   2> 2045196 INFO  (TEST-TestGroupingSearch.testGroupAPI-seed#[5926FD11F35274B]) [    ] o.a.s.s.SolrIndexSearcher Opening [Searcher@4446d784[collection1] main]
   [junit4]   2> 2045197 INFO  (TEST-TestGroupingSearch.testGroupAPI-seed#[5926FD11F35274B]) [    ] o.a.s.u.DirectUpdateHandler2 end_commit_flush
   [junit4]   2> 2045198 INFO  (searcherExecutor-6638-thread-1) [    ] o.a.s.c.SolrCore [collection1] Registered new searcher Searcher@4446d784[collection1] main{ExitableDirectoryReader(UninvertingDirectoryReader(Uninverting(_5(6.0.0):c3) Uninverting(_6(6.0.0):c4)))}
   [junit4]   2> 2045199 INFO  (TEST-TestGroupingSearch.testGroupAPI-seed#[5926FD11F35274B]) [    ] o.a.s.u.p.LogUpdateProcessorFactory [collection1]  webapp=null path=null params={}{commit=} 0 6
   [junit4]   2> 2045200 INFO  (TEST-TestGroupingSearch.testGroupAPI-seed#[5926FD11F35274B]) [    ] o.a.s.u.p.LogUpdateProcessorFactory [collection1]  webapp=null path=null params={}{add=[8]} 0 1
   [junit4]   2> 2045201 INFO  (TEST-TestGroupingSearch.testGroupAPI-seed#[5926FD11F35274B]) [    ] o.a.s.u.p.LogUpdateProcessorFactory [collection1]  webapp=null path=null params={}{add=[9]} 0 0
   [junit4]   2> 2045201 INFO  (TEST-TestGroupingSearch.testGroupAPI-seed#[5926FD11F35274B]) [    ] o.a.s.u.DirectUpdateHandler2 start commit{,optimize=false,openSearcher=true,waitSearcher=true,expungeDeletes=false,softCommit=false,prepareCommit=false}
   [junit4]   2> 2045204 INFO  (TEST-TestGroupingSearch.testGroupAPI-seed#[5926FD11F35274B]) [    ] o.a.s.c.SolrDeletionPolicy SolrDeletionPolicy.onCommit: commits: num=2
   [junit4]   2> 	commit{dir=MockDirectoryWrapper(RAMDirectory@71ff9b33 lockFactory=org.apache.lucene.store.SingleInstanceLockFactory@7adb9861),segFN=segments_e,generation=14}
   [junit4]   2> 	commit{dir=MockDirectoryWrapper(RAMDirectory@71ff9b33 lockFactory=org.apache.lucene.store.SingleInstanceLockFactory@7adb9861),segFN=segments_f,generation=15}
   [junit4]   2> 2045204 INFO  (TEST-TestGroupingSearch.testGroupAPI-seed#[5926FD11F35274B]) [    ] o.a.s.c.SolrDeletionPolicy newest commit generation = 15
   [junit4]   2> 2045205 INFO  (TEST-TestGroupingSearch.testGroupAPI-seed#[5926FD11F35274B]) [    ] o.a.s.s.SolrIndexSearcher Opening [Searcher@61a4739f[collection1] main]
   [junit4]   2> 2045205 INFO  (TEST-TestGroupingSearch.testGroupAPI-seed#[5926FD11F35274B]) [    ] o.a.s.u.DirectUpdateHandler2 end_commit_flush
   [junit4]   2> 2045207 INFO  (searcherExecutor-6638-thread-1) [    ] o.a.s.c.SolrCore [collection1] Registered new searcher Searcher@61a4739f[collection1] main{ExitableDirectoryReader(UninvertingDirectoryReader(Uninverting(_5(6.0.0):c3) Uninverting(_6(6.0.0):c4) Uninverting(_7(6.0.0):c2)))}
   [junit4]   2> 2045210 INFO  (TEST-TestGroupingSearch.testGroupAPI-seed#[5926FD11F35274B]) [    ] o.a.s.u.p.LogUpdateProcessorFactory [collection1]  webapp=null path=null params={}{commit=} 0 8
   [junit4]   2> 2045211 INFO  (TEST-TestGroupingSearch.testGroupAPI-seed#[5926FD11F35274B]) [    ] o.a.s.u.p.LogUpdateProcessorFactory [collection1]  webapp=null path=null params={}{add=[10]} 0 0
   [junit4]   2> 2045211 INFO  (TEST-TestGroupingSearch.testGroupAPI-seed#[5926FD11F35274B]) [    ] o.a.s.u.DirectUpdateHandler2 start commit{,optimize=false,openSearcher=true,waitSearcher=true,expungeDeletes=false,softCommit=false,prepareCommit=false}
   [junit4]   2> 2045232 INFO  (TEST-TestGroupingSearch.testGroupAPI-seed#[5926FD11F35274B]) [    ] o.a.s.c.SolrDeletionPolicy SolrDeletionPolicy.onCommit: commits: num=2
   [junit4]   2> 	commit{dir=MockDirectoryWrapper(RAMDirectory@71ff9b33 lockFactory=org.apache.lucene.store.SingleInstanceLockFactory@7adb9861),segFN=segments_f,generation=15}
   [junit4]   2> 	commit{dir=MockDirectoryWrapper(RAMDirectory@71ff9b33 lockFactory=org.apache.lucene.store.SingleInstanceLockFactory@7adb9861),segFN=segments_g,generation=16}
   [junit4]   2> 2045233 INFO  (TEST-TestGroupingSearch.testGroupAPI-seed#[5926FD11F35274B]) [    ] o.a.s.c.SolrDeletionPolicy newest commit generation = 16
   [junit4]   2> 2045234 INFO  (TEST-TestGroupingSearch.testGroupAPI-seed#[5926FD11F35274B]) [    ] o.a.s.s.SolrIndexSearcher Opening [Searcher@2e8fe2e2[collection1] main]
   [junit4]   2> 2045234 INFO  (TEST-TestGroupingSearch.testGroupAPI-seed#[5926FD11F35274B]) [    ] o.a.s.u.DirectUpdateHandler2 end_commit_flush
   [junit4]   2> 2045235 INFO  (searcherExecutor-6638-thread-1) [    ] o.a.s.c.SolrCore [collection1] Registered new searcher Searcher@2e8fe2e2[collection1] main{ExitableDirectoryReader(UninvertingDirectoryReader(Uninverting(_9(6.0.0):c10)))}
   [junit4]   2> 2045236 INFO  (TEST-TestGroupingSearch.testGroupAPI-seed#[5926FD11F35274B]) [    ] o.a.s.u.p.LogUpdateProcessorFactory [collection1]  webapp=null path=null params={}{commit=} 0 25
   [junit4]   2> 2045238 INFO  (TEST-TestGroupingSearch.testGroupAPI-seed#[5926FD11F35274B]) [    ] o.a.s.c.S.Request [collection1]  webapp=null path=null params={q={!func}foo2_i&fq=foo_i:[*+TO+*]&wt=xml&group.field=foo_i&group=true} hits=10 status=0 QTime=0
   [junit4]   2> 2045239 INFO  (TEST-TestGroupingSearch.testGroupAPI-seed#[5926FD11F35274B]) [    ] o.a.s.c.S.Request [collection1]  webapp=null path=null params={q={!func}foo2_i&fl=id&fq=foo_i:[*+TO+*]&wt=xml&group.field=foo_i&group=true} hits=10 status=0 QTime=0
   [junit4]   2> 2045239 INFO  (TEST-TestGroupingSearch.testGroupAPI-seed#[5926FD11F35274B]) [    ] o.a.s.c.S.Request [collection1]  webapp=null path=null params={q={!func}foo2_i&fl=id&fq=foo_i:[*+TO+*]&fq=foo_i:2&wt=xml&group.field=foo_i&group=true} hits=3 status=0 QTime=0
   [junit4]   2> 2045240 INFO  (TEST-TestGroupingSearch.testGroupAPI-seed#[5926FD11F35274B]) [    ] o.a.s.c.S.Request [collection1]  webapp=null path=null params={q={!func}foo2_i&fl=id&fq=foo_i:[*+TO+*]&rows=2&wt=xml&group.field=foo_i&group=true} hits=10 status=0 QTime=0
   [junit4]   2> 2045240 INFO  (TEST-TestGroupingSearch.testGroupAPI-seed#[5926FD11F35274B]) [    ] o.a.s.c.S.Request [collection1]  webapp=null path=null params={q={!func}foo2_i&fl=id&start=1&fq=foo_i:[*+TO+*]&rows=1&wt=xml&group.field=foo_i&group=true} hits=10 status=0 QTime=0
   [junit4]   2> 2045241 INFO  (TEST-TestGroupingSearch.testGroupAPI-seed#[5926FD11F35274B]) [    ] o.a.s.c.S.Request [collection1]  webapp=null path=null params={q={!func}foo2_i&fl=id&start=100&fq=foo_i:[*+TO+*]&rows=1&wt=xml&group.field=foo_i&group=true} hits=10 status=0 QTime=0
   [junit4]   2> 2045241 INFO  (TEST-TestGroupingSearch.testGroupAPI-seed#[5926FD11F35274B]) [    ] o.a.s.c.S.Request [collection1]  webapp=null path=null params={q={!func}foo2_i&fl=id&group.limit=3&fq=foo_i:[*+TO+*]&rows=2&wt=xml&group.field=foo_i&group=true} hits=10 status=0 QTime=0
   [junit4]   2> 2045242 INFO  (TEST-TestGroupingSearch.testGroupAPI-seed#[5926FD11F35274B]) [    ] o.a.s.c.S.Request [collection1]  webapp=null path=null params={q={!func}foo2_i&fl=id&group.limit=3&fq=foo_i:[*+TO+*]&group.offset=1&rows=2&wt=xml&group.field=foo_i&group=true} hits=10 status=0 QTime=0
   [junit4]   2> 2045242 INFO  (TEST-TestGroupingSearch.testGroupAPI-seed#[5926FD11F35274B]) [    ] o.a.s.c.S.Request [collection1]  webapp=null path=null params={q={!func}foo2_i&fl=id&group.limit=3&fq=foo_i:[*+TO+*]&group.offset=10&rows=2&wt=xml&group.field=foo_i&group=true} hits=10 status=0 QTime=0
   [junit4]   2> 2045242 INFO  (TEST-TestGroupingSearch.testGroupAPI-seed#[5926FD11F35274B]) [    ] o.a.s.c.S.Request [collection1]  webapp=null path=null params={q={!func}foo2_i&indent=off&fl=id,score&group.limit=2&fq=foo_i:[*+TO+*]&rows=2&wt=xml&group.field=foo_i&group=true} hits=10 status=0 QTime=0
   [junit4]   2> 2045243 INFO  (TEST-TestGroupingSearch.testGroupAPI-seed#[5926FD11F35274B]) [    ] o.a.s.c.S.Request [collection1]  webapp=null path=null params={q={!func}foo2_i&fl=id&fq=foo_i:[*+TO+*]&group.func=add(foo_i,foo_i)&rows=2&wt=xml&group=true} hits=10 status=0 QTime=0
   [junit4]   2> 2045244 INFO  (TEST-TestGroupingSearch.testGroupAPI-seed#[5926FD11F35274B]) [    ] o.a.s.c.S.Request [collection1]  webapp=null path=null params={q={!func}foo2_i&facet.field=foo_i&fl=id&fq=foo_i:[*+TO+*]&facet=true&wt=xml&group.field=foo_i&group=true} hits=10 status=0 QTime=0
   [junit4]   2> 2045245 INFO  (TEST-TestGroupingSearch.testGroupAPI-seed#[5926FD11F35274B]) [    ] o.a.s.c.S.Request [collection1]  webapp=null path=null params={q={!func}foo2_i&hl=true&fl=id&fq=foo_i:[*+TO+*]&hl.fl=foo_i&wt=xml&group.field=foo_i&group=true} hits=10 status=0 QTime=0
   [junit4]   2> 2045245 INFO  (TEST-TestGroupingSearch.testGroupAPI-seed#[5926FD11F35274B]) [    ] o.a.s.c.S.Request [collection1]  webapp=null path=null params={q={!func}foo2_i&fl=id&fq=foo_i:[*+TO+*]&wt=xml&group.field=foo_i&debugQuery=true&group=true} hits=10 status=0 QTime=0
   [junit4]   2> 2045246 INFO  (TEST-TestGroupingSearch.testGroupAPI-seed#[5926FD11F35274B]) [    ] o.a.s.c.S.Request [collection1]  webapp=null path=null params={q={!func}foo2_i&fl=id&group.limit=3&fq=foo_i:[*+TO+*]&group.query=id:[2+TO+5]&wt=xml&group=true} hits=10 status=0 QTime=0
   [junit4]   2> 2045246 ERROR (TEST-TestGroupingSearch.testGroupAPI-seed#[5926FD11F35274B]) [    ] o.a.s.SolrTestCaseJ4 query failed JSON validation. error=mismatch: '2'!='5' @ grouped/id:[2 TO 5]/doclist/docs/[2]/id
   [junit4]   2>  expected =/grouped=={'id:[2 TO 5]':{'matches':10,'doclist':{'numFound':4,'start':0,'docs':[{'id':'3'},{'id':'4'},{'id':'2'}]}}}
   [junit4]   2>  response = {
   [junit4]   2>   "responseHeader":{
   [junit4]   2>     "status":0,
   [junit4]   2>     "QTime":0},
   [junit4]   2>   "grouped":{
   [junit4]   2>     "id:[2 TO 5]":{
   [junit4]   2>       "matches":10,
   [junit4]   2>       "doclist":{"numFound":4,"start":0,"docs":[
   [junit4]   2>           {
   [junit4]   2>             "id":"3"},
   [junit4]   2>           {
   [junit4]   2>             "id":"4"},
   [junit4]   2>           {
   [junit4]   2>             "id":"5"}]
   [junit4]   2>       }}}}
   [junit4]   2> 
   [junit4]   2>  request = q={!func}foo2_i&fl=id&group.limit=3&fq=foo_i:[*+TO+*]&group.query=id:[2+TO+5]&wt=xml&group=true
   [junit4]   2> 2045247 INFO  (TEST-TestGroupingSearch.testGroupAPI-seed#[5926FD11F35274B]) [    ] o.a.s.SolrTestCaseJ4 ###Ending testGroupAPI
   [junit4]   2> NOTE: reproduce with: ant test  -Dtestcase=TestGroupingSearch -Dtests.method=testGroupAPI -Dtests.seed=5926FD11F35274B -Dtests.slow=true -Dtests.locale=sr-ME -Dtests.timezone=America/Aruba -Dtests.asserts=true -Dtests.file.encoding=US-ASCII
   [junit4] ERROR   0.09s J1 | TestGroupingSearch.testGroupAPI <<<
   [junit4]    > Throwable #1: java.lang.RuntimeException: mismatch: '2'!='5' @ grouped/id:[2 TO 5]/doclist/docs/[2]/id
   [junit4]    > 	at __randomizedtesting.SeedInfo.seed([5926FD11F35274B:98375B9C8C08D761]:0)
   [junit4]    > 	at org.apache.solr.SolrTestCaseJ4.assertJQ(SolrTestCaseJ4.java:842)
   [junit4]    > 	at org.apache.solr.SolrTestCaseJ4.assertJQ(SolrTestCaseJ4.java:789)
   [junit4]    > 	at org.apache.solr.TestGroupingSearch.testGroupAPI(TestGroupingSearch.java:546)
   [junit4]    > 	at java.lang.Thread.run(Thread.java:745)
   [junit4]   2> 2045266 INFO  (TEST-TestGroupingSearch.testGroupingGroupSortingScore_withTotalGroupCount-seed#[5926FD11F35274B]) [    ] o.a.s.SolrTestCaseJ4 ###Starting testGroupingGroupSortingScore_withTotalGroupCount
   [junit4]   2> 2045268 INFO  (TEST-TestGroupingSearch.testGroupingGroupSortingScore_withTotalGroupCount-seed#[5926FD11F35274B]) [    ] o.a.s.u.DirectUpdateHandler2 [collection1] REMOVING ALL DOCUMENTS FROM INDEX
   [junit4]   2> 2045276 INFO  (TEST-TestGroupingSearch.testGroupingGroupSortingScore_withTotalGroupCount-seed#[5926FD11F35274B]) [    ] o.a.s.u.p.LogUpdateProcessorFactory [collection1]  webapp=null path=null params={}{deleteByQuery=*:*} 0 8
   [junit4]   2> 2045277 INFO  (TEST-TestGroupingSearch.testGroupingGroupSortingScore_withTotalGroupCount-seed#[5926FD11F35274B]) [    ] o.a.s.u.DirectUpdateHandler2 start commit{,optimize=false,openSearcher=true,waitSearcher=true,expungeDeletes=false,softCommit=false,prepareCommit=false}
   [junit4]   2> 2045277 INFO  (TEST-TestGroupingSearch.testGroupingGroupSortingScore_withTotalGroupCount-seed#[5926FD11F35274B]) [    ] o.a.s.c.SolrDeletionPolicy SolrDeletionPolicy.onCommit: commits: num=2
   [junit4]   2> 	commit{dir=MockDirectoryWrapper(RAMDirectory@71ff9b33 lockFactory=org.apache.lucene.store.SingleInstanceLockFactory@7adb9861),segFN=segments_g,generation=16}
   [junit4]   2> 	commit{dir=MockDirectoryWrapper(RAMDirectory@71ff9b33 lockFactory=org.apache.lucene.store.SingleInstanceLockFactory@7adb9861),segFN=segments_h,generation=17}
   [junit4]   2> 2045277 INFO  (TEST-TestGroupingSearch.testGroupingGroupSortingScore_withTotalGroupCount-seed#[5926FD11F35274B]) [    ] o.a.s.c.SolrDeletionPolicy newest commit generation = 17
   [junit4]   2> 2045277 INFO  (TEST-TestGroupingSearch.testGroupingGroupSortingScore_withTotalGroupCount-seed#[5926FD11F35274B]) [    ] o.a.s.s.SolrIndexSearcher Opening [Searcher@5129af55[collection1] main]
   [junit4]   2> 2045277 INFO  (TEST-TestGroupingSearch.testGroupingGroupSortingScore_withTotalGroupCount-seed#[5926FD11F35274B]) [    ] o.a.s.u.DirectUpdateHandler2 end_commit_flush
   [junit4]   2> 2045278 INFO  (searcherExecutor-6638-thread-1) [    ] o.a.s.c.SolrCore [collection1] Registered new searcher Searcher@5129af55[collection1] main{ExitableDirectoryReader(UninvertingDirectoryReader())}
   [junit4]   2> 2045279 INFO  (TEST-TestGroupingSearch.testGroupingGroupSortingScore_withTotalGroupCount-seed#[5926FD11F35274B]) [    ] o.a.s.u.p.LogUpdateProcessorFactory [collection1]  webapp=null path=null params={}{commit=} 0 2
   [junit4]   2> 2045280 INFO  (TEST-TestGroupingSearch.testGroupingGroupSortingScore_withTotalGroupCount-seed#[5926FD11F35274B]) [    ] o.a.s.u.p.LogUpdateProcessorFactory [collection1]  webapp=null path=null params={}{add=[1]} 0 0
   [junit4]   2> 2045280 INFO  (TEST-TestGroupingSearch.testGroupingGroupSortingScore_withTotalGroupCount-seed#[5926FD11F35274B]) [    ] o.a.s.u.p.LogUpdateProcessorFactory [collection1]  webapp=null path=null params={}{add=[2]} 0 0
   [junit4]   2> 2045280 INFO  (TEST-TestGroupingSearch.testGroupingGroupSortingScore_withTotalGroupCount-seed#[5926FD11F35274B]) [    ] o.a.s.u.p.LogUpdateProcessorFactory [collection1]  webapp=null path=null params={}{add=[3]} 0 0
   [junit4]   2> 2045280 INFO  (TEST-TestGroupingSearch.testGroupingGroupSortingScore_withTotalGroupCount-seed#[5926FD11F35274B]) [    ] o.a.s.u.p.LogUpdateProcessorFactory [collection1]  webapp=null path=null params={}{add=[4]} 0 0
   [junit4]   2> 2045281 INFO  (TEST-TestGroupingSearch.testGroupingGroupSortingScore_withTotalGroupCount-seed#[5926FD11F35274B]) [    ] o.a.s.u.p.LogUpdateProcessorFactory [collection1]  webapp=null path=null params={}{add=[5]} 0 0
   [junit4]   2> 2045281 INFO  (TEST-TestGroupingSearch.testGroupingGroupSortingScore_withTotalGroupCount-seed#[5926FD11F35274B]) [    ] o.a.s.u.DirectUpdateHandler2 start commit{,optimize=false,openSearcher=true,waitSearcher=true,expungeDeletes=false,softCommit=false,prepareCommit=false}
   [junit4]   2> 2045283 INFO  (TEST-TestGroupingSearch.testGroupingGroupSortingScore_withTotalGroupCount-seed#[5926FD11F35274B]) [    ] o.a.s.c.SolrDeletionPolicy SolrDeletionPolicy.onCommit: commits: num=2
   [junit4]   2> 	commit{dir=MockDirectoryWrapper(RAMDirectory@71ff9b33 lockFactory=org.apache.lucene.store.SingleInstanceLockFactory@7adb9861),segFN=segments_h,generation=17}
   [junit4]   2> 	commit{dir=MockDirectoryWrapper(RAMDirectory@71ff9b33 lockFactory=org.apache.lucene.store.SingleInstanceLockFactory@7adb9861),segFN=segments_i,generation=18}
   [junit4]   2> 2045283 INFO  (TEST-TestGroupingSearch.testGroupingGroupSortingScore_withTotalGroupCount-seed#[5926FD11F35274B]) [    ] o.a.s.c.SolrDeletionPolicy newest commit generation = 18
   [junit4]   2> 2045284 INFO  (TEST-TestGroupingSearch.testGroupingGroupSortingScore_withTotalGroupCount-seed#[5926FD11F35274B]) [    ] o.a.s.s.SolrIndexSearcher Opening [Searcher@16429d64[collection1] main]
   [junit4]   2> 2045284 INFO  (TEST-TestGroupingSearch.testGroupingGroupSortingScore_withTotalGroupCount-seed#[5926FD11F35274B]) [    ] o.a.s.u.DirectUpdateHandler2 end_commit_flush
   [junit4]   2> 2045288 INFO  (searcherExecutor-6638-thread-1) [    ] o.a.s.c.SolrCore [collection1] Registered new searcher Searcher@16429d64[collection1] main{ExitableDirectoryReader(UninvertingDirectoryReader(Uninverting(_a(6.0.0):c5)))}
   [junit4]   2> 2045290 INFO  (TEST-TestGroupingSearch.testGroupingGroupSortingScore_withTotalGroupCount-seed#[5926FD11F35274B]) [    ] o.a.s.u.p.LogUpdateProcessorFactory [collection1]  webapp=null path=null params={}{commit=} 0 8
   [junit4]   2> 2045291 INFO  (TEST-TestGroupingSearch.testGroupingGroupSortingScore_withTotalGroupCount-seed#[5926FD11F35274B]) [    ] o.a.s.c.S.Request [collection1]  webapp=null path=null params={q={!func}id_i&group.ngroups=true&wt=xml&group.field=name&group=true} hits=5 status=0 QTime=0
   [junit4]   2> 2045293 INFO  (TEST-TestGroupingSearch.testGroupingGroupSortingScore_withTotalGroupCount-seed#[5926FD11F35274B]) [    ] o.a.s.c.S.Request [collection1]  webapp=null path=null params={q={!func}id_i&group.ngroups=true&wt=xml&group.field=group_i&group=true} hits=5 status=0 QTime=0
   [junit4]   2> 2045294 INFO  (TEST-TestGroupingSearch.testGroupingGroupSortingScore_withTotalGroupCount-seed#[5926FD11F35274B]) [    ] o.a.s.SolrTestCaseJ4 ###Ending testGroupingGroupSortingScore_withTotalGroupCount
   [junit4]   2> 2045300 INFO  (TEST-TestGroupingSearch.testGroupingGroupSortingScore_basic-seed#[5926FD11F35274B]) [    ] o.a.s.SolrTestCaseJ4 ###Starting testGroupingGroupSortingScore_basic
   [junit4]   2> 2045301 INFO  (TEST-TestGroupingSearch.testGroupingGroupSortingScore_basic-seed#[5926FD11F35274B]) [    ] o.a.s.u.DirectUpdateHandler2 [collection1] REMOVING ALL DOCUMENTS FROM INDEX
   [junit4]   2> 2045301 INFO  (TEST-TestGroupingSearch.testGroupingGroupSortingScore_basic-seed#[5926FD11F35274B]) [    ] o.a.s.u.p.LogUpdateProcessorFactory [collection1]  webapp=null path=null params={}{deleteByQuery=*:*} 0 0
   [junit4]   2> 2045301 INFO  (TEST-TestGroupingSearch.testGroupingGroupSortingScore_basic-seed#[5926FD11F35274B]) [    ] o.a.s.u.DirectUpdateHandler2 start commit{,optimize=false,openSearcher=true,waitSearcher=true,expungeDeletes=false,softCommit=false,prepareCommit=false}
   [junit4]   2> 2045301 INFO  (TEST-TestGroupingSearch.testGroupingGroupSortingScore_basic-seed#[5926FD11F35274B]) [    ] o.a.s.c.SolrDeletionPolicy SolrDeletionPolicy.onCommit: commits: num=2
   [junit4]   2> 	commit{dir=MockDirectoryWrapper(RAMDirectory@71ff9b33 lockFactory=org.apache.lucene.store.SingleInstanceLockFactory@7adb9861),segFN=segments_i,generation=18}
   [junit4]   2> 	commit{dir=MockDirectoryWrapper(RAMDirectory@71ff9b33 lockFactory=org.apache.lucene.store.SingleInstanceLockFactory@7adb9861),segFN=segments_j,generation=19}
   [junit4]   2> 2045302 INFO  (TEST-TestGroupingSearch.testGroupingGroupSortingScore_basic-seed#[5926FD11F35274B]) [    ] o.a.s.c.SolrDeletionPolicy newest commit generation = 19
   [junit4]   2> 2045304 INFO  (TEST-TestGroupingSearch.testGroupingGroupSortingScore_basic-seed#[5926FD11F35274B]) [    ] o.a.s.s.SolrIndexSearcher Opening [Searcher@64b991cd[collection1] main]
   [junit4]   2> 2045304 INFO  (TEST-TestGroupingSearch.testGroupingGroupSortingScore_basic-seed#[5926FD11F35274B]) [    ] o.a.s.u.DirectUpdateHandler2 end_commit_flush
   [junit4]   2> 2045305 INFO  (searcherExecutor-6638-thread-1) [    ] o.a.s.c.SolrCore [collection1] Registered new searcher Searcher@64b991cd[collection1] main{ExitableDirectoryReader(UninvertingDirectoryReader())}
   [junit4]   2> 2045306 INFO  (TEST-TestGroupingSearch.testGroupingGroupSortingScore_basic-seed#[5926FD11F35274B]) [    ] o.a.s.u.p.LogUpdateProcessorFactory [collection1]  webapp=null path=null params={}{commit=} 0 4
   [junit4]   2> 2045307 INFO  (TEST-TestGroupingSearch.testGroupingGroupSortingScore_basic-seed#[5926FD11F35274B]) [    ] o.a.s.u.p.LogUpdateProcessorFactory [collection1]  webapp=null path=null params={}{add=[1]} 0 0
   [junit4]   2> 2045307 INFO  (TEST-TestGroupingSearch.testGroupingGroupSortingScore_basic-seed#[5926FD11F35274B]) [    ] o.a.s.u.p.LogUpdateProcessorFactory [collection1]  webapp=null path=null params={}{add=[2]} 0 0
   [junit4]   2> 2045307 INFO  (TEST-TestGroupingSearch.testGroupingGroupSortingScore_basic-seed#[5926FD11F35274B]) [    ] o.a.s.u.p.LogUpdateProcessorFactory [collection1]  webapp=null path=null params={}{add=[3]} 0 0
   [junit4]   2> 2045308 INFO  (TEST-TestGroupingSearch.testGroupingGroupSortingScore_basic-seed#[5926FD11F35274B]) [    ] o.a.s.u.p.LogUpdateProcessorFactory [collection1]  webapp=null path=null params={}{add=[4]} 0 0
   [junit4]   2> 2045308 INFO  (TEST-TestGroupingSearch.testGroupingGroupSortingScore_basic-seed#[5926FD11F35274B]) [    ] o.a.s.u.p.LogUpdateProcessorFactory [collection1]  webapp=null path=null params={}{add=[5]} 0 0
   [junit4]   2> 2045309 INFO  (TEST-TestGroupingSearch.testGroupingGroupSortingScore_basic-seed#[5926FD11F35274B]) [    ] o.a.s.u.DirectUpdateHandler2 start commit{,optimize=false,openSearcher=true,waitSearcher=true,expungeDeletes=false,softCommit=false,prepareCommit=false}
   [junit4]   2> 2045315 INFO  (TEST-TestGroupingSearch.testGroupingGroupSortingScore_basic-seed#[5926FD11F35274B]) [    ] o.a.s.c.SolrDeletionPolicy SolrDeletionPolicy.onCommit: commits: num=2
   [junit4]   2> 	commit{dir=MockDirectoryWrapper(RAMDirectory@71ff9b33 lockFactory=org.apache.lucene.store.SingleInstanceLockFactory@7adb9861),segFN=segments_j,generation=19}
   [junit4]   2> 	commit{dir=MockDirectoryWrapper(RAMDirectory@71ff9b33 lockFactory=org.apache.lucene.store.SingleInstanceLockFactory@7adb9861),segFN=segments_k,generation=20}
   [junit4]   2> 2045316 INFO  (TEST-TestGroupingSearch.testGroupingGroupSortingScore_basic-seed#[5926FD11F35274B]) [    ] o.a.s.c.SolrDeletionPolicy newest commit generation = 20
   [junit4]   2> 2045317 INFO  (TEST-TestGroupingSearch.testGroupingGroupSortingScore_basic-seed#[5926FD11F35274B]) [    ] o.a.s.s.SolrIndexSearcher Opening [Searcher@6e64a8b5[collection1] main]
   [junit4]   2> 2045317 INFO  (TEST-TestGroupingSearch.testGroupingGroupSortingScore_basic-seed#[5926FD11F35274B]) [    ] o.a.s.u.DirectUpdateHandler2 end_commit_flush
   [junit4]   2> 2045318 INFO  (searcherExecutor-6638-thread-1) [    ] o.a.s.c.SolrCore [collection1] Registered new searcher Searcher@6e64a8b5[collection1] main{ExitableDirectoryReader(UninvertingDirectoryReader(Uninverting(_b(6.0.0):c5)))}
   [junit4]   2> 2045319 INFO  (TEST-TestGroupingSearch.testGroupingGroupSortingScore_basic-seed#[5926FD11F35274B]) [    ] o.a.s.u.p.LogUpdateProcessorFactory [collection1]  webapp=null path=null params={}{commit=} 0 10
   [junit4]   2> 2045319 INFO  (TEST-TestGroupingSearch.testGroupingGroupSortingScore_basic-seed#[5926FD11F35274B]) [    ] o.a.s.c.S.Request [collection1]  webapp=null path=null params={q={!func}id_i&fl=id,+score&wt=xml&group.field=name&group=true} hits=5 status=0 QTime=0
   [junit4]   2> 2045330 INFO  (TEST-TestGroupingSearch.testGroupingGroupSortingScore_basic-seed#[5926FD11F35274B]) [    ] o.a.s.c.S.Request [collection1]  webapp=null path=null params={q=title:title&wt=xml&group.field=group_i&group=true} hits=5 status=0 QTime=0
   [junit4]   2> 2045333 INFO  (TEST-TestGroupingSearch.testGroupingGroupSortingScore_basic-seed#[5926FD11F35274B]) [    ] o.a.s.SolrTestCaseJ4 ###Ending testGroupingGroupSortingScore_basic
   [junit4]   2> 2045336 INFO  (TEST-TestGroupingSearch.testGroupingGroupSortingWeight-seed#[5926FD11F35274B]) [    ] o.a.s.SolrTestCaseJ4 ###Starting testGroupingGroupSortingWeight
   [junit4]   2> 2045336 INFO  (TEST-TestGroupingSearch.testGroupingGroupSortingWeight-seed#[5926FD11F35274B]) [    ] o.a.s.u.DirectUpdateHandler2 [collection1] REMOVING ALL DOCUMENTS FROM INDEX
   [junit4]   2> 2045336 INFO  (TEST-TestGroupingSearch.testGroupingGroupSortingWeight-seed#[5926FD11F35274B]) [    ] o.a.s.u.p.LogUpdateProcessorFactory [collection1]  webapp=null path=null params={}{deleteByQuery=*:*} 0 0
   [junit4]   2> 2045337 INFO  (TEST-TestGroupingSearch.testGroupingGroupSortingWeight-seed#[5926FD11F35274B]) [    ] o.a.s.u.DirectUpdateHandler2 start commit{,optimize=false,openSearcher=true,waitSearcher=true,expungeDeletes=false,softCommit=false,prepareCommit=false}
   [junit4]   2> 2045337 INFO  (TEST-TestGroupingSearch.testGroupingGroupSortingWeight-seed#[5926FD11F35274B]) [    ] o.a.s.c.SolrDeletionPolicy SolrDeletionPolicy.onCommit: commits: num=2
   [junit4]   2> 	commit{dir=MockDirectoryWrapper(RAMDirectory@71ff9b33 lockFactory=org.apache.lucene.store.SingleInstanceLockFactory@7adb9861),segFN=segments_k,generation=20}
   [junit4]   2> 	commit{dir=MockDirectoryWrapper(RAMDirectory@71ff9b33 lockFactory=org.apache.lucene.store.SingleInstanceLockFactory@7adb9861),segFN=segments_l,generation=21}
   [junit4]   2> 2045337 INFO  (TEST-TestGroupingSearch.testGroupingGroupSortingWeight-seed#[5926FD11F35274B]) [    ] o.a.s.c.SolrDeletionPolicy newest commit generation = 21
   [junit4]   2> 2045337 INFO  (TEST-TestGroupingSearch.testGroupingGroupSortingWeight-seed#[5926FD11F35274B]) [    ] o.a.s.s.SolrIndexSearcher Opening [Searcher@531af6d1[collection1] main]
   [junit4]   2> 2045337 INFO  (TEST-TestGroupingSearch.testGroupingGroupSortingWeight-seed#[5926FD11F35274B]) [    ] o.a.s.u.DirectUpdateHandler2 end_commit_flush
   [junit4]   2> 2045338 INFO  (searcherExecutor-6638-thread-1) [    ] o.a.s.c.SolrCore [collection1] Registered new searcher Searcher@531af6d1[collection1] main{ExitableDirectoryReader(UninvertingDirectoryReader())}
   [junit4]   2> 2045339 INFO  (TEST-TestGroupingSearch.testGroupingGroupSortingWeight-seed#[5926FD11F35274B]) [    ] o.a.s.u.p.LogUpdateProcessorFactory [collection1]  webapp=null path=null params={}{commit=} 0 2
   [junit4]   2> 2045339 INFO  (TEST-TestGroupingSearch.testGroupingGroupSortingWeight-seed#[5926FD11F35274B]) [    ] o.a.s.u.p.LogUpdateProcessorFactory [collection1]  webapp=null path=null params={}{add=[1]} 0 0
   [junit4]   2> 2045340 INFO  (TEST-TestGroupingSearch.testGroupingGroupSortingWeight-seed#[5926FD11F35274B]) [    ] o.a.s.u.p.LogUpdateProcessorFactory [collection1]  webapp=null path=null params={}{add=[2]} 0 0
   [junit4]   2> 2045340 INFO  (TEST-TestGroupingSearch.testGroupingGroupSortingWeight-seed#[5926FD11F35274B]) [    ] o.a.s.u.p.LogUpdateProcessorFactory [collection1]  webapp=null path=null params={}{add=[3]} 0 0
   [junit4]   2> 2045340 INFO  (TEST-TestGroupingSearch.testGroupingGroupSortingWeight-seed#[5926FD11F35274B]) [    ] o.a.s.u.p.LogUpdateProcessorFactory [collection1]  webapp=null path=null params={}{add=[4]} 0 0
   [junit4]   2> 2045340 INFO  (TEST-TestGroupingSearch.testGroupingGroupSortingWeight-seed#[5926FD11F35274B]) [    ] o.a.s.u.DirectUpdateHandler2 start commit{,optimize=false,openSearcher=true,waitSearcher=true,expungeDeletes=false,softCommit=false,prepareCommit=false}
   [junit4]   2> 2045342 INFO  (TEST-TestGroupingSearch.testGroupingGroupSortingWeight-seed#[5926FD11F35274B]) [    ] o.a.s.c.SolrDeletionPolicy SolrDeletionPolicy.onCommit: commits: num=2
   [junit4]   2> 	commit{dir=MockDirectoryWrapper(RAMDirectory@71ff9b33 lockFactory=org.apache.lucene.store.SingleInstanceLockFactory@7adb986

[...truncated too long message...]

s=6 status=0 QTime=0
   [junit4]   2> 2048948 INFO  (TEST-TestGroupingSearch.testGroupingSimpleFormatArrayIndexOutOfBoundsExceptionWithJavaBin-seed#[5926FD11F35274B]) [    ] o.a.s.SolrTestCaseJ4 ###Ending testGroupingSimpleFormatArrayIndexOutOfBoundsExceptionWithJavaBin
   [junit4]   2> 2048948 INFO  (SUITE-TestGroupingSearch-seed#[5926FD11F35274B]-worker) [    ] o.a.s.SolrTestCaseJ4 ###deleteCore
   [junit4]   2> 2048948 INFO  (SUITE-TestGroupingSearch-seed#[5926FD11F35274B]-worker) [    ] o.a.s.c.CoreContainer Shutting down CoreContainer instance=2009576236
   [junit4]   2> 2048949 INFO  (coreCloseExecutor-6642-thread-1) [    x:collection1] o.a.s.c.SolrCore [collection1]  CLOSING SolrCore org.apache.solr.core.SolrCore@81d3303
   [junit4]   2> 2048949 INFO  (coreCloseExecutor-6642-thread-1) [    x:collection1] o.a.s.u.DirectUpdateHandler2 closing DirectUpdateHandler2{commits=55,autocommits=0,soft autocommits=0,optimizes=1,rollbacks=0,expungeDeletes=0,docsPending=0,adds=0,deletesById=0,deletesByQuery=0,errors=0,cumulative_adds=255,cumulative_deletesById=0,cumulative_deletesByQuery=27,cumulative_errors=0}
   [junit4]   2> 2048949 INFO  (coreCloseExecutor-6642-thread-1) [    x:collection1] o.a.s.u.SolrCoreState Closing SolrCoreState
   [junit4]   2> 2048949 INFO  (coreCloseExecutor-6642-thread-1) [    x:collection1] o.a.s.u.DefaultSolrCoreState SolrCoreState ref count has reached 0 - closing IndexWriter
   [junit4]   2> 2048949 INFO  (coreCloseExecutor-6642-thread-1) [    x:collection1] o.a.s.u.DefaultSolrCoreState closing IndexWriter with IndexWriterCloser
   [junit4]   2> 2048950 INFO  (coreCloseExecutor-6642-thread-1) [    x:collection1] o.a.s.c.SolrCore [collection1] Closing main searcher on request.
   [junit4]   2> 2048965 INFO  (coreCloseExecutor-6642-thread-1) [    x:collection1] o.a.s.c.CachingDirectoryFactory Closing MockDirectoryFactory - 2 directories currently being tracked
   [junit4]   2> 2048965 INFO  (coreCloseExecutor-6642-thread-1) [    x:collection1] o.a.s.c.CachingDirectoryFactory looking to close /Users/jenkins/workspace/Lucene-Solr-trunk-MacOSX/solr/build/solr-core/test/J1/temp/solr.TestGroupingSearch_5926FD11F35274B-001/init-core-data-001 [CachedDir<<refCount=0;path=/Users/jenkins/workspace/Lucene-Solr-trunk-MacOSX/solr/build/solr-core/test/J1/temp/solr.TestGroupingSearch_5926FD11F35274B-001/init-core-data-001;done=false>>]
   [junit4]   2> 2048965 INFO  (coreCloseExecutor-6642-thread-1) [    x:collection1] o.a.s.c.CachingDirectoryFactory Closing directory: /Users/jenkins/workspace/Lucene-Solr-trunk-MacOSX/solr/build/solr-core/test/J1/temp/solr.TestGroupingSearch_5926FD11F35274B-001/init-core-data-001
   [junit4]   2> 2048965 INFO  (coreCloseExecutor-6642-thread-1) [    x:collection1] o.a.s.c.CachingDirectoryFactory looking to close /Users/jenkins/workspace/Lucene-Solr-trunk-MacOSX/solr/build/solr-core/test/J1/temp/solr.TestGroupingSearch_5926FD11F35274B-001/init-core-data-001/index [CachedDir<<refCount=0;path=/Users/jenkins/workspace/Lucene-Solr-trunk-MacOSX/solr/build/solr-core/test/J1/temp/solr.TestGroupingSearch_5926FD11F35274B-001/init-core-data-001/index;done=false>>]
   [junit4]   2> 2048965 INFO  (coreCloseExecutor-6642-thread-1) [    x:collection1] o.a.s.c.CachingDirectoryFactory Closing directory: /Users/jenkins/workspace/Lucene-Solr-trunk-MacOSX/solr/build/solr-core/test/J1/temp/solr.TestGroupingSearch_5926FD11F35274B-001/init-core-data-001/index
   [junit4]   2> NOTE: leaving temporary files on disk at: /Users/jenkins/workspace/Lucene-Solr-trunk-MacOSX/solr/build/solr-core/test/J1/temp/solr.TestGroupingSearch_5926FD11F35274B-001
   [junit4]   2> NOTE: test params are: codec=Asserting(Lucene60): {cat_sI=FSTOrd50, nullfirst=FSTOrd50, store_rpt=PostingsFormat(name=LuceneFixedGap), small_i=PostingsFormat(name=LuceneVarGapFixedInterval), foo2_i=PostingsFormat(name=MockRandom), title=PostingsFormat(name=LuceneFixedGap), small_s1=PostingsFormat(name=MockRandom), value1_s1=PostingsFormat(name=LuceneVarGapFixedInterval), bday=PostingsFormat(name=MockRandom), group_i=FSTOrd50, score_f=FSTOrd50, value3_s1=FSTOrd50, id=PostingsFormat(name=LuceneVarGapFixedInterval), text=FSTOrd50, store_0_coordinate=FSTOrd50, foo_i=PostingsFormat(name=LuceneFixedGap), weight=PostingsFormat(name=LuceneFixedGap), foo_s1=FSTOrd50, title_lettertok=PostingsFormat(name=LuceneVarGapFixedInterval), id_i=FSTOrd50, store_1_coordinate=PostingsFormat(name=LuceneFixedGap), title_stemmed=PostingsFormat(name=LuceneFixedGap), name=PostingsFormat(name=LuceneVarGapFixedInterval), value2_i=FSTOrd50, value1_i=PostingsFormat(name=MockRandom), value4_i=PostingsFormat(name=LuceneVarGapFixedInterval)}, docValues:{}, sim=ClassicSimilarity, locale=sr-ME, timezone=America/Aruba
   [junit4]   2> NOTE: Mac OS X 10.8.5 x86_64/Oracle Corporation 1.8.0_72 (64-bit)/cpus=3,threads=1,free=114898376,total=529530880
   [junit4]   2> NOTE: All tests run in this JVM: [TestCopyFieldCollectionResource, TestBM25SimilarityFactory, TestFieldCollectionResource, TestConfigReload, HdfsRecoveryZkTest, TestNonDefinedSimilarityFactory, TestRTimerTree, TestTestInjection, TestFieldSortValues, FullSolrCloudDistribCmdsTest, TestBinaryField, HdfsLockFactoryTest, ZkSolrClientTest, CheckHdfsIndexTest, TestFastWriter, TestDistribDocBasedVersion, CollectionTooManyReplicasTest, MergeStrategyTest, SuggesterTSTTest, FieldMutatingUpdateProcessorTest, MultiThreadedOCPTest, TlogReplayBufferedWhileIndexingTest, HLLSerializationTest, SpatialHeatmapFacetsTest, HighlighterMaxOffsetTest, ShowFileRequestHandlerTest, DirectoryFactoryTest, IndexSchemaRuntimeFieldTest, TestQueryUtils, OverseerRolesTest, ParsingFieldUpdateProcessorsTest, EnumFieldTest, TestSmileRequest, TestCloudPivotFacet, TestBadConfig, FieldAnalysisRequestHandlerTest, TestSha256AuthenticationProvider, OpenCloseCoreStressTest, TestWriterPerf, CdcrVersionReplicationTest, TestSuggestSpellingConverter, TestMacros, TestShortCircuitedRequests, SuggesterWFSTTest, TestStressRecovery, DebugComponentTest, StatsComponentTest, TestCloudManagedSchemaConcurrent, SolrIndexSplitterTest, ConcurrentDeleteAndCreateCollectionTest, DirectSolrConnectionTest, LoggingHandlerTest, TestDynamicLoading, TestMaxScoreQueryParser, LeaderElectionIntegrationTest, TestAuthenticationFramework, TestConfigSetProperties, DeleteInactiveReplicaTest, SmileWriterTest, BasicDistributedZk2Test, TestMiniSolrCloudClusterBase, TestSolr4Spatial, LeaderInitiatedRecoveryOnShardRestartTest, HdfsDirectoryFactoryTest, TestTrieFacet, TestManagedResourceStorage, TestManagedSchemaDynamicFieldResource, TestRangeQuery, TestExceedMaxTermLength, TestRebalanceLeaders, ChaosMonkeySafeLeaderTest, HdfsBasicDistributedZkTest, HdfsWriteToMultipleCollectionsTest, DataDrivenBlockJoinTest, RequestHandlersTest, TestZkChroot, TestComplexPhraseQParserPlugin, TestBlendedInfixSuggestions, BigEndianAscendingWordSerializerTest, OpenExchangeRatesOrgProviderTest, TestSystemIdResolver, CloudMLTQParserTest, TestUseDocValuesAsStored2, DateMathParserTest, DistribDocExpirationUpdateProcessorTest, DistanceFunctionTest, TestAtomicUpdateErrorCases, CurrencyFieldOpenExchangeTest, BaseCdcrDistributedZkTest, SuggestComponentTest, DirectUpdateHandlerOptimizeTest, TestFiltering, TermVectorComponentTest, TestSolrCoreProperties, ShardSplitTest, DefaultValueUpdateProcessorTest, TestSimpleTrackingShardHandler, DateFieldTest, SuggesterTest, TestNoOpRegenerator, TestReqParamsAPI, TestNamedUpdateProcessors, TestRandomFaceting, SolrCmdDistributorTest, TestCoreDiscovery, TestSolrJ, TestSolrDeletionPolicy2, TestMiniSolrCloudClusterSSL, HdfsNNFailoverTest, UpdateRequestProcessorFactoryTest, RAMDirectoryFactoryTest, SynonymTokenizerTest, TestBulkSchemaConcurrent, NotRequiredUniqueKeyTest, TestOrdValues, DistributedQueueTest, CleanupOldIndexTest, TermVectorComponentDistributedTest, AsyncCallRequestStatusResponseTest, BadIndexSchemaTest, WordBreakSolrSpellCheckerTest, TestQueryTypes, PKIAuthenticationIntegrationTest, DistributedExpandComponentTest, TestDistributedGrouping, TestExpandComponent, AutoCommitTest, TestNRTOpen, DistributedIntervalFacetingTest, TestBulkSchemaAPI, SortByFunctionTest, CdcrReplicationHandlerTest, SearchHandlerTest, ResponseLogComponentTest, TestSolrQueryParser, ConvertedLegacyTest, TestScoreJoinQPScore, BlockCacheTest, TestPKIAuthenticationPlugin, SpellPossibilityIteratorTest, TestOmitPositions, TestClassicSimilarityFactory, BasicDistributedZkTest, OverseerTest, ClusterStateUpdateTest, LeaderElectionTest, ShardRoutingCustomTest, TestHashPartitioner, ZkControllerTest, TestRealTimeGet, TestReload, TestCoreContainer, SpellCheckComponentTest, TestGroupingSearch]
   [junit4] Completed [312/579 (1!)] on J1 in 4.58s, 13 tests, 1 error <<< FAILURES!

[...truncated 856 lines...]
BUILD FAILED
/Users/jenkins/workspace/Lucene-Solr-trunk-MacOSX/build.xml:740: The following error occurred while executing this line:
/Users/jenkins/workspace/Lucene-Solr-trunk-MacOSX/build.xml:684: The following error occurred while executing this line:
/Users/jenkins/workspace/Lucene-Solr-trunk-MacOSX/build.xml:59: The following error occurred while executing this line:
/Users/jenkins/workspace/Lucene-Solr-trunk-MacOSX/solr/build.xml:233: The following error occurred while executing this line:
/Users/jenkins/workspace/Lucene-Solr-trunk-MacOSX/solr/common-build.xml:524: The following error occurred while executing this line:
/Users/jenkins/workspace/Lucene-Solr-trunk-MacOSX/lucene/common-build.xml:1457: The following error occurred while executing this line:
/Users/jenkins/workspace/Lucene-Solr-trunk-MacOSX/lucene/common-build.xml:1014: There were test failures: 579 suites (8 ignored), 2331 tests, 1 error, 122 ignored (71 assumptions) [seed: 5926FD11F35274B]

Total time: 71 minutes 19 seconds
Build step 'Invoke Ant' marked build as failure
Archiving artifacts
[WARNINGS] Skipping publisher since build result is FAILURE
Recording test results
Email was triggered for: Failure - Any
Sending email for trigger: Failure - Any



Mime
View raw message