lucene-dev mailing list archives

Site index · List index
Message view « Date » · « Thread »
Top « Date » · « Thread »
From Policeman Jenkins Server <jenk...@thetaphi.de>
Subject [JENKINS] Lucene-Solr-5.x-Solaris (multiarch/jdk1.7.0) - Build # 394 - Failure!
Date Mon, 15 Feb 2016 08:13:15 GMT
Build: http://jenkins.thetaphi.de/job/Lucene-Solr-5.x-Solaris/394/
Java: multiarch/jdk1.7.0 -d64 -XX:-UseCompressedOops -XX:+UseSerialGC

1 tests failed.
FAILED:  org.apache.solr.update.HardAutoCommitTest.testCommitWithin

Error Message:
Exception during query

Stack Trace:
java.lang.RuntimeException: Exception during query
	at __randomizedtesting.SeedInfo.seed([1E4AF50345EDFE10:A4989A7BC6C31005]:0)
	at org.apache.solr.SolrTestCaseJ4.assertQ(SolrTestCaseJ4.java:754)
	at org.apache.solr.update.HardAutoCommitTest.testCommitWithin(HardAutoCommitTest.java:99)
	at sun.reflect.NativeMethodAccessorImpl.invoke0(Native Method)
	at sun.reflect.NativeMethodAccessorImpl.invoke(NativeMethodAccessorImpl.java:57)
	at sun.reflect.DelegatingMethodAccessorImpl.invoke(DelegatingMethodAccessorImpl.java:43)
	at java.lang.reflect.Method.invoke(Method.java:606)
	at com.carrotsearch.randomizedtesting.RandomizedRunner.invoke(RandomizedRunner.java:1764)
	at com.carrotsearch.randomizedtesting.RandomizedRunner$8.evaluate(RandomizedRunner.java:871)
	at com.carrotsearch.randomizedtesting.RandomizedRunner$9.evaluate(RandomizedRunner.java:907)
	at com.carrotsearch.randomizedtesting.RandomizedRunner$10.evaluate(RandomizedRunner.java:921)
	at com.carrotsearch.randomizedtesting.rules.SystemPropertiesRestoreRule$1.evaluate(SystemPropertiesRestoreRule.java:57)
	at org.apache.lucene.util.TestRuleSetupTeardownChained$1.evaluate(TestRuleSetupTeardownChained.java:49)
	at org.apache.lucene.util.AbstractBeforeAfterRule$1.evaluate(AbstractBeforeAfterRule.java:45)
	at org.apache.lucene.util.TestRuleThreadAndTestName$1.evaluate(TestRuleThreadAndTestName.java:48)
	at org.apache.lucene.util.TestRuleIgnoreAfterMaxFailures$1.evaluate(TestRuleIgnoreAfterMaxFailures.java:64)
	at org.apache.lucene.util.TestRuleMarkFailure$1.evaluate(TestRuleMarkFailure.java:47)
	at com.carrotsearch.randomizedtesting.rules.StatementAdapter.evaluate(StatementAdapter.java:36)
	at com.carrotsearch.randomizedtesting.ThreadLeakControl$StatementRunner.run(ThreadLeakControl.java:367)
	at com.carrotsearch.randomizedtesting.ThreadLeakControl.forkTimeoutingTask(ThreadLeakControl.java:809)
	at com.carrotsearch.randomizedtesting.ThreadLeakControl$3.evaluate(ThreadLeakControl.java:460)
	at com.carrotsearch.randomizedtesting.RandomizedRunner.runSingleTest(RandomizedRunner.java:880)
	at com.carrotsearch.randomizedtesting.RandomizedRunner$5.evaluate(RandomizedRunner.java:781)
	at com.carrotsearch.randomizedtesting.RandomizedRunner$6.evaluate(RandomizedRunner.java:816)
	at com.carrotsearch.randomizedtesting.RandomizedRunner$7.evaluate(RandomizedRunner.java:827)
	at com.carrotsearch.randomizedtesting.rules.StatementAdapter.evaluate(StatementAdapter.java:36)
	at com.carrotsearch.randomizedtesting.rules.SystemPropertiesRestoreRule$1.evaluate(SystemPropertiesRestoreRule.java:57)
	at org.apache.lucene.util.AbstractBeforeAfterRule$1.evaluate(AbstractBeforeAfterRule.java:45)
	at com.carrotsearch.randomizedtesting.rules.StatementAdapter.evaluate(StatementAdapter.java:36)
	at org.apache.lucene.util.TestRuleStoreClassName$1.evaluate(TestRuleStoreClassName.java:41)
	at com.carrotsearch.randomizedtesting.rules.NoShadowingOrOverridesOnMethodsRule$1.evaluate(NoShadowingOrOverridesOnMethodsRule.java:40)
	at com.carrotsearch.randomizedtesting.rules.NoShadowingOrOverridesOnMethodsRule$1.evaluate(NoShadowingOrOverridesOnMethodsRule.java:40)
	at com.carrotsearch.randomizedtesting.rules.StatementAdapter.evaluate(StatementAdapter.java:36)
	at com.carrotsearch.randomizedtesting.rules.StatementAdapter.evaluate(StatementAdapter.java:36)
	at com.carrotsearch.randomizedtesting.rules.StatementAdapter.evaluate(StatementAdapter.java:36)
	at org.apache.lucene.util.TestRuleAssertionsRequired$1.evaluate(TestRuleAssertionsRequired.java:53)
	at org.apache.lucene.util.TestRuleMarkFailure$1.evaluate(TestRuleMarkFailure.java:47)
	at org.apache.lucene.util.TestRuleIgnoreAfterMaxFailures$1.evaluate(TestRuleIgnoreAfterMaxFailures.java:64)
	at org.apache.lucene.util.TestRuleIgnoreTestSuites$1.evaluate(TestRuleIgnoreTestSuites.java:54)
	at com.carrotsearch.randomizedtesting.rules.StatementAdapter.evaluate(StatementAdapter.java:36)
	at com.carrotsearch.randomizedtesting.ThreadLeakControl$StatementRunner.run(ThreadLeakControl.java:367)
	at java.lang.Thread.run(Thread.java:745)
Caused by: java.lang.RuntimeException: REQUEST FAILED: xpath=//result[@numFound=1]
	xml response was: <?xml version="1.0" encoding="UTF-8"?>
<response>
<lst name="responseHeader"><int name="status">0</int><int name="QTime">0</int></lst><result name="response" numFound="0" start="0"></result>
</response>

	request was:q=id:529&qt=standard&rows=20&version=2.2&start=0
	at org.apache.solr.SolrTestCaseJ4.assertQ(SolrTestCaseJ4.java:747)
	... 40 more




Build Log:
[...truncated 11502 lines...]
   [junit4] Suite: org.apache.solr.update.HardAutoCommitTest
   [junit4]   2> Creating dataDir: /export/home/jenkins/workspace/Lucene-Solr-5.x-Solaris/solr/build/solr-core/test/J1/temp/solr.update.HardAutoCommitTest_1E4AF50345EDFE10-001/init-core-data-001
   [junit4]   2> 1923997 INFO  (SUITE-HardAutoCommitTest-seed#[1E4AF50345EDFE10]-worker) [    ] o.a.s.SolrTestCaseJ4 Randomized ssl (false) and clientAuth (true)
   [junit4]   2> 1923997 INFO  (SUITE-HardAutoCommitTest-seed#[1E4AF50345EDFE10]-worker) [    ] o.a.s.SolrTestCaseJ4 ####initCore
   [junit4]   2> 1923997 INFO  (SUITE-HardAutoCommitTest-seed#[1E4AF50345EDFE10]-worker) [    ] o.a.s.c.SolrResourceLoader new SolrResourceLoader for directory: '/export/home/jenkins/workspace/Lucene-Solr-5.x-Solaris/solr/core/src/test-files/solr/collection1'
   [junit4]   2> 1923997 INFO  (SUITE-HardAutoCommitTest-seed#[1E4AF50345EDFE10]-worker) [    ] o.a.s.c.SolrResourceLoader JNDI not configured for solr (NoInitialContextEx)
   [junit4]   2> 1923997 INFO  (SUITE-HardAutoCommitTest-seed#[1E4AF50345EDFE10]-worker) [    ] o.a.s.c.SolrResourceLoader using system property solr.solr.home: /export/home/jenkins/workspace/Lucene-Solr-5.x-Solaris/solr/core/src/test-files/solr
   [junit4]   2> 1923998 INFO  (SUITE-HardAutoCommitTest-seed#[1E4AF50345EDFE10]-worker) [    ] o.a.s.c.SolrResourceLoader Adding 'file:/export/home/jenkins/workspace/Lucene-Solr-5.x-Solaris/solr/core/src/test-files/solr/collection1/lib/classes/' to classloader
   [junit4]   2> 1923998 INFO  (SUITE-HardAutoCommitTest-seed#[1E4AF50345EDFE10]-worker) [    ] o.a.s.c.SolrResourceLoader Adding 'file:/export/home/jenkins/workspace/Lucene-Solr-5.x-Solaris/solr/core/src/test-files/solr/collection1/lib/README' to classloader
   [junit4]   2> 1924032 INFO  (SUITE-HardAutoCommitTest-seed#[1E4AF50345EDFE10]-worker) [    ] o.a.s.c.SolrConfig current version of requestparams : -1
   [junit4]   2> 1924050 INFO  (SUITE-HardAutoCommitTest-seed#[1E4AF50345EDFE10]-worker) [    ] o.a.s.c.SolrConfig Using Lucene MatchVersion: 5.6.0
   [junit4]   2> 1924088 INFO  (SUITE-HardAutoCommitTest-seed#[1E4AF50345EDFE10]-worker) [    ] o.a.s.c.SolrConfig Loaded SolrConfig: solrconfig.xml
   [junit4]   2> 1924095 INFO  (SUITE-HardAutoCommitTest-seed#[1E4AF50345EDFE10]-worker) [    ] o.a.s.s.IndexSchema [null] Schema name=test
   [junit4]   2> 1924361 INFO  (SUITE-HardAutoCommitTest-seed#[1E4AF50345EDFE10]-worker) [    ] o.a.s.s.OpenExchangeRatesOrgProvider Initialized with rates=open-exchange-rates.json, refreshInterval=1440.
   [junit4]   2> 1924370 INFO  (SUITE-HardAutoCommitTest-seed#[1E4AF50345EDFE10]-worker) [    ] o.a.s.s.IndexSchema default search field in schema is text
   [junit4]   2> 1924371 INFO  (SUITE-HardAutoCommitTest-seed#[1E4AF50345EDFE10]-worker) [    ] o.a.s.s.IndexSchema unique key field: id
   [junit4]   2> 1924375 INFO  (SUITE-HardAutoCommitTest-seed#[1E4AF50345EDFE10]-worker) [    ] o.a.s.s.FileExchangeRateProvider Reloading exchange rates from file currency.xml
   [junit4]   2> 1924378 INFO  (SUITE-HardAutoCommitTest-seed#[1E4AF50345EDFE10]-worker) [    ] o.a.s.s.FileExchangeRateProvider Reloading exchange rates from file currency.xml
   [junit4]   2> 1924381 INFO  (SUITE-HardAutoCommitTest-seed#[1E4AF50345EDFE10]-worker) [    ] o.a.s.s.OpenExchangeRatesOrgProvider Reloading exchange rates from open-exchange-rates.json
   [junit4]   2> 1924381 INFO  (SUITE-HardAutoCommitTest-seed#[1E4AF50345EDFE10]-worker) [    ] o.a.s.s.OpenExchangeRatesOrgProvider Reloading exchange rates from open-exchange-rates.json
   [junit4]   2> 1924381 INFO  (SUITE-HardAutoCommitTest-seed#[1E4AF50345EDFE10]-worker) [    ] o.a.s.c.SolrResourceLoader JNDI not configured for solr (NoInitialContextEx)
   [junit4]   2> 1924381 INFO  (SUITE-HardAutoCommitTest-seed#[1E4AF50345EDFE10]-worker) [    ] o.a.s.c.SolrResourceLoader using system property solr.solr.home: /export/home/jenkins/workspace/Lucene-Solr-5.x-Solaris/solr/core/src/test-files/solr
   [junit4]   2> 1924381 INFO  (SUITE-HardAutoCommitTest-seed#[1E4AF50345EDFE10]-worker) [    ] o.a.s.c.SolrResourceLoader new SolrResourceLoader for directory: '/export/home/jenkins/workspace/Lucene-Solr-5.x-Solaris/solr/core/src/test-files/solr'
   [junit4]   2> 1924382 INFO  (SUITE-HardAutoCommitTest-seed#[1E4AF50345EDFE10]-worker) [    ] o.a.s.c.SolrResourceLoader JNDI not configured for solr (NoInitialContextEx)
   [junit4]   2> 1924382 INFO  (SUITE-HardAutoCommitTest-seed#[1E4AF50345EDFE10]-worker) [    ] o.a.s.c.SolrResourceLoader using system property solr.solr.home: /export/home/jenkins/workspace/Lucene-Solr-5.x-Solaris/solr/core/src/test-files/solr
   [junit4]   2> 1924382 INFO  (SUITE-HardAutoCommitTest-seed#[1E4AF50345EDFE10]-worker) [    ] o.a.s.c.CoreContainer New CoreContainer 1579674097
   [junit4]   2> 1924382 INFO  (SUITE-HardAutoCommitTest-seed#[1E4AF50345EDFE10]-worker) [    ] o.a.s.c.CoreContainer Loading cores into CoreContainer [instanceDir=/export/home/jenkins/workspace/Lucene-Solr-5.x-Solaris/solr/core/src/test-files/solr]
   [junit4]   2> 1924382 WARN  (SUITE-HardAutoCommitTest-seed#[1E4AF50345EDFE10]-worker) [    ] o.a.s.c.CoreContainer Couldn't add files from /export/home/jenkins/workspace/Lucene-Solr-5.x-Solaris/solr/core/src/test-files/solr/lib to classpath: /export/home/jenkins/workspace/Lucene-Solr-5.x-Solaris/solr/core/src/test-files/solr/lib
   [junit4]   2> 1924382 INFO  (SUITE-HardAutoCommitTest-seed#[1E4AF50345EDFE10]-worker) [    ] o.a.s.h.c.HttpShardHandlerFactory created with socketTimeout : 600000,connTimeout : 60000,maxConnectionsPerHost : 20,maxConnections : 10000,corePoolSize : 0,maximumPoolSize : 2147483647,maxThreadIdleTime : 5,sizeOfQueue : -1,fairnessPolicy : false,useRetries : false,
   [junit4]   2> 1924384 INFO  (SUITE-HardAutoCommitTest-seed#[1E4AF50345EDFE10]-worker) [    ] o.a.s.u.UpdateShardHandler Creating UpdateShardHandler HTTP client with params: socketTimeout=30000&connTimeout=30000&retry=true
   [junit4]   2> 1924385 INFO  (SUITE-HardAutoCommitTest-seed#[1E4AF50345EDFE10]-worker) [    ] o.a.s.l.LogWatcher SLF4J impl is org.slf4j.impl.Log4jLoggerFactory
   [junit4]   2> 1924385 INFO  (SUITE-HardAutoCommitTest-seed#[1E4AF50345EDFE10]-worker) [    ] o.a.s.l.LogWatcher Registering Log Listener [Log4j (org.slf4j.impl.Log4jLoggerFactory)]
   [junit4]   2> 1924385 INFO  (SUITE-HardAutoCommitTest-seed#[1E4AF50345EDFE10]-worker) [    ] o.a.s.c.CoreContainer Security conf doesn't exist. Skipping setup for authorization module.
   [junit4]   2> 1924385 INFO  (SUITE-HardAutoCommitTest-seed#[1E4AF50345EDFE10]-worker) [    ] o.a.s.c.CoreContainer No authentication plugin used.
   [junit4]   2> 1924386 INFO  (SUITE-HardAutoCommitTest-seed#[1E4AF50345EDFE10]-worker) [    ] o.a.s.c.CoreDescriptor Created CoreDescriptor: {name=collection1, transient=false, collection=collection1, configSetProperties=configsetprops.json, shard=shard1, dataDir=/export/home/jenkins/workspace/Lucene-Solr-5.x-Solaris/solr/build/solr-core/test/J1/temp/solr.update.HardAutoCommitTest_1E4AF50345EDFE10-001/init-core-data-001, loadOnStartup=true, config=solrconfig.xml, schema=schema.xml}
   [junit4]   2> 1924387 INFO  (coreLoadExecutor-6474-thread-1) [    ] o.a.s.c.SolrResourceLoader new SolrResourceLoader for directory: '/export/home/jenkins/workspace/Lucene-Solr-5.x-Solaris/solr/core/src/test-files/solr/collection1'
   [junit4]   2> 1924387 INFO  (coreLoadExecutor-6474-thread-1) [    ] o.a.s.c.SolrResourceLoader JNDI not configured for solr (NoInitialContextEx)
   [junit4]   2> 1924387 INFO  (coreLoadExecutor-6474-thread-1) [    ] o.a.s.c.SolrResourceLoader using system property solr.solr.home: /export/home/jenkins/workspace/Lucene-Solr-5.x-Solaris/solr/core/src/test-files/solr
   [junit4]   2> 1924387 INFO  (coreLoadExecutor-6474-thread-1) [    ] o.a.s.c.SolrResourceLoader Adding 'file:/export/home/jenkins/workspace/Lucene-Solr-5.x-Solaris/solr/core/src/test-files/solr/collection1/lib/classes/' to classloader
   [junit4]   2> 1924388 INFO  (coreLoadExecutor-6474-thread-1) [    ] o.a.s.c.SolrResourceLoader Adding 'file:/export/home/jenkins/workspace/Lucene-Solr-5.x-Solaris/solr/core/src/test-files/solr/collection1/lib/README' to classloader
   [junit4]   2> 1924418 INFO  (coreLoadExecutor-6474-thread-1) [    ] o.a.s.c.SolrConfig current version of requestparams : -1
   [junit4]   2> 1924437 INFO  (coreLoadExecutor-6474-thread-1) [    ] o.a.s.c.SolrConfig Using Lucene MatchVersion: 5.6.0
   [junit4]   2> 1924478 INFO  (coreLoadExecutor-6474-thread-1) [    ] o.a.s.c.SolrConfig Loaded SolrConfig: solrconfig.xml
   [junit4]   2> 1924499 INFO  (coreLoadExecutor-6474-thread-1) [    ] o.a.s.s.IndexSchema [collection1] Schema name=test
   [junit4]   2> 1924778 INFO  (coreLoadExecutor-6474-thread-1) [    ] o.a.s.s.OpenExchangeRatesOrgProvider Initialized with rates=open-exchange-rates.json, refreshInterval=1440.
   [junit4]   2> 1924785 INFO  (coreLoadExecutor-6474-thread-1) [    ] o.a.s.s.IndexSchema default search field in schema is text
   [junit4]   2> 1924787 INFO  (coreLoadExecutor-6474-thread-1) [    ] o.a.s.s.IndexSchema unique key field: id
   [junit4]   2> 1924791 INFO  (coreLoadExecutor-6474-thread-1) [    ] o.a.s.s.FileExchangeRateProvider Reloading exchange rates from file currency.xml
   [junit4]   2> 1924794 INFO  (coreLoadExecutor-6474-thread-1) [    ] o.a.s.s.FileExchangeRateProvider Reloading exchange rates from file currency.xml
   [junit4]   2> 1924797 INFO  (coreLoadExecutor-6474-thread-1) [    ] o.a.s.s.OpenExchangeRatesOrgProvider Reloading exchange rates from open-exchange-rates.json
   [junit4]   2> 1924797 INFO  (coreLoadExecutor-6474-thread-1) [    ] o.a.s.s.OpenExchangeRatesOrgProvider Reloading exchange rates from open-exchange-rates.json
   [junit4]   2> 1924799 INFO  (coreLoadExecutor-6474-thread-1) [    ] o.a.s.c.ConfigSetProperties Did not find ConfigSet properties, assuming default properties: Can't find resource 'configsetprops.json' in classpath or '/export/home/jenkins/workspace/Lucene-Solr-5.x-Solaris/solr/core/src/test-files/solr/collection1'
   [junit4]   2> 1924799 INFO  (coreLoadExecutor-6474-thread-1) [    ] o.a.s.c.CoreContainer Creating SolrCore 'collection1' using configuration from instancedir /export/home/jenkins/workspace/Lucene-Solr-5.x-Solaris/solr/core/src/test-files/solr/collection1
   [junit4]   2> 1924799 INFO  (coreLoadExecutor-6474-thread-1) [    x:collection1] o.a.s.c.SolrCore org.apache.solr.core.MockDirectoryFactory
   [junit4]   2> 1924799 INFO  (coreLoadExecutor-6474-thread-1) [    x:collection1] o.a.s.c.SolrCore [[collection1] ] Opening new SolrCore at [/export/home/jenkins/workspace/Lucene-Solr-5.x-Solaris/solr/core/src/test-files/solr/collection1], dataDir=[/export/home/jenkins/workspace/Lucene-Solr-5.x-Solaris/solr/build/solr-core/test/J1/temp/solr.update.HardAutoCommitTest_1E4AF50345EDFE10-001/init-core-data-001/]
   [junit4]   2> 1924800 INFO  (coreLoadExecutor-6474-thread-1) [    x:collection1] o.a.s.c.JmxMonitoredMap JMX monitoring is enabled. Adding Solr mbeans to JMX Server: com.sun.jmx.mbeanserver.JmxMBeanServer@38598a4f
   [junit4]   2> 1924800 INFO  (coreLoadExecutor-6474-thread-1) [    x:collection1] o.a.s.c.CachingDirectoryFactory return new directory for /export/home/jenkins/workspace/Lucene-Solr-5.x-Solaris/solr/build/solr-core/test/J1/temp/solr.update.HardAutoCommitTest_1E4AF50345EDFE10-001/init-core-data-001
   [junit4]   2> 1924800 INFO  (coreLoadExecutor-6474-thread-1) [    x:collection1] o.a.s.c.SolrCore New index directory detected: old=null new=/export/home/jenkins/workspace/Lucene-Solr-5.x-Solaris/solr/build/solr-core/test/J1/temp/solr.update.HardAutoCommitTest_1E4AF50345EDFE10-001/init-core-data-001/index/
   [junit4]   2> 1924800 WARN  (coreLoadExecutor-6474-thread-1) [    x:collection1] o.a.s.c.SolrCore [collection1] Solr index directory '/export/home/jenkins/workspace/Lucene-Solr-5.x-Solaris/solr/build/solr-core/test/J1/temp/solr.update.HardAutoCommitTest_1E4AF50345EDFE10-001/init-core-data-001/index' doesn't exist. Creating new index...
   [junit4]   2> 1924801 INFO  (coreLoadExecutor-6474-thread-1) [    x:collection1] o.a.s.c.CachingDirectoryFactory return new directory for /export/home/jenkins/workspace/Lucene-Solr-5.x-Solaris/solr/build/solr-core/test/J1/temp/solr.update.HardAutoCommitTest_1E4AF50345EDFE10-001/init-core-data-001/index
   [junit4]   2> 1924801 INFO  (coreLoadExecutor-6474-thread-1) [    x:collection1] o.a.s.u.RandomMergePolicy RandomMergePolicy wrapping class org.apache.lucene.index.LogByteSizeMergePolicy: [LogByteSizeMergePolicy: minMergeSize=1677721, mergeFactor=43, maxMergeSize=2147483648, maxMergeSizeForForcedMerge=9223372036854775807, calibrateSizeByDeletes=false, maxMergeDocs=2147483647, maxCFSSegmentSizeMB=8.796093022207999E12, noCFSRatio=0.0]
   [junit4]   2> 1924801 INFO  (coreLoadExecutor-6474-thread-1) [    x:collection1] o.a.s.c.SolrDeletionPolicy SolrDeletionPolicy.onCommit: commits: num=1
   [junit4]   2> 	commit{dir=MockDirectoryWrapper(RAMDirectory@3e34692b lockFactory=org.apache.lucene.store.SingleInstanceLockFactory@62e4a5f4),segFN=segments_1,generation=1}
   [junit4]   2> 1924801 INFO  (coreLoadExecutor-6474-thread-1) [    x:collection1] o.a.s.c.SolrDeletionPolicy newest commit generation = 1
   [junit4]   2> 1924802 INFO  (OldIndexDirectoryCleanupThreadForCore-collection1) [    x:collection1] o.a.s.c.SolrCore Looking for old index directories to cleanup for core collection1 in /export/home/jenkins/workspace/Lucene-Solr-5.x-Solaris/solr/build/solr-core/test/J1/temp/solr.update.HardAutoCommitTest_1E4AF50345EDFE10-001/init-core-data-001/
   [junit4]   2> 1924805 INFO  (coreLoadExecutor-6474-thread-1) [    x:collection1] o.a.s.u.p.UpdateRequestProcessorChain creating updateRequestProcessorChain "dedupe"
   [junit4]   2> 1924805 INFO  (coreLoadExecutor-6474-thread-1) [    x:collection1] o.a.s.u.p.UpdateRequestProcessorChain inserting DistributedUpdateProcessorFactory into updateRequestProcessorChain "dedupe"
   [junit4]   2> 1924805 INFO  (coreLoadExecutor-6474-thread-1) [    x:collection1] o.a.s.u.p.UpdateRequestProcessorChain creating updateRequestProcessorChain "dedupe-allfields"
   [junit4]   2> 1924805 INFO  (coreLoadExecutor-6474-thread-1) [    x:collection1] o.a.s.u.p.UpdateRequestProcessorChain inserting DistributedUpdateProcessorFactory into updateRequestProcessorChain "dedupe-allfields"
   [junit4]   2> 1924805 INFO  (coreLoadExecutor-6474-thread-1) [    x:collection1] o.a.s.u.p.UpdateRequestProcessorChain creating updateRequestProcessorChain "stored_sig"
   [junit4]   2> 1924805 INFO  (coreLoadExecutor-6474-thread-1) [    x:collection1] o.a.s.u.p.UpdateRequestProcessorChain inserting DistributedUpdateProcessorFactory into updateRequestProcessorChain "stored_sig"
   [junit4]   2> 1924806 INFO  (coreLoadExecutor-6474-thread-1) [    x:collection1] o.a.s.u.p.UpdateRequestProcessorChain creating updateRequestProcessorChain "uniq-fields"
   [junit4]   2> 1924806 INFO  (coreLoadExecutor-6474-thread-1) [    x:collection1] o.a.s.u.p.UpdateRequestProcessorChain inserting DistributedUpdateProcessorFactory into updateRequestProcessorChain "uniq-fields"
   [junit4]   2> 1924806 INFO  (coreLoadExecutor-6474-thread-1) [    x:collection1] o.a.s.u.p.UpdateRequestProcessorChain creating updateRequestProcessorChain "distrib-dup-test-chain-explicit"
   [junit4]   2> 1924806 INFO  (coreLoadExecutor-6474-thread-1) [    x:collection1] o.a.s.u.p.UpdateRequestProcessorChain creating updateRequestProcessorChain "distrib-dup-test-chain-implicit"
   [junit4]   2> 1924806 INFO  (coreLoadExecutor-6474-thread-1) [    x:collection1] o.a.s.u.p.UpdateRequestProcessorChain inserting DistributedUpdateProcessorFactory into updateRequestProcessorChain "distrib-dup-test-chain-implicit"
   [junit4]   2> 1924806 INFO  (coreLoadExecutor-6474-thread-1) [    x:collection1] o.a.s.c.SolrCore no updateRequestProcessorChain defined as default, creating implicit default
   [junit4]   2> 1924809 INFO  (coreLoadExecutor-6474-thread-1) [    x:collection1] o.a.s.h.l.XMLLoader xsltCacheLifetimeSeconds=60
   [junit4]   2> 1924812 INFO  (coreLoadExecutor-6474-thread-1) [    x:collection1] o.a.s.h.l.XMLLoader xsltCacheLifetimeSeconds=60
   [junit4]   2> 1924816 INFO  (coreLoadExecutor-6474-thread-1) [    x:collection1] o.a.s.h.l.XMLLoader xsltCacheLifetimeSeconds=60
   [junit4]   2> 1924820 INFO  (coreLoadExecutor-6474-thread-1) [    x:collection1] o.a.s.h.l.XMLLoader xsltCacheLifetimeSeconds=60
   [junit4]   2> 1924826 INFO  (coreLoadExecutor-6474-thread-1) [    x:collection1] o.a.s.c.PluginBag requestHandler : 'lazy' created with startup=lazy 
   [junit4]   2> 1924829 INFO  (coreLoadExecutor-6474-thread-1) [    x:collection1] o.a.s.c.RequestHandlers Registered paths: /update/json,tvrh,/admin/plugins,spellCheckCompRH,/config,/update/json/docs,/debug/dump,standard,/admin/properties,defaults,/admin/system,/terms,/admin/segments,/search-facet-invariants,/replication,/admin/logging,/get,/admin/ping,/admin/luke,mock,spellCheckWithWordbreak,spellCheckWithWordbreak_Direct,/admin/file,/admin/threads,lazy,/schema,/update/csv,mltrh,/search-facet-def,/update,spellCheckCompRH_Direct,/mlt,/admin/mbeans,spellCheckCompRH1,dismax
   [junit4]   2> 1924831 WARN  (coreLoadExecutor-6474-thread-1) [    x:collection1] o.a.s.c.SolrCore solrconfig.xml uses deprecated <admin/gettableFiles>, Please update your config to use the ShowFileRequestHandler.
   [junit4]   2> 1924832 INFO  (coreLoadExecutor-6474-thread-1) [    x:collection1] o.a.s.c.SolrCore Using default statsCache cache: org.apache.solr.search.stats.LocalStatsCache
   [junit4]   2> 1924832 INFO  (coreLoadExecutor-6474-thread-1) [    x:collection1] o.a.s.u.UpdateHandler Using UpdateLog implementation: org.apache.solr.update.UpdateLog
   [junit4]   2> 1924832 INFO  (coreLoadExecutor-6474-thread-1) [    x:collection1] o.a.s.u.UpdateLog Initializing UpdateLog: dataDir= defaultSyncLevel=FLUSH numRecordsToKeep=100 maxNumLogsToKeep=10 numVersionBuckets=65536
   [junit4]   2> 1924833 INFO  (coreLoadExecutor-6474-thread-1) [    x:collection1] o.a.s.u.CommitTracker Hard AutoCommit: disabled
   [junit4]   2> 1924833 INFO  (coreLoadExecutor-6474-thread-1) [    x:collection1] o.a.s.u.CommitTracker Soft AutoCommit: disabled
   [junit4]   2> 1924834 INFO  (coreLoadExecutor-6474-thread-1) [    x:collection1] o.a.s.u.RandomMergePolicy RandomMergePolicy wrapping class org.apache.lucene.index.LogByteSizeMergePolicy: [LogByteSizeMergePolicy: minMergeSize=1677721, mergeFactor=12, maxMergeSize=2147483648, maxMergeSizeForForcedMerge=9223372036854775807, calibrateSizeByDeletes=false, maxMergeDocs=2147483647, maxCFSSegmentSizeMB=8.796093022207999E12, noCFSRatio=1.0]
   [junit4]   2> 1924834 INFO  (coreLoadExecutor-6474-thread-1) [    x:collection1] o.a.s.c.SolrDeletionPolicy SolrDeletionPolicy.onInit: commits: num=1
   [junit4]   2> 	commit{dir=MockDirectoryWrapper(RAMDirectory@3e34692b lockFactory=org.apache.lucene.store.SingleInstanceLockFactory@62e4a5f4),segFN=segments_1,generation=1}
   [junit4]   2> 1924834 INFO  (coreLoadExecutor-6474-thread-1) [    x:collection1] o.a.s.c.SolrDeletionPolicy newest commit generation = 1
   [junit4]   2> 1924834 INFO  (coreLoadExecutor-6474-thread-1) [    x:collection1] o.a.s.s.SolrIndexSearcher Opening Searcher@5a4d40be[collection1] main
   [junit4]   2> 1924834 INFO  (coreLoadExecutor-6474-thread-1) [    x:collection1] o.a.s.r.RestManager Initializing RestManager with initArgs: {storageIO=org.apache.solr.rest.ManagedResourceStorage$InMemoryStorageIO}
   [junit4]   2> 1924834 INFO  (coreLoadExecutor-6474-thread-1) [    x:collection1] o.a.s.r.ManagedResourceStorage Reading _rest_managed.json using InMemoryStorage
   [junit4]   2> 1924835 INFO  (coreLoadExecutor-6474-thread-1) [    x:collection1] o.a.s.r.RestManager Initializing 0 registered ManagedResources
   [junit4]   2> 1924835 INFO  (coreLoadExecutor-6474-thread-1) [    x:collection1] o.a.s.h.c.SpellCheckComponent Initializing spell checkers
   [junit4]   2> 1924991 INFO  (coreLoadExecutor-6474-thread-1) [    x:collection1] o.a.s.s.DirectSolrSpellChecker init: {name=direct,classname=DirectSolrSpellChecker,field=lowerfilt,minQueryLength=3}
   [junit4]   2> 1925402 INFO  (coreLoadExecutor-6474-thread-1) [    x:collection1] o.a.s.h.ReplicationHandler Commits will be reserved for  10000
   [junit4]   2> 1925402 INFO  (searcherExecutor-6475-thread-1-processing-x:collection1) [    x:collection1] o.a.s.h.c.SpellCheckComponent Loading spell index for spellchecker: default
   [junit4]   2> 1925403 INFO  (searcherExecutor-6475-thread-1-processing-x:collection1) [    x:collection1] o.a.s.h.c.SpellCheckComponent Loading spell index for spellchecker: direct
   [junit4]   2> 1925403 INFO  (searcherExecutor-6475-thread-1-processing-x:collection1) [    x:collection1] o.a.s.h.c.SpellCheckComponent Loading spell index for spellchecker: wordbreak
   [junit4]   2> 1925403 INFO  (searcherExecutor-6475-thread-1-processing-x:collection1) [    x:collection1] o.a.s.h.c.SpellCheckComponent Loading spell index for spellchecker: multipleFields
   [junit4]   2> 1925403 INFO  (coreLoadExecutor-6474-thread-1) [    x:collection1] o.a.s.u.UpdateLog Looking up max value of version field to seed version buckets
   [junit4]   2> 1925403 INFO  (coreLoadExecutor-6474-thread-1) [    x:collection1] o.a.s.u.VersionInfo Refreshing highest value of _version_ for 65536 version buckets from index
   [junit4]   2> 1925403 INFO  (coreLoadExecutor-6474-thread-1) [    x:collection1] o.a.s.u.VersionInfo No terms found for _version_, cannot seed version bucket highest value from index
   [junit4]   2> 1925403 INFO  (coreLoadExecutor-6474-thread-1) [    x:collection1] o.a.s.u.UpdateLog Could not find max version in index or recent updates, using new clock 1526225921512570880
   [junit4]   2> 1925403 INFO  (searcherExecutor-6475-thread-1-processing-x:collection1) [    x:collection1] o.a.s.h.c.SpellCheckComponent Loading spell index for spellchecker: jarowinkler
   [junit4]   2> 1925404 INFO  (searcherExecutor-6475-thread-1-processing-x:collection1) [    x:collection1] o.a.s.h.c.SpellCheckComponent Loading spell index for spellchecker: external
   [junit4]   2> 1925405 INFO  (searcherExecutor-6475-thread-1-processing-x:collection1) [    x:collection1] o.a.s.h.c.SpellCheckComponent Loading spell index for spellchecker: freq
   [junit4]   2> 1925405 INFO  (coreLoadExecutor-6474-thread-1) [    x:collection1] o.a.s.u.UpdateLog Took 2.0ms to seed version buckets with highest version 1526225921512570880
   [junit4]   2> 1925405 INFO  (searcherExecutor-6475-thread-1-processing-x:collection1) [    x:collection1] o.a.s.h.c.SpellCheckComponent Loading spell index for spellchecker: fqcn
   [junit4]   2> 1925405 INFO  (coreLoadExecutor-6474-thread-1) [    x:collection1] o.a.s.c.CoreContainer registering core: collection1
   [junit4]   2> 1925406 INFO  (searcherExecutor-6475-thread-1-processing-x:collection1) [    x:collection1] o.a.s.h.c.SpellCheckComponent Loading spell index for spellchecker: perDict
   [junit4]   2> 1925407 INFO  (searcherExecutor-6475-thread-1-processing-x:collection1) [    x:collection1] o.a.s.c.SolrCore [collection1] Registered new searcher Searcher@5a4d40be[collection1] main{ExitableDirectoryReader(UninvertingDirectoryReader())}
   [junit4]   2> 1925407 INFO  (SUITE-HardAutoCommitTest-seed#[1E4AF50345EDFE10]-worker) [    ] o.a.s.SolrTestCaseJ4 ####initCore end
   [junit4]   2> 1925411 INFO  (TEST-HardAutoCommitTest.testCommitWithin-seed#[1E4AF50345EDFE10]) [    ] o.a.s.SolrTestCaseJ4 ###Starting testCommitWithin
   [junit4]   2> 1925413 INFO  (TEST-HardAutoCommitTest.testCommitWithin-seed#[1E4AF50345EDFE10]) [    ] o.a.s.u.p.LogUpdateProcessorFactory [collection1]  webapp=null path=null params={}{deleteByQuery=*:* (-1526225921520959488)} 0 1
   [junit4]   2> 1925417 INFO  (TEST-HardAutoCommitTest.testCommitWithin-seed#[1E4AF50345EDFE10]) [    ] o.a.s.c.SolrResourceLoader new SolrResourceLoader for directory: '/export/home/jenkins/workspace/Lucene-Solr-5.x-Solaris/solr/core/src/test-files/solr/collection1'
   [junit4]   2> 1925417 INFO  (TEST-HardAutoCommitTest.testCommitWithin-seed#[1E4AF50345EDFE10]) [    ] o.a.s.c.SolrResourceLoader JNDI not configured for solr (NoInitialContextEx)
   [junit4]   2> 1925417 INFO  (TEST-HardAutoCommitTest.testCommitWithin-seed#[1E4AF50345EDFE10]) [    ] o.a.s.c.SolrResourceLoader using system property solr.solr.home: /export/home/jenkins/workspace/Lucene-Solr-5.x-Solaris/solr/core/src/test-files/solr
   [junit4]   2> 1925418 INFO  (TEST-HardAutoCommitTest.testCommitWithin-seed#[1E4AF50345EDFE10]) [    ] o.a.s.c.SolrResourceLoader Adding 'file:/export/home/jenkins/workspace/Lucene-Solr-5.x-Solaris/solr/core/src/test-files/solr/collection1/lib/classes/' to classloader
   [junit4]   2> 1925418 INFO  (TEST-HardAutoCommitTest.testCommitWithin-seed#[1E4AF50345EDFE10]) [    ] o.a.s.c.SolrResourceLoader Adding 'file:/export/home/jenkins/workspace/Lucene-Solr-5.x-Solaris/solr/core/src/test-files/solr/collection1/lib/README' to classloader
   [junit4]   2> 1925466 INFO  (TEST-HardAutoCommitTest.testCommitWithin-seed#[1E4AF50345EDFE10]) [    ] o.a.s.c.SolrConfig current version of requestparams : -1
   [junit4]   2> 1925485 INFO  (TEST-HardAutoCommitTest.testCommitWithin-seed#[1E4AF50345EDFE10]) [    ] o.a.s.c.SolrConfig Using Lucene MatchVersion: 5.6.0
   [junit4]   2> 1925526 INFO  (TEST-HardAutoCommitTest.testCommitWithin-seed#[1E4AF50345EDFE10]) [    ] o.a.s.c.SolrConfig Loaded SolrConfig: solrconfig.xml
   [junit4]   2> 1925533 INFO  (TEST-HardAutoCommitTest.testCommitWithin-seed#[1E4AF50345EDFE10]) [    ] o.a.s.s.IndexSchema [collection1] Schema name=test
   [junit4]   2> 1925880 INFO  (TEST-HardAutoCommitTest.testCommitWithin-seed#[1E4AF50345EDFE10]) [    ] o.a.s.s.OpenExchangeRatesOrgProvider Initialized with rates=open-exchange-rates.json, refreshInterval=1440.
   [junit4]   2> 1925895 INFO  (TEST-HardAutoCommitTest.testCommitWithin-seed#[1E4AF50345EDFE10]) [    ] o.a.s.s.IndexSchema default search field in schema is text
   [junit4]   2> 1925898 INFO  (TEST-HardAutoCommitTest.testCommitWithin-seed#[1E4AF50345EDFE10]) [    ] o.a.s.s.IndexSchema unique key field: id
   [junit4]   2> 1925905 INFO  (TEST-HardAutoCommitTest.testCommitWithin-seed#[1E4AF50345EDFE10]) [    ] o.a.s.s.FileExchangeRateProvider Reloading exchange rates from file currency.xml
   [junit4]   2> 1925910 INFO  (TEST-HardAutoCommitTest.testCommitWithin-seed#[1E4AF50345EDFE10]) [    ] o.a.s.s.FileExchangeRateProvider Reloading exchange rates from file currency.xml
   [junit4]   2> 1925914 INFO  (TEST-HardAutoCommitTest.testCommitWithin-seed#[1E4AF50345EDFE10]) [    ] o.a.s.s.OpenExchangeRatesOrgProvider Reloading exchange rates from open-exchange-rates.json
   [junit4]   2> 1925915 INFO  (TEST-HardAutoCommitTest.testCommitWithin-seed#[1E4AF50345EDFE10]) [    ] o.a.s.s.OpenExchangeRatesOrgProvider Reloading exchange rates from open-exchange-rates.json
   [junit4]   2> 1925919 INFO  (TEST-HardAutoCommitTest.testCommitWithin-seed#[1E4AF50345EDFE10]) [    ] o.a.s.c.ConfigSetProperties Did not find ConfigSet properties, assuming default properties: Can't find resource 'configsetprops.json' in classpath or '/export/home/jenkins/workspace/Lucene-Solr-5.x-Solaris/solr/core/src/test-files/solr/collection1'
   [junit4]   2> 1925919 INFO  (TEST-HardAutoCommitTest.testCommitWithin-seed#[1E4AF50345EDFE10]) [    ] o.a.s.c.CoreContainer Reloading SolrCore 'collection1' using configuration from instancedir /export/home/jenkins/workspace/Lucene-Solr-5.x-Solaris/solr/core/src/test-files/solr/collection1
   [junit4]   2> 1925920 INFO  (TEST-HardAutoCommitTest.testCommitWithin-seed#[1E4AF50345EDFE10]) [    x:collection1] o.a.s.c.SolrCore [[collection1] ] Opening new SolrCore at [/export/home/jenkins/workspace/Lucene-Solr-5.x-Solaris/solr/core/src/test-files/solr/collection1], dataDir=[/export/home/jenkins/workspace/Lucene-Solr-5.x-Solaris/solr/build/solr-core/test/J1/temp/solr.update.HardAutoCommitTest_1E4AF50345EDFE10-001/init-core-data-001/]
   [junit4]   2> 1925920 INFO  (TEST-HardAutoCommitTest.testCommitWithin-seed#[1E4AF50345EDFE10]) [    x:collection1] o.a.s.c.JmxMonitoredMap JMX monitoring is enabled. Adding Solr mbeans to JMX Server: com.sun.jmx.mbeanserver.JmxMBeanServer@38598a4f
   [junit4]   2> 1925920 INFO  (TEST-HardAutoCommitTest.testCommitWithin-seed#[1E4AF50345EDFE10]) [    x:collection1] o.a.s.c.SolrCore New index directory detected: old=null new=/export/home/jenkins/workspace/Lucene-Solr-5.x-Solaris/solr/build/solr-core/test/J1/temp/solr.update.HardAutoCommitTest_1E4AF50345EDFE10-001/init-core-data-001/index/
   [junit4]   2> 1925929 INFO  (TEST-HardAutoCommitTest.testCommitWithin-seed#[1E4AF50345EDFE10]) [    x:collection1] o.a.s.u.p.UpdateRequestProcessorChain creating updateRequestProcessorChain "dedupe"
   [junit4]   2> 1925929 INFO  (TEST-HardAutoCommitTest.testCommitWithin-seed#[1E4AF50345EDFE10]) [    x:collection1] o.a.s.u.p.UpdateRequestProcessorChain inserting DistributedUpdateProcessorFactory into updateRequestProcessorChain "dedupe"
   [junit4]   2> 1925929 INFO  (TEST-HardAutoCommitTest.testCommitWithin-seed#[1E4AF50345EDFE10]) [    x:collection1] o.a.s.u.p.UpdateRequestProcessorChain creating updateRequestProcessorChain "dedupe-allfields"
   [junit4]   2> 1925929 INFO  (TEST-HardAutoCommitTest.testCommitWithin-seed#[1E4AF50345EDFE10]) [    x:collection1] o.a.s.u.p.UpdateRequestProcessorChain inserting DistributedUpdateProcessorFactory into updateRequestProcessorChain "dedupe-allfields"
   [junit4]   2> 1925929 INFO  (TEST-HardAutoCommitTest.testCommitWithin-seed#[1E4AF50345EDFE10]) [    x:collection1] o.a.s.u.p.UpdateRequestProcessorChain creating updateRequestProcessorChain "stored_sig"
   [junit4]   2> 1925929 INFO  (TEST-HardAutoCommitTest.testCommitWithin-seed#[1E4AF50345EDFE10]) [    x:collection1] o.a.s.u.p.UpdateRequestProcessorChain inserting DistributedUpdateProcessorFactory into updateRequestProcessorChain "stored_sig"
   [junit4]   2> 1925929 INFO  (TEST-HardAutoCommitTest.testCommitWithin-seed#[1E4AF50345EDFE10]) [    x:collection1] o.a.s.u.p.UpdateRequestProcessorChain creating updateRequestProcessorChain "uniq-fields"
   [junit4]   2> 1925930 INFO  (TEST-HardAutoCommitTest.testCommitWithin-seed#[1E4AF50345EDFE10]) [    x:collection1] o.a.s.u.p.UpdateRequestProcessorChain inserting DistributedUpdateProcessorFactory into updateRequestProcessorChain "uniq-fields"
   [junit4]   2> 1925930 INFO  (TEST-HardAutoCommitTest.testCommitWithin-seed#[1E4AF50345EDFE10]) [    x:collection1] o.a.s.u.p.UpdateRequestProcessorChain creating updateRequestProcessorChain "distrib-dup-test-chain-explicit"
   [junit4]   2> 1925930 INFO  (TEST-HardAutoCommitTest.testCommitWithin-seed#[1E4AF50345EDFE10]) [    x:collection1] o.a.s.u.p.UpdateRequestProcessorChain creating updateRequestProcessorChain "distrib-dup-test-chain-implicit"
   [junit4]   2> 1925930 INFO  (TEST-HardAutoCommitTest.testCommitWithin-seed#[1E4AF50345EDFE10]) [    x:collection1] o.a.s.u.p.UpdateRequestProcessorChain inserting DistributedUpdateProcessorFactory into updateRequestProcessorChain "distrib-dup-test-chain-implicit"
   [junit4]   2> 1925930 INFO  (TEST-HardAutoCommitTest.testCommitWithin-seed#[1E4AF50345EDFE10]) [    x:collection1] o.a.s.c.SolrCore no updateRequestProcessorChain defined as default, creating implicit default
   [junit4]   2> 1925934 INFO  (OldIndexDirectoryCleanupThreadForCore-collection1) [    x:collection1] o.a.s.c.SolrCore Looking for old index directories to cleanup for core collection1 in /export/home/jenkins/workspace/Lucene-Solr-5.x-Solaris/solr/build/solr-core/test/J1/temp/solr.update.HardAutoCommitTest_1E4AF50345EDFE10-001/init-core-data-001/
   [junit4]   2> 1925937 INFO  (TEST-HardAutoCommitTest.testCommitWithin-seed#[1E4AF50345EDFE10]) [    x:collection1] o.a.s.h.l.XMLLoader xsltCacheLifetimeSeconds=60
   [junit4]   2> 1925939 INFO  (TEST-HardAutoCommitTest.testCommitWithin-seed#[1E4AF50345EDFE10]) [    x:collection1] o.a.s.h.l.XMLLoader xsltCacheLifetimeSeconds=60
   [junit4]   2> 1925942 INFO  (TEST-HardAutoCommitTest.testCommitWithin-seed#[1E4AF50345EDFE10]) [    x:collection1] o.a.s.h.l.XMLLoader xsltCacheLifetimeSeconds=60
   [junit4]   2> 1925945 INFO  (TEST-HardAutoCommitTest.testCommitWithin-seed#[1E4AF50345EDFE10]) [    x:collection1] o.a.s.h.l.XMLLoader xsltCacheLifetimeSeconds=60
   [junit4]   2> 1925953 INFO  (TEST-HardAutoCommitTest.testCommitWithin-seed#[1E4AF50345EDFE10]) [    x:collection1] o.a.s.c.PluginBag requestHandler : 'lazy' created with startup=lazy 
   [junit4]   2> 1925957 INFO  (TEST-HardAutoCommitTest.testCommitWithin-seed#[1E4AF50345EDFE10]) [    x:collection1] o.a.s.c.RequestHandlers Registered paths: /update/json,tvrh,/admin/plugins,spellCheckCompRH,/config,/update/json/docs,/debug/dump,standard,/admin/properties,defaults,/admin/system,/terms,/admin/segments,/search-facet-invariants,/replication,/admin/logging,/get,/admin/ping,/admin/luke,mock,spellCheckWithWordbreak,spellCheckWithWordbreak_Direct,/admin/file,/admin/threads,lazy,/schema,/update/csv,mltrh,/search-facet-def,/update,spellCheckCompRH_Direct,/mlt,/admin/mbeans,spellCheckCompRH1,dismax
   [junit4]   2> 1925959 WARN  (TEST-HardAutoCommitTest.testCommitWithin-seed#[1E4AF50345EDFE10]) [    x:collection1] o.a.s.c.SolrCore solrconfig.xml uses deprecated <admin/gettableFiles>, Please update your config to use the ShowFileRequestHandler.
   [junit4]   2> 1925961 INFO  (TEST-HardAutoCommitTest.testCommitWithin-seed#[1E4AF50345EDFE10]) [    x:collection1] o.a.s.c.SolrCore Using default statsCache cache: org.apache.solr.search.stats.LocalStatsCache
   [junit4]   2> 1925962 INFO  (TEST-HardAutoCommitTest.testCommitWithin-seed#[1E4AF50345EDFE10]) [    x:collection1] o.a.s.u.CommitTracker Hard AutoCommit: disabled
   [junit4]   2> 1925962 INFO  (TEST-HardAutoCommitTest.testCommitWithin-seed#[1E4AF50345EDFE10]) [    x:collection1] o.a.s.u.CommitTracker Soft AutoCommit: disabled
   [junit4]   2> 1925962 INFO  (TEST-HardAutoCommitTest.testCommitWithin-seed#[1E4AF50345EDFE10]) [    x:collection1] o.a.s.s.SolrIndexSearcher Opening Searcher@737439e6[collection1] main
   [junit4]   2> 1925963 INFO  (TEST-HardAutoCommitTest.testCommitWithin-seed#[1E4AF50345EDFE10]) [    x:collection1] o.a.s.r.RestManager Initializing RestManager with initArgs: {storageIO=org.apache.solr.rest.ManagedResourceStorage$InMemoryStorageIO}
   [junit4]   2> 1925963 INFO  (TEST-HardAutoCommitTest.testCommitWithin-seed#[1E4AF50345EDFE10]) [    x:collection1] o.a.s.r.ManagedResourceStorage Reading _rest_managed.json using InMemoryStorage
   [junit4]   2> 1925963 INFO  (TEST-HardAutoCommitTest.testCommitWithin-seed#[1E4AF50345EDFE10]) [    x:collection1] o.a.s.r.RestManager Initializing 0 registered ManagedResources
   [junit4]   2> 1925963 INFO  (TEST-HardAutoCommitTest.testCommitWithin-seed#[1E4AF50345EDFE10]) [    x:collection1] o.a.s.h.c.SpellCheckComponent Initializing spell checkers
   [junit4]   2> 1925965 INFO  (TEST-HardAutoCommitTest.testCommitWithin-seed#[1E4AF50345EDFE10]) [    x:collection1] o.a.s.s.DirectSolrSpellChecker init: {name=direct,classname=DirectSolrSpellChecker,field=lowerfilt,minQueryLength=3}
   [junit4]   2> 1925970 INFO  (TEST-HardAutoCommitTest.testCommitWithin-seed#[1E4AF50345EDFE10]) [    x:collection1] o.a.s.h.ReplicationHandler Commits will be reserved for  10000
   [junit4]   2> 1925971 INFO  (searcherExecutor-6480-thread-1-processing-x:collection1) [    x:collection1] o.a.s.h.c.SpellCheckComponent Loading spell index for spellchecker: default
   [junit4]   2> 1925972 INFO  (searcherExecutor-6480-thread-1-processing-x:collection1) [    x:collection1] o.a.s.h.c.SpellCheckComponent Loading spell index for spellchecker: direct
   [junit4]   2> 1925972 INFO  (searcherExecutor-6480-thread-1-processing-x:collection1) [    x:collection1] o.a.s.h.c.SpellCheckComponent Loading spell index for spellchecker: wordbreak
   [junit4]   2> 1925972 INFO  (searcherExecutor-6480-thread-1-processing-x:collection1) [    x:collection1] o.a.s.h.c.SpellCheckComponent Loading spell index for spellchecker: multipleFields
   [junit4]   2> 1925973 INFO  (searcherExecutor-6480-thread-1-processing-x:collection1) [    x:collection1] o.a.s.h.c.SpellCheckComponent Loading spell index for spellchecker: jarowinkler
   [junit4]   2> 1925973 INFO  (searcherExecutor-6480-thread-1-processing-x:collection1) [    x:collection1] o.a.s.h.c.SpellCheckComponent Loading spell index for spellchecker: external
   [junit4]   2> 1925974 INFO  (searcherExecutor-6480-thread-1-processing-x:collection1) [    x:collection1] o.a.s.h.c.SpellCheckComponent Loading spell index for spellchecker: freq
   [junit4]   2> 1925975 INFO  (searcherExecutor-6480-thread-1-processing-x:collection1) [    x:collection1] o.a.s.h.c.SpellCheckComponent Loading spell index for spellchecker: fqcn
   [junit4]   2> 1925975 INFO  (searcherExecutor-6480-thread-1-processing-x:collection1) [    x:collection1] o.a.s.h.c.SpellCheckComponent Loading spell index for spellchecker: perDict
   [junit4]   2> 1925978 INFO  (TEST-HardAutoCommitTest.testCommitWithin-seed#[1E4AF50345EDFE10]) [    x:collection1] o.a.s.u.UpdateLog Looking up max value of version field to seed version buckets
   [junit4]   2> 1925978 INFO  (TEST-HardAutoCommitTest.testCommitWithin-seed#[1E4AF50345EDFE10]) [    x:collection1] o.a.s.u.VersionInfo Refreshing highest value of _version_ for 65536 version buckets from index
   [junit4]   2> 1925978 INFO  (TEST-HardAutoCommitTest.testCommitWithin-seed#[1E4AF50345EDFE10]) [    x:collection1] o.a.s.u.VersionInfo No terms found for _version_, cannot seed version bucket highest value from index
   [junit4]   2> 1925980 INFO  (TEST-HardAutoCommitTest.testCommitWithin-seed#[1E4AF50345EDFE10]) [    x:collection1] o.a.s.u.UpdateLog Took 2.0ms to seed version buckets with highest version 1526225921520959488
   [junit4]   2> 1925981 INFO  (TEST-HardAutoCommitTest.testCommitWithin-seed#[1E4AF50345EDFE10]) [    x:collection1] o.a.s.u.DefaultSolrCoreState Closing old IndexWriter... core=collection1
   [junit4]   2> 1925986 INFO  (searcherExecutor-6480-thread-1-processing-x:collection1) [    x:collection1] o.a.s.c.SolrCore [collection1] Registered new searcher Searcher@737439e6[collection1] main{ExitableDirectoryReader(UninvertingDirectoryReader())}
   [junit4]   2> 1925987 INFO  (TEST-HardAutoCommitTest.testCommitWithin-seed#[1E4AF50345EDFE10]) [    x:collection1] o.a.s.u.RandomMergePolicy RandomMergePolicy wrapping class org.apache.lucene.index.TieredMergePolicy: [TieredMergePolicy: maxMergeAtOnce=22, maxMergeAtOnceExplicit=43, maxMergedSegmentMB=91.6650390625, floorSegmentMB=0.537109375, forceMergeDeletesPctAllowed=11.772609180246416, segmentsPerTier=38.0, maxCFSSegmentSizeMB=8.796093022207999E12, noCFSRatio=0.0
   [junit4]   2> 1925987 INFO  (TEST-HardAutoCommitTest.testCommitWithin-seed#[1E4AF50345EDFE10]) [    x:collection1] o.a.s.c.SolrDeletionPolicy SolrDeletionPolicy.onInit: commits: num=1
   [junit4]   2> 	commit{dir=MockDirectoryWrapper(RAMDirectory@3e34692b lockFactory=org.apache.lucene.store.SingleInstanceLockFactory@62e4a5f4),segFN=segments_1,generation=1}
   [junit4]   2> 1925996 INFO  (TEST-HardAutoCommitTest.testCommitWithin-seed#[1E4AF50345EDFE10]) [    x:collection1] o.a.s.c.SolrDeletionPolicy newest commit generation = 1
   [junit4]   2> 1925996 INFO  (TEST-HardAutoCommitTest.testCommitWithin-seed#[1E4AF50345EDFE10]) [    x:collection1] o.a.s.u.DefaultSolrCoreState New IndexWriter is ready to be used.
   [junit4]   2> 1925997 INFO  (TEST-HardAutoCommitTest.testCommitWithin-seed#[1E4AF50345EDFE10]) [    x:collection1] o.a.s.s.SolrIndexSearcher Opening Searcher@5bf1302a[collection1] main
   [junit4]   2> 1925997 INFO  (TEST-HardAutoCommitTest.testCommitWithin-seed#[1E4AF50345EDFE10]) [    x:collection1] o.a.s.c.CoreContainer replacing core: collection1
   [junit4]   2> 1925997 INFO  (TEST-HardAutoCommitTest.testCommitWithin-seed#[1E4AF50345EDFE10]) [    x:collection1] o.a.s.c.SolrCore [collection1]  CLOSING SolrCore org.apache.solr.core.SolrCore@2e999514
   [junit4]   2> 1925997 INFO  (TEST-HardAutoCommitTest.testCommitWithin-seed#[1E4AF50345EDFE10]) [    x:collection1] o.a.s.u.DirectUpdateHandler2 closing DirectUpdateHandler2{commits=0,autocommits=0,soft autocommits=0,optimizes=0,rollbacks=0,expungeDeletes=0,docsPending=0,adds=0,deletesById=0,deletesByQuery=1,errors=0,cumulative_adds=0,cumulative_deletesById=0,cumulative_deletesByQuery=1,cumulative_errors=0,transaction_logs_total_size=0,transaction_logs_total_number=0}
   [junit4]   2> 1925997 INFO  (TEST-HardAutoCommitTest.testCommitWithin-seed#[1E4AF50345EDFE10]) [    x:collection1] o.a.s.c.SolrCore [collection1] Closing main searcher on request.
   [junit4]   2> 1926019 INFO  (TEST-HardAutoCommitTest.testCommitWithin-seed#[1E4AF50345EDFE10]) [    x:collection1] o.a.s.u.p.LogUpdateProcessorFactory [collection1] {add=[529 (1526225922157445120)]} 0 2
   [junit4]   2> 1926019 INFO  (TEST-HardAutoCommitTest.testCommitWithin-seed#[1E4AF50345EDFE10]) [    x:collection1] o.a.s.c.S.Request [collection1]  webapp=null path=null params={q=id:529&qt=standard&rows=20&version=2.2&start=0} hits=0 status=0 QTime=0
   [junit4]   2> 1926027 INFO  (searcherExecutor-6480-thread-1-processing-x:collection1) [    x:collection1] o.a.s.c.SolrCore [collection1] Registered new searcher Searcher@5bf1302a[collection1] main{ExitableDirectoryReader(UninvertingDirectoryReader())}
   [junit4]   2> 1926271 INFO  (TEST-HardAutoCommitTest.testCommitWithin-seed#[1E4AF50345EDFE10]) [    x:collection1] o.a.s.u.p.LogUpdateProcessorFactory [collection1] {add=[530 (1526225922421686272)]} 0 255
   [junit4]   2> 1926271 INFO  (TEST-HardAutoCommitTest.testCommitWithin-seed#[1E4AF50345EDFE10]) [    x:collection1] o.a.s.c.S.Request [collection1]  webapp=null path=null params={q=id:530&qt=standard&rows=20&version=2.2&start=0} hits=0 status=0 QTime=0
   [junit4]   2> 1926272 INFO  (TEST-HardAutoCommitTest.testCommitWithin-seed#[1E4AF50345EDFE10]) [    x:collection1] o.a.s.u.p.LogUpdateProcessorFactory [collection1] {delete=[529 (-1526225922423783424)]} 0 256
   [junit4]   2> 1926272 INFO  (TEST-HardAutoCommitTest.testCommitWithin-seed#[1E4AF50345EDFE10]) [    x:collection1] o.a.s.c.S.Request [collection1]  webapp=null path=null params={q=id:529&qt=standard&rows=20&version=2.2&start=0} hits=0 status=0 QTime=0
   [junit4]   2> 1926273 ERROR (TEST-HardAutoCommitTest.testCommitWithin-seed#[1E4AF50345EDFE10]) [    x:collection1] o.a.s.SolrTestCaseJ4 REQUEST FAILED: xpath=//result[@numFound=1]
   [junit4]   2> 	xml response was: <?xml version="1.0" encoding="UTF-8"?>
   [junit4]   2> <response>
   [junit4]   2> <lst name="responseHeader"><int name="status">0</int><int name="QTime">0</int></lst><result name="response" numFound="0" start="0"></result>
   [junit4]   2> </response>
   [junit4]   2> 
   [junit4]   2> 	request was:q=id:529&qt=standard&rows=20&version=2.2&start=0
   [junit4]   2> 1926274 ERROR (TEST-HardAutoCommitTest.testCommitWithin-seed#[1E4AF50345EDFE10]) [    x:collection1] o.a.s.SolrTestCaseJ4 REQUEST FAILED: q=id:529&qt=standard&rows=20&version=2.2&start=0:java.lang.RuntimeException: REQUEST FAILED: xpath=//result[@numFound=1]
   [junit4]   2> 	xml response was: <?xml version="1.0" encoding="UTF-8"?>
   [junit4]   2> <response>
   [junit4]   2> <lst name="responseHeader"><int name="status">0</int><int name="QTime">0</int></lst><result name="response" numFound="0" start="0"></result>
   [junit4]   2> </response>
   [junit4]   2> 
   [junit4]   2> 	request was:q=id:529&qt=standard&rows=20&version=2.2&start=0
   [junit4]   2> 	at org.apache.solr.SolrTestCaseJ4.assertQ(SolrTestCaseJ4.java:747)
   [junit4]   2> 	at org.apache.solr.update.HardAutoCommitTest.testCommitWithin(HardAutoCommitTest.java:99)
   [junit4]   2> 	at sun.reflect.NativeMethodAccessorImpl.invoke0(Native Method)
   [junit4]   2> 	at sun.reflect.NativeMethodAccessorImpl.invoke(NativeMethodAccessorImpl.java:57)
   [junit4]   2> 	at sun.reflect.DelegatingMethodAccessorImpl.invoke(DelegatingMethodAccessorImpl.java:43)
   [junit4]   2> 	at java.lang.reflect.Method.invoke(Method.java:606)
   [junit4]   2> 	at com.carrotsearch.randomizedtesting.RandomizedRunner.invoke(RandomizedRunner.java:1764)
   [junit4]   2> 	at com.carrotsearch.randomizedtesting.RandomizedRunner$8.evaluate(RandomizedRunner.java:871)
   [junit4]   2> 	at com.carrotsearch.randomizedtesting.RandomizedRunner$9.evaluate(RandomizedRunner.java:907)
   [junit4]   2> 	at com.carrotsearch.randomizedtesting.RandomizedRunner$10.evaluate(RandomizedRunner.java:921)
   [junit4]   2> 	at com.carrotsearch.randomizedtesting.rules.SystemPropertiesRestoreRule$1.evaluate(SystemPropertiesRestoreRule.java:57)
   [junit4]   2> 	at org.apache.lucene.util.TestRuleSetupTeardownChained$1.evaluate(TestRuleSetupTeardownChained.java:49)
   [junit4]   2> 	at org.apache.lucene.util.AbstractBeforeAfterRule$1.evaluate(AbstractBeforeAfterRule.java:45)
   [junit4]   2> 	at org.apache.lucene.util.TestRuleThreadAndTestName$1.evaluate(TestRuleThreadAndTestName.java:48)
   [junit4]   2> 	at org.apache.lucene.util.TestRuleIgnoreAfterMaxFailures$1.evaluate(TestRuleIgnoreAfterMaxFailures.java:64)
   [junit4]   2> 	at org.apache.lucene.util.TestRuleMarkFailure$1.evaluate(TestRuleMarkFailure.java:47)
   [junit4]   2> 	at com.carrotsearch.randomizedtesting.rules.StatementAdapter.evaluate(StatementAdapter.java:36)
   [junit4]   2> 	at com.carrotsearch.randomizedtesting.ThreadLeakControl$StatementRunner.run(ThreadLeakControl.java:367)
   [junit4]   2> 	at com.carrotsearch.randomizedtesting.ThreadLeakControl.forkTimeoutingTask(ThreadLeakControl.java:809)
   [junit4]   2> 	at com.carrotsearch.randomizedtesting.ThreadLeakControl$3.evaluate(ThreadLeakControl.java:460)
   [junit4]   2> 	at com.carrotsearch.randomizedtesting.RandomizedRunner.runSingleTest(RandomizedRunner.java:880)
   [junit4]   2> 	at com.carrotsearch.randomizedtesting.RandomizedRunner$5.evaluate(RandomizedRunner.java:781)
   [junit4]   2> 	at com.carrotsearch.randomizedtesting.RandomizedRunner$6.evaluate(RandomizedRunner.java:816)
   [junit4]   2> 	at com.carrotsearch.randomizedtesting.RandomizedRunner$7.evaluate(RandomizedRunner.java:827)
   [junit4]   2> 	at com.carrotsearch.randomizedtesting.rules.StatementAdapter.evaluate(StatementAdapter.java:36)
   [junit4]   2> 	at com.carrotsearch.randomizedtesting.rules.SystemPropertiesRestoreRule$1.evaluate(SystemPropertiesRestoreRule.java:57)
   [junit4]   2> 	at org.apache.lucene.util.AbstractBeforeAfterRule$1.evaluate(AbstractBeforeAfterRule.java:45)
   [junit4]   2> 	at com.carrotsearch.randomizedtesting.rules.StatementAdapter.evaluate(StatementAdapter.java:36)
   [junit4]   2> 	at org.apache.lucene.util.TestRuleStoreClassName$1.evaluate(TestRuleStoreClassName.java:41)
   [junit4]   2> 	at com.carrotsearch.randomizedtesting.rules.NoShadowingOrOverridesOnMethodsRule$1.evaluate(NoShadowingOrOverridesOnMethodsRule.java:40)
   [junit4]   2> 	at com.carrotsearch.randomizedtesting.rules.NoShadowingOrOverridesOnMethodsRule$1.evaluate(NoShadowingOrOverridesOnMethodsRule.java:40)
   [junit4]   2> 	at com.carrotsearch.randomizedtesting.rules.StatementAdapter.evaluate(StatementAdapter.java:36)
   [junit4]   2> 	at com.carrotsearch.randomizedtesting.rules.StatementAdapter.evaluate(StatementAdapter.java:36)
   [junit4]   2> 	at com.carrotsearch.randomizedtesting.rules.StatementAdapter.evaluate(StatementAdapter.java:36)
   [junit4]   2> 	at org.apache.lucene.util.TestRuleAssertionsRequired$1.evaluate(TestRuleAssertionsRequired.java:53)
   [junit4]   2> 	at org.apache.lucene.util.TestRuleMarkFailure$1.evaluate(TestRuleMarkFailure.java:47)
   [junit4]   2> 	at org.apache.lucene.util.TestRuleIgnoreAfterMaxFailures$1.evaluate(TestRuleIgnoreAfterMaxFailures.java:64)
   [junit4]   2> 	at org.apache.lucene.util.TestRuleIgnoreTestSuites$1.evaluate(TestRuleIgnoreTestSuites.java:54)
   [junit4]   2> 	at com.carrotsearch.randomizedtesting.rules.StatementAdapter.evaluate(StatementAdapter.java:36)
   [junit4]   2> 	at com.carrotsearch.randomizedtesting.ThreadLeakControl$StatementRunner.run(ThreadLeakControl.java:367)
   [junit4]   2> 	at java.lang.Thread.run(Thread.java:745)
   [junit4]   2> 
   [junit4]   2> 1926274 INFO  (TEST-HardAutoCommitTest.testCommitWithin-seed#[1E4AF50345EDFE10]) [    x:collection1] o.a.s.SolrTestCaseJ4 ###Ending testCommitWithin
   [junit4]   2> NOTE: reproduce with: ant test  -Dtestcase=HardAutoCommitTest -Dtests.method=testCommitWithin -Dtests.seed=1E4AF50345EDFE10 -Dtests.slow=true -Dtests.locale=de-AT -Dtests.timezone=Pacific/Johnston -Dtests.asserts=true -Dtests.file.encoding=ISO-8859-1
   [junit4] ERROR   0.87s J1 | HardAutoCommitTest.testCommitWithin <<<
   [junit4]    > Throwable #1: java.lang.RuntimeException: Exception during query
   [junit4]    > 	at __randomizedtesting.SeedInfo.seed([1E4AF50345EDFE10:A4989A7BC6C31005]:0)
   [junit4]    > 	at org.apache.solr.SolrTestCaseJ4.assertQ(SolrTestCaseJ4.java:754)
   [junit4]    > 	at org.apache.solr.update.HardAutoCommitTest.testCommitWithin(HardAutoCommitTest.java:99)
   [junit4]    > 	at java.lang.Thread.run(Thread.java:745)
   [junit4]    > Caused by: java.lang.RuntimeException: REQUEST FAILED: xpath=//result[@numFound=1]
   [junit4]    > 	xml response was: <?xml version="1.0" encoding="UTF-8"?>
   [junit4]    > <response>
   [junit4]    > <lst name="responseHeader"><int name="status">0</int><int name="QTime">0</int></lst><result name="response" numFound="0" start="0"></result>
   [junit4]    > </response>
   [junit4]    > 	request was:q=id:529&qt=standard&rows=20&version=2.2&start=0
   [junit4]    > 	at org.apache.solr.SolrTestCaseJ4.assertQ(SolrTestCaseJ4.java:747)
   [junit4]    > 	... 40 more
   [junit4]   2> 1926279 INFO  (SUITE-HardAutoCommitTest-seed#[1E4AF50345EDFE10]-worker) [    x:collection1] o.a.s.SolrTestCaseJ4 ###deleteCore
   [junit4]   2> 1926279 INFO  (SUITE-HardAutoCommitTest-seed#[1E4AF50345EDFE10]-worker) [    x:collection1] o.a.s.c.CoreContainer Shutting down CoreContainer instance=1579674097
   [junit4]   2> 1926279 INFO  (coreCloseExecutor-6484-thread-1-processing-x:collection1) [    x:collection1] o.a.s.c.SolrCore [collection1]  CLOSING SolrCore org.apache.solr.core.SolrCore@7d1cfc18
   [junit4]   2> 1926280 INFO  (coreCloseExecutor-6484-thread-1-processing-x:collection1) [    x:collection1] o.a.s.u.DirectUpdateHandler2 closing DirectUpdateHandler2{commits=0,autocommits=0,soft autocommits=0,optimizes=0,rollbacks=0,expungeDeletes=0,docsPending=2,adds=2,deletesById=1,deletesByQuery=0,errors=0,cumulative_adds=2,cumulative_deletesById=1,cumulative_deletesByQuery=0,cumulative_errors=0,transaction_logs_total_size=0,transaction_logs_total_number=0}
   [junit4]   2> 1926280 INFO  (coreCloseExecutor-6484-thread-1-processing-x:collection1) [    x:collection1] o.a.s.u.SolrCoreState Closing SolrCoreState
   [junit4]   2> 1926280 INFO  (coreCloseExecutor-6484-thread-1-processing-x:collection1) [    x:collection1] o.a.s.u.DefaultSolrCoreState SolrCoreState ref count has reached 0 - closing IndexWriter
   [junit4]   2> 1926280 INFO  (coreCloseExecutor-6484-thread-1-processing-x:collection1) [    x:collection1] o.a.s.u.DefaultSolrCoreState closing IndexWriter with IndexWriterCloser
   [junit4]   2> 1926280 INFO  (coreCloseExecutor-6484-thread-1-processing-x:collection1) [    x:collection1] o.a.s.u.DirectUpdateHandler2 Committing on IndexWriter close.
   [junit4]   2> 1926283 INFO  (coreCloseExecutor-6484-thread-1-processing-x:collection1) [    x:collection1] o.a.s.c.SolrDeletionPolicy SolrDeletionPolicy.onCommit: commits: num=2
   [junit4]   2> 	commit{dir=MockDirectoryWrapper(RAMDirectory@3e34692b lockFactory=org.apache.lucene.store.SingleInstanceLockFactory@62e4a5f4),segFN=segments_1,generation=1}
   [junit4]   2> 	commit{dir=MockDirectoryWrapper(RAMDirectory@3e34692b lockFactory=org.apache.lucene.store.SingleInstanceLockFactory@62e4a5f4),segFN=segments_2,generation=2}
   [junit4]   2> 1926283 INFO  (coreCloseExecutor-6484-thread-1-processing-x:collection1) [    x:collection1] o.a.s.c.SolrDeletionPolicy newest commit generation = 2
   [junit4]   2> 1926284 INFO  (coreCloseExecutor-6484-thread-1-processing-x:collection1) [    x:collection1] o.a.s.c.SolrCore [collection1] Closing main searcher on request.
   [junit4]   2> 1926294 INFO  (coreCloseExecutor-6484-thread-1-processing-x:collection1) [    x:collection1] o.a.s.c.CachingDirectoryFactory Closing MockDirectoryFactory - 2 directories currently being tracked
   [junit4]   2> 1926294 INFO  (coreCloseExecutor-6484-thread-1-processing-x:collection1) [    x:collection1] o.a.s.c.CachingDirectoryFactory looking to close /export/home/jenkins/workspace/Lucene-Solr-5.x-Solaris/solr/build/solr-core/test/J1/temp/solr.update.HardAutoCommitTest_1E4AF50345EDFE10-001/init-core-data-001 [CachedDir<<refCount=0;path=/export/home/jenkins/workspace/Lucene-Solr-5.x-Solaris/solr/build/solr-core/test/J1/temp/solr.update.HardAutoCommitTest_1E4AF50345EDFE10-001/init-core-data-001;done=false>>]
   [junit4]   2> 1926294 INFO  (coreCloseExecutor-6484-thread-1-processing-x:collection1) [    x:collection1] o.a.s.c.CachingDirectoryFactory Closing directory: /export/home/jenkins/workspace/Lucene-Solr-5.x-Solaris/solr/build/solr-core/test/J1/temp/solr.update.HardAutoCommitTest_1E4AF50345EDFE10-001/init-core-data-001
   [junit4]   2> 1926294 INFO  (coreCloseExecutor-6484-thread-1-processing-x:collection1) [    x:collection1] o.a.s.c.CachingDirectoryFactory looking to close /export/home/jenkins/workspace/Lucene-Solr-5.x-Solaris/solr/build/solr-core/test/J1/temp/solr.update.HardAutoCommitTest_1E4AF50345EDFE10-001/init-core-data-001/index [CachedDir<<refCount=0;path=/export/home/jenkins/workspace/Lucene-Solr-5.x-Solaris/solr/build/solr-core/test/J1/temp/solr.update.HardAutoCommitTest_1E4AF50345EDFE10-001/init-core-data-001/index;done=false>>]
   [junit4]   2> 1926294 INFO  (coreCloseExecutor-6484-thread-1-processing-x:collection1) [    x:collection1] o.a.s.c.CachingDirectoryFactory Closing directory: /export/home/jenkins/workspace/Lucene-Solr-5.x-Solaris/solr/build/solr-core/test/J1/temp/solr.update.HardAutoCommitTest_1E4AF50345EDFE10-001/init-core-data-001/index
   [junit4]   2> NOTE: leaving temporary files on disk at: /export/home/jenkins/workspace/Lucene-Solr-5.x-Solaris/solr/build/solr-core/test/J1/temp/solr.update.HardAutoCommitTest_1E4AF50345EDFE10-001
   [junit4]   2> NOTE: test params are: codec=Asserting(Lucene54): {text=TestBloomFilteredLucenePostings(BloomFilteringPostingsFormat(Lucene50(blocksize=128))), range_facet_i_dv=PostingsFormat(name=Asserting), id=PostingsFormat(name=Memory doPackFST= false), subject=PostingsFormat(name=Asserting), field_t=PostingsFormat(name=Memory doPackFST= false), _version_=FSTOrd50, multiDefault=PostingsFormat(name=Asserting), range_facet_l=PostingsFormat(name=Asserting), range_facet_l_dv=PostingsFormat(name=Memory doPackFST= false), intDefault=FSTOrd50, timestamp=PostingsFormat(name=Asserting)}, docValues:{range_facet_i_dv=DocValuesFormat(name=Direct), range_facet_l_dv=DocValuesFormat(name=Lucene54), timestamp=DocValuesFormat(name=Direct)}, sim=RandomSimilarity(queryNorm=false,coord=crazy): {}, locale=de-AT, timezone=Pacific/Johnston
   [junit4]   2> NOTE: SunOS 5.11 amd64/Oracle Corporation 1.7.0_95 (64-bit)/cpus=3,threads=1,free=174757816,total=518979584
   [junit4]   2> NOTE: All tests run in this JVM: [TestInitParams, TestHdfsUpdateLog, DistributedIntervalFacetingTest, TestDynamicFieldCollectionResource, TestCloudInspectUtil, TestSystemIdResolver, TestIndexingPerformance, TestBlobHandler, TestSearcherReuse, RecoveryAfterSoftCommitTest, TestManagedSchemaDynamicFieldResource, CollectionsAPIAsyncDistributedZkTest, SmileWriterTest, TestSortingResponseWriter, BasicDistributedZk2Test, TestFastOutputStream, FieldMutatingUpdateProcessorTest, ZkNodePropsTest, AsyncCallRequestStatusResponseTest, TestRecovery, TestRawTransformer, RAMDirectoryFactoryTest, TestMacros, TestComplexPhraseQParserPlugin, TestSolrQueryParser, TestReplicationHandlerBackup, TestCopyFieldCollectionResource, DirectSolrConnectionTest, CollectionStateFormat2Test, TestSimpleTrackingShardHandler, DistributedFacetPivotLongTailTest, ChaosMonkeySafeLeaderTest, BinaryUpdateRequestHandlerTest, DeleteLastCustomShardedReplicaTest, IndexSchemaRuntimeFieldTest, SpatialHeatmapFacetsTest, LukeRequestHandlerTest, CSVRequestHandlerTest, SortSpecParsingTest, TestQueryTypes, DefaultValueUpdateProcessorTest, TestBinaryField, TestDownShardTolerantSearch, TestCoreDiscovery, CloneFieldUpdateProcessorFactoryTest, NotRequiredUniqueKeyTest, TestFuzzyAnalyzedSuggestions, TestConfigSetsAPIExclusivity, TestSolrDeletionPolicy2, TestSerializedLuceneMatchVersion, TestSolrCLIRunExample, SharedFSAutoReplicaFailoverTest, HdfsSyncSliceTest, TestCryptoKeys, LeaderInitiatedRecoveryOnCommitTest, SegmentsInfoRequestHandlerTest, TestSolrConfigHandlerConcurrent, FileBasedSpellCheckerTest, TestJettySolrRunner, PluginInfoTest, OverseerStatusTest, TestConfigSetImmutable, DistributedExpandComponentTest, IgnoreCommitOptimizeUpdateProcessorFactoryTest, SolrInfoMBeanTest, TestSolrJ, TestJsonFacets, SolrXmlInZkTest, PKIAuthenticationIntegrationTest, ReplicationFactorTest, SolrCoreCheckLockOnStartupTest, MigrateRouteKeyTest, AnalysisErrorHandlingTest, TestOmitPositions, QueryParsingTest, SpellCheckComponentTest, DistribCursorPagingTest, SuggesterWFSTTest, TestFreeTextSuggestions, OpenCloseCoreStressTest, TestRTGBase, TestSolr4Spatial, SearchHandlerTest, TestTrackingShardHandlerFactory, TestJoin, MinimalSchemaTest, ResourceLoaderTest, TestRecoveryHdfs, TestBulkSchemaAPI, TestFoldingMultitermQuery, DistribJoinFromCollectionTest, ConfigSetsAPITest, BJQParserTest, CoreAdminRequestStatusTest, TestRealTimeGet, SynonymTokenizerTest, LoggingHandlerTest, OutOfBoxZkACLAndCredentialsProvidersTest, BufferStoreTest, StressHdfsTest, BasicFunctionalityTest, CurrencyFieldOpenExchangeTest, DistributedMLTComponentTest, TestPKIAuthenticationPlugin, TestSchemaSimilarityResource, TestDFISimilarityFactory, TestRequestStatusCollectionAPI, TestFiltering, HighlighterMaxOffsetTest, TestStandardQParsers, HdfsUnloadDistributedZkTest, TestDistributedGrouping, SpellingQueryConverterTest, ShardRoutingCustomTest, BigEndianAscendingWordDeserializerTest, TestPHPSerializedResponseWriter, TestLeaderElectionZkExpiry, UpdateRequestProcessorFactoryTest, DistributedTermsComponentTest, BitVectorTest, TestBinaryResponseWriter, AnalyticsQueryTest, ResponseLogComponentTest, DateMathParserTest, VMParamsZkACLAndCredentialsProvidersTest, TestReversedWildcardFilterFactory, TestStressRecovery, QueryResultKeyTest, TestTrieFacet, SpellPossibilityIteratorTest, CoreAdminHandlerTest, WordBreakSolrSpellCheckerTest, TestSolrXml, DistributedFacetPivotSmallTest, TestExactSharedStatsCache, CustomCollectionTest, AddSchemaFieldsUpdateProcessorFactoryTest, SimpleMLTQParserTest, BasicDistributedZkTest, CollectionsAPIDistributedZkTest, LeaderElectionIntegrationTest, ShardRoutingTest, BasicZkTest, RecoveryZkTest, FullSolrCloudDistribCmdsTest, TestRandomFaceting, ZkSolrClientTest, TestZkChroot, ZkCLITest, AutoCommitTest, TestFaceting, TestHashPartitioner, DistributedSpellCheckComponentTest, ZkControllerTest, TestStressReorder, HardAutoCommitTest]
   [junit4] Completed [304/566 (1!)] on J1 in 2.32s, 1 test, 1 error <<< FAILURES!

[...truncated 832 lines...]
BUILD FAILED
/export/home/jenkins/workspace/Lucene-Solr-5.x-Solaris/build.xml:750: The following error occurred while executing this line:
/export/home/jenkins/workspace/Lucene-Solr-5.x-Solaris/build.xml:694: The following error occurred while executing this line:
/export/home/jenkins/workspace/Lucene-Solr-5.x-Solaris/build.xml:59: The following error occurred while executing this line:
/export/home/jenkins/workspace/Lucene-Solr-5.x-Solaris/solr/build.xml:233: The following error occurred while executing this line:
/export/home/jenkins/workspace/Lucene-Solr-5.x-Solaris/solr/common-build.xml:534: The following error occurred while executing this line:
/export/home/jenkins/workspace/Lucene-Solr-5.x-Solaris/lucene/common-build.xml:1477: The following error occurred while executing this line:
/export/home/jenkins/workspace/Lucene-Solr-5.x-Solaris/lucene/common-build.xml:1033: There were test failures: 566 suites (7 ignored), 2279 tests, 1 error, 55 ignored (39 assumptions) [seed: 1E4AF50345EDFE10]

Total time: 79 minutes 19 seconds
Build step 'Invoke Ant' marked build as failure
Archiving artifacts
[WARNINGS] Skipping publisher since build result is FAILURE
Recording test results
Email was triggered for: Failure - Any
Sending email for trigger: Failure - Any



Mime
View raw message