lucene-dev mailing list archives

Site index · List index
Message view « Date » · « Thread »
Top « Date » · « Thread »
From Policeman Jenkins Server <jenk...@thetaphi.de>
Subject [JENKINS] Lucene-Solr-5.x-Solaris (64bit/jdk1.8.0) - Build # 406 - Failure!
Date Sun, 21 Feb 2016 08:34:20 GMT
Build: http://jenkins.thetaphi.de/job/Lucene-Solr-5.x-Solaris/406/
Java: 64bit/jdk1.8.0 -XX:-UseCompressedOops -XX:+UseConcMarkSweepGC

1 tests failed.
FAILED:  org.apache.solr.search.TestIndexSearcher.testReopen

Error Message:
expected:<_0(5.5.0):c2> but was:<_2(5.5.0):c4>

Stack Trace:
java.lang.AssertionError: expected:<_0(5.5.0):c2> but was:<_2(5.5.0):c4>
	at __randomizedtesting.SeedInfo.seed([C54BCBA9F8D085CA:E9031ABF8BEC0AE9]:0)
	at org.junit.Assert.fail(Assert.java:93)
	at org.junit.Assert.failNotEquals(Assert.java:647)
	at org.junit.Assert.assertEquals(Assert.java:128)
	at org.junit.Assert.assertEquals(Assert.java:147)
	at org.apache.solr.search.TestIndexSearcher.testReopen(TestIndexSearcher.java:111)
	at sun.reflect.NativeMethodAccessorImpl.invoke0(Native Method)
	at sun.reflect.NativeMethodAccessorImpl.invoke(NativeMethodAccessorImpl.java:62)
	at sun.reflect.DelegatingMethodAccessorImpl.invoke(DelegatingMethodAccessorImpl.java:43)
	at java.lang.reflect.Method.invoke(Method.java:498)
	at com.carrotsearch.randomizedtesting.RandomizedRunner.invoke(RandomizedRunner.java:1764)
	at com.carrotsearch.randomizedtesting.RandomizedRunner$8.evaluate(RandomizedRunner.java:871)
	at com.carrotsearch.randomizedtesting.RandomizedRunner$9.evaluate(RandomizedRunner.java:907)
	at com.carrotsearch.randomizedtesting.RandomizedRunner$10.evaluate(RandomizedRunner.java:921)
	at com.carrotsearch.randomizedtesting.rules.SystemPropertiesRestoreRule$1.evaluate(SystemPropertiesRestoreRule.java:57)
	at org.apache.lucene.util.TestRuleSetupTeardownChained$1.evaluate(TestRuleSetupTeardownChained.java:49)
	at org.apache.lucene.util.AbstractBeforeAfterRule$1.evaluate(AbstractBeforeAfterRule.java:45)
	at org.apache.lucene.util.TestRuleThreadAndTestName$1.evaluate(TestRuleThreadAndTestName.java:48)
	at org.apache.lucene.util.TestRuleIgnoreAfterMaxFailures$1.evaluate(TestRuleIgnoreAfterMaxFailures.java:64)
	at org.apache.lucene.util.TestRuleMarkFailure$1.evaluate(TestRuleMarkFailure.java:47)
	at com.carrotsearch.randomizedtesting.rules.StatementAdapter.evaluate(StatementAdapter.java:36)
	at com.carrotsearch.randomizedtesting.ThreadLeakControl$StatementRunner.run(ThreadLeakControl.java:367)
	at com.carrotsearch.randomizedtesting.ThreadLeakControl.forkTimeoutingTask(ThreadLeakControl.java:809)
	at com.carrotsearch.randomizedtesting.ThreadLeakControl$3.evaluate(ThreadLeakControl.java:460)
	at com.carrotsearch.randomizedtesting.RandomizedRunner.runSingleTest(RandomizedRunner.java:880)
	at com.carrotsearch.randomizedtesting.RandomizedRunner$5.evaluate(RandomizedRunner.java:781)
	at com.carrotsearch.randomizedtesting.RandomizedRunner$6.evaluate(RandomizedRunner.java:816)
	at com.carrotsearch.randomizedtesting.RandomizedRunner$7.evaluate(RandomizedRunner.java:827)
	at com.carrotsearch.randomizedtesting.rules.StatementAdapter.evaluate(StatementAdapter.java:36)
	at com.carrotsearch.randomizedtesting.rules.SystemPropertiesRestoreRule$1.evaluate(SystemPropertiesRestoreRule.java:57)
	at org.apache.lucene.util.AbstractBeforeAfterRule$1.evaluate(AbstractBeforeAfterRule.java:45)
	at com.carrotsearch.randomizedtesting.rules.StatementAdapter.evaluate(StatementAdapter.java:36)
	at org.apache.lucene.util.TestRuleStoreClassName$1.evaluate(TestRuleStoreClassName.java:41)
	at com.carrotsearch.randomizedtesting.rules.NoShadowingOrOverridesOnMethodsRule$1.evaluate(NoShadowingOrOverridesOnMethodsRule.java:40)
	at com.carrotsearch.randomizedtesting.rules.NoShadowingOrOverridesOnMethodsRule$1.evaluate(NoShadowingOrOverridesOnMethodsRule.java:40)
	at com.carrotsearch.randomizedtesting.rules.StatementAdapter.evaluate(StatementAdapter.java:36)
	at com.carrotsearch.randomizedtesting.rules.StatementAdapter.evaluate(StatementAdapter.java:36)
	at com.carrotsearch.randomizedtesting.rules.StatementAdapter.evaluate(StatementAdapter.java:36)
	at org.apache.lucene.util.TestRuleAssertionsRequired$1.evaluate(TestRuleAssertionsRequired.java:53)
	at org.apache.lucene.util.TestRuleMarkFailure$1.evaluate(TestRuleMarkFailure.java:47)
	at org.apache.lucene.util.TestRuleIgnoreAfterMaxFailures$1.evaluate(TestRuleIgnoreAfterMaxFailures.java:64)
	at org.apache.lucene.util.TestRuleIgnoreTestSuites$1.evaluate(TestRuleIgnoreTestSuites.java:54)
	at com.carrotsearch.randomizedtesting.rules.StatementAdapter.evaluate(StatementAdapter.java:36)
	at com.carrotsearch.randomizedtesting.ThreadLeakControl$StatementRunner.run(ThreadLeakControl.java:367)
	at java.lang.Thread.run(Thread.java:745)




Build Log:
[...truncated 11238 lines...]
   [junit4] Suite: org.apache.solr.search.TestIndexSearcher
   [junit4]   2> Creating dataDir: /export/home/jenkins/workspace/Lucene-Solr-5.x-Solaris/solr/build/solr-core/test/J1/temp/solr.search.TestIndexSearcher_C54BCBA9F8D085CA-001/init-core-data-001
   [junit4]   2> 1126775 INFO  (SUITE-TestIndexSearcher-seed#[C54BCBA9F8D085CA]-worker) [    ] o.a.s.SolrTestCaseJ4 Randomized ssl (false) and clientAuth (false)
   [junit4]   2> 1126776 INFO  (SUITE-TestIndexSearcher-seed#[C54BCBA9F8D085CA]-worker) [    ] o.a.s.SolrTestCaseJ4 ####initCore
   [junit4]   2> 1126776 INFO  (SUITE-TestIndexSearcher-seed#[C54BCBA9F8D085CA]-worker) [    ] o.a.s.c.SolrResourceLoader new SolrResourceLoader for directory: '/export/home/jenkins/workspace/Lucene-Solr-5.x-Solaris/solr/core/src/test-files/solr/collection1'
   [junit4]   2> 1126776 INFO  (SUITE-TestIndexSearcher-seed#[C54BCBA9F8D085CA]-worker) [    ] o.a.s.c.SolrResourceLoader JNDI not configured for solr (NoInitialContextEx)
   [junit4]   2> 1126776 INFO  (SUITE-TestIndexSearcher-seed#[C54BCBA9F8D085CA]-worker) [    ] o.a.s.c.SolrResourceLoader using system property solr.solr.home: /export/home/jenkins/workspace/Lucene-Solr-5.x-Solaris/solr/core/src/test-files/solr
   [junit4]   2> 1126776 INFO  (SUITE-TestIndexSearcher-seed#[C54BCBA9F8D085CA]-worker) [    ] o.a.s.c.SolrResourceLoader Adding 'file:/export/home/jenkins/workspace/Lucene-Solr-5.x-Solaris/solr/core/src/test-files/solr/collection1/lib/classes/' to classloader
   [junit4]   2> 1126776 INFO  (SUITE-TestIndexSearcher-seed#[C54BCBA9F8D085CA]-worker) [    ] o.a.s.c.SolrResourceLoader Adding 'file:/export/home/jenkins/workspace/Lucene-Solr-5.x-Solaris/solr/core/src/test-files/solr/collection1/lib/README' to classloader
   [junit4]   2> 1126822 INFO  (SUITE-TestIndexSearcher-seed#[C54BCBA9F8D085CA]-worker) [    ] o.a.s.c.SolrConfig current version of requestparams : -1
   [junit4]   2> 1126834 INFO  (SUITE-TestIndexSearcher-seed#[C54BCBA9F8D085CA]-worker) [    ] o.a.s.c.SolrConfig Using Lucene MatchVersion: 5.5.0
   [junit4]   2> 1126865 INFO  (SUITE-TestIndexSearcher-seed#[C54BCBA9F8D085CA]-worker) [    ] o.a.s.c.SolrConfig Loaded SolrConfig: solrconfig.xml
   [junit4]   2> 1126872 INFO  (SUITE-TestIndexSearcher-seed#[C54BCBA9F8D085CA]-worker) [    ] o.a.s.s.IndexSchema [null] Schema name=test
   [junit4]   2> 1126991 INFO  (SUITE-TestIndexSearcher-seed#[C54BCBA9F8D085CA]-worker) [    ] o.a.s.s.OpenExchangeRatesOrgProvider Initialized with rates=open-exchange-rates.json, refreshInterval=1440.
   [junit4]   2> 1126998 INFO  (SUITE-TestIndexSearcher-seed#[C54BCBA9F8D085CA]-worker) [    ] o.a.s.s.IndexSchema default search field in schema is text
   [junit4]   2> 1126999 INFO  (SUITE-TestIndexSearcher-seed#[C54BCBA9F8D085CA]-worker) [    ] o.a.s.s.IndexSchema unique key field: id
   [junit4]   2> 1127003 INFO  (SUITE-TestIndexSearcher-seed#[C54BCBA9F8D085CA]-worker) [    ] o.a.s.s.FileExchangeRateProvider Reloading exchange rates from file currency.xml
   [junit4]   2> 1127006 INFO  (SUITE-TestIndexSearcher-seed#[C54BCBA9F8D085CA]-worker) [    ] o.a.s.s.FileExchangeRateProvider Reloading exchange rates from file currency.xml
   [junit4]   2> 1127008 INFO  (SUITE-TestIndexSearcher-seed#[C54BCBA9F8D085CA]-worker) [    ] o.a.s.s.OpenExchangeRatesOrgProvider Reloading exchange rates from open-exchange-rates.json
   [junit4]   2> 1127008 INFO  (SUITE-TestIndexSearcher-seed#[C54BCBA9F8D085CA]-worker) [    ] o.a.s.s.OpenExchangeRatesOrgProvider Reloading exchange rates from open-exchange-rates.json
   [junit4]   2> 1127008 INFO  (SUITE-TestIndexSearcher-seed#[C54BCBA9F8D085CA]-worker) [    ] o.a.s.c.SolrResourceLoader JNDI not configured for solr (NoInitialContextEx)
   [junit4]   2> 1127008 INFO  (SUITE-TestIndexSearcher-seed#[C54BCBA9F8D085CA]-worker) [    ] o.a.s.c.SolrResourceLoader using system property solr.solr.home: /export/home/jenkins/workspace/Lucene-Solr-5.x-Solaris/solr/core/src/test-files/solr
   [junit4]   2> 1127008 INFO  (SUITE-TestIndexSearcher-seed#[C54BCBA9F8D085CA]-worker) [    ] o.a.s.c.SolrResourceLoader new SolrResourceLoader for directory: '/export/home/jenkins/workspace/Lucene-Solr-5.x-Solaris/solr/core/src/test-files/solr'
   [junit4]   2> 1127008 INFO  (SUITE-TestIndexSearcher-seed#[C54BCBA9F8D085CA]-worker) [    ] o.a.s.c.SolrResourceLoader JNDI not configured for solr (NoInitialContextEx)
   [junit4]   2> 1127009 INFO  (SUITE-TestIndexSearcher-seed#[C54BCBA9F8D085CA]-worker) [    ] o.a.s.c.SolrResourceLoader using system property solr.solr.home: /export/home/jenkins/workspace/Lucene-Solr-5.x-Solaris/solr/core/src/test-files/solr
   [junit4]   2> 1127009 INFO  (SUITE-TestIndexSearcher-seed#[C54BCBA9F8D085CA]-worker) [    ] o.a.s.c.CoreContainer New CoreContainer 1449704725
   [junit4]   2> 1127009 INFO  (SUITE-TestIndexSearcher-seed#[C54BCBA9F8D085CA]-worker) [    ] o.a.s.c.CoreContainer Loading cores into CoreContainer [instanceDir=/export/home/jenkins/workspace/Lucene-Solr-5.x-Solaris/solr/core/src/test-files/solr]
   [junit4]   2> 1127009 WARN  (SUITE-TestIndexSearcher-seed#[C54BCBA9F8D085CA]-worker) [    ] o.a.s.c.CoreContainer Couldn't add files from /export/home/jenkins/workspace/Lucene-Solr-5.x-Solaris/solr/core/src/test-files/solr/lib to classpath: /export/home/jenkins/workspace/Lucene-Solr-5.x-Solaris/solr/core/src/test-files/solr/lib
   [junit4]   2> 1127009 INFO  (SUITE-TestIndexSearcher-seed#[C54BCBA9F8D085CA]-worker) [    ] o.a.s.h.c.HttpShardHandlerFactory created with socketTimeout : 600000,connTimeout : 60000,maxConnectionsPerHost : 20,maxConnections : 10000,corePoolSize : 0,maximumPoolSize : 2147483647,maxThreadIdleTime : 5,sizeOfQueue : -1,fairnessPolicy : false,useRetries : false,
   [junit4]   2> 1127011 INFO  (SUITE-TestIndexSearcher-seed#[C54BCBA9F8D085CA]-worker) [    ] o.a.s.u.UpdateShardHandler Creating UpdateShardHandler HTTP client with params: socketTimeout=30000&connTimeout=30000&retry=true
   [junit4]   2> 1127011 INFO  (SUITE-TestIndexSearcher-seed#[C54BCBA9F8D085CA]-worker) [    ] o.a.s.l.LogWatcher SLF4J impl is org.slf4j.impl.Log4jLoggerFactory
   [junit4]   2> 1127011 INFO  (SUITE-TestIndexSearcher-seed#[C54BCBA9F8D085CA]-worker) [    ] o.a.s.l.LogWatcher Registering Log Listener [Log4j (org.slf4j.impl.Log4jLoggerFactory)]
   [junit4]   2> 1127012 INFO  (SUITE-TestIndexSearcher-seed#[C54BCBA9F8D085CA]-worker) [    ] o.a.s.c.CoreContainer Security conf doesn't exist. Skipping setup for authorization module.
   [junit4]   2> 1127012 INFO  (SUITE-TestIndexSearcher-seed#[C54BCBA9F8D085CA]-worker) [    ] o.a.s.c.CoreContainer No authentication plugin used.
   [junit4]   2> 1127013 INFO  (SUITE-TestIndexSearcher-seed#[C54BCBA9F8D085CA]-worker) [    ] o.a.s.c.CoreDescriptor Created CoreDescriptor: {name=collection1, config=solrconfig.xml, transient=false, schema=schema.xml, loadOnStartup=true, configSetProperties=configsetprops.json, collection=collection1, dataDir=/export/home/jenkins/workspace/Lucene-Solr-5.x-Solaris/solr/build/solr-core/test/J1/temp/solr.search.TestIndexSearcher_C54BCBA9F8D085CA-001/init-core-data-001, shard=shard1}
   [junit4]   2> 1127013 INFO  (coreLoadExecutor-3482-thread-1) [    ] o.a.s.c.SolrResourceLoader new SolrResourceLoader for directory: '/export/home/jenkins/workspace/Lucene-Solr-5.x-Solaris/solr/core/src/test-files/solr/collection1'
   [junit4]   2> 1127013 INFO  (coreLoadExecutor-3482-thread-1) [    ] o.a.s.c.SolrResourceLoader JNDI not configured for solr (NoInitialContextEx)
   [junit4]   2> 1127013 INFO  (coreLoadExecutor-3482-thread-1) [    ] o.a.s.c.SolrResourceLoader using system property solr.solr.home: /export/home/jenkins/workspace/Lucene-Solr-5.x-Solaris/solr/core/src/test-files/solr
   [junit4]   2> 1127014 INFO  (coreLoadExecutor-3482-thread-1) [    ] o.a.s.c.SolrResourceLoader Adding 'file:/export/home/jenkins/workspace/Lucene-Solr-5.x-Solaris/solr/core/src/test-files/solr/collection1/lib/classes/' to classloader
   [junit4]   2> 1127014 INFO  (coreLoadExecutor-3482-thread-1) [    ] o.a.s.c.SolrResourceLoader Adding 'file:/export/home/jenkins/workspace/Lucene-Solr-5.x-Solaris/solr/core/src/test-files/solr/collection1/lib/README' to classloader
   [junit4]   2> 1127044 INFO  (coreLoadExecutor-3482-thread-1) [    ] o.a.s.c.SolrConfig current version of requestparams : -1
   [junit4]   2> 1127055 INFO  (coreLoadExecutor-3482-thread-1) [    ] o.a.s.c.SolrConfig Using Lucene MatchVersion: 5.5.0
   [junit4]   2> 1127091 INFO  (coreLoadExecutor-3482-thread-1) [    ] o.a.s.c.SolrConfig Loaded SolrConfig: solrconfig.xml
   [junit4]   2> 1127097 INFO  (coreLoadExecutor-3482-thread-1) [    ] o.a.s.s.IndexSchema [collection1] Schema name=test
   [junit4]   2> 1127199 INFO  (coreLoadExecutor-3482-thread-1) [    ] o.a.s.s.OpenExchangeRatesOrgProvider Initialized with rates=open-exchange-rates.json, refreshInterval=1440.
   [junit4]   2> 1127205 INFO  (coreLoadExecutor-3482-thread-1) [    ] o.a.s.s.IndexSchema default search field in schema is text
   [junit4]   2> 1127206 INFO  (coreLoadExecutor-3482-thread-1) [    ] o.a.s.s.IndexSchema unique key field: id
   [junit4]   2> 1127209 INFO  (coreLoadExecutor-3482-thread-1) [    ] o.a.s.s.FileExchangeRateProvider Reloading exchange rates from file currency.xml
   [junit4]   2> 1127212 INFO  (coreLoadExecutor-3482-thread-1) [    ] o.a.s.s.FileExchangeRateProvider Reloading exchange rates from file currency.xml
   [junit4]   2> 1127214 INFO  (coreLoadExecutor-3482-thread-1) [    ] o.a.s.s.OpenExchangeRatesOrgProvider Reloading exchange rates from open-exchange-rates.json
   [junit4]   2> 1127214 INFO  (coreLoadExecutor-3482-thread-1) [    ] o.a.s.s.OpenExchangeRatesOrgProvider Reloading exchange rates from open-exchange-rates.json
   [junit4]   2> 1127217 INFO  (coreLoadExecutor-3482-thread-1) [    ] o.a.s.c.ConfigSetProperties Did not find ConfigSet properties, assuming default properties: Can't find resource 'configsetprops.json' in classpath or '/export/home/jenkins/workspace/Lucene-Solr-5.x-Solaris/solr/core/src/test-files/solr/collection1'
   [junit4]   2> 1127217 INFO  (coreLoadExecutor-3482-thread-1) [    ] o.a.s.c.CoreContainer Creating SolrCore 'collection1' using configuration from instancedir /export/home/jenkins/workspace/Lucene-Solr-5.x-Solaris/solr/core/src/test-files/solr/collection1
   [junit4]   2> 1127217 INFO  (coreLoadExecutor-3482-thread-1) [    x:collection1] o.a.s.c.SolrCore org.apache.solr.core.MockDirectoryFactory
   [junit4]   2> 1127217 INFO  (coreLoadExecutor-3482-thread-1) [    x:collection1] o.a.s.c.SolrCore [[collection1] ] Opening new SolrCore at [/export/home/jenkins/workspace/Lucene-Solr-5.x-Solaris/solr/core/src/test-files/solr/collection1], dataDir=[/export/home/jenkins/workspace/Lucene-Solr-5.x-Solaris/solr/build/solr-core/test/J1/temp/solr.search.TestIndexSearcher_C54BCBA9F8D085CA-001/init-core-data-001/]
   [junit4]   2> 1127217 INFO  (coreLoadExecutor-3482-thread-1) [    x:collection1] o.a.s.c.JmxMonitoredMap JMX monitoring is enabled. Adding Solr mbeans to JMX Server: com.sun.jmx.mbeanserver.JmxMBeanServer@17afa7e6
   [junit4]   2> 1127218 INFO  (coreLoadExecutor-3482-thread-1) [    x:collection1] o.a.s.c.CachingDirectoryFactory return new directory for /export/home/jenkins/workspace/Lucene-Solr-5.x-Solaris/solr/build/solr-core/test/J1/temp/solr.search.TestIndexSearcher_C54BCBA9F8D085CA-001/init-core-data-001
   [junit4]   2> 1127218 INFO  (coreLoadExecutor-3482-thread-1) [    x:collection1] o.a.s.c.SolrCore New index directory detected: old=null new=/export/home/jenkins/workspace/Lucene-Solr-5.x-Solaris/solr/build/solr-core/test/J1/temp/solr.search.TestIndexSearcher_C54BCBA9F8D085CA-001/init-core-data-001/index/
   [junit4]   2> 1127218 WARN  (coreLoadExecutor-3482-thread-1) [    x:collection1] o.a.s.c.SolrCore [collection1] Solr index directory '/export/home/jenkins/workspace/Lucene-Solr-5.x-Solaris/solr/build/solr-core/test/J1/temp/solr.search.TestIndexSearcher_C54BCBA9F8D085CA-001/init-core-data-001/index' doesn't exist. Creating new index...
   [junit4]   2> 1127219 INFO  (coreLoadExecutor-3482-thread-1) [    x:collection1] o.a.s.c.CachingDirectoryFactory return new directory for /export/home/jenkins/workspace/Lucene-Solr-5.x-Solaris/solr/build/solr-core/test/J1/temp/solr.search.TestIndexSearcher_C54BCBA9F8D085CA-001/init-core-data-001/index
   [junit4]   2> 1127219 INFO  (coreLoadExecutor-3482-thread-1) [    x:collection1] o.a.s.u.RandomMergePolicy RandomMergePolicy wrapping class org.apache.lucene.index.TieredMergePolicy: [TieredMergePolicy: maxMergeAtOnce=19, maxMergeAtOnceExplicit=24, maxMergedSegmentMB=66.8037109375, floorSegmentMB=1.76953125, forceMergeDeletesPctAllowed=5.6524345155458375, segmentsPerTier=50.0, maxCFSSegmentSizeMB=8.796093022207999E12, noCFSRatio=1.0
   [junit4]   2> 1127219 INFO  (coreLoadExecutor-3482-thread-1) [    x:collection1] o.a.s.c.SolrDeletionPolicy SolrDeletionPolicy.onCommit: commits: num=1
   [junit4]   2> 	commit{dir=MockDirectoryWrapper(RAMDirectory@4951cb8a lockFactory=org.apache.lucene.store.SingleInstanceLockFactory@6291d05a),segFN=segments_1,generation=1}
   [junit4]   2> 1127219 INFO  (coreLoadExecutor-3482-thread-1) [    x:collection1] o.a.s.c.SolrDeletionPolicy newest commit generation = 1
   [junit4]   2> 1127221 INFO  (OldIndexDirectoryCleanupThreadForCore-collection1) [    x:collection1] o.a.s.c.SolrCore Looking for old index directories to cleanup for core collection1 in /export/home/jenkins/workspace/Lucene-Solr-5.x-Solaris/solr/build/solr-core/test/J1/temp/solr.search.TestIndexSearcher_C54BCBA9F8D085CA-001/init-core-data-001/
   [junit4]   2> 1127224 INFO  (coreLoadExecutor-3482-thread-1) [    x:collection1] o.a.s.u.p.UpdateRequestProcessorChain creating updateRequestProcessorChain "dedupe"
   [junit4]   2> 1127229 INFO  (coreLoadExecutor-3482-thread-1) [    x:collection1] o.a.s.u.p.UpdateRequestProcessorChain inserting DistributedUpdateProcessorFactory into updateRequestProcessorChain "dedupe"
   [junit4]   2> 1127229 INFO  (coreLoadExecutor-3482-thread-1) [    x:collection1] o.a.s.u.p.UpdateRequestProcessorChain creating updateRequestProcessorChain "dedupe-allfields"
   [junit4]   2> 1127229 INFO  (coreLoadExecutor-3482-thread-1) [    x:collection1] o.a.s.u.p.UpdateRequestProcessorChain inserting DistributedUpdateProcessorFactory into updateRequestProcessorChain "dedupe-allfields"
   [junit4]   2> 1127229 INFO  (coreLoadExecutor-3482-thread-1) [    x:collection1] o.a.s.u.p.UpdateRequestProcessorChain creating updateRequestProcessorChain "stored_sig"
   [junit4]   2> 1127229 INFO  (coreLoadExecutor-3482-thread-1) [    x:collection1] o.a.s.u.p.UpdateRequestProcessorChain inserting DistributedUpdateProcessorFactory into updateRequestProcessorChain "stored_sig"
   [junit4]   2> 1127229 INFO  (coreLoadExecutor-3482-thread-1) [    x:collection1] o.a.s.u.p.UpdateRequestProcessorChain creating updateRequestProcessorChain "uniq-fields"
   [junit4]   2> 1127229 INFO  (coreLoadExecutor-3482-thread-1) [    x:collection1] o.a.s.u.p.UpdateRequestProcessorChain inserting DistributedUpdateProcessorFactory into updateRequestProcessorChain "uniq-fields"
   [junit4]   2> 1127229 INFO  (coreLoadExecutor-3482-thread-1) [    x:collection1] o.a.s.u.p.UpdateRequestProcessorChain creating updateRequestProcessorChain "distrib-dup-test-chain-explicit"
   [junit4]   2> 1127230 INFO  (coreLoadExecutor-3482-thread-1) [    x:collection1] o.a.s.u.p.UpdateRequestProcessorChain creating updateRequestProcessorChain "distrib-dup-test-chain-implicit"
   [junit4]   2> 1127230 INFO  (coreLoadExecutor-3482-thread-1) [    x:collection1] o.a.s.u.p.UpdateRequestProcessorChain inserting DistributedUpdateProcessorFactory into updateRequestProcessorChain "distrib-dup-test-chain-implicit"
   [junit4]   2> 1127230 INFO  (coreLoadExecutor-3482-thread-1) [    x:collection1] o.a.s.c.SolrCore no updateRequestProcessorChain defined as default, creating implicit default
   [junit4]   2> 1127232 INFO  (coreLoadExecutor-3482-thread-1) [    x:collection1] o.a.s.h.l.XMLLoader xsltCacheLifetimeSeconds=60
   [junit4]   2> 1127234 INFO  (coreLoadExecutor-3482-thread-1) [    x:collection1] o.a.s.h.l.XMLLoader xsltCacheLifetimeSeconds=60
   [junit4]   2> 1127235 INFO  (coreLoadExecutor-3482-thread-1) [    x:collection1] o.a.s.h.l.XMLLoader xsltCacheLifetimeSeconds=60
   [junit4]   2> 1127236 INFO  (coreLoadExecutor-3482-thread-1) [    x:collection1] o.a.s.h.l.XMLLoader xsltCacheLifetimeSeconds=60
   [junit4]   2> 1127258 INFO  (coreLoadExecutor-3482-thread-1) [    x:collection1] o.a.s.c.PluginBag requestHandler : 'lazy' created with startup=lazy 
   [junit4]   2> 1127260 INFO  (coreLoadExecutor-3482-thread-1) [    x:collection1] o.a.s.c.RequestHandlers Registered paths: /admin/mbeans,standard,spellCheckCompRH,lazy,/update/json/docs,/admin/luke,spellCheckWithWordbreak_Direct,tvrh,/get,/admin/properties,/update/json,mltrh,/admin/threads,/search-facet-def,/update/csv,/search-facet-invariants,/admin/segments,spellCheckCompRH1,/mlt,/admin/system,/replication,dismax,defaults,/config,/schema,/admin/plugins,/admin/logging,spellCheckWithWordbreak,mock,/admin/ping,/update,/admin/file,/terms,spellCheckCompRH_Direct,/debug/dump
   [junit4]   2> 1127260 WARN  (coreLoadExecutor-3482-thread-1) [    x:collection1] o.a.s.c.SolrCore solrconfig.xml uses deprecated <admin/gettableFiles>, Please update your config to use the ShowFileRequestHandler.
   [junit4]   2> 1127261 INFO  (coreLoadExecutor-3482-thread-1) [    x:collection1] o.a.s.c.SolrCore Using default statsCache cache: org.apache.solr.search.stats.LocalStatsCache
   [junit4]   2> 1127262 INFO  (coreLoadExecutor-3482-thread-1) [    x:collection1] o.a.s.u.UpdateHandler Using UpdateLog implementation: org.apache.solr.update.UpdateLog
   [junit4]   2> 1127262 INFO  (coreLoadExecutor-3482-thread-1) [    x:collection1] o.a.s.u.UpdateLog Initializing UpdateLog: dataDir= defaultSyncLevel=FLUSH numRecordsToKeep=100 maxNumLogsToKeep=10 numVersionBuckets=65536
   [junit4]   2> 1127263 INFO  (coreLoadExecutor-3482-thread-1) [    x:collection1] o.a.s.u.CommitTracker Hard AutoCommit: disabled
   [junit4]   2> 1127263 INFO  (coreLoadExecutor-3482-thread-1) [    x:collection1] o.a.s.u.CommitTracker Soft AutoCommit: disabled
   [junit4]   2> 1127263 INFO  (coreLoadExecutor-3482-thread-1) [    x:collection1] o.a.s.u.RandomMergePolicy RandomMergePolicy wrapping class org.apache.lucene.index.TieredMergePolicy: [TieredMergePolicy: maxMergeAtOnce=2, maxMergeAtOnceExplicit=3, maxMergedSegmentMB=21.9306640625, floorSegmentMB=0.99609375, forceMergeDeletesPctAllowed=10.217073665977574, segmentsPerTier=25.0, maxCFSSegmentSizeMB=8.796093022207999E12, noCFSRatio=0.6514934693064683
   [junit4]   2> 1127263 INFO  (coreLoadExecutor-3482-thread-1) [    x:collection1] o.a.s.c.SolrDeletionPolicy SolrDeletionPolicy.onInit: commits: num=1
   [junit4]   2> 	commit{dir=MockDirectoryWrapper(RAMDirectory@4951cb8a lockFactory=org.apache.lucene.store.SingleInstanceLockFactory@6291d05a),segFN=segments_1,generation=1}
   [junit4]   2> 1127263 INFO  (coreLoadExecutor-3482-thread-1) [    x:collection1] o.a.s.c.SolrDeletionPolicy newest commit generation = 1
   [junit4]   2> 1127263 INFO  (coreLoadExecutor-3482-thread-1) [    x:collection1] o.a.s.s.SolrIndexSearcher Opening Searcher@2a571729[collection1] main
   [junit4]   2> 1127264 INFO  (coreLoadExecutor-3482-thread-1) [    x:collection1] o.a.s.r.RestManager Initializing RestManager with initArgs: {storageIO=org.apache.solr.rest.ManagedResourceStorage$InMemoryStorageIO}
   [junit4]   2> 1127264 INFO  (coreLoadExecutor-3482-thread-1) [    x:collection1] o.a.s.r.ManagedResourceStorage Reading _rest_managed.json using InMemoryStorage
   [junit4]   2> 1127264 INFO  (coreLoadExecutor-3482-thread-1) [    x:collection1] o.a.s.r.RestManager Initializing 0 registered ManagedResources
   [junit4]   2> 1127264 INFO  (coreLoadExecutor-3482-thread-1) [    x:collection1] o.a.s.h.c.SpellCheckComponent Initializing spell checkers
   [junit4]   2> 1127285 INFO  (coreLoadExecutor-3482-thread-1) [    x:collection1] o.a.s.s.DirectSolrSpellChecker init: {name=direct,classname=DirectSolrSpellChecker,field=lowerfilt,minQueryLength=3}
   [junit4]   2> 1127362 INFO  (coreLoadExecutor-3482-thread-1) [    x:collection1] o.a.s.h.ReplicationHandler Commits will be reserved for  10000
   [junit4]   2> 1127362 INFO  (searcherExecutor-3483-thread-1-processing-x:collection1) [    x:collection1] o.a.s.h.c.SpellCheckComponent Loading spell index for spellchecker: default
   [junit4]   2> 1127363 INFO  (coreLoadExecutor-3482-thread-1) [    x:collection1] o.a.s.u.UpdateLog Looking up max value of version field to seed version buckets
   [junit4]   2> 1127363 INFO  (coreLoadExecutor-3482-thread-1) [    x:collection1] o.a.s.u.VersionInfo Refreshing highest value of _version_ for 65536 version buckets from index
   [junit4]   2> 1127363 INFO  (coreLoadExecutor-3482-thread-1) [    x:collection1] o.a.s.u.VersionInfo No terms found for _version_, cannot seed version bucket highest value from index
   [junit4]   2> 1127363 INFO  (searcherExecutor-3483-thread-1-processing-x:collection1) [    x:collection1] o.a.s.h.c.SpellCheckComponent Loading spell index for spellchecker: direct
   [junit4]   2> 1127363 INFO  (searcherExecutor-3483-thread-1-processing-x:collection1) [    x:collection1] o.a.s.h.c.SpellCheckComponent Loading spell index for spellchecker: wordbreak
   [junit4]   2> 1127363 INFO  (coreLoadExecutor-3482-thread-1) [    x:collection1] o.a.s.u.UpdateLog Could not find max version in index or recent updates, using new clock 1526770204289269760
   [junit4]   2> 1127363 INFO  (searcherExecutor-3483-thread-1-processing-x:collection1) [    x:collection1] o.a.s.h.c.SpellCheckComponent Loading spell index for spellchecker: multipleFields
   [junit4]   2> 1127363 INFO  (searcherExecutor-3483-thread-1-processing-x:collection1) [    x:collection1] o.a.s.h.c.SpellCheckComponent Loading spell index for spellchecker: jarowinkler
   [junit4]   2> 1127365 INFO  (coreLoadExecutor-3482-thread-1) [    x:collection1] o.a.s.u.UpdateLog Took 2.0ms to seed version buckets with highest version 1526770204289269760
   [junit4]   2> 1127365 INFO  (searcherExecutor-3483-thread-1-processing-x:collection1) [    x:collection1] o.a.s.h.c.SpellCheckComponent Loading spell index for spellchecker: external
   [junit4]   2> 1127365 INFO  (coreLoadExecutor-3482-thread-1) [    x:collection1] o.a.s.c.CoreContainer registering core: collection1
   [junit4]   2> 1127365 INFO  (searcherExecutor-3483-thread-1-processing-x:collection1) [    x:collection1] o.a.s.h.c.SpellCheckComponent Loading spell index for spellchecker: freq
   [junit4]   2> 1127366 INFO  (searcherExecutor-3483-thread-1-processing-x:collection1) [    x:collection1] o.a.s.h.c.SpellCheckComponent Loading spell index for spellchecker: fqcn
   [junit4]   2> 1127368 INFO  (SUITE-TestIndexSearcher-seed#[C54BCBA9F8D085CA]-worker) [    ] o.a.s.SolrTestCaseJ4 ####initCore end
   [junit4]   2> 1127373 INFO  (searcherExecutor-3483-thread-1-processing-x:collection1) [    x:collection1] o.a.s.h.c.SpellCheckComponent Loading spell index for spellchecker: perDict
   [junit4]   2> 1127375 INFO  (TEST-TestIndexSearcher.testDontUseColdSearcher-seed#[C54BCBA9F8D085CA]) [    ] o.a.s.SolrTestCaseJ4 ###Starting testDontUseColdSearcher
   [junit4]   2> 1127375 INFO  (searcherExecutor-3483-thread-1-processing-x:collection1) [    x:collection1] o.a.s.c.SolrCore [collection1] Registered new searcher Searcher@2a571729[collection1] main{ExitableDirectoryReader(UninvertingDirectoryReader())}
   [junit4]   2> 1127379 INFO  (TEST-TestIndexSearcher.testDontUseColdSearcher-seed#[C54BCBA9F8D085CA]) [    ] o.a.s.c.CoreDescriptor Created CoreDescriptor: {name=core1, config=solrconfig-searcher-listeners1.xml, loadOnStartup=true, schema=schema.xml, configSetProperties=configsetprops.json, transient=false, dataDir=data/}
   [junit4]   2> 1127379 INFO  (TEST-TestIndexSearcher.testDontUseColdSearcher-seed#[C54BCBA9F8D085CA]) [    ] o.a.s.c.SolrResourceLoader new SolrResourceLoader for directory: '/export/home/jenkins/workspace/Lucene-Solr-5.x-Solaris/solr/core/src/test-files/solr/collection1'
   [junit4]   2> 1127379 INFO  (TEST-TestIndexSearcher.testDontUseColdSearcher-seed#[C54BCBA9F8D085CA]) [    ] o.a.s.c.SolrResourceLoader JNDI not configured for solr (NoInitialContextEx)
   [junit4]   2> 1127379 INFO  (TEST-TestIndexSearcher.testDontUseColdSearcher-seed#[C54BCBA9F8D085CA]) [    ] o.a.s.c.SolrResourceLoader using system property solr.solr.home: /export/home/jenkins/workspace/Lucene-Solr-5.x-Solaris/solr/core/src/test-files/solr
   [junit4]   2> 1127379 INFO  (TEST-TestIndexSearcher.testDontUseColdSearcher-seed#[C54BCBA9F8D085CA]) [    ] o.a.s.c.SolrResourceLoader Adding 'file:/export/home/jenkins/workspace/Lucene-Solr-5.x-Solaris/solr/core/src/test-files/solr/collection1/lib/classes/' to classloader
   [junit4]   2> 1127379 INFO  (TEST-TestIndexSearcher.testDontUseColdSearcher-seed#[C54BCBA9F8D085CA]) [    ] o.a.s.c.SolrResourceLoader Adding 'file:/export/home/jenkins/workspace/Lucene-Solr-5.x-Solaris/solr/core/src/test-files/solr/collection1/lib/README' to classloader
   [junit4]   2> 1127414 INFO  (TEST-TestIndexSearcher.testDontUseColdSearcher-seed#[C54BCBA9F8D085CA]) [    ] o.a.s.c.SolrConfig current version of requestparams : -1
   [junit4]   2> 1127417 INFO  (TEST-TestIndexSearcher.testDontUseColdSearcher-seed#[C54BCBA9F8D085CA]) [    ] o.a.s.c.SolrConfig Using Lucene MatchVersion: 5.5.0
   [junit4]   2> 1127422 INFO  (TEST-TestIndexSearcher.testDontUseColdSearcher-seed#[C54BCBA9F8D085CA]) [    ] o.a.s.c.SolrConfig Loaded SolrConfig: solrconfig-searcher-listeners1.xml
   [junit4]   2> 1127428 INFO  (TEST-TestIndexSearcher.testDontUseColdSearcher-seed#[C54BCBA9F8D085CA]) [    ] o.a.s.s.IndexSchema [core1] Schema name=test
   [junit4]   2> 1127537 INFO  (TEST-TestIndexSearcher.testDontUseColdSearcher-seed#[C54BCBA9F8D085CA]) [    ] o.a.s.s.OpenExchangeRatesOrgProvider Initialized with rates=open-exchange-rates.json, refreshInterval=1440.
   [junit4]   2> 1127541 INFO  (TEST-TestIndexSearcher.testDontUseColdSearcher-seed#[C54BCBA9F8D085CA]) [    ] o.a.s.s.IndexSchema default search field in schema is text
   [junit4]   2> 1127542 INFO  (TEST-TestIndexSearcher.testDontUseColdSearcher-seed#[C54BCBA9F8D085CA]) [    ] o.a.s.s.IndexSchema unique key field: id
   [junit4]   2> 1127545 INFO  (TEST-TestIndexSearcher.testDontUseColdSearcher-seed#[C54BCBA9F8D085CA]) [    ] o.a.s.s.FileExchangeRateProvider Reloading exchange rates from file currency.xml
   [junit4]   2> 1127547 INFO  (TEST-TestIndexSearcher.testDontUseColdSearcher-seed#[C54BCBA9F8D085CA]) [    ] o.a.s.s.FileExchangeRateProvider Reloading exchange rates from file currency.xml
   [junit4]   2> 1127549 INFO  (TEST-TestIndexSearcher.testDontUseColdSearcher-seed#[C54BCBA9F8D085CA]) [    ] o.a.s.s.OpenExchangeRatesOrgProvider Reloading exchange rates from open-exchange-rates.json
   [junit4]   2> 1127549 INFO  (TEST-TestIndexSearcher.testDontUseColdSearcher-seed#[C54BCBA9F8D085CA]) [    ] o.a.s.s.OpenExchangeRatesOrgProvider Reloading exchange rates from open-exchange-rates.json
   [junit4]   2> 1127552 INFO  (TEST-TestIndexSearcher.testDontUseColdSearcher-seed#[C54BCBA9F8D085CA]) [    ] o.a.s.c.ConfigSetProperties Did not find ConfigSet properties, assuming default properties: Can't find resource 'configsetprops.json' in classpath or '/export/home/jenkins/workspace/Lucene-Solr-5.x-Solaris/solr/core/src/test-files/solr/collection1'
   [junit4]   2> 1127552 INFO  (TEST-TestIndexSearcher.testDontUseColdSearcher-seed#[C54BCBA9F8D085CA]) [    ] o.a.s.c.CoreContainer Creating SolrCore 'core1' using configuration from instancedir /export/home/jenkins/workspace/Lucene-Solr-5.x-Solaris/solr/core/src/test-files/solr/collection1
   [junit4]   2> 1127552 INFO  (TEST-TestIndexSearcher.testDontUseColdSearcher-seed#[C54BCBA9F8D085CA]) [    x:core1] o.a.s.c.SolrCore org.apache.solr.core.MockDirectoryFactory
   [junit4]   2> 1127553 INFO  (TEST-TestIndexSearcher.testDontUseColdSearcher-seed#[C54BCBA9F8D085CA]) [    x:core1] o.a.s.c.SolrCore [[core1] ] Opening new SolrCore at [/export/home/jenkins/workspace/Lucene-Solr-5.x-Solaris/solr/core/src/test-files/solr/collection1], dataDir=[/export/home/jenkins/workspace/Lucene-Solr-5.x-Solaris/solr/core/src/test-files/solr/collection1/data/]
   [junit4]   2> 1127553 INFO  (TEST-TestIndexSearcher.testDontUseColdSearcher-seed#[C54BCBA9F8D085CA]) [    x:core1] o.a.s.c.SolrCore JMX monitoring not detected for core: core1
   [junit4]   2> 1127553 INFO  (TEST-TestIndexSearcher.testDontUseColdSearcher-seed#[C54BCBA9F8D085CA]) [    x:core1] o.a.s.c.CachingDirectoryFactory return new directory for /export/home/jenkins/workspace/Lucene-Solr-5.x-Solaris/solr/core/src/test-files/solr/collection1/data
   [junit4]   2> 1127553 INFO  (TEST-TestIndexSearcher.testDontUseColdSearcher-seed#[C54BCBA9F8D085CA]) [    x:core1] o.a.s.c.SolrCore New index directory detected: old=null new=/export/home/jenkins/workspace/Lucene-Solr-5.x-Solaris/solr/core/src/test-files/solr/collection1/data/index/
   [junit4]   2> 1127553 WARN  (TEST-TestIndexSearcher.testDontUseColdSearcher-seed#[C54BCBA9F8D085CA]) [    x:core1] o.a.s.c.SolrCore [core1] Solr index directory '/export/home/jenkins/workspace/Lucene-Solr-5.x-Solaris/solr/core/src/test-files/solr/collection1/data/index' doesn't exist. Creating new index...
   [junit4]   2> 1127555 INFO  (TEST-TestIndexSearcher.testDontUseColdSearcher-seed#[C54BCBA9F8D085CA]) [    x:core1] o.a.s.c.CachingDirectoryFactory return new directory for /export/home/jenkins/workspace/Lucene-Solr-5.x-Solaris/solr/core/src/test-files/solr/collection1/data/index
   [junit4]   2> 1127555 INFO  (TEST-TestIndexSearcher.testDontUseColdSearcher-seed#[C54BCBA9F8D085CA]) [    x:core1] o.a.s.u.RandomMergePolicy RandomMergePolicy wrapping class org.apache.lucene.index.LogDocMergePolicy: [LogDocMergePolicy: minMergeSize=1000, mergeFactor=22, maxMergeSize=9223372036854775807, maxMergeSizeForForcedMerge=9223372036854775807, calibrateSizeByDeletes=false, maxMergeDocs=2147483647, maxCFSSegmentSizeMB=8.796093022207999E12, noCFSRatio=0.8005352255537728]
   [junit4]   2> 1127555 INFO  (TEST-TestIndexSearcher.testDontUseColdSearcher-seed#[C54BCBA9F8D085CA]) [    x:core1] o.a.s.c.SolrDeletionPolicy SolrDeletionPolicy.onCommit: commits: num=1
   [junit4]   2> 	commit{dir=MockDirectoryWrapper(RAMDirectory@7191daff lockFactory=org.apache.lucene.store.SingleInstanceLockFactory@5b0aa911),segFN=segments_1,generation=1}
   [junit4]   2> 1127555 INFO  (TEST-TestIndexSearcher.testDontUseColdSearcher-seed#[C54BCBA9F8D085CA]) [    x:core1] o.a.s.c.SolrDeletionPolicy newest commit generation = 1
   [junit4]   2> 1127556 INFO  (OldIndexDirectoryCleanupThreadForCore-core1) [    x:core1] o.a.s.c.SolrCore Looking for old index directories to cleanup for core core1 in /export/home/jenkins/workspace/Lucene-Solr-5.x-Solaris/solr/core/src/test-files/solr/collection1/data/
   [junit4]   2> 1127556 WARN  (OldIndexDirectoryCleanupThreadForCore-core1) [    x:core1] o.a.s.c.DirectoryFactory /export/home/jenkins/workspace/Lucene-Solr-5.x-Solaris/solr/core/src/test-files/solr/collection1/data/ does not point to a valid data directory; skipping clean-up of old index directories.
   [junit4]   2> 1127558 INFO  (TEST-TestIndexSearcher.testDontUseColdSearcher-seed#[C54BCBA9F8D085CA]) [    x:core1] o.a.s.c.SolrCore no updateRequestProcessorChain defined as default, creating implicit default
   [junit4]   2> 1127560 INFO  (TEST-TestIndexSearcher.testDontUseColdSearcher-seed#[C54BCBA9F8D085CA]) [    x:core1] o.a.s.h.l.XMLLoader xsltCacheLifetimeSeconds=60
   [junit4]   2> 1127561 INFO  (TEST-TestIndexSearcher.testDontUseColdSearcher-seed#[C54BCBA9F8D085CA]) [    x:core1] o.a.s.h.l.XMLLoader xsltCacheLifetimeSeconds=60
   [junit4]   2> 1127561 INFO  (TEST-TestIndexSearcher.testDontUseColdSearcher-seed#[C54BCBA9F8D085CA]) [    x:core1] o.a.s.h.l.XMLLoader xsltCacheLifetimeSeconds=60
   [junit4]   2> 1127562 INFO  (TEST-TestIndexSearcher.testDontUseColdSearcher-seed#[C54BCBA9F8D085CA]) [    x:core1] o.a.s.h.l.XMLLoader xsltCacheLifetimeSeconds=60
   [junit4]   2> 1127563 INFO  (TEST-TestIndexSearcher.testDontUseColdSearcher-seed#[C54BCBA9F8D085CA]) [    x:core1] o.a.s.c.RequestHandlers Registered paths: /admin/mbeans,standard,/update/csv,/update/json/docs,/admin/luke,/admin/segments,/get,/admin/system,/replication,/admin/properties,/config,/schema,/admin/plugins,/admin/logging,/update/json,/admin/threads,/admin/ping,/update,/admin/file
   [junit4]   2> 1127564 INFO  (TEST-TestIndexSearcher.testDontUseColdSearcher-seed#[C54BCBA9F8D085CA]) [    x:core1] o.a.s.c.SolrCore Using default statsCache cache: org.apache.solr.search.stats.LocalStatsCache
   [junit4]   2> 1127564 INFO  (TEST-TestIndexSearcher.testDontUseColdSearcher-seed#[C54BCBA9F8D085CA]) [    x:core1] o.a.s.u.CommitTracker Hard AutoCommit: disabled
   [junit4]   2> 1127564 INFO  (TEST-TestIndexSearcher.testDontUseColdSearcher-seed#[C54BCBA9F8D085CA]) [    x:core1] o.a.s.u.CommitTracker Soft AutoCommit: disabled
   [junit4]   2> 1127564 INFO  (TEST-TestIndexSearcher.testDontUseColdSearcher-seed#[C54BCBA9F8D085CA]) [    x:core1] o.a.s.u.RandomMergePolicy RandomMergePolicy wrapping class org.apache.lucene.index.TieredMergePolicy: [TieredMergePolicy: maxMergeAtOnce=36, maxMergeAtOnceExplicit=27, maxMergedSegmentMB=12.931640625, floorSegmentMB=0.48828125, forceMergeDeletesPctAllowed=8.796886919244397, segmentsPerTier=27.0, maxCFSSegmentSizeMB=8.796093022207999E12, noCFSRatio=1.0
   [junit4]   2> 1127564 INFO  (TEST-TestIndexSearcher.testDontUseColdSearcher-seed#[C54BCBA9F8D085CA]) [    x:core1] o.a.s.c.SolrDeletionPolicy SolrDeletionPolicy.onInit: commits: num=1
   [junit4]   2> 	commit{dir=MockDirectoryWrapper(RAMDirectory@7191daff lockFactory=org.apache.lucene.store.SingleInstanceLockFactory@5b0aa911),segFN=segments_1,generation=1}
   [junit4]   2> 1127564 INFO  (TEST-TestIndexSearcher.testDontUseColdSearcher-seed#[C54BCBA9F8D085CA]) [    x:core1] o.a.s.c.SolrDeletionPolicy newest commit generation = 1
   [junit4]   2> 1127564 INFO  (TEST-TestIndexSearcher.testDontUseColdSearcher-seed#[C54BCBA9F8D085CA]) [    x:core1] o.a.s.s.SolrIndexSearcher Opening Searcher@16c0dd8e[core1] main
   [junit4]   2> 1127565 WARN  (TEST-TestIndexSearcher.testDontUseColdSearcher-seed#[C54BCBA9F8D085CA]) [    x:core1] o.a.s.r.ManagedResourceStorage Cannot write to config directory /export/home/jenkins/workspace/Lucene-Solr-5.x-Solaris/solr/core/src/test-files/solr/collection1/conf; switching to use InMemory storage instead.
   [junit4]   2> 1127565 INFO  (TEST-TestIndexSearcher.testDontUseColdSearcher-seed#[C54BCBA9F8D085CA]) [    x:core1] o.a.s.r.RestManager Initializing RestManager with initArgs: {}
   [junit4]   2> 1127565 INFO  (TEST-TestIndexSearcher.testDontUseColdSearcher-seed#[C54BCBA9F8D085CA]) [    x:core1] o.a.s.r.ManagedResourceStorage Reading _rest_managed.json using InMemoryStorage
   [junit4]   2> 1127565 INFO  (TEST-TestIndexSearcher.testDontUseColdSearcher-seed#[C54BCBA9F8D085CA]) [    x:core1] o.a.s.r.RestManager Initializing 0 registered ManagedResources
   [junit4]   2> 1127565 INFO  (TEST-TestIndexSearcher.testDontUseColdSearcher-seed#[C54BCBA9F8D085CA]) [    x:core1] o.a.s.h.ReplicationHandler Commits will be reserved for  10000
   [junit4]   2> 1127565 INFO  (TEST-TestIndexSearcher.testDontUseColdSearcher-seed#[C54BCBA9F8D085CA]) [    x:core1] o.a.s.c.CoreContainer registering core: core1
   [junit4]   2> 1128066 INFO  (searcherExecutor-3488-thread-1-processing-x:core1) [    x:core1] o.a.s.c.SolrCore [core1] Registered new searcher Searcher@16c0dd8e[core1] main{ExitableDirectoryReader(UninvertingDirectoryReader())}
   [junit4]   2> 1128066 INFO  (Thread-4303) [    x:core1] o.a.s.c.S.Request [core1]  webapp=null path=null params={q=*:*} hits=0 status=0 QTime=500
   [junit4]   2> 1128076 INFO  (TEST-TestIndexSearcher.testDontUseColdSearcher-seed#[C54BCBA9F8D085CA]) [    x:core1] o.a.s.c.SolrCore [core1]  CLOSING SolrCore org.apache.solr.core.SolrCore@722608f8
   [junit4]   2> 1128076 INFO  (TEST-TestIndexSearcher.testDontUseColdSearcher-seed#[C54BCBA9F8D085CA]) [    x:core1] o.a.s.u.DirectUpdateHandler2 closing DirectUpdateHandler2{commits=0,autocommits=0,soft autocommits=0,optimizes=0,rollbacks=0,expungeDeletes=0,docsPending=0,adds=0,deletesById=0,deletesByQuery=0,errors=0,cumulative_adds=0,cumulative_deletesById=0,cumulative_deletesByQuery=0,cumulative_errors=0}
   [junit4]   2> 1128076 INFO  (TEST-TestIndexSearcher.testDontUseColdSearcher-seed#[C54BCBA9F8D085CA]) [    x:core1] o.a.s.u.SolrCoreState Closing SolrCoreState
   [junit4]   2> 1128076 INFO  (TEST-TestIndexSearcher.testDontUseColdSearcher-seed#[C54BCBA9F8D085CA]) [    x:core1] o.a.s.u.DefaultSolrCoreState SolrCoreState ref count has reached 0 - closing IndexWriter
   [junit4]   2> 1128076 INFO  (TEST-TestIndexSearcher.testDontUseColdSearcher-seed#[C54BCBA9F8D085CA]) [    x:core1] o.a.s.u.DefaultSolrCoreState closing IndexWriter with IndexWriterCloser
   [junit4]   2> 1128079 INFO  (TEST-TestIndexSearcher.testDontUseColdSearcher-seed#[C54BCBA9F8D085CA]) [    x:core1] o.a.s.c.SolrCore [core1] Closing main searcher on request.
   [junit4]   2> 1128079 INFO  (TEST-TestIndexSearcher.testDontUseColdSearcher-seed#[C54BCBA9F8D085CA]) [    x:core1] o.a.s.c.CachingDirectoryFactory Closing MockDirectoryFactory - 2 directories currently being tracked
   [junit4]   2> 1128079 INFO  (TEST-TestIndexSearcher.testDontUseColdSearcher-seed#[C54BCBA9F8D085CA]) [    x:core1] o.a.s.c.CachingDirectoryFactory looking to close /export/home/jenkins/workspace/Lucene-Solr-5.x-Solaris/solr/core/src/test-files/solr/collection1/data [CachedDir<<refCount=0;path=/export/home/jenkins/workspace/Lucene-Solr-5.x-Solaris/solr/core/src/test-files/solr/collection1/data;done=false>>]
   [junit4]   2> 1128080 INFO  (TEST-TestIndexSearcher.testDontUseColdSearcher-seed#[C54BCBA9F8D085CA]) [    x:core1] o.a.s.c.CachingDirectoryFactory Closing directory: /export/home/jenkins/workspace/Lucene-Solr-5.x-Solaris/solr/core/src/test-files/solr/collection1/data
   [junit4]   2> 1128080 INFO  (TEST-TestIndexSearcher.testDontUseColdSearcher-seed#[C54BCBA9F8D085CA]) [    x:core1] o.a.s.c.CachingDirectoryFactory looking to close /export/home/jenkins/workspace/Lucene-Solr-5.x-Solaris/solr/core/src/test-files/solr/collection1/data/index [CachedDir<<refCount=0;path=/export/home/jenkins/workspace/Lucene-Solr-5.x-Solaris/solr/core/src/test-files/solr/collection1/data/index;done=false>>]
   [junit4]   2> 1128080 INFO  (TEST-TestIndexSearcher.testDontUseColdSearcher-seed#[C54BCBA9F8D085CA]) [    x:core1] o.a.s.c.CachingDirectoryFactory Closing directory: /export/home/jenkins/workspace/Lucene-Solr-5.x-Solaris/solr/core/src/test-files/solr/collection1/data/index
   [junit4]   2> 1128080 INFO  (TEST-TestIndexSearcher.testDontUseColdSearcher-seed#[C54BCBA9F8D085CA]) [    x:core1] o.a.s.SolrTestCaseJ4 ###Ending testDontUseColdSearcher
   [junit4]   2> 1128089 INFO  (TEST-TestIndexSearcher.testDontUseColdSearcher-seed#[C54BCBA9F8D085CA]) [    x:core1] o.a.s.u.p.LogUpdateProcessorFactory [collection1]  webapp=null path=null params={}{deleteByQuery=*:* (-1526770205041098752)} 0 9
   [junit4]   2> 1128092 INFO  (TEST-TestIndexSearcher.testDontUseColdSearcher-seed#[C54BCBA9F8D085CA]) [    x:core1] o.a.s.u.DirectUpdateHandler2 start commit{,optimize=false,openSearcher=true,waitSearcher=true,expungeDeletes=false,softCommit=false,prepareCommit=false}
   [junit4]   2> 1128092 INFO  (TEST-TestIndexSearcher.testDontUseColdSearcher-seed#[C54BCBA9F8D085CA]) [    x:core1] o.a.s.u.DirectUpdateHandler2 No uncommitted changes. Skipping IW.commit.
   [junit4]   2> 1128093 INFO  (TEST-TestIndexSearcher.testDontUseColdSearcher-seed#[C54BCBA9F8D085CA]) [    x:core1] o.a.s.c.SolrCore SolrIndexSearcher has not changed - not re-opening: org.apache.solr.search.SolrIndexSearcher
   [junit4]   2> 1128093 INFO  (TEST-TestIndexSearcher.testDontUseColdSearcher-seed#[C54BCBA9F8D085CA]) [    x:core1] o.a.s.u.DirectUpdateHandler2 end_commit_flush
   [junit4]   2> 1128093 INFO  (TEST-TestIndexSearcher.testDontUseColdSearcher-seed#[C54BCBA9F8D085CA]) [    x:core1] o.a.s.u.p.LogUpdateProcessorFactory [collection1]  webapp=null path=null params={}{commit=} 0 1
   [junit4]   2> 1128097 INFO  (TEST-TestIndexSearcher.testSearcherListeners-seed#[C54BCBA9F8D085CA]) [    x:core1] o.a.s.SolrTestCaseJ4 ###Starting testSearcherListeners
   [junit4]   2> 1128105 INFO  (TEST-TestIndexSearcher.testSearcherListeners-seed#[C54BCBA9F8D085CA]) [    x:core1] o.a.s.c.CoreDescriptor Created CoreDescriptor: {name=core1, config=solrconfig-searcher-listeners1.xml, loadOnStartup=true, schema=schema.xml, configSetProperties=configsetprops.json, transient=false, dataDir=data/}
   [junit4]   2> 1128105 INFO  (TEST-TestIndexSearcher.testSearcherListeners-seed#[C54BCBA9F8D085CA]) [    x:core1] o.a.s.c.SolrResourceLoader new SolrResourceLoader for directory: '/export/home/jenkins/workspace/Lucene-Solr-5.x-Solaris/solr/core/src/test-files/solr/collection1'
   [junit4]   2> 1128106 INFO  (TEST-TestIndexSearcher.testSearcherListeners-seed#[C54BCBA9F8D085CA]) [    x:core1] o.a.s.c.SolrResourceLoader JNDI not configured for solr (NoInitialContextEx)
   [junit4]   2> 1128106 INFO  (TEST-TestIndexSearcher.testSearcherListeners-seed#[C54BCBA9F8D085CA]) [    x:core1] o.a.s.c.SolrResourceLoader using system property solr.solr.home: /export/home/jenkins/workspace/Lucene-Solr-5.x-Solaris/solr/core/src/test-files/solr
   [junit4]   2> 1128106 INFO  (TEST-TestIndexSearcher.testSearcherListeners-seed#[C54BCBA9F8D085CA]) [    x:core1] o.a.s.c.SolrResourceLoader Adding 'file:/export/home/jenkins/workspace/Lucene-Solr-5.x-Solaris/solr/core/src/test-files/solr/collection1/lib/classes/' to classloader
   [junit4]   2> 1128107 INFO  (TEST-TestIndexSearcher.testSearcherListeners-seed#[C54BCBA9F8D085CA]) [    x:core1] o.a.s.c.SolrResourceLoader Adding 'file:/export/home/jenkins/workspace/Lucene-Solr-5.x-Solaris/solr/core/src/test-files/solr/collection1/lib/README' to classloader
   [junit4]   2> 1128141 INFO  (TEST-TestIndexSearcher.testSearcherListeners-seed#[C54BCBA9F8D085CA]) [    x:core1] o.a.s.c.SolrConfig current version of requestparams : -1
   [junit4]   2> 1128144 INFO  (TEST-TestIndexSearcher.testSearcherListeners-seed#[C54BCBA9F8D085CA]) [    x:core1] o.a.s.c.SolrConfig Using Lucene MatchVersion: 5.5.0
   [junit4]   2> 1128148 INFO  (TEST-TestIndexSearcher.testSearcherListeners-seed#[C54BCBA9F8D085CA]) [    x:core1] o.a.s.c.SolrConfig Loaded SolrConfig: solrconfig-searcher-listeners1.xml
   [junit4]   2> 1128155 INFO  (TEST-TestIndexSearcher.testSearcherListeners-seed#[C54BCBA9F8D085CA]) [    x:core1] o.a.s.s.IndexSchema [core1] Schema name=test
   [junit4]   2> 1128294 INFO  (TEST-TestIndexSearcher.testSearcherListeners-seed#[C54BCBA9F8D085CA]) [    x:core1] o.a.s.s.OpenExchangeRatesOrgProvider Initialized with rates=open-exchange-rates.json, refreshInterval=1440.
   [junit4]   2> 1128303 INFO  (TEST-TestIndexSearcher.testSearcherListeners-seed#[C54BCBA9F8D085CA]) [    x:core1] o.a.s.s.IndexSchema default search field in schema is text
   [junit4]   2> 1128305 INFO  (TEST-TestIndexSearcher.testSearcherListeners-seed#[C54BCBA9F8D085CA]) [    x:core1] o.a.s.s.IndexSchema unique key field: id
   [junit4]   2> 1128313 INFO  (TEST-TestIndexSearcher.testSearcherListeners-seed#[C54BCBA9F8D085CA]) [    x:core1] o.a.s.s.FileExchangeRateProvider Reloading exchange rates from file currency.xml
   [junit4]   2> 1128315 INFO  (TEST-TestIndexSearcher.testSearcherListeners-seed#[C54BCBA9F8D085CA]) [    x:core1] o.a.s.s.FileExchangeRateProvider Reloading exchange rates from file currency.xml
   [junit4]   2> 1128316 INFO  (TEST-TestIndexSearcher.testSearcherListeners-seed#[C54BCBA9F8D085CA]) [    x:core1] o.a.s.s.OpenExchangeRatesOrgProvider Reloading exchange rates from open-exchange-rates.json
   [junit4]   2> 1128316 INFO  (TEST-TestIndexSearcher.testSearcherListeners-seed#[C54BCBA9F8D085CA]) [    x:core1] o.a.s.s.OpenExchangeRatesOrgProvider Reloading exchange rates from open-exchange-rates.json
   [junit4]   2> 1128319 INFO  (TEST-TestIndexSearcher.testSearcherListeners-seed#[C54BCBA9F8D085CA]) [    x:core1] o.a.s.c.ConfigSetProperties Did not find ConfigSet properties, assuming default properties: Can't find resource 'configsetprops.json' in classpath or '/export/home/jenkins/workspace/Lucene-Solr-5.x-Solaris/solr/core/src/test-files/solr/collection1'
   [junit4]   2> 1128319 INFO  (TEST-TestIndexSearcher.testSearcherListeners-seed#[C54BCBA9F8D085CA]) [    x:core1] o.a.s.c.CoreContainer Creating SolrCore 'core1' using configuration from instancedir /export/home/jenkins/workspace/Lucene-Solr-5.x-Solaris/solr/core/src/test-files/solr/collection1
   [junit4]   2> 1128319 INFO  (TEST-TestIndexSearcher.testSearcherListeners-seed#[C54BCBA9F8D085CA]) [    x:core1] o.a.s.c.SolrCore org.apache.solr.core.MockDirectoryFactory
   [junit4]   2> 1128319 INFO  (TEST-TestIndexSearcher.testSearcherListeners-seed#[C54BCBA9F8D085CA]) [    x:core1] o.a.s.c.SolrCore [[core1] ] Opening new SolrCore at [/export/home/jenkins/workspace/Lucene-Solr-5.x-Solaris/solr/core/src/test-files/solr/collection1], dataDir=[/export/home/jenkins/workspace/Lucene-Solr-5.x-Solaris/solr/core/src/test-files/solr/collection1/data/]
   [junit4]   2> 1128319 INFO  (TEST-TestIndexSearcher.testSearcherListeners-seed#[C54BCBA9F8D085CA]) [    x:core1] o.a.s.c.SolrCore JMX monitoring not detected for core: core1
   [junit4]   2> 1128320 INFO  (TEST-TestIndexSearcher.testSearcherListeners-seed#[C54BCBA9F8D085CA]) [    x:core1] o.a.s.c.CachingDirectoryFactory return new directory for /export/home/jenkins/workspace/Lucene-Solr-5.x-Solaris/solr/core/src/test-files/solr/collection1/data
   [junit4]   2> 1128320 INFO  (TEST-TestIndexSearcher.testSearcherListeners-seed#[C54BCBA9F8D085CA]) [    x:core1] o.a.s.c.SolrCore New index directory detected: old=null new=/export/home/jenkins/workspace/Lucene-Solr-5.x-Solaris/solr/core/src/test-files/solr/collection1/data/index/
   [junit4]   2> 1128320 WARN  (TEST-TestIndexSearcher.testSearcherListeners-seed#[C54BCBA9F8D085CA]) [    x:core1] o.a.s.c.SolrCore [core1] Solr index directory '/export/home/jenkins/workspace/Lucene-Solr-5.x-Solaris/solr/core/src/test-files/solr/collection1/data/index' doesn't exist. Creating new index...
   [junit4]   2> 1128320 INFO  (TEST-TestIndexSearcher.testSearcherListeners-seed#[C54BCBA9F8D085CA]) [    x:core1] o.a.s.c.CachingDirectoryFactory return new directory for /export/home/jenkins/workspace/Lucene-Solr-5.x-Solaris/solr/core/src/test-files/solr/collection1/data/index
   [junit4]   2> 1128320 INFO  (TEST-TestIndexSearcher.testSearcherListeners-seed#[C54BCBA9F8D085CA]) [    x:core1] o.a.s.u.RandomMergePolicy RandomMergePolicy wrapping class org.apache.lucene.index.LogDocMergePolicy: [LogDocMergePolicy: minMergeSize=1000, mergeFactor=24, maxMergeSize=9223372036854775807, maxMergeSizeForForcedMerge=9223372036854775807, calibrateSizeByDeletes=false, maxMergeDocs=2147483647, maxCFSSegmentSizeMB=8.796093022207999E12, noCFSRatio=0.7614594344189974]
   [junit4]   2> 1128330 INFO  (TEST-TestIndexSearcher.testSearcherListeners-seed#[C54BCBA9F8D085CA]) [    x:core1] o.a.s.c.SolrDeletionPolicy SolrDeletionPolicy.onCommit: commits: num=1
   [junit4]   2> 	commit{dir=MockDirectoryWrapper(RAMDirectory@628dca18 lockFactory=org.apache.lucene.store.SingleInstanceLockFactory@49f0d853),segFN=segments_1,generation=1}
   [junit4]   2> 1128330 INFO  (TEST-TestIndexSearcher.testSearcherListeners-seed#[C54BCBA9F8D085CA]) [    x:core1] o.a.s.c.SolrDeletionPolicy newest commit generation = 1
   [junit4]   2> 1128330 INFO  (OldIndexDirectoryCleanupThreadForCore-core1) [    x:core1] o.a.s.c.SolrCore Looking for old index directories to cleanup for core core1 in /export/home/jenkins/workspace/Lucene-Solr-5.x-Solaris/solr/core/src/test-files/solr/collection1/data/
   [junit4]   2> 1128331 WARN  (OldIndexDirectoryCleanupThreadForCore-core1) [    x:core1] o.a.s.c.DirectoryFactory /export/home/jenkins/workspace/Lucene-Solr-5.x-Solaris/solr/core/src/test-files/solr/collection1/data/ does not point to a valid data directory; skipping clean-up of old index directories.
   [junit4]   2> 1128332 INFO  (TEST-TestIndexSearcher.testSearcherListeners-seed#[C54BCBA9F8D085CA]) [    x:core1] o.a.s.c.SolrCore no updateRequestProcessorChain defined as default, creating implicit default
   [junit4]   2> 1128333 INFO  (TEST-TestIndexSearcher.testSearcherListeners-seed#[C54BCBA9F8D085CA]) [    x:core1] o.a.s.h.l.XMLLoader xsltCacheLifetimeSeconds=60
   [junit4]   2> 1128334 INFO  (TEST-TestIndexSearcher.testSearcherListeners-seed#[C54BCBA9F8D085CA]) [    x:core1] o.a.s.h.l.XMLLoader xsltCacheLifetimeSeconds=60
   [junit4]   2> 1128335 INFO  (TEST-TestIndexSearcher.testSearcherListeners-seed#[C54BCBA9F8D085CA]) [    x:core1] o.a.s.h.l.XMLLoader xsltCacheLifetimeSeconds=60
   [junit4]   2> 1128336 INFO  (TEST-TestIndexSearcher.testSearcherListeners-seed#[C54BCBA9F8D085CA]) [    x:core1] o.a.s.h.l.XMLLoader xsltCacheLifetimeSeconds=60
   [junit4]   2> 1128337 INFO  (TEST-TestIndexSearcher.testSearcherListeners-seed#[C54BCBA9F8D085CA]) [    x:core1] o.a.s.c.RequestHandlers Registered paths: /admin/mbeans,standard,/update/csv,/update/json/docs,/admin/luke,/admin/segments,/get,/admin/system,/replication,/admin/properties,/config,/schema,/admin/plugins,/admin/logging,/update/json,/admin/threads,/admin/ping,/update,/admin/file
   [junit4]   2> 1128338 INFO  (TEST-TestIndexSearcher.testSearcherListeners-seed#[C54BCBA9F8D085CA]) [    x:core1] o.a.s.c.SolrCore Using default statsCache cache: org.apache.solr.search.stats.LocalStatsCache
   [junit4]   2> 1128338 INFO  (TEST-TestIndexSearcher.testSearcherListeners-seed#[C54BCBA9F8D085CA]) [    x:core1] o.a.s.u.CommitTracker Hard AutoCommit: disabled
   [junit4]   2> 1128338 INFO  (TEST-TestIndexSearcher.testSearcherListeners-seed#[C54BCBA9F8D085CA]) [    x:core1] o.a.s.u.CommitTracker Soft AutoCommit: disabled
   [junit4]   2> 1128338 INFO  (TEST-TestIndexSearcher.testSearcherListeners-seed#[C54BCBA9F8D085CA]) [    x:core1] o.a.s.u.RandomMergePolicy RandomMergePolicy wrapping class org.apache.lucene.index.LogByteSizeMergePolicy: [LogByteSizeMergePolicy: minMergeSize=1677721, mergeFactor=43, maxMergeSize=2147483648, maxMergeSizeForForcedMerge=9223372036854775807, calibrateSizeByDeletes=false, maxMergeDocs=2147483647, maxCFSSegmentSizeMB=8.796093022207999E12, noCFSRatio=1.0]
   [junit4]   2> 1128338 INFO  (TEST-TestIndexSearcher.testSearcherListeners-seed#[C54BCBA9F8D085CA]) [    x:core1] o.a.s.c.SolrDeletionPolicy SolrDeletionPolicy.onInit: commits: num=1
   [junit4]   2> 	commit{dir=MockDirectoryWrapper(RAMDirectory@628dca18 lockFactory=org.apache.lucene.store.SingleInstanceLockFactory@49f0d853),segFN=segments_1,generation=1}
   [junit4]   2> 1128338 INFO  (TEST-TestIndexSearcher.testSearcherListeners-seed#[C54BCBA9F8D085CA]) [    x:core1] o.a.s.c.SolrDeletionPolicy newest commit generation = 1
   [junit4]   2> 1128338 INFO  (TEST-TestIndexSearcher.testSearcherListeners-seed#[C54BCBA9F8D085CA]) [    x:core1] o.a.s.s.SolrIndexSearcher Opening Searcher@73028dba[core1] main
   [junit4]   2> 1128339 WARN  (TEST-TestIndexSearcher.testSearcherListeners-seed#[C54BCBA9F8D085CA]) [    x:core1] o.a.s.r.ManagedResourceStorage Cannot write to config directory /export/home/jenkins/workspace/Lucene-Solr-5.x-Solaris/solr/core/src/test-files/solr/collection1/conf; switching to use InMemory storage instead.
   [junit4]   2> 1128339 INFO  (TEST-TestIndexSearcher.testSearcherListeners-seed#[C54BCBA9F8D085CA]) [    x:core1] o.a.s.r.RestManager Initializing RestManager with initArgs: {}
   [junit4]   2> 1128339 INFO  (TEST-TestIndexSearcher.testSearcherListeners-seed#[C54BCBA9F8D085CA]) [    x:core1] o.a.s.r.ManagedResourceStorage Reading _rest_managed.json using InMemoryStorage
   [junit4]   2> 1128339 INFO  (TEST-TestIndexSearcher.testSearcherListeners-seed#[C54BCBA9F8D085CA]) [    x:core1] o.a.s.r.RestManager Initializing 0 registered ManagedResources
   [junit4]   2> 1128339 INFO  (TEST-TestIndexSearcher.testSearcherListeners-seed#[C54BCBA9F8D085CA]) [    x:core1] o.a.s.h.ReplicationHandler Commits will be reserved for  10000
   [junit4]   2> 1128339 INFO  (searcherExecutor-3492-thread-1-processing-x:core1) [    x:core1] o.a.s.c.SolrCore [core1] Registered new searcher Searcher@73028dba[core1] main{ExitableDirectoryReader(UninvertingDirectoryReader())}
   [junit4]   2> 1128339 INFO  (TEST-TestIndexSearcher.testSearcherListeners-seed#[C54BCBA9F8D085CA]) [    x:core1] o.a.s.c.CoreContainer registering core: core1
   [junit4]   2> 1128339 INFO  (TEST-TestIndexSearcher.testSearcherListeners-seed#[C54BCBA9F8D085CA]) [    x:core1] o.a.s.c.S.Request [core1]  webapp=null path=null params={q=*:*} hits=0 status=0 QTime=0
   [junit4]   2> 1128340 INFO  (TEST-TestIndexSearcher.testSearcherListeners-seed#[C54BCBA9F8D085CA]) [    x:core1] o.a.s.u.p.LogUpdateProcessorFactory [core1]  webapp=null path=null params={}{add=[1]} 0 0
   [junit4]   2> 1128342 INFO  (TEST-TestIndexSearcher.testSearcherListeners-seed#[C54BCBA9F8D085CA]) [    x:core1] o.a.s.s.SolrIndexSearcher Opening Searcher@63cf230[core1] main
   [junit4]   2> 1128342 INFO  (searcherExecutor-3492-thread-1-processing-x:core1) [    x:core1] o.a.s.c.SolrCore [core1] Registered new searcher Searcher@63cf230[core1] main{ExitableDirectoryReader(UninvertingDirectoryReader(Uninverting(_0(5.5.0):c1)))}
   [junit4]   2> 1128343 INFO  (TEST-TestIndexSearcher.testSearcherListeners-seed#[C54BCBA9F8D085CA]) [    x:core1] o.a.s.c.SolrCore [core1]  CLOSING SolrCore org.apache.solr.core.SolrCore@2045975f
   [junit4]   2> 1128343 INFO  (TEST-TestIndexSearcher.testSearcherListeners-seed#[C54BCBA9F8D085CA]) [    x:core1] o.a.s.u.DirectUpdateHandler2 closing DirectUpdateHandler2{commits=0,autocommits=0,soft autocommits=0,optimizes=0,rollbacks=0,expungeDeletes=0,docsPending=1,adds=1,deletesById=0,deletesByQuery=0,errors=0,cumulative_adds=1,cumulative_deletesById=0,cumulative_deletesByQuery=0,cumulative_errors=0}
   [junit4]   2> 1128343 INFO  (TEST-TestIndexSearcher.testSearcherListeners-seed#[C54BCBA9F8D085CA]) [    x:core1] o.a.s.u.SolrCoreState Closing SolrCoreState
   [junit4]   2> 1128343 INFO  (TEST-TestIndexSearcher.testSearcherListeners-seed#[C54BCBA9F8D085CA]) [    x:core1] o.a.s.u.DefaultSolrCoreState SolrCoreState ref count has reached 0 - closing IndexWriter
   [junit4]   2> 1128343 INFO  (TEST-TestIndexSearcher.testSearcherListeners-seed#[C54BCBA9F8D085CA]) [    x:core1] o.a.s.u.DefaultSolrCoreState closing IndexWriter with IndexWriterCloser
   [junit4]   2> 1128343 INFO  (TEST-TestIndexSearcher.testSearcherListeners-seed#[C54BCBA9F8D085CA]) [    x:core1] o.a.s.c.SolrDeletionPolicy SolrDeletionPolicy.onCommit: commits: num=2
   [junit4]   2> 	commit{dir=MockDirectoryWrapper(RAMDirectory@628dca18 lockFactory=org.apache.lucene.store.SingleInstanceLockFactory@49f0d853),segFN=segments_1,generation=1}
   [junit4]   2> 	commit{dir=MockDirectoryWrapper(RAMDirectory@628dca18 lockFactory=org.apache.lucene.store.SingleInstanceLockFactory@49f0d853),segFN=segments_2,generation=2}
   [junit4]   2> 1128344 INFO  (TEST-TestIndexSearcher.testSearcherListeners-seed#[C54BCBA9F8D085CA]) [    x:core1] o.a.s.c.SolrDeletionPolicy newest commit generation = 2
   [junit4]   2> 1128344 INFO  (TEST-TestIndexSearcher.testSearcherListeners-seed#[C54BCBA9F8D085CA]) [    x:core1] o.a.s.c.SolrCore [core1] Closing main searcher on request.
   [junit4]   2> 1128344 INFO  (TEST-TestIndexSearcher.testSearcherListeners-seed#[C54BCBA9F8D085CA]) [    x:core1] o.a.s.c.CachingDirectoryFactory Closing MockDirectoryFactory - 2 directories currently being tracked
   [junit4]   2> 1128344 INFO  (TEST-TestIndexSearcher.testSearcherListeners-seed#[C54BCBA9F8D085CA]) [    x:core1] o.a.s.c.CachingDirectoryFactory looking to close /export/home/jenkins/workspace/Lucene-Solr-5.x-Solaris/solr/core/src/test-files/solr/collection1/data [CachedDir<<refCount=0;path=/export/home/jenkins/workspace/Lucene-Solr-5.x-Solaris/solr/core/src/test-files/solr/collection1/data;done=false>>]
   [junit4]   2> 1128344 INFO  (TEST-TestIndexSearcher.testSearcherListeners-seed#[C54BCBA9F8D085CA]) [    x:core1] o.a.s.c.CachingDirectoryFactory Closing directory: /export/home/jenkins/workspace/Lucene-Solr-5.x-Solaris/solr/core/src/test-files/solr/collection1/data
   [junit4]   2> 1128344 INFO  (TEST-TestIndexSearcher.testSearcherListeners-seed#[C54BCBA9F8D085CA]) [    x:core1] o.a.s.c.CachingDirectoryFactory looking to close /export/home/jenkins/workspace/Lucene-Solr-5.x-Solaris/solr/core/src/test-files/solr/collection1/data/index [CachedDir<<refCount=0;path=/export/home/jenkins/workspace/Lucene-Solr-5.x-Solaris/solr/core/src/test-files/solr/collection1/data/index;done=false>>]
   [junit4]   2> 1128344 INFO  (TEST-TestIndexSearcher.testSearcherListeners-seed#[C54BCBA9F8D085CA]) [    x:core1] o.a.s.c.CachingDirectoryFactory Closing directory: /export/home/jenkins/workspace/Lucene-Solr-5.x-Solaris/solr/core/src/test-files/solr/collection1/data/index
   [junit4]   2> 1128345 INFO  (TEST-TestIndexSearcher.testSearcherListeners-seed#[C54BCBA9F8D085CA]) [    x:core1] o.a.s.c.CoreDescriptor Created CoreDescriptor: {name=core1, config=solrconfig-searcher-listeners1.xml, loadOnStartup=true, schema=schema.xml, configSetProperties=configsetprops.json, transient=false, dataDir=data/}
   [junit4]   2> 1128345 INFO  (TEST-TestIndexSearcher.testSearcherListeners-seed#[C54BCBA9F8D085CA]) [    x:core1] o.a.s.c.SolrResourceLoader new SolrResourceLoader for directory: '/export/home/jenkins/workspace/Lucene-Solr-5.x-Solaris/solr/core/src/test-files/solr/collection1'
   [junit4]   2> 1128345 INFO  (TEST-TestIndexSearcher.testSearcherListeners-seed#[C54BCBA9F8D085CA]) [    x:core1] o.a.s.c.SolrResourceLoader JNDI not configured for solr (NoInitialContextEx)
   [junit4]   2> 1128345 INFO  (TEST-TestIndexSearcher.testSearcherListeners-seed#[C54BCBA9F8D085CA]) [    x:core1] o.a.s.c.SolrResourceLoader using system property solr.solr.home: /export/home/jenkins/workspace/Lucene-Solr-5.x-Solaris/solr/core/src/test-files/solr
   [junit4]   2> 1128345 INFO  (TEST-TestIndexSearcher.testSearcherListeners-seed#[C54BCBA9F8D085CA]) [    x:core1] o.a.s.c.SolrResourceLoader Adding 'file:/export/home/jenkins/workspace/Lucene-Solr-5.x-Solaris/solr/core/src/test-files/solr/collection1/lib/classes/' to classloader
   [junit4]   2> 1128367 INFO  (TEST-TestIndexSearcher.testSearcherListeners-seed#[C54BCBA9F8D085CA]) [    x:core1] o.a.s.c.SolrResourceLoader Adding 'file:/export/home/jenkins/workspace/Lucene-Solr-5.x-Solaris/solr/core/src/test-files/solr/collection1/lib/README' to classloader
   [junit4]   2> 1128408 INFO  (TEST-TestIndexSearcher.testSearcherListeners-seed#[C54BCBA9F8D085CA]) [    x:core1] o.a.s.c.SolrConfig current version of requestparams : -1
   [junit4]   2> 1128410 INFO  (TEST-TestIndexSearcher.testSearcherListeners-seed#[C54BCBA9F8D085CA]) [    x:core1] o.a.s.c.SolrConfig Using Lucene MatchVersion: 5.5.0
   [junit4]   2> 1128426 INFO  (TEST-TestIndexSearcher.testSearcherListeners-seed#[C54BCBA9F8D085CA]) [    x:core1] o.a.s.c.SolrConfig Loaded SolrConfig: solrconfig-searcher-listeners1.xml
   [junit4]   2> 1128430 INFO  (TEST-TestIndexSearcher.testSearcherListeners-seed#[C54BCBA9F8D085CA]) [    x:core1] o.a.s.s.IndexSchema [core1] Schema name=test
   [junit4]   2> 1128519 INFO  (TEST-TestIndexSearcher.testSearcherListeners-seed#[C54BCBA9F8D085CA]) [    x:core1] o.a.s.s.OpenExchangeRatesOrgProvider Initialized with rates=open-exchange-rates.json, refreshInterval=1440.
   [junit4]   2> 1128525 INFO  (TEST-TestIndexSearcher.testSearcherListeners-seed#[C54BCBA9F8D085CA]) [    x:core1] o.a.s.s.IndexSchema default search field in schema is text
   [junit4]   2> 1128526 INFO  (TEST-TestIndexSearcher.testSearcherListeners-seed#[C54BCBA9F8D085CA]) [    x:core1] o.a.s.s.IndexSchema unique key field: id
   [junit4]   2> 1128531 INFO  (TEST-TestIndexSearcher.testSearcherListeners-seed#[C54BCBA9F8D085CA]) [    x:core1] o.a.s.s.FileExchangeRateProvider Reloading exchange rates from file currency.xml
   [junit4]   2> 1128533 INFO  (TEST-TestIndexSearcher.testSearcherListeners-seed#[C54BCBA9F8D085CA]) [    x:core1] o.a.s.s.FileExchangeRateProvider Reloading exchange rates from file currency.xml
   [junit4]   2> 1128534 INFO  (TEST-TestIndexSearcher.testSearcherListeners-seed#[C54BCBA9F8D085CA]) [    x:core1] o.a.s.s.OpenExchangeRatesOrgProvider Reloading exchange rates from open-exchange-rates.json
   [junit4]   2> 1128534 INFO  (TEST-TestIndexSearcher.testSearcherListeners-seed#[C54BCBA9F8D085CA]) [    x:core1] o.a.s.s.OpenExchangeRatesOrgProvider Reloading exchange rates from open-exchange-rates.json
   [junit4]   2> 1128536 INFO  (TEST-TestIndexSearcher.testSearcherListeners-seed#[C54BCBA9F8D085CA]) [    x:core1] o.a.s.c.ConfigSetProperties Did not find ConfigSet properties, assuming default properties: Can't find resource 'configsetprops.json' in classpath or '/export/home/jenkins/workspace/Lucene-Solr-5.x-Solaris/solr/core/src/test-files/solr/collection1'
   [junit4]   2> 1128536 INFO  (TEST-TestIndexSearcher.testSearcherListeners-seed#[C54BCBA9F8D085CA]) [    x:core1] o.a.s.c.CoreContainer Creating SolrCore 'core1' using configuration from instancedir /export/home/jenkins/workspace/Lucene-Solr-5.x-Solaris/solr/core/src/test-files/solr/collection1
   [junit4]   2> 1128537 INFO  (TEST-TestIndexSearcher.testSearcherListeners-seed#[C54BCBA9F8D085CA]) [    x:core1] o.a.s.c.SolrCore org.apache.solr.core.MockDirectoryFactory
   [junit4]   2> 1128537 INFO  (TEST-TestIndexSearcher.testSearcherListeners-seed#[C54BCBA9F8D085CA]) [    x:core1] o.a.s.c.SolrCore [[core1] ] Opening new SolrCore at [/export/home/jenkins/workspace/Lucene-Solr-5.x-Solaris/solr/core/src/test-files/solr/collection1], dataDir=[/export/home/jenkins/workspace/Lucene-Solr-5.x-Solaris/solr/core/src/test-files/solr/collection1/data/]
   [junit4]   2> 1128537 INFO  (TEST-TestIndexSearcher.testSearcherListeners-seed#[C54BCBA9F8D085CA]) [    x:core1] o.a.s.c.SolrCore JMX monitoring not detected for core: core1
   [junit4]   2> 1128537 INFO  (TEST-TestIndexSearcher.testSearcherListeners-seed#[C54BCBA9F8D085CA]) [    x:core1] o.a.s.c.CachingDirectoryFactory return new directory for /export/home/jenkins/workspace/Lucene-Solr-5.x-Solaris/solr/core/src/test-files/solr/collection1/data
   [junit4]   2> 1128537 INFO  (TEST-TestIndexSearcher.testSearcherListeners-seed#[C54BCBA9F8D085CA]) [    x:core1] o.a.s.c.SolrCore New index directory detected: old=null new=/export/home/jenkins/workspace/Lucene-Solr-5.x-Solaris/solr/core/src/test-files/solr/collection1/data/index/
   [junit4]   2> 1128537 WARN  (TEST-TestIndexSearcher.testSearcherListeners-seed#[C54BCBA9F8D085CA]) [    x:core1] o.a.s.c.SolrCore [core1] Solr index directory '/export/home/jenkins/workspace/Lucene-Solr-5.x-Solaris/solr/core/src/test-files/solr/collection1/data/index' doesn't exist. Creating new index...
   [junit4]   2> 1128538 INFO  (TEST-TestIndexSearcher.testSearcherListeners-seed#[C54BCBA9F8D085CA]) [    x:core1] o.a.s.c.CachingDirectoryFactory return new directory for /export/home/jenkins/workspace/Lucene-Solr-5.x-Solaris/solr/core/src/test-files/solr/collection1/data/index
   [junit4]   2> 1128538 INFO  (TEST-TestIndexSearcher.testSearcherListeners-seed#[C54BCBA9F8D085CA]) [    x:core1] o.a.s.u.RandomMergePolicy RandomMergePolicy wrapping class org.apache.lucene.index.AlcoholicMergePolicy: [AlcoholicMergePolicy: minMergeSize=0, mergeFactor=10, maxMergeSize=725218905, maxMergeSizeForForcedMerge=9223372036854775807, calibrateSizeByDeletes=true, maxMergeDocs=2147483647, maxCFSSegmentSizeMB=8.796093022207999E12, noCFSRatio=0.1]
   [junit4]   2> 1128538 INFO  (TEST-TestIndexSearcher.testSearcherListeners-seed#[C54BCBA9F8D085CA]) [    x:core1] o.a.s.c.SolrDeletionPolicy SolrDeletionPolicy.onCommit: commits: num=1
   [junit4]   2> 	commit{dir=MockDirectoryWrapper(RAMDirectory@4dd1274e lockFactory=org.apache.lucene.store.SingleInstanceLockFactory@6a7a32e),segFN=segments_1,generation=1}
   [junit4]   2> 1128538 INFO  (TEST-TestIndexSearcher.testSearcherListeners-seed#[C54BCBA9F8D085CA]) [    x:core1] o.a.s.c.SolrDeletionPolicy newest commit generation = 1
   [junit4]   2> 1128539 INFO  (OldIndexDirectoryCleanupThreadForCore-core1) [    x:core1] o.a.s.c.SolrCore Looking for old index directories to cleanup for core core1 in /export/home/jenkins/workspace/Lucene-Solr-5.x-Solaris/solr/core/src/test-files/solr/collection1/data/
   [junit4]   2> 1128539 WARN  (OldIndexDirectoryCleanupThreadForCore-core1) [    x:core1] o.a.s.c.DirectoryFactory /export/home/jenkins/workspace/Lucene-Solr-5.x-Solaris/solr/core/src/test-files/solr/collection1/data/ does not point to a valid data directory; skipping clean-up of old index directories.
   [junit4]   2> 1128544 INFO  (TEST-TestIndexSearcher.testSearcherListeners-seed#[C54BCBA9F8D085CA]) [    x:core1] o.a.s.c.SolrCore no updateRequestProcessorChain defined as default, creating implicit default
   [junit4]   2> 1128546 INFO  (TEST-TestIndexSearcher.testSearcherListeners-seed#[C54BCBA9F8D085CA]) [    x:core1] o.a.s.h.l.XMLLoader xsltCacheLifetimeSeconds=60
   [junit4]   2> 1128547 INFO  (TEST-TestIndexSearcher.testSearcherListeners-seed#[C54BCBA9F8D085CA]) [    x:core1] o.a.s.h.l.XMLLoader xsltCacheLifetimeSeconds=60
   [junit4]   2> 1128547 INFO  (TEST-TestIndexSearcher.testSearcherListeners-seed#[C54BCBA9F8D085CA]) [    x:core1] o.a.s.h.l.XMLLoader xsltCacheLifetimeSeconds=60
   [junit4]   2> 1128548 INFO  (TEST-TestIndexSearcher.testSearcherListeners-seed#[C54BCBA9F8D085CA]) [    x:core1] o.a.s.h.l.XMLLoader xsltCacheLifetimeSeconds=60
   [junit4]   2> 1128549 INFO  (TEST-TestIndexSearcher.testSearcherListeners-seed#[C54BCBA9F8D085CA]) [    x:core1] o.a.s.c.RequestHandlers Registered paths: /admin/mbeans,standard,/update/csv,/update/json/docs,/admin/luke,/admin/segments,/get,/admin/system,/replication,/admin/properties,/config,/schema,/admin/plugins,/admin/logging,/update/json,/admin/threads,/admin/ping,/update,/admin/file
   [junit4]   2> 1128550 INFO  (TEST-TestIndexSearcher.testSearcherListeners-seed#[C54BCBA9F8D085CA]) [    x:core1] o.a.s.c.SolrCore Using default statsCache cache: org.apache.solr.search.stats.LocalStatsCache
   [junit4]   2> 1128550 INFO  (TEST-TestIndexSearcher.testSearcherListeners-seed#[C54BCBA9F8D085CA]) [    x:core1] o.a.s.u.CommitTracker Hard AutoCommit: disabled
   [junit4]   2> 1128550 INFO  (TEST-TestIndexSearcher.testSearcherListeners-seed#[C54BCBA9F8D085CA]) [    x:core1] o.a.s.u.CommitTracker Soft AutoCommit: disabled
   [junit4]   2> 1128550 INFO  (TEST-TestIndexSearcher.testSearcherListeners-seed#[C54BCBA9F8D085CA]) [    x:core1] o.a.s.u.RandomMergePolicy RandomMergePolicy wrapping class org.apache.lucene.index.LogByteSizeMergePolicy: [LogByteSizeMergePolicy: minMergeSize=1677721, mergeFactor=41, maxMergeSize=2147483648, maxMergeSizeForForcedMerge=9223372036854775807, calibrateSizeByDeletes=false, maxMergeDocs=2147483647, maxCFSSegmentSizeMB=8.796093022207999E12, noCFSRatio=0.3152523298112798]
   [junit4]   2> 1128554 INFO  (TEST-TestIndexSearcher.testSearcherListeners-seed#[C54BCBA9F8D085CA]) [    x:core1] o.a.s.c.SolrDeletionPolicy SolrDeletionPolicy.onInit: commits: num=1
   [junit4]   2> 	commit{dir=MockDirectoryWrapper(RAMDirectory@4dd1274e lockFactory=org.apache.lucene.store.SingleInstanceLockFactory@6a7a32e),segFN=segments_1,generation=1}
   [junit4]   2> 1128554 INFO  (TEST-TestIndexSearcher.testSearcherListeners-seed#[C54BCBA9F8D085CA]) [    x:core1] o.a.s.c.SolrDeletionPolicy newest commit generation = 1
   [junit4]   2> 1128554 INFO  (TEST-TestIndexSearcher.testSearcherListeners-seed#[C54BCBA9F8D085CA]) [    x:core1] o.a.s.s.SolrIndexSearcher Opening Searcher@40c23052[core1] main
   [junit4]   2> 1128555 WARN  (TEST-TestIndexSearcher.testSearcherListeners-seed#[C54BCBA9F8D085CA]) [    x:core1] o.a.s.r.ManagedResourceStorage Cannot write to config directory /export/home/jenkins/workspace/Lucene-Solr-5.x-Solaris/solr/core/src/test-files/solr/collection1/conf; switching to use InMemory storage instead.
   [junit4]   2> 1128555 INFO  (TEST-TestIndexSearcher.testSearcherListeners-seed#[C54BCBA9F8D085CA]) [    x:core1] o.a.s.r.RestManager Initializing RestManager with initArgs: {}
   [junit4]   2> 1128555 INFO  (TEST-TestIndexSearcher.testSearcherListeners-seed#[C54BCBA9F8D085CA]) [    x:core1] o.a.s.r.ManagedResourceStorage Reading _rest_managed.json using InMemoryStorage
   [junit4]   2> 1128555 INFO  (TEST-TestIndexSearcher.testSearcherListeners-seed#[C54BCBA9F8D085CA]) [    x:core1] o.a.s.r.RestManager Initializing 0 registered ManagedResources
   [junit4]   2> 1128555 INFO  (TEST-TestIndexSearcher.testSearcherListeners-seed#[C54BCBA9F8D085CA]) [    x:core1] o.a.s.h.ReplicationHandler Commits will be reserved for  10000
   [junit4]   2> 1128556 INFO  (TEST-TestIndexSearcher.testSearcherListeners-seed#[C54BCBA9F8D085CA]) [    x:core1] o.a.s.c.CoreContainer registering core: core1
   [junit4]   2> 1128556 INFO  (searcherExecutor-3496-thread-1-processing-x:core1) [    x:core1] o.a.s.c.SolrCore [core1] Registered new searcher Searcher@40c23052[core1] main{ExitableDirectoryReader(UninvertingDirectoryReader())}
   [junit4]   2> 1128556 INFO  (TEST-TestIndexSearcher.testSearcherListeners-seed#[C54BCBA9F8D085CA]) [    x:core1] o.a.s.c.S.Request [core1]  webapp=null path=null params={q=*:*} hits=0 status=0 QTime=0
   [junit4]   2> 1128557 INFO  (TEST-TestIndexSearcher.testSearcherListeners-seed#[C54BCBA9F8D085CA]) [    x:core1] o.a.s.u.p.LogUpdateProcessorFactory [core1]  webapp=null path=null params={}{add=[1]} 0 0
   [junit4]   2> 1128560 INFO  (TEST-TestIndexSearcher.testSearcherListeners-seed#[C54BCBA9F8D085CA]) [    x:core1] o.a.s.s.SolrIndexSearcher Opening Searcher@38f9cbfb[core1] main
   [junit4]   2> 1128560 INFO  (searcherExecutor-3496-thread-1-processing-x:core1) [    x:core1] o.a.s.c.SolrCore [core1] Registered new searcher Searcher@38f9cbfb[core1] main{ExitableDirectoryReader(UninvertingDirectoryReader(Uninverting(_0(5.5.0):c1)))}
   [junit4]   2> 1128561 INFO  (TEST-TestIndexSearcher.testSearcherListeners-seed#[C54BCBA9F8D085CA]) [    x:core1] o.a.s.c.SolrCore [core1]  CLOSING SolrCore org.apache.solr.core.SolrCore@1f62f69
   [junit4]   2> 1128561 INFO  (TEST-TestIndexSearcher.testSearcherListeners-seed#[C54BCBA9F8D085CA]) [    x:core1] o.a.s.u.DirectUpdateHandler2 closing DirectUpdateHandler2{commits=0,autocommits=0,soft autocommits=0,optimizes=0,rollbacks=0,expungeDeletes=0,docsPending=1,adds=1,deletesById=0,deletesByQuery=0,errors=0,cumulative_adds=1,cumulative_deletesById=0,cumulative_deletesByQuery=0,cumulative_errors=0}
   [junit4]   2> 1128561 INFO  (TEST-TestIndexSearcher.testSearcherListeners-seed#[C54BCBA9F8D085CA]) [    x:core1] o.a.s.u.SolrCoreState Closing SolrCoreState
   [junit4]   2> 1128561 INFO  (TEST-TestIndexSearcher.testSearcherListeners-seed#[C54BCBA9F8D085CA]) [    x:core1] o.a.s.u.DefaultSolrCoreState SolrCoreState ref count has reached 0 - closing IndexWriter
   [junit4]   2> 1128561 INFO  (TEST-TestIndexSearcher.testSearcherListeners-seed#[C54BCBA9F8D085CA]) [    x:core1] o.a.s.u.DefaultSolrCoreState closing IndexWriter with IndexWriterCloser
   [junit4]   2> 1128566 INFO  (TEST-TestIndexSearcher.testSearcherListeners-seed#[C54BCBA9F8D085CA]) [    x:core1] o.a.s.c.SolrDeletionPolicy SolrDeletionPolicy.onCommit: commits: num=2
   [junit4]   2> 	commit{dir=MockDirectoryWrapper(RAMDirectory@4dd1274e lockFactory=org.apache.lucene.store.SingleInstanceLockFactory@6a7a32e),segFN=segments_1,generation=1}
   [junit4]   2> 	commit{dir=MockDirectoryWrapper(RAMDirectory@4dd1274e lockFactory=org.apache.lucene.store.SingleInstanceLockFactory@6a7a32e),segFN=segments_2,generation=2}
   [junit4]   2> 1128566 INFO  (TEST-TestIndexSearcher.testSearcherListeners-seed#[C54BCBA9F8D085CA]) [    x:core1] o.a.s.c.SolrDeletionPolicy newest commit generation = 2
   [junit4]   2> 1128567 INFO  (TEST-TestIndexSearcher.testSearcherListeners-seed#[C54BCBA9F8D085CA]) [    x:core1] o.a.s.c.SolrCore [core1] Closing main searcher on request.
   [junit4]   2> 1128567 INFO  (TEST-TestIndexSearcher.testSearcherListeners-seed#[C54BCBA9F8D085CA]) [    x:core1] o.a.s.c.CachingDirectoryFactory Closing MockDirectoryFactory - 2 directories currently being tracked
   [junit4]   2> 1128567 INFO  (TEST-TestIndexSearcher.testSearcherListeners-seed#[C54BCBA9F8D085CA]) [    x:core1] o.a.s.c.CachingDirectoryFactory looking to close /export/home/jenkins/workspace/Lucene-Solr-5.x-Solaris/solr/core/src/test-files/solr/collection1/data [CachedDir<<refCount=0;path=/export/home/jenkins/workspace/Lucene-Solr-5.x-Solaris/solr/core/src/test-files/solr/collection1/data;done=false>>]
   [junit4]   2> 1128567 INFO  (TEST-TestIndexSearcher.testSearcherListeners-seed#[C54BCBA9F8D085CA]) [    x:core1] o.a.s.c.CachingDirectoryFactory Closing directory: /export/home/jenkins/workspace/Lucene-Solr-5.x-Solaris/solr/core/src/test-files/solr/collection1/data
   [junit4]   2> 1128567 INFO  (TEST-TestIndexSearcher.testSearcherListeners-seed#[C54BCBA9F8D085CA]) [    x:core1] o.a.s.c.CachingDirectoryFactory looking to close /export/home/jenkins/workspace/Lucene-Solr-5.x-Solaris/solr/core/src/test-files/solr/collection1/data/index [CachedDir<<refCount=0;path=/export/home/jenkins/workspace/Lucene-Solr-5.x-Solaris/solr/core/src/test-files/solr/collection1/data/index;done=false>>]
   [junit4]   2> 1128567 INFO  (TEST-TestIndexSearcher.testSearcherListeners-seed#[C54BCBA9F8D085CA]) [    x:core1] o.a.s.c.CachingDirectoryFactory Closing directory: /export/home/jenkins/workspace/Lucene-Solr-5.x-Solaris/solr/core/src/test-files/solr/collection1/data/index
   [junit4]   2> 1128568 INFO  (TEST-TestIndexSearcher.testSearcherListeners-seed#[C54BCBA9F8D085CA]) [    x:core1] o.a.s.c.CoreDescriptor Created CoreDescriptor: {name=core1, config=solrconfig-searcher-listeners1.xml, loadOnStartup=true, schema=schema.xml, configSetProperties=configsetprops.json, transient=false, dataDir=data/}
   [junit4]   2> 1128568 INFO  (TEST-TestIndexSearcher.testSearcherListeners-seed#[C54BCBA9F8D085CA]) [    x:core1] o.a.s.c.SolrResourceLoader new SolrResourceLoader for directory: '/export/home/jenkins/workspace/Lucene-Solr-5.x-Solaris/solr/core/src/test-files/solr/collection1'
   [junit4]   2> 1128568 INFO  (TEST-TestIndexSearcher.testSearcherListeners-seed#[C54BCBA9F8D085CA]) [    x:core1] o.a.s.c.SolrResourceLoader JNDI not configured for solr (NoInitialContextEx)
   [junit4]   2> 1128568 INFO  (TEST-TestIndexSearcher.testSearcherListeners-seed#[C54BCBA9F8D085CA]) [    x:core1] o.a.s.c.SolrResourceLoader using system property solr.solr.home: /export/home/jenkins/workspace/Lucene-Solr-5.x-Solaris/solr/core/src/test-files/solr
   [junit4]   2> 1128568 INFO  (TEST-TestIndexSearcher.testSearcherListeners-seed#[C54BCBA9F8D085CA]) [    x:core1] o.a.s.c.SolrResourceLoader Adding 'file:/export/home/jenkins/workspace/Lucene-Solr-5.x-Solaris/solr/core/src/test-files/solr/collection1/lib/classes/' to classloader
   [junit4]   2> 1128568 INFO  (TEST-TestIndexSearcher.testSearcherListeners-seed#[C54BCBA9F8D085CA]) [    x:core1] o.a.s.c.SolrResourceLoader Adding 'file:/export/home/jenkins/workspace/Lucene-Solr-5.x-Solaris/solr/core/src/test-files/solr/collection1/lib/README' to classloader
   [junit4]   2> 1128603 INFO  (TEST-TestIndexSearcher.testSearcherListeners-seed#[C54BCBA9F8D085CA]) [    x:core1] o.a.s.c.SolrConfig current version of requestparams : -1
   [junit4]   2> 1128624 INFO  (TEST-TestIndexSearcher.testSearcherListeners-seed#[C54BCBA9F8D085CA]) [    x:core1] o.a.s.c.SolrConfig Using Lucene MatchVersion: 5.5.0
   [junit4]   2> 1128628 INFO  (TEST-TestIndexSearcher.testSearcherListeners-seed#[C54BCBA9F8D085CA]) [    x:core1] o.a.s.c.SolrConfig Loaded SolrConfig: solrconfig-searcher-listeners1.xml
   [junit4]   2> 1128638 INFO  (TEST-TestIndexSearcher.testSearcherListeners-seed#[C54BCBA9F8D085CA]) [    x:core1] o.a.s.s.IndexSchema [core1] Schema name=test
   [junit4]   2> 1128789 INFO  (TEST-TestIndexSearcher.testSearcherListeners-seed#[C54BCBA9F8D085CA]) [    x:core1] o.a.s.s.OpenExchangeRatesOrgProvider Initialized with rates=open-exchange-rates.json, refreshInterval=1440.
   [junit4]   2> 1128796 INFO  (TEST-TestIndexSearcher.testSearcherListeners-seed#[C54BCBA9F8D085CA]) [    x:core1] o.a.s.s.IndexSchema default search field in schema is text
   [junit4]   2> 1128857 INFO  (TEST-TestIndexSearcher.testSearcherListeners-seed#[C54BCBA9F8D085CA]) [    x:core1] o.a.s.s.IndexSchema unique key field: id
   [junit4]   2> 1128863 INFO  (TEST-TestIndexSearcher.testSearcherListeners-seed#[C54BCBA9F8D085CA]) [    x:core1] o.a.s.s.FileExchangeRateProvider Reloading exchange rates from file currency.xml
   [junit4]   2> 1128865 INFO  (TEST-TestIndexSearcher.testSearcherListeners-seed#[C54BCBA9F8D085CA]) [    x:core1] o.a.s.s.FileExchangeRateProvider Reloading exchange rates from file currency.xml
   [junit4]   2> 1128867 INFO  (TEST-TestIndexSearcher.testSearcherListeners-seed#[C54BCBA9F8D085CA]) [    x:core1] o.a.s.s.OpenExchangeRatesOrgProvider Reloading exchange rates from open-exchange-rates.json
   [junit4]   2> 1128868 INFO  (TEST-TestIndexSearcher.testSearcherListeners-seed#[C54BCBA9F8D085CA]) [    x:core1] o.a.s.s.OpenExchangeRatesOrgProvider Reloading exchange rates from open-exchange-rates.json
   [junit4]   2> 1128871 INFO  (TEST-TestIndexSearcher.testSearcherListeners-seed#[C54BCBA9F8D085CA]) [    x:core1] o.a.s.c.ConfigSetProperties Did not find ConfigSet properties, assuming default properties: Can't find resource 'configsetprops.json' in classpath or '/export/home/jenkins/workspace/Lucene-Solr-5.x-Solaris/solr/core/src/test-files/solr/collection1'
   [junit4]   2> 1128871 INFO  (TEST-TestIndexSearcher.testSearcherListeners-seed#[C54BCBA9F8D085CA]) [    x:core1] o.a.s.c.CoreContainer Creating SolrCore 'core1' using configuration from instancedir /export/home/jenkins/workspace/Lucene-Solr-5.x-Solaris/solr/core/src/test-files/solr/collection1
   [junit4]   2> 1128871 INFO  (TEST-TestIndexSearcher.testSearcherListeners-seed#[C54BCBA9F8D085CA]) [    x:core1] o.a.s.c.SolrCore org.apache.solr.core.MockDirectoryFactory
   [junit4]   2> 1128871 INFO  (TEST-TestIndexSearcher.testSearcherListeners-seed#[C54BCBA9F8D085CA]) [    x:core1] o.a.s.c.SolrCore [[core1] ] Opening new SolrCore at [/export/home/jenkins/workspace/Lucene-Solr-5.x-Solaris/solr/core/src/test-files/solr/collection1], dataDir=[/export/home/jenkins/workspace/Lucene-Solr-5.x-Solaris/solr/core/src/test-files/solr/collection1/data/]
   [junit4]   2> 1128871 INFO  (TEST-TestIndexSearcher.testSearcherListeners-seed#[C54BCBA9F8D085CA]) [    x:core1] o.a.s.c.SolrCore JMX monitoring not detected for core: core1
   [junit4]   2> 1128872 INFO  (TEST-TestIndexSearcher.testSearcherListeners-seed#[C54BCBA9F8D085CA]) [    x:core1] o.a.s.c.CachingDirectoryFactory return new directory for /export/home/jenkins/workspace/Lucene-Solr-5.x-Solaris/solr/core/src/test-files/solr/collection1/data
   [junit4]   2> 1128872 INFO  (TEST-TestIndexSearcher.testSearcherListeners-seed#[C54BCBA9F8D085CA]) [    x:core1] o.a.s.c.SolrCore New index directory detected: old=null new=/export/home/jenkins/workspace/Lucene-Solr-5.x-Solaris/solr/core/src/test-files/solr/collection1/data/index/
   [junit4]   2> 1128872 WARN  (TEST-TestIndexSearcher.testSearcherListeners-seed#[C54BCBA9F8D085CA]) [    x:core1] o.a.s.c.SolrCore [core1] Solr index directory '/export/home/jenkins/workspace/Lucene-Solr-5.x-Solaris/solr/core/src/test-files/solr/collection1/data/index' doesn't exist. Creating new index...
   [junit4]   2> 1128872 INFO  (TEST-TestIndexSearcher.testSearcherListeners-seed#[C54BCBA9F8D085CA]) [    x:core1] o.a.s.c.CachingDirectoryFactory return new directory for /export/home/jenkins/workspace/Lucene-Solr-5.x-Solaris/solr/core/src/test-files/solr/collection1/data/index
   [junit4]   2> 1128873 INFO  (TEST-TestIndexSearcher.testSearcherListeners-seed#[C54BCBA9F8D085CA]) [    x:core1] o.a.s.u.RandomMergePolicy RandomMergePolicy wrapping class org.apache.lucene.index.TieredMergePolicy: [TieredMergePolicy: maxMergeAtOnce=14, maxMergeAtOnceExplicit=45, maxMergedSegmentMB=74.14453125, floorSegmentMB=2.033203125, forceMergeDeletesPctAllowed=19.088404764875584, segmentsPerTier=44.0, maxCFSSegmentSizeMB=8.796093022207999E12, noCFSRatio=0.0
   [junit4]   2> 1128873 INFO  (TEST-TestIndexSearcher.testSearcherListeners-seed#[C54BCBA9F8D085CA]) [    x:core1] o.a.s.c.SolrDeletionPolicy SolrDeletionPolicy.onCommit: commits: num=1
   [junit4]   2> 	commit{dir=MockDirectoryWrapper(RAMDirectory@b1b5e49 lockFactory=org.apache.lucene.store.SingleInstanceLockFactory@5fe60e85),segFN=segments_1,generation=1}
   [junit4]   2> 1128873 INFO  (TEST-TestIndexSearcher.testSearcherListeners-seed#[C54BCBA9F8D085CA]) [    x:core1] o.a.s.c.SolrDeletionPolicy newest commit generation = 1
   [junit4]   2> 1128873 INFO  (OldIndexDirectoryCleanupThreadForCore-core1) [    x:core1] o.a.s.c.SolrCore Looking for old index directories to cleanup for core core1 in /export/home/jenkins/workspace/Lucene-Solr-5.x-Solaris/solr/core/src/test-files/solr/collection1/data/
   [junit4]   2> 1128873 WARN  (OldIndexDirectoryCleanupThreadForCore-core1) [    x:core1] o.a.s.c.DirectoryFactory /export/home/jenkins/workspace/Lucene-Solr-5.x-Solaris/solr/core/src/test-files/solr/collection1/data/ does not point to a valid data directory; skipping clean-up of old index directories.
   [junit4]   2> 1128876 INFO  (TEST-TestIndexSearcher.testSearcherListeners-seed#[C54BCBA9F8D085CA]) [    x:core1] o.a.s.c.SolrCore no updateRequestProcessorChain defined as default, creating implicit default
   [junit4]   2> 1128878 INFO  (TEST-TestIndexSearcher.testSearcherListeners-seed#[C54BCBA9F8D085CA]) [    x:core1] o.a.s.h.l.XMLLoader xsltCacheLifetimeSeconds=60
   [junit4]   2> 1128879 INFO  (TEST-TestIndexSearcher.testSearcherListeners-seed#[C54BCBA9F8D085CA]) [    x:core1] o.a.s.h.l.XMLLoader xsltCacheLifetimeSeconds=60
   [junit4]   2> 1128881 INFO  (TEST-TestIndexSearcher.testSearcherListeners-seed#[C54BCBA9F8D085CA]) [    x:core1] o.a.s.h.l.XMLLoader xsltCacheLifetimeSeconds=60
   [junit4]   2> 1128882 INFO  (TEST-TestIndexSearcher.testSearcherListeners-seed#[C54BCBA9F8D085CA]) [    x:core1] o.a.s.h.l.XMLLoader xsltCacheLifetimeSeconds=60
   [junit4]   2> 1128884 INFO  (TEST-TestIndexSearcher.testSearcherListeners-seed#[C54BCBA9F8D085CA]) [    x:core1] o.a.s.c.RequestHandlers Registered paths: /admin/mbeans,standard,/update/csv,/update/json/docs,/admin/luke,/admin/segments,/get,/admin/system,/replication,/admin/properties,/config,/schema,/admin/plugins,/admin/logging,/update/json,/admin/threads,/admin/ping,/update,/admin/file
   [junit4]   2> 1128884 INFO  (TEST-TestIndexSearcher.testSearcherListeners-seed#[C54BCBA9F8D085CA]) [    x:core1] o.a.s.c.SolrCore Using default statsCache cache: org.apache.solr.search.stats.LocalStatsCache
   [junit4]   2> 1128886 INFO  (TEST-TestIndexSearcher.testSearcherListeners-seed#[C54BCBA9F8D085CA]) [    x:core1] o.a.s.u.CommitTracker Hard AutoCommit: disabled
   [junit4]   2> 1128886 INFO  (TEST-TestIndexSearcher.testSearcherListeners-seed#[C54BCBA9F8D085CA]) [    x:core1] o.a.s.u.CommitTracker Soft AutoCommit: disabled
   [junit4]   2> 1128887 INFO  (TEST-TestIndexSearcher.testSearcherListeners-seed#[C54BCBA9F8D085CA]) [    x:core1] o.a.s.u.RandomMergePolicy RandomMergePolicy wrapping class org.apache.lucene.index.LogByteSizeMergePolicy: [LogByteSizeMergePolicy: minMergeSize=1677721, mergeFactor=11, maxMergeSize=2147483648, maxMergeSizeForForcedMerge=9223372036854775807, calibrateSizeByDeletes=false, maxMergeDocs=2147483647, maxCFSSegmentSizeMB=8.796093022207999E12, noCFSRatio=1.0]
   [junit4]   2> 1128887 INFO  (TEST-TestIndexSearcher.testSearcherListeners-seed#[C54BCBA9F8D085CA]) [    x:core1] o.a.s.c.SolrDeletionPolicy SolrDeletionPolicy.onInit: commits: num=1
   [junit4]   2> 	commit{dir=MockDirectoryWrapper(RAMDirectory@b1b5e49 lockFactory=org.apache.lucene.store.SingleInstanceLockFactory@5fe60e85),segFN=segments_1,generation=1}
   [junit4]   2> 1128887 INFO  (TEST-TestIndexSearcher.testSearcherListeners-seed#[C54BCBA9F8D085CA]) [    x:core1] o.a.s.c.SolrDeletionPolicy newest commit generation = 1
   [junit4]   2> 1128891 INFO  (TEST-TestIndexSearcher.testSearcherListeners-seed#[C54BCBA9F8D085CA]) [    x:core1] o.a.s.s.SolrIndexSearcher Opening Searcher@7556df08[core1] main
   [junit4]   2> 1128891 WARN  (TEST-TestIndexSearcher.testSearcherListeners-seed#[C54BCBA9F8D085CA]) [    x:core1] o.a.s.r.ManagedResourceStorage Cannot write to config directory /export/home/jenkins/workspace/Lucene-Solr-5.x-Solaris/solr/core/src/test-files/solr/collection1/conf; switching to use InMemory storage instead.
   [junit4]   2> 1128892 INFO  (TEST-TestIndexSearcher.testSearcherListeners-seed#[C54BCBA9F8D085CA]) [    x:core1] o.a.s.r.RestManager Initializing RestManager with initArgs: {}
   [junit4]   2> 1128892 INFO  (TEST-TestIndexSearcher.testSearcherL

[...truncated too long message...]

ser
   [junit4]   2> 1130708 INFO  (coreCloseExecutor-3508-thread-1-processing-x:core1) [    x:collection1] o.a.s.c.SolrCore [collection1] Closing main searcher on request.
   [junit4]   2> 1130717 INFO  (coreCloseExecutor-3508-thread-1-processing-x:core1) [    x:collection1] o.a.s.c.CachingDirectoryFactory Closing MockDirectoryFactory - 2 directories currently being tracked
   [junit4]   2> 1142902 ERROR (coreCloseExecutor-3508-thread-1-processing-x:core1) [    x:collection1] o.a.s.c.CachingDirectoryFactory Timeout waiting for all directory ref counts to be released - gave up waiting on CachedDir<<refCount=2;path=/export/home/jenkins/workspace/Lucene-Solr-5.x-Solaris/solr/build/solr-core/test/J1/temp/solr.search.TestIndexSearcher_C54BCBA9F8D085CA-001/init-core-data-001/index;done=false>>
   [junit4]   2> 1142902 ERROR (coreCloseExecutor-3508-thread-1-processing-x:core1) [    x:collection1] o.a.s.c.CachingDirectoryFactory Error closing directory:org.apache.solr.common.SolrException: Timeout waiting for all directory ref counts to be released - gave up waiting on CachedDir<<refCount=2;path=/export/home/jenkins/workspace/Lucene-Solr-5.x-Solaris/solr/build/solr-core/test/J1/temp/solr.search.TestIndexSearcher_C54BCBA9F8D085CA-001/init-core-data-001/index;done=false>>
   [junit4]   2> 	at org.apache.solr.core.CachingDirectoryFactory.close(CachingDirectoryFactory.java:187)
   [junit4]   2> 	at org.apache.solr.core.SolrCore.close(SolrCore.java:1275)
   [junit4]   2> 	at org.apache.solr.core.SolrCores$2.call(SolrCores.java:134)
   [junit4]   2> 	at org.apache.solr.core.SolrCores$2.call(SolrCores.java:129)
   [junit4]   2> 	at java.util.concurrent.FutureTask.run(FutureTask.java:266)
   [junit4]   2> 	at org.apache.solr.common.util.ExecutorUtil$MDCAwareThreadPoolExecutor$1.run(ExecutorUtil.java:231)
   [junit4]   2> 	at java.util.concurrent.ThreadPoolExecutor.runWorker(ThreadPoolExecutor.java:1142)
   [junit4]   2> 	at java.util.concurrent.ThreadPoolExecutor$Worker.run(ThreadPoolExecutor.java:617)
   [junit4]   2> 	at java.lang.Thread.run(Thread.java:745)
   [junit4]   2> 
   [junit4]   2> 1142903 INFO  (coreCloseExecutor-3508-thread-1-processing-x:core1) [    x:collection1] o.a.s.c.CachingDirectoryFactory looking to close /export/home/jenkins/workspace/Lucene-Solr-5.x-Solaris/solr/build/solr-core/test/J1/temp/solr.search.TestIndexSearcher_C54BCBA9F8D085CA-001/init-core-data-001 [CachedDir<<refCount=0;path=/export/home/jenkins/workspace/Lucene-Solr-5.x-Solaris/solr/build/solr-core/test/J1/temp/solr.search.TestIndexSearcher_C54BCBA9F8D085CA-001/init-core-data-001;done=false>>]
   [junit4]   2> 1142903 INFO  (coreCloseExecutor-3508-thread-1-processing-x:core1) [    x:collection1] o.a.s.c.CachingDirectoryFactory Closing directory: /export/home/jenkins/workspace/Lucene-Solr-5.x-Solaris/solr/build/solr-core/test/J1/temp/solr.search.TestIndexSearcher_C54BCBA9F8D085CA-001/init-core-data-001
   [junit4]   2> 1142903 ERROR (coreCloseExecutor-3508-thread-1-processing-x:core1) [    x:collection1] o.a.s.c.SolrCore java.lang.AssertionError: 2
   [junit4]   2> 	at org.apache.solr.core.CachingDirectoryFactory.close(CachingDirectoryFactory.java:201)
   [junit4]   2> 	at org.apache.solr.core.SolrCore.close(SolrCore.java:1275)
   [junit4]   2> 	at org.apache.solr.core.SolrCores$2.call(SolrCores.java:134)
   [junit4]   2> 	at org.apache.solr.core.SolrCores$2.call(SolrCores.java:129)
   [junit4]   2> 	at java.util.concurrent.FutureTask.run(FutureTask.java:266)
   [junit4]   2> 	at org.apache.solr.common.util.ExecutorUtil$MDCAwareThreadPoolExecutor$1.run(ExecutorUtil.java:231)
   [junit4]   2> 	at java.util.concurrent.ThreadPoolExecutor.runWorker(ThreadPoolExecutor.java:1142)
   [junit4]   2> 	at java.util.concurrent.ThreadPoolExecutor$Worker.run(ThreadPoolExecutor.java:617)
   [junit4]   2> 	at java.lang.Thread.run(Thread.java:745)
   [junit4]   2> 
   [junit4]   2> 1142903 ERROR (coreCloseExecutor-3508-thread-1-processing-x:core1) [    x:collection1] o.a.s.c.SolrCores Error shutting down core:java.lang.AssertionError: 2
   [junit4]   2> 	at org.apache.solr.core.CachingDirectoryFactory.close(CachingDirectoryFactory.java:201)
   [junit4]   2> 	at org.apache.solr.core.SolrCore.close(SolrCore.java:1275)
   [junit4]   2> 	at org.apache.solr.core.SolrCores$2.call(SolrCores.java:134)
   [junit4]   2> 	at org.apache.solr.core.SolrCores$2.call(SolrCores.java:129)
   [junit4]   2> 	at java.util.concurrent.FutureTask.run(FutureTask.java:266)
   [junit4]   2> 	at org.apache.solr.common.util.ExecutorUtil$MDCAwareThreadPoolExecutor$1.run(ExecutorUtil.java:231)
   [junit4]   2> 	at java.util.concurrent.ThreadPoolExecutor.runWorker(ThreadPoolExecutor.java:1142)
   [junit4]   2> 	at java.util.concurrent.ThreadPoolExecutor$Worker.run(ThreadPoolExecutor.java:617)
   [junit4]   2> 	at java.lang.Thread.run(Thread.java:745)
   [junit4]   2> 
   [junit4]   2> NOTE: leaving temporary files on disk at: /export/home/jenkins/workspace/Lucene-Solr-5.x-Solaris/solr/build/solr-core/test/J1/temp/solr.search.TestIndexSearcher_C54BCBA9F8D085CA-001
   [junit4]   2> NOTE: test params are: codec=Asserting(Lucene54): {v_s1=FST50, range_facet_l_dv=FST50, _version_=PostingsFormat(name=LuceneVarGapFixedInterval), multiDefault=PostingsFormat(name=Memory doPackFST= true), intDefault=PostingsFormat(name=LuceneVarGapFixedInterval), v_t=FST50, id=FST50, range_facet_i_dv=PostingsFormat(name=LuceneVarGapFixedInterval), text=BlockTreeOrds(blocksize=128), range_facet_l=PostingsFormat(name=LuceneVarGapFixedInterval), timestamp=PostingsFormat(name=LuceneVarGapFixedInterval)}, docValues:{range_facet_l_dv=DocValuesFormat(name=Memory), range_facet_i_dv=DocValuesFormat(name=Asserting), timestamp=DocValuesFormat(name=Asserting)}, sim=DefaultSimilarity, locale=de-GR, timezone=Pacific/Johnston
   [junit4]   2> NOTE: SunOS 5.11 amd64/Oracle Corporation 1.8.0_72 (64-bit)/cpus=3,threads=1,free=90651160,total=372473856
   [junit4]   2> NOTE: All tests run in this JVM: [TestCloudManagedSchemaConcurrent, TestSolrCoreProperties, HdfsSyncSliceTest, ShardRoutingCustomTest, SuggesterTest, TestManagedSchemaFieldTypeResource, ExitableDirectoryReaderTest, TestSolrQueryParserResource, TestManagedResourceStorage, PluginInfoTest, TestCryptoKeys, ConvertedLegacyTest, TestPHPSerializedResponseWriter, TestRecovery, TestBinaryResponseWriter, IndexSchemaRuntimeFieldTest, TestBulkSchemaConcurrent, QueryParsingTest, DistribJoinFromCollectionTest, TestInitParams, TestSimpleTrackingShardHandler, TestSmileRequest, SortSpecParsingTest, OverseerStatusTest, BasicFunctionalityTest, BJQParserTest, TestCollationFieldDocValues, SpellCheckCollatorTest, TestImplicitCoreProperties, TestConfigSetImmutable, SpellingQueryConverterTest, TestRawTransformer, TestSolrConfigHandler, HighlighterConfigTest, TestInitQParser, SharedFSAutoReplicaFailoverTest, RequestHandlersTest, TermVectorComponentDistributedTest, TestRandomFaceting, TestWriterPerf, CoreAdminHandlerTest, BadIndexSchemaTest, SimpleMLTQParserTest, TestDocBasedVersionConstraints, TestDFISimilarityFactory, MinimalSchemaTest, TestSchemaSimilarityResource, CollectionsAPIAsyncDistributedZkTest, InfoHandlerTest, VMParamsZkACLAndCredentialsProvidersTest, TestMacros, DistributedTermsComponentTest, SolrInfoMBeanTest, TestFoldingMultitermQuery, TestFiltering, TestStandardQParsers, TestJoin, FileBasedSpellCheckerTest, IgnoreCommitOptimizeUpdateProcessorFactoryTest, TestSerializedLuceneMatchVersion, SolrCoreCheckLockOnStartupTest, BadCopyFieldTest, DeleteShardTest, TestCustomDocTransformer, StatsComponentTest, DateFieldTest, LoggingHandlerTest, NotRequiredUniqueKeyTest, SegmentsInfoRequestHandlerTest, HLLUtilTest, TestSolrIndexConfig, TestMiniSolrCloudCluster, SuggesterTSTTest, TestReload, TestRTGBase, BasicZkTest, RecoveryAfterSoftCommitTest, TestLMJelinekMercerSimilarityFactory, TestJsonFacets, TestJsonRequest, TestSystemIdResolver, TestReplicationHandlerBackup, TestBlobHandler, TestSuggestSpellingConverter, TestFastWriter, ZkStateReaderTest, TestBinaryField, SmileWriterTest, TestSchemaNameResource, TestJettySolrRunner, WordBreakSolrSpellCheckerTest, PreAnalyzedUpdateProcessorTest, TestRangeQuery, OutputWriterTest, TestPerFieldSimilarityWithDefaultOverride, DistanceFunctionTest, UniqFieldsUpdateProcessorFactoryTest, TestFuzzyAnalyzedSuggestions, CheckHdfsIndexTest, TestValueSourceCache, AnalyticsQueryTest, TestRealTimeGet, AliasIntegrationTest, TestConfigSetsAPIExclusivity, TestScoreJoinQPNoScore, AddSchemaFieldsUpdateProcessorFactoryTest, DateMathParserTest, TestMissingGroups, SuggestComponentTest, TestIndexSearcher]
   [junit4] Completed [218/566 (1!)] on J1 in 16.15s, 5 tests, 1 failure <<< FAILURES!

[...truncated 1110 lines...]
BUILD FAILED
/export/home/jenkins/workspace/Lucene-Solr-5.x-Solaris/build.xml:750: The following error occurred while executing this line:
/export/home/jenkins/workspace/Lucene-Solr-5.x-Solaris/build.xml:694: The following error occurred while executing this line:
/export/home/jenkins/workspace/Lucene-Solr-5.x-Solaris/build.xml:59: The following error occurred while executing this line:
/export/home/jenkins/workspace/Lucene-Solr-5.x-Solaris/solr/build.xml:233: The following error occurred while executing this line:
/export/home/jenkins/workspace/Lucene-Solr-5.x-Solaris/solr/common-build.xml:534: The following error occurred while executing this line:
/export/home/jenkins/workspace/Lucene-Solr-5.x-Solaris/lucene/common-build.xml:1477: The following error occurred while executing this line:
/export/home/jenkins/workspace/Lucene-Solr-5.x-Solaris/lucene/common-build.xml:1033: There were test failures: 566 suites (7 ignored), 2279 tests, 1 failure, 55 ignored (39 assumptions) [seed: C54BCBA9F8D085CA]

Total time: 73 minutes 42 seconds
Build step 'Invoke Ant' marked build as failure
Archiving artifacts
[WARNINGS] Skipping publisher since build result is FAILURE
Recording test results
Email was triggered for: Failure - Any
Sending email for trigger: Failure - Any



Mime
View raw message