lucene-dev mailing list archives

Site index · List index
Message view « Date » · « Thread »
Top « Date » · « Thread »
From Policeman Jenkins Server <jenk...@thetaphi.de>
Subject [JENKINS] Lucene-Solr-trunk-Solaris (64bit/jdk1.8.0) - Build # 408 - Failure!
Date Wed, 17 Feb 2016 13:43:09 GMT
Build: http://jenkins.thetaphi.de/job/Lucene-Solr-trunk-Solaris/408/
Java: 64bit/jdk1.8.0 -XX:-UseCompressedOops -XX:+UseG1GC

1 tests failed.
FAILED:  org.apache.solr.cloud.DistribDocExpirationUpdateProcessorTest.test

Error Message:
There are still nodes recoverying - waited for 45 seconds

Stack Trace:
java.lang.AssertionError: There are still nodes recoverying - waited for 45 seconds
	at __randomizedtesting.SeedInfo.seed([43F6DC65C75CC80D:CBA2E3BF69A0A5F5]:0)
	at org.junit.Assert.fail(Assert.java:93)
	at org.apache.solr.cloud.AbstractDistribZkTestBase.waitForRecoveriesToFinish(AbstractDistribZkTestBase.java:174)
	at org.apache.solr.cloud.AbstractFullDistribZkTestBase.waitForRecoveriesToFinish(AbstractFullDistribZkTestBase.java:856)
	at org.apache.solr.cloud.DistribDocExpirationUpdateProcessorTest.test(DistribDocExpirationUpdateProcessorTest.java:73)
	at sun.reflect.NativeMethodAccessorImpl.invoke0(Native Method)
	at sun.reflect.NativeMethodAccessorImpl.invoke(NativeMethodAccessorImpl.java:62)
	at sun.reflect.DelegatingMethodAccessorImpl.invoke(DelegatingMethodAccessorImpl.java:43)
	at java.lang.reflect.Method.invoke(Method.java:498)
	at com.carrotsearch.randomizedtesting.RandomizedRunner.invoke(RandomizedRunner.java:1764)
	at com.carrotsearch.randomizedtesting.RandomizedRunner$8.evaluate(RandomizedRunner.java:871)
	at com.carrotsearch.randomizedtesting.RandomizedRunner$9.evaluate(RandomizedRunner.java:907)
	at com.carrotsearch.randomizedtesting.RandomizedRunner$10.evaluate(RandomizedRunner.java:921)
	at org.apache.solr.BaseDistributedSearchTestCase$ShardsRepeatRule$ShardsFixedStatement.callStatement(BaseDistributedSearchTestCase.java:964)
	at org.apache.solr.BaseDistributedSearchTestCase$ShardsRepeatRule$ShardsStatement.evaluate(BaseDistributedSearchTestCase.java:939)
	at com.carrotsearch.randomizedtesting.rules.SystemPropertiesRestoreRule$1.evaluate(SystemPropertiesRestoreRule.java:57)
	at org.apache.lucene.util.TestRuleSetupTeardownChained$1.evaluate(TestRuleSetupTeardownChained.java:49)
	at org.apache.lucene.util.AbstractBeforeAfterRule$1.evaluate(AbstractBeforeAfterRule.java:45)
	at org.apache.lucene.util.TestRuleThreadAndTestName$1.evaluate(TestRuleThreadAndTestName.java:48)
	at org.apache.lucene.util.TestRuleIgnoreAfterMaxFailures$1.evaluate(TestRuleIgnoreAfterMaxFailures.java:64)
	at org.apache.lucene.util.TestRuleMarkFailure$1.evaluate(TestRuleMarkFailure.java:47)
	at com.carrotsearch.randomizedtesting.rules.StatementAdapter.evaluate(StatementAdapter.java:36)
	at com.carrotsearch.randomizedtesting.ThreadLeakControl$StatementRunner.run(ThreadLeakControl.java:367)
	at com.carrotsearch.randomizedtesting.ThreadLeakControl.forkTimeoutingTask(ThreadLeakControl.java:809)
	at com.carrotsearch.randomizedtesting.ThreadLeakControl$3.evaluate(ThreadLeakControl.java:460)
	at com.carrotsearch.randomizedtesting.RandomizedRunner.runSingleTest(RandomizedRunner.java:880)
	at com.carrotsearch.randomizedtesting.RandomizedRunner$5.evaluate(RandomizedRunner.java:781)
	at com.carrotsearch.randomizedtesting.RandomizedRunner$6.evaluate(RandomizedRunner.java:816)
	at com.carrotsearch.randomizedtesting.RandomizedRunner$7.evaluate(RandomizedRunner.java:827)
	at com.carrotsearch.randomizedtesting.rules.StatementAdapter.evaluate(StatementAdapter.java:36)
	at com.carrotsearch.randomizedtesting.rules.SystemPropertiesRestoreRule$1.evaluate(SystemPropertiesRestoreRule.java:57)
	at org.apache.lucene.util.AbstractBeforeAfterRule$1.evaluate(AbstractBeforeAfterRule.java:45)
	at com.carrotsearch.randomizedtesting.rules.StatementAdapter.evaluate(StatementAdapter.java:36)
	at org.apache.lucene.util.TestRuleStoreClassName$1.evaluate(TestRuleStoreClassName.java:41)
	at com.carrotsearch.randomizedtesting.rules.NoShadowingOrOverridesOnMethodsRule$1.evaluate(NoShadowingOrOverridesOnMethodsRule.java:40)
	at com.carrotsearch.randomizedtesting.rules.NoShadowingOrOverridesOnMethodsRule$1.evaluate(NoShadowingOrOverridesOnMethodsRule.java:40)
	at com.carrotsearch.randomizedtesting.rules.StatementAdapter.evaluate(StatementAdapter.java:36)
	at com.carrotsearch.randomizedtesting.rules.StatementAdapter.evaluate(StatementAdapter.java:36)
	at com.carrotsearch.randomizedtesting.rules.StatementAdapter.evaluate(StatementAdapter.java:36)
	at org.apache.lucene.util.TestRuleAssertionsRequired$1.evaluate(TestRuleAssertionsRequired.java:53)
	at org.apache.lucene.util.TestRuleMarkFailure$1.evaluate(TestRuleMarkFailure.java:47)
	at org.apache.lucene.util.TestRuleIgnoreAfterMaxFailures$1.evaluate(TestRuleIgnoreAfterMaxFailures.java:64)
	at org.apache.lucene.util.TestRuleIgnoreTestSuites$1.evaluate(TestRuleIgnoreTestSuites.java:54)
	at com.carrotsearch.randomizedtesting.rules.StatementAdapter.evaluate(StatementAdapter.java:36)
	at com.carrotsearch.randomizedtesting.ThreadLeakControl$StatementRunner.run(ThreadLeakControl.java:367)
	at java.lang.Thread.run(Thread.java:745)




Build Log:
[...truncated 10569 lines...]
   [junit4] Suite: org.apache.solr.cloud.DistribDocExpirationUpdateProcessorTest
   [junit4]   2> Creating dataDir: /export/home/jenkins/workspace/Lucene-Solr-trunk-Solaris/solr/build/solr-core/test/J1/temp/solr.cloud.DistribDocExpirationUpdateProcessorTest_43F6DC65C75CC80D-001/init-core-data-001
   [junit4]   2> 378810 INFO  (SUITE-DistribDocExpirationUpdateProcessorTest-seed#[43F6DC65C75CC80D]-worker) [    ] o.a.s.SolrTestCaseJ4 Randomized ssl (false) and clientAuth (false)
   [junit4]   2> 378811 INFO  (SUITE-DistribDocExpirationUpdateProcessorTest-seed#[43F6DC65C75CC80D]-worker) [    ] o.a.s.BaseDistributedSearchTestCase Setting hostContext system property: /oc_d/n
   [junit4]   2> 378826 INFO  (TEST-DistribDocExpirationUpdateProcessorTest.test-seed#[43F6DC65C75CC80D]) [    ] o.a.s.c.ZkTestServer STARTING ZK TEST SERVER
   [junit4]   2> 378826 INFO  (Thread-2323) [    ] o.a.s.c.ZkTestServer client port:0.0.0.0/0.0.0.0:0
   [junit4]   2> 378826 INFO  (Thread-2323) [    ] o.a.s.c.ZkTestServer Starting server
   [junit4]   2> 378926 INFO  (TEST-DistribDocExpirationUpdateProcessorTest.test-seed#[43F6DC65C75CC80D]) [    ] o.a.s.c.ZkTestServer start zk server on port:63019
   [junit4]   2> 378927 INFO  (TEST-DistribDocExpirationUpdateProcessorTest.test-seed#[43F6DC65C75CC80D]) [    ] o.a.s.c.c.SolrZkClient Using default ZkCredentialsProvider
   [junit4]   2> 378927 INFO  (TEST-DistribDocExpirationUpdateProcessorTest.test-seed#[43F6DC65C75CC80D]) [    ] o.a.s.c.c.ConnectionManager Waiting for client to connect to ZooKeeper
   [junit4]   2> 378930 INFO  (zkCallback-408-thread-1) [    ] o.a.s.c.c.ConnectionManager Watcher org.apache.solr.common.cloud.ConnectionManager@d7a4eb8 name:ZooKeeperConnection Watcher:127.0.0.1:63019 got event WatchedEvent state:SyncConnected type:None path:null path:null type:None
   [junit4]   2> 378930 INFO  (TEST-DistribDocExpirationUpdateProcessorTest.test-seed#[43F6DC65C75CC80D]) [    ] o.a.s.c.c.ConnectionManager Client is connected to ZooKeeper
   [junit4]   2> 378930 INFO  (TEST-DistribDocExpirationUpdateProcessorTest.test-seed#[43F6DC65C75CC80D]) [    ] o.a.s.c.c.SolrZkClient Using default ZkACLProvider
   [junit4]   2> 378930 INFO  (TEST-DistribDocExpirationUpdateProcessorTest.test-seed#[43F6DC65C75CC80D]) [    ] o.a.s.c.c.SolrZkClient makePath: /solr
   [junit4]   2> 378934 INFO  (TEST-DistribDocExpirationUpdateProcessorTest.test-seed#[43F6DC65C75CC80D]) [    ] o.a.s.c.c.SolrZkClient Using default ZkCredentialsProvider
   [junit4]   2> 378934 INFO  (TEST-DistribDocExpirationUpdateProcessorTest.test-seed#[43F6DC65C75CC80D]) [    ] o.a.s.c.c.ConnectionManager Waiting for client to connect to ZooKeeper
   [junit4]   2> 378936 INFO  (zkCallback-409-thread-1) [    ] o.a.s.c.c.ConnectionManager Watcher org.apache.solr.common.cloud.ConnectionManager@5f0b7cec name:ZooKeeperConnection Watcher:127.0.0.1:63019/solr got event WatchedEvent state:SyncConnected type:None path:null path:null type:None
   [junit4]   2> 378936 INFO  (TEST-DistribDocExpirationUpdateProcessorTest.test-seed#[43F6DC65C75CC80D]) [    ] o.a.s.c.c.ConnectionManager Client is connected to ZooKeeper
   [junit4]   2> 378936 INFO  (TEST-DistribDocExpirationUpdateProcessorTest.test-seed#[43F6DC65C75CC80D]) [    ] o.a.s.c.c.SolrZkClient Using default ZkACLProvider
   [junit4]   2> 378936 INFO  (TEST-DistribDocExpirationUpdateProcessorTest.test-seed#[43F6DC65C75CC80D]) [    ] o.a.s.c.c.SolrZkClient makePath: /collections/collection1
   [junit4]   2> 378939 INFO  (TEST-DistribDocExpirationUpdateProcessorTest.test-seed#[43F6DC65C75CC80D]) [    ] o.a.s.c.c.SolrZkClient makePath: /collections/collection1/shards
   [junit4]   2> 378941 INFO  (TEST-DistribDocExpirationUpdateProcessorTest.test-seed#[43F6DC65C75CC80D]) [    ] o.a.s.c.c.SolrZkClient makePath: /collections/control_collection
   [junit4]   2> 378943 INFO  (TEST-DistribDocExpirationUpdateProcessorTest.test-seed#[43F6DC65C75CC80D]) [    ] o.a.s.c.c.SolrZkClient makePath: /collections/control_collection/shards
   [junit4]   2> 378946 INFO  (TEST-DistribDocExpirationUpdateProcessorTest.test-seed#[43F6DC65C75CC80D]) [    ] o.a.s.c.AbstractZkTestCase put /export/home/jenkins/workspace/Lucene-Solr-trunk-Solaris/solr/core/src/test-files/solr/collection1/conf/solrconfig-doc-expire-update-processor.xml to /configs/conf1/solrconfig.xml
   [junit4]   2> 378965 INFO  (TEST-DistribDocExpirationUpdateProcessorTest.test-seed#[43F6DC65C75CC80D]) [    ] o.a.s.c.c.SolrZkClient makePath: /configs/conf1/solrconfig.xml
   [junit4]   2> 378969 INFO  (TEST-DistribDocExpirationUpdateProcessorTest.test-seed#[43F6DC65C75CC80D]) [    ] o.a.s.c.AbstractZkTestCase put /export/home/jenkins/workspace/Lucene-Solr-trunk-Solaris/solr/core/src/test-files/solr/collection1/conf/schema15.xml to /configs/conf1/schema.xml
   [junit4]   2> 378973 INFO  (TEST-DistribDocExpirationUpdateProcessorTest.test-seed#[43F6DC65C75CC80D]) [    ] o.a.s.c.c.SolrZkClient makePath: /configs/conf1/schema.xml
   [junit4]   2> 378976 INFO  (TEST-DistribDocExpirationUpdateProcessorTest.test-seed#[43F6DC65C75CC80D]) [    ] o.a.s.c.AbstractZkTestCase put /export/home/jenkins/workspace/Lucene-Solr-trunk-Solaris/solr/core/src/test-files/solr/collection1/conf/solrconfig.snippet.randomindexconfig.xml to /configs/conf1/solrconfig.snippet.randomindexconfig.xml
   [junit4]   2> 378976 INFO  (TEST-DistribDocExpirationUpdateProcessorTest.test-seed#[43F6DC65C75CC80D]) [    ] o.a.s.c.c.SolrZkClient makePath: /configs/conf1/solrconfig.snippet.randomindexconfig.xml
   [junit4]   2> 378978 INFO  (TEST-DistribDocExpirationUpdateProcessorTest.test-seed#[43F6DC65C75CC80D]) [    ] o.a.s.c.AbstractZkTestCase put /export/home/jenkins/workspace/Lucene-Solr-trunk-Solaris/solr/core/src/test-files/solr/collection1/conf/stopwords.txt to /configs/conf1/stopwords.txt
   [junit4]   2> 378978 INFO  (TEST-DistribDocExpirationUpdateProcessorTest.test-seed#[43F6DC65C75CC80D]) [    ] o.a.s.c.c.SolrZkClient makePath: /configs/conf1/stopwords.txt
   [junit4]   2> 378980 INFO  (TEST-DistribDocExpirationUpdateProcessorTest.test-seed#[43F6DC65C75CC80D]) [    ] o.a.s.c.AbstractZkTestCase put /export/home/jenkins/workspace/Lucene-Solr-trunk-Solaris/solr/core/src/test-files/solr/collection1/conf/protwords.txt to /configs/conf1/protwords.txt
   [junit4]   2> 378981 INFO  (TEST-DistribDocExpirationUpdateProcessorTest.test-seed#[43F6DC65C75CC80D]) [    ] o.a.s.c.c.SolrZkClient makePath: /configs/conf1/protwords.txt
   [junit4]   2> 378983 INFO  (TEST-DistribDocExpirationUpdateProcessorTest.test-seed#[43F6DC65C75CC80D]) [    ] o.a.s.c.AbstractZkTestCase put /export/home/jenkins/workspace/Lucene-Solr-trunk-Solaris/solr/core/src/test-files/solr/collection1/conf/currency.xml to /configs/conf1/currency.xml
   [junit4]   2> 378983 INFO  (TEST-DistribDocExpirationUpdateProcessorTest.test-seed#[43F6DC65C75CC80D]) [    ] o.a.s.c.c.SolrZkClient makePath: /configs/conf1/currency.xml
   [junit4]   2> 378986 INFO  (TEST-DistribDocExpirationUpdateProcessorTest.test-seed#[43F6DC65C75CC80D]) [    ] o.a.s.c.AbstractZkTestCase put /export/home/jenkins/workspace/Lucene-Solr-trunk-Solaris/solr/core/src/test-files/solr/collection1/conf/enumsConfig.xml to /configs/conf1/enumsConfig.xml
   [junit4]   2> 378986 INFO  (TEST-DistribDocExpirationUpdateProcessorTest.test-seed#[43F6DC65C75CC80D]) [    ] o.a.s.c.c.SolrZkClient makePath: /configs/conf1/enumsConfig.xml
   [junit4]   2> 378988 INFO  (TEST-DistribDocExpirationUpdateProcessorTest.test-seed#[43F6DC65C75CC80D]) [    ] o.a.s.c.AbstractZkTestCase put /export/home/jenkins/workspace/Lucene-Solr-trunk-Solaris/solr/core/src/test-files/solr/collection1/conf/open-exchange-rates.json to /configs/conf1/open-exchange-rates.json
   [junit4]   2> 378988 INFO  (TEST-DistribDocExpirationUpdateProcessorTest.test-seed#[43F6DC65C75CC80D]) [    ] o.a.s.c.c.SolrZkClient makePath: /configs/conf1/open-exchange-rates.json
   [junit4]   2> 378991 INFO  (TEST-DistribDocExpirationUpdateProcessorTest.test-seed#[43F6DC65C75CC80D]) [    ] o.a.s.c.AbstractZkTestCase put /export/home/jenkins/workspace/Lucene-Solr-trunk-Solaris/solr/core/src/test-files/solr/collection1/conf/mapping-ISOLatin1Accent.txt to /configs/conf1/mapping-ISOLatin1Accent.txt
   [junit4]   2> 378991 INFO  (TEST-DistribDocExpirationUpdateProcessorTest.test-seed#[43F6DC65C75CC80D]) [    ] o.a.s.c.c.SolrZkClient makePath: /configs/conf1/mapping-ISOLatin1Accent.txt
   [junit4]   2> 378994 INFO  (TEST-DistribDocExpirationUpdateProcessorTest.test-seed#[43F6DC65C75CC80D]) [    ] o.a.s.c.AbstractZkTestCase put /export/home/jenkins/workspace/Lucene-Solr-trunk-Solaris/solr/core/src/test-files/solr/collection1/conf/old_synonyms.txt to /configs/conf1/old_synonyms.txt
   [junit4]   2> 378994 INFO  (TEST-DistribDocExpirationUpdateProcessorTest.test-seed#[43F6DC65C75CC80D]) [    ] o.a.s.c.c.SolrZkClient makePath: /configs/conf1/old_synonyms.txt
   [junit4]   2> 378997 INFO  (TEST-DistribDocExpirationUpdateProcessorTest.test-seed#[43F6DC65C75CC80D]) [    ] o.a.s.c.AbstractZkTestCase put /export/home/jenkins/workspace/Lucene-Solr-trunk-Solaris/solr/core/src/test-files/solr/collection1/conf/synonyms.txt to /configs/conf1/synonyms.txt
   [junit4]   2> 378997 INFO  (TEST-DistribDocExpirationUpdateProcessorTest.test-seed#[43F6DC65C75CC80D]) [    ] o.a.s.c.c.SolrZkClient makePath: /configs/conf1/synonyms.txt
   [junit4]   2> 380204 INFO  (TEST-DistribDocExpirationUpdateProcessorTest.test-seed#[43F6DC65C75CC80D]) [    ] o.a.s.SolrTestCaseJ4 Writing core.properties file to /export/home/jenkins/workspace/Lucene-Solr-trunk-Solaris/solr/build/solr-core/test/J1/temp/solr.cloud.DistribDocExpirationUpdateProcessorTest_43F6DC65C75CC80D-001/control-001/cores/collection1
   [junit4]   2> 380206 INFO  (TEST-DistribDocExpirationUpdateProcessorTest.test-seed#[43F6DC65C75CC80D]) [    ] o.e.j.s.Server jetty-9.3.6.v20151106
   [junit4]   2> 380209 INFO  (TEST-DistribDocExpirationUpdateProcessorTest.test-seed#[43F6DC65C75CC80D]) [    ] o.e.j.s.h.ContextHandler Started o.e.j.s.ServletContextHandler@31751158{/oc_d/n,null,AVAILABLE}
   [junit4]   2> 380210 INFO  (TEST-DistribDocExpirationUpdateProcessorTest.test-seed#[43F6DC65C75CC80D]) [    ] o.e.j.s.ServerConnector Started ServerConnector@6e056ee2{HTTP/1.1,[http/1.1]}{127.0.0.1:62605}
   [junit4]   2> 380210 INFO  (TEST-DistribDocExpirationUpdateProcessorTest.test-seed#[43F6DC65C75CC80D]) [    ] o.e.j.s.Server Started @385952ms
   [junit4]   2> 380210 INFO  (TEST-DistribDocExpirationUpdateProcessorTest.test-seed#[43F6DC65C75CC80D]) [    ] o.a.s.c.s.e.JettySolrRunner Jetty properties: {solr.data.dir=/export/home/jenkins/workspace/Lucene-Solr-trunk-Solaris/solr/build/solr-core/test/J1/temp/solr.cloud.DistribDocExpirationUpdateProcessorTest_43F6DC65C75CC80D-001/tempDir-001/control/data, hostContext=/oc_d/n, hostPort=62605, coreRootDirectory=/export/home/jenkins/workspace/Lucene-Solr-trunk-Solaris/solr/build/solr-core/test/J1/temp/solr.cloud.DistribDocExpirationUpdateProcessorTest_43F6DC65C75CC80D-001/control-001/cores}
   [junit4]   2> 380211 INFO  (TEST-DistribDocExpirationUpdateProcessorTest.test-seed#[43F6DC65C75CC80D]) [    ] o.a.s.s.SolrDispatchFilter SolrDispatchFilter.init(): sun.misc.Launcher$AppClassLoader@6d06d69c
   [junit4]   2> 380211 INFO  (TEST-DistribDocExpirationUpdateProcessorTest.test-seed#[43F6DC65C75CC80D]) [    ] o.a.s.c.SolrResourceLoader new SolrResourceLoader for directory: '/export/home/jenkins/workspace/Lucene-Solr-trunk-Solaris/solr/build/solr-core/test/J1/temp/solr.cloud.DistribDocExpirationUpdateProcessorTest_43F6DC65C75CC80D-001/control-001'
   [junit4]   2> 380211 INFO  (TEST-DistribDocExpirationUpdateProcessorTest.test-seed#[43F6DC65C75CC80D]) [    ] o.a.s.c.SolrResourceLoader JNDI not configured for solr (NoInitialContextEx)
   [junit4]   2> 380211 INFO  (TEST-DistribDocExpirationUpdateProcessorTest.test-seed#[43F6DC65C75CC80D]) [    ] o.a.s.c.SolrResourceLoader solr home defaulted to 'solr/' (could not find system property or JNDI)
   [junit4]   2> 380211 INFO  (TEST-DistribDocExpirationUpdateProcessorTest.test-seed#[43F6DC65C75CC80D]) [    ] o.a.s.c.c.SolrZkClient Using default ZkCredentialsProvider
   [junit4]   2> 380212 INFO  (TEST-DistribDocExpirationUpdateProcessorTest.test-seed#[43F6DC65C75CC80D]) [    ] o.a.s.c.c.ConnectionManager Waiting for client to connect to ZooKeeper
   [junit4]   2> 380215 INFO  (zkCallback-410-thread-1) [    ] o.a.s.c.c.ConnectionManager Watcher org.apache.solr.common.cloud.ConnectionManager@77fe88d0 name:ZooKeeperConnection Watcher:127.0.0.1:63019/solr got event WatchedEvent state:SyncConnected type:None path:null path:null type:None
   [junit4]   2> 380215 INFO  (TEST-DistribDocExpirationUpdateProcessorTest.test-seed#[43F6DC65C75CC80D]) [    ] o.a.s.c.c.ConnectionManager Client is connected to ZooKeeper
   [junit4]   2> 380215 INFO  (TEST-DistribDocExpirationUpdateProcessorTest.test-seed#[43F6DC65C75CC80D]) [    ] o.a.s.c.c.SolrZkClient Using default ZkACLProvider
   [junit4]   2> 380217 INFO  (TEST-DistribDocExpirationUpdateProcessorTest.test-seed#[43F6DC65C75CC80D]) [    ] o.a.s.s.SolrDispatchFilter Loading solr.xml from SolrHome (not found in ZooKeeper)
   [junit4]   2> 380217 INFO  (TEST-DistribDocExpirationUpdateProcessorTest.test-seed#[43F6DC65C75CC80D]) [    ] o.a.s.c.SolrXmlConfig Loading container configuration from /export/home/jenkins/workspace/Lucene-Solr-trunk-Solaris/solr/build/solr-core/test/J1/temp/solr.cloud.DistribDocExpirationUpdateProcessorTest_43F6DC65C75CC80D-001/control-001/solr.xml
   [junit4]   2> 380222 INFO  (TEST-DistribDocExpirationUpdateProcessorTest.test-seed#[43F6DC65C75CC80D]) [    ] o.a.s.c.CorePropertiesLocator Config-defined core root directory: /export/home/jenkins/workspace/Lucene-Solr-trunk-Solaris/solr/build/solr-core/test/J1/temp/solr.cloud.DistribDocExpirationUpdateProcessorTest_43F6DC65C75CC80D-001/control-001/cores
   [junit4]   2> 380222 INFO  (TEST-DistribDocExpirationUpdateProcessorTest.test-seed#[43F6DC65C75CC80D]) [    ] o.a.s.c.CoreContainer New CoreContainer 863985676
   [junit4]   2> 380222 INFO  (TEST-DistribDocExpirationUpdateProcessorTest.test-seed#[43F6DC65C75CC80D]) [    ] o.a.s.c.CoreContainer Loading cores into CoreContainer [instanceDir=/export/home/jenkins/workspace/Lucene-Solr-trunk-Solaris/solr/build/solr-core/test/J1/temp/solr.cloud.DistribDocExpirationUpdateProcessorTest_43F6DC65C75CC80D-001/control-001]
   [junit4]   2> 380222 WARN  (TEST-DistribDocExpirationUpdateProcessorTest.test-seed#[43F6DC65C75CC80D]) [    ] o.a.s.c.CoreContainer Couldn't add files from /export/home/jenkins/workspace/Lucene-Solr-trunk-Solaris/solr/build/solr-core/test/J1/temp/solr.cloud.DistribDocExpirationUpdateProcessorTest_43F6DC65C75CC80D-001/control-001/lib to classpath: /export/home/jenkins/workspace/Lucene-Solr-trunk-Solaris/solr/build/solr-core/test/J1/temp/solr.cloud.DistribDocExpirationUpdateProcessorTest_43F6DC65C75CC80D-001/control-001/lib
   [junit4]   2> 380222 INFO  (TEST-DistribDocExpirationUpdateProcessorTest.test-seed#[43F6DC65C75CC80D]) [    ] o.a.s.h.c.HttpShardHandlerFactory created with socketTimeout : 90000,urlScheme : ,connTimeout : 15000,maxConnectionsPerHost : 20,maxConnections : 10000,corePoolSize : 0,maximumPoolSize : 2147483647,maxThreadIdleTime : 5,sizeOfQueue : -1,fairnessPolicy : false,useRetries : false,
   [junit4]   2> 380248 INFO  (TEST-DistribDocExpirationUpdateProcessorTest.test-seed#[43F6DC65C75CC80D]) [    ] o.a.s.u.UpdateShardHandler Creating UpdateShardHandler HTTP client with params: socketTimeout=340000&connTimeout=45000&retry=true
   [junit4]   2> 380249 INFO  (TEST-DistribDocExpirationUpdateProcessorTest.test-seed#[43F6DC65C75CC80D]) [    ] o.a.s.l.LogWatcher SLF4J impl is org.slf4j.impl.Log4jLoggerFactory
   [junit4]   2> 380249 INFO  (TEST-DistribDocExpirationUpdateProcessorTest.test-seed#[43F6DC65C75CC80D]) [    ] o.a.s.l.LogWatcher Registering Log Listener [Log4j (org.slf4j.impl.Log4jLoggerFactory)]
   [junit4]   2> 380249 INFO  (TEST-DistribDocExpirationUpdateProcessorTest.test-seed#[43F6DC65C75CC80D]) [    ] o.a.s.c.ZkContainer Zookeeper client=127.0.0.1:63019/solr
   [junit4]   2> 380249 INFO  (TEST-DistribDocExpirationUpdateProcessorTest.test-seed#[43F6DC65C75CC80D]) [    ] o.a.s.c.ZkController zkHost includes chroot
   [junit4]   2> 380249 INFO  (TEST-DistribDocExpirationUpdateProcessorTest.test-seed#[43F6DC65C75CC80D]) [    ] o.a.s.c.c.SolrZkClient Using default ZkCredentialsProvider
   [junit4]   2> 380250 INFO  (TEST-DistribDocExpirationUpdateProcessorTest.test-seed#[43F6DC65C75CC80D]) [    ] o.a.s.c.c.ConnectionManager Waiting for client to connect to ZooKeeper
   [junit4]   2> 380256 INFO  (zkCallback-413-thread-1) [    ] o.a.s.c.c.ConnectionManager Watcher org.apache.solr.common.cloud.ConnectionManager@1eb241f8 name:ZooKeeperConnection Watcher:127.0.0.1:63019 got event WatchedEvent state:SyncConnected type:None path:null path:null type:None
   [junit4]   2> 380257 INFO  (TEST-DistribDocExpirationUpdateProcessorTest.test-seed#[43F6DC65C75CC80D]) [    ] o.a.s.c.c.ConnectionManager Client is connected to ZooKeeper
   [junit4]   2> 380257 INFO  (TEST-DistribDocExpirationUpdateProcessorTest.test-seed#[43F6DC65C75CC80D]) [    ] o.a.s.c.c.SolrZkClient Using default ZkACLProvider
   [junit4]   2> 380260 INFO  (TEST-DistribDocExpirationUpdateProcessorTest.test-seed#[43F6DC65C75CC80D]) [n:127.0.0.1:62605_oc_d%2Fn    ] o.a.s.c.c.ConnectionManager Waiting for client to connect to ZooKeeper
   [junit4]   2> 380262 INFO  (zkCallback-414-thread-1-processing-n:127.0.0.1:62605_oc_d%2Fn) [n:127.0.0.1:62605_oc_d%2Fn    ] o.a.s.c.c.ConnectionManager Watcher org.apache.solr.common.cloud.ConnectionManager@6a95976b name:ZooKeeperConnection Watcher:127.0.0.1:63019/solr got event WatchedEvent state:SyncConnected type:None path:null path:null type:None
   [junit4]   2> 380262 INFO  (TEST-DistribDocExpirationUpdateProcessorTest.test-seed#[43F6DC65C75CC80D]) [n:127.0.0.1:62605_oc_d%2Fn    ] o.a.s.c.c.ConnectionManager Client is connected to ZooKeeper
   [junit4]   2> 380263 INFO  (TEST-DistribDocExpirationUpdateProcessorTest.test-seed#[43F6DC65C75CC80D]) [n:127.0.0.1:62605_oc_d%2Fn    ] o.a.s.c.c.SolrZkClient makePath: /overseer/queue
   [junit4]   2> 380267 INFO  (TEST-DistribDocExpirationUpdateProcessorTest.test-seed#[43F6DC65C75CC80D]) [n:127.0.0.1:62605_oc_d%2Fn    ] o.a.s.c.c.SolrZkClient makePath: /overseer/collection-queue-work
   [junit4]   2> 380272 INFO  (TEST-DistribDocExpirationUpdateProcessorTest.test-seed#[43F6DC65C75CC80D]) [n:127.0.0.1:62605_oc_d%2Fn    ] o.a.s.c.c.SolrZkClient makePath: /overseer/collection-map-running
   [junit4]   2> 380275 INFO  (TEST-DistribDocExpirationUpdateProcessorTest.test-seed#[43F6DC65C75CC80D]) [n:127.0.0.1:62605_oc_d%2Fn    ] o.a.s.c.c.SolrZkClient makePath: /overseer/collection-map-completed
   [junit4]   2> 380279 INFO  (TEST-DistribDocExpirationUpdateProcessorTest.test-seed#[43F6DC65C75CC80D]) [n:127.0.0.1:62605_oc_d%2Fn    ] o.a.s.c.c.SolrZkClient makePath: /overseer/collection-map-failure
   [junit4]   2> 380282 INFO  (TEST-DistribDocExpirationUpdateProcessorTest.test-seed#[43F6DC65C75CC80D]) [n:127.0.0.1:62605_oc_d%2Fn    ] o.a.s.c.c.SolrZkClient makePath: /live_nodes
   [junit4]   2> 380284 INFO  (TEST-DistribDocExpirationUpdateProcessorTest.test-seed#[43F6DC65C75CC80D]) [n:127.0.0.1:62605_oc_d%2Fn    ] o.a.s.c.c.SolrZkClient makePath: /aliases.json
   [junit4]   2> 380286 INFO  (TEST-DistribDocExpirationUpdateProcessorTest.test-seed#[43F6DC65C75CC80D]) [n:127.0.0.1:62605_oc_d%2Fn    ] o.a.s.c.c.SolrZkClient makePath: /clusterstate.json
   [junit4]   2> 380288 INFO  (TEST-DistribDocExpirationUpdateProcessorTest.test-seed#[43F6DC65C75CC80D]) [n:127.0.0.1:62605_oc_d%2Fn    ] o.a.s.c.c.SolrZkClient makePath: /security.json
   [junit4]   2> 380290 INFO  (TEST-DistribDocExpirationUpdateProcessorTest.test-seed#[43F6DC65C75CC80D]) [n:127.0.0.1:62605_oc_d%2Fn    ] o.a.s.c.ZkController Register node as live in ZooKeeper:/live_nodes/127.0.0.1:62605_oc_d%2Fn
   [junit4]   2> 380291 INFO  (TEST-DistribDocExpirationUpdateProcessorTest.test-seed#[43F6DC65C75CC80D]) [n:127.0.0.1:62605_oc_d%2Fn    ] o.a.s.c.c.SolrZkClient makePath: /live_nodes/127.0.0.1:62605_oc_d%2Fn
   [junit4]   2> 380293 INFO  (TEST-DistribDocExpirationUpdateProcessorTest.test-seed#[43F6DC65C75CC80D]) [n:127.0.0.1:62605_oc_d%2Fn    ] o.a.s.c.c.SolrZkClient makePath: /overseer_elect
   [junit4]   2> 380295 INFO  (TEST-DistribDocExpirationUpdateProcessorTest.test-seed#[43F6DC65C75CC80D]) [n:127.0.0.1:62605_oc_d%2Fn    ] o.a.s.c.c.SolrZkClient makePath: /overseer_elect/election
   [junit4]   2> 380297 INFO  (TEST-DistribDocExpirationUpdateProcessorTest.test-seed#[43F6DC65C75CC80D]) [n:127.0.0.1:62605_oc_d%2Fn    ] o.a.s.c.Overseer Overseer (id=null) closing
   [junit4]   2> 380298 INFO  (TEST-DistribDocExpirationUpdateProcessorTest.test-seed#[43F6DC65C75CC80D]) [n:127.0.0.1:62605_oc_d%2Fn    ] o.a.s.c.LeaderElector Joined leadership election with path: /overseer_elect/election/95401648072884228-127.0.0.1:62605_oc_d%2Fn-n_0000000000
   [junit4]   2> 380299 INFO  (TEST-DistribDocExpirationUpdateProcessorTest.test-seed#[43F6DC65C75CC80D]) [n:127.0.0.1:62605_oc_d%2Fn    ] o.a.s.c.OverseerElectionContext I am going to be the leader 127.0.0.1:62605_oc_d%2Fn
   [junit4]   2> 380299 INFO  (TEST-DistribDocExpirationUpdateProcessorTest.test-seed#[43F6DC65C75CC80D]) [n:127.0.0.1:62605_oc_d%2Fn    ] o.a.s.c.c.SolrZkClient makePath: /overseer_elect/leader
   [junit4]   2> 380301 INFO  (TEST-DistribDocExpirationUpdateProcessorTest.test-seed#[43F6DC65C75CC80D]) [n:127.0.0.1:62605_oc_d%2Fn    ] o.a.s.c.Overseer Overseer (id=95401648072884228-127.0.0.1:62605_oc_d%2Fn-n_0000000000) starting
   [junit4]   2> 380305 INFO  (TEST-DistribDocExpirationUpdateProcessorTest.test-seed#[43F6DC65C75CC80D]) [n:127.0.0.1:62605_oc_d%2Fn    ] o.a.s.c.c.SolrZkClient makePath: /overseer/queue-work
   [junit4]   2> 380314 INFO  (TEST-DistribDocExpirationUpdateProcessorTest.test-seed#[43F6DC65C75CC80D]) [n:127.0.0.1:62605_oc_d%2Fn    ] o.a.s.c.OverseerAutoReplicaFailoverThread Starting OverseerAutoReplicaFailoverThread autoReplicaFailoverWorkLoopDelay=10000 autoReplicaFailoverWaitAfterExpiration=30000 autoReplicaFailoverBadNodeExpiration=60000
   [junit4]   2> 380315 INFO  (TEST-DistribDocExpirationUpdateProcessorTest.test-seed#[43F6DC65C75CC80D]) [n:127.0.0.1:62605_oc_d%2Fn    ] o.a.s.c.c.ZkStateReader Updating cluster state from ZooKeeper... 
   [junit4]   2> 380315 INFO  (OverseerCollectionConfigSetProcessor-95401648072884228-127.0.0.1:62605_oc_d%2Fn-n_0000000000) [n:127.0.0.1:62605_oc_d%2Fn    ] o.a.s.c.OverseerTaskProcessor Process current queue of overseer operations
   [junit4]   2> 380316 INFO  (OverseerStateUpdate-95401648072884228-127.0.0.1:62605_oc_d%2Fn-n_0000000000) [n:127.0.0.1:62605_oc_d%2Fn    ] o.a.s.c.Overseer Starting to work on the main queue
   [junit4]   2> 380346 INFO  (TEST-DistribDocExpirationUpdateProcessorTest.test-seed#[43F6DC65C75CC80D]) [n:127.0.0.1:62605_oc_d%2Fn    ] o.a.s.c.CoreContainer Security conf doesn't exist. Skipping setup for authorization module.
   [junit4]   2> 380346 INFO  (TEST-DistribDocExpirationUpdateProcessorTest.test-seed#[43F6DC65C75CC80D]) [n:127.0.0.1:62605_oc_d%2Fn    ] o.a.s.c.CoreContainer No authentication plugin used.
   [junit4]   2> 380349 INFO  (TEST-DistribDocExpirationUpdateProcessorTest.test-seed#[43F6DC65C75CC80D]) [n:127.0.0.1:62605_oc_d%2Fn    ] o.a.s.c.CorePropertiesLocator Looking for core definitions underneath /export/home/jenkins/workspace/Lucene-Solr-trunk-Solaris/solr/build/solr-core/test/J1/temp/solr.cloud.DistribDocExpirationUpdateProcessorTest_43F6DC65C75CC80D-001/control-001/cores
   [junit4]   2> 380351 INFO  (TEST-DistribDocExpirationUpdateProcessorTest.test-seed#[43F6DC65C75CC80D]) [n:127.0.0.1:62605_oc_d%2Fn    ] o.a.s.c.CoreDescriptor Created CoreDescriptor: {name=collection1, config=solrconfig.xml, transient=false, schema=schema.xml, loadOnStartup=true, configSetProperties=configsetprops.json, collection=control_collection, coreNodeName=, dataDir=data/, shard=}
   [junit4]   2> 380351 INFO  (TEST-DistribDocExpirationUpdateProcessorTest.test-seed#[43F6DC65C75CC80D]) [n:127.0.0.1:62605_oc_d%2Fn    ] o.a.s.c.CorePropertiesLocator Found core collection1 in /export/home/jenkins/workspace/Lucene-Solr-trunk-Solaris/solr/build/solr-core/test/J1/temp/solr.cloud.DistribDocExpirationUpdateProcessorTest_43F6DC65C75CC80D-001/control-001/cores/collection1
   [junit4]   2> 380351 INFO  (TEST-DistribDocExpirationUpdateProcessorTest.test-seed#[43F6DC65C75CC80D]) [n:127.0.0.1:62605_oc_d%2Fn    ] o.a.s.c.CorePropertiesLocator Found 1 core definitions
   [junit4]   2> 380354 INFO  (TEST-DistribDocExpirationUpdateProcessorTest.test-seed#[43F6DC65C75CC80D]) [n:127.0.0.1:62605_oc_d%2Fn    ] o.a.s.s.SolrDispatchFilter user.dir=/export/home/jenkins/workspace/Lucene-Solr-trunk-Solaris/solr/build/solr-core/test/J1
   [junit4]   2> 380354 INFO  (TEST-DistribDocExpirationUpdateProcessorTest.test-seed#[43F6DC65C75CC80D]) [n:127.0.0.1:62605_oc_d%2Fn    ] o.a.s.s.SolrDispatchFilter SolrDispatchFilter.init() done
   [junit4]   2> 380355 INFO  (coreLoadExecutor-759-thread-1-processing-n:127.0.0.1:62605_oc_d%2Fn) [n:127.0.0.1:62605_oc_d%2Fn c:control_collection   x:collection1] o.a.s.c.ZkController publishing state=down
   [junit4]   2> 380355 INFO  (coreLoadExecutor-759-thread-1-processing-n:127.0.0.1:62605_oc_d%2Fn) [n:127.0.0.1:62605_oc_d%2Fn c:control_collection   x:collection1] o.a.s.c.ZkController numShards not found on descriptor - reading it from system property
   [junit4]   2> 380357 INFO  (OverseerStateUpdate-95401648072884228-127.0.0.1:62605_oc_d%2Fn-n_0000000000) [n:127.0.0.1:62605_oc_d%2Fn    ] o.a.s.c.Overseer processMessage: queueSize: 1, message = {
   [junit4]   2>   "core":"collection1",
   [junit4]   2>   "roles":null,
   [junit4]   2>   "base_url":"http://127.0.0.1:62605/oc_d/n",
   [junit4]   2>   "node_name":"127.0.0.1:62605_oc_d%2Fn",
   [junit4]   2>   "numShards":"1",
   [junit4]   2>   "state":"down",
   [junit4]   2>   "shard":null,
   [junit4]   2>   "collection":"control_collection",
   [junit4]   2>   "operation":"state"} current state version: 0
   [junit4]   2> 380358 INFO  (OverseerStateUpdate-95401648072884228-127.0.0.1:62605_oc_d%2Fn-n_0000000000) [n:127.0.0.1:62605_oc_d%2Fn    ] o.a.s.c.o.ReplicaMutator Update state numShards=1 message={
   [junit4]   2>   "core":"collection1",
   [junit4]   2>   "roles":null,
   [junit4]   2>   "base_url":"http://127.0.0.1:62605/oc_d/n",
   [junit4]   2>   "node_name":"127.0.0.1:62605_oc_d%2Fn",
   [junit4]   2>   "numShards":"1",
   [junit4]   2>   "state":"down",
   [junit4]   2>   "shard":null,
   [junit4]   2>   "collection":"control_collection",
   [junit4]   2>   "operation":"state"}
   [junit4]   2> 380358 INFO  (coreLoadExecutor-759-thread-1-processing-n:127.0.0.1:62605_oc_d%2Fn) [n:127.0.0.1:62605_oc_d%2Fn c:control_collection   x:collection1] o.a.s.c.ZkController look for our core node name
   [junit4]   2> 380359 INFO  (OverseerStateUpdate-95401648072884228-127.0.0.1:62605_oc_d%2Fn-n_0000000000) [n:127.0.0.1:62605_oc_d%2Fn    ] o.a.s.c.o.ClusterStateMutator building a new cName: control_collection
   [junit4]   2> 380359 INFO  (OverseerStateUpdate-95401648072884228-127.0.0.1:62605_oc_d%2Fn-n_0000000000) [n:127.0.0.1:62605_oc_d%2Fn    ] o.a.s.c.o.ReplicaMutator Assigning new node to shard shard=shard1
   [junit4]   2> 380361 INFO  (zkCallback-414-thread-1-processing-n:127.0.0.1:62605_oc_d%2Fn) [n:127.0.0.1:62605_oc_d%2Fn    ] o.a.s.c.c.ZkStateReader A cluster state change: [WatchedEvent state:SyncConnected type:NodeDataChanged path:/clusterstate.json], has occurred - updating... (live nodes size: [1])
   [junit4]   2> 381360 INFO  (coreLoadExecutor-759-thread-1-processing-n:127.0.0.1:62605_oc_d%2Fn) [n:127.0.0.1:62605_oc_d%2Fn c:control_collection   x:collection1] o.a.s.c.ZkController waiting to find shard id in clusterstate for collection1
   [junit4]   2> 381360 INFO  (coreLoadExecutor-759-thread-1-processing-n:127.0.0.1:62605_oc_d%2Fn) [n:127.0.0.1:62605_oc_d%2Fn c:control_collection   x:collection1] o.a.s.c.ZkController Check for collection zkNode:control_collection
   [junit4]   2> 381361 INFO  (coreLoadExecutor-759-thread-1-processing-n:127.0.0.1:62605_oc_d%2Fn) [n:127.0.0.1:62605_oc_d%2Fn c:control_collection   x:collection1] o.a.s.c.ZkController Collection zkNode exists
   [junit4]   2> 381361 INFO  (coreLoadExecutor-759-thread-1-processing-n:127.0.0.1:62605_oc_d%2Fn) [n:127.0.0.1:62605_oc_d%2Fn c:control_collection   x:collection1] o.a.s.c.c.ZkStateReader Load collection config from: [/collections/control_collection]
   [junit4]   2> 381363 INFO  (coreLoadExecutor-759-thread-1-processing-n:127.0.0.1:62605_oc_d%2Fn) [n:127.0.0.1:62605_oc_d%2Fn c:control_collection   x:collection1] o.a.s.c.c.ZkStateReader path=[/collections/control_collection] [configName]=[conf1] specified config exists in ZooKeeper
   [junit4]   2> 381363 INFO  (coreLoadExecutor-759-thread-1-processing-n:127.0.0.1:62605_oc_d%2Fn) [n:127.0.0.1:62605_oc_d%2Fn c:control_collection   x:collection1] o.a.s.c.SolrResourceLoader new SolrResourceLoader for directory: '/export/home/jenkins/workspace/Lucene-Solr-trunk-Solaris/solr/build/solr-core/test/J1/temp/solr.cloud.DistribDocExpirationUpdateProcessorTest_43F6DC65C75CC80D-001/control-001/cores/collection1'
   [junit4]   2> 381363 INFO  (coreLoadExecutor-759-thread-1-processing-n:127.0.0.1:62605_oc_d%2Fn) [n:127.0.0.1:62605_oc_d%2Fn c:control_collection   x:collection1] o.a.s.c.SolrResourceLoader JNDI not configured for solr (NoInitialContextEx)
   [junit4]   2> 381363 INFO  (coreLoadExecutor-759-thread-1-processing-n:127.0.0.1:62605_oc_d%2Fn) [n:127.0.0.1:62605_oc_d%2Fn c:control_collection   x:collection1] o.a.s.c.SolrResourceLoader solr home defaulted to 'solr/' (could not find system property or JNDI)
   [junit4]   2> 381367 INFO  (coreLoadExecutor-759-thread-1-processing-n:127.0.0.1:62605_oc_d%2Fn) [n:127.0.0.1:62605_oc_d%2Fn c:control_collection   x:collection1] o.a.s.c.Config loaded config solrconfig.xml with version 0 
   [junit4]   2> 381381 INFO  (coreLoadExecutor-759-thread-1-processing-n:127.0.0.1:62605_oc_d%2Fn) [n:127.0.0.1:62605_oc_d%2Fn c:control_collection   x:collection1] o.a.s.c.SolrConfig current version of requestparams : -1
   [junit4]   2> 381384 INFO  (coreLoadExecutor-759-thread-1-processing-n:127.0.0.1:62605_oc_d%2Fn) [n:127.0.0.1:62605_oc_d%2Fn c:control_collection   x:collection1] o.a.s.c.SolrConfig Using Lucene MatchVersion: 6.0.0
   [junit4]   2> 381389 INFO  (coreLoadExecutor-759-thread-1-processing-n:127.0.0.1:62605_oc_d%2Fn) [n:127.0.0.1:62605_oc_d%2Fn c:control_collection   x:collection1] o.a.s.c.SolrConfig Loaded SolrConfig: solrconfig.xml
   [junit4]   2> 381407 INFO  (coreLoadExecutor-759-thread-1-processing-n:127.0.0.1:62605_oc_d%2Fn) [n:127.0.0.1:62605_oc_d%2Fn c:control_collection   x:collection1] o.a.s.s.IndexSchema [collection1] Schema name=test
   [junit4]   2> 381510 INFO  (coreLoadExecutor-759-thread-1-processing-n:127.0.0.1:62605_oc_d%2Fn) [n:127.0.0.1:62605_oc_d%2Fn c:control_collection   x:collection1] o.a.s.s.IndexSchema default search field in schema is text
   [junit4]   2> 381511 INFO  (coreLoadExecutor-759-thread-1-processing-n:127.0.0.1:62605_oc_d%2Fn) [n:127.0.0.1:62605_oc_d%2Fn c:control_collection   x:collection1] o.a.s.s.IndexSchema unique key field: id
   [junit4]   2> 381512 INFO  (coreLoadExecutor-759-thread-1-processing-n:127.0.0.1:62605_oc_d%2Fn) [n:127.0.0.1:62605_oc_d%2Fn c:control_collection   x:collection1] o.a.s.s.FileExchangeRateProvider Reloading exchange rates from file currency.xml
   [junit4]   2> 381521 INFO  (coreLoadExecutor-759-thread-1-processing-n:127.0.0.1:62605_oc_d%2Fn) [n:127.0.0.1:62605_oc_d%2Fn c:control_collection   x:collection1] o.a.s.s.FileExchangeRateProvider Reloading exchange rates from file currency.xml
   [junit4]   2> 381569 INFO  (coreLoadExecutor-759-thread-1-processing-n:127.0.0.1:62605_oc_d%2Fn) [n:127.0.0.1:62605_oc_d%2Fn c:control_collection   x:collection1] o.a.s.c.ConfigSetProperties Did not find ConfigSet properties, assuming default properties: Can't find resource 'configsetprops.json' in classpath or '/configs/conf1', cwd=/export/home/jenkins/workspace/Lucene-Solr-trunk-Solaris/solr/build/solr-core/test/J1
   [junit4]   2> 381569 INFO  (coreLoadExecutor-759-thread-1-processing-n:127.0.0.1:62605_oc_d%2Fn) [n:127.0.0.1:62605_oc_d%2Fn c:control_collection   x:collection1] o.a.s.c.CoreContainer Creating SolrCore 'collection1' using configuration from collection control_collection
   [junit4]   2> 381569 INFO  (coreLoadExecutor-759-thread-1-processing-n:127.0.0.1:62605_oc_d%2Fn) [n:127.0.0.1:62605_oc_d%2Fn c:control_collection s:shard1 r:core_node1 x:collection1] o.a.s.c.SolrCore org.apache.solr.core.MockDirectoryFactory
   [junit4]   2> 381569 INFO  (coreLoadExecutor-759-thread-1-processing-n:127.0.0.1:62605_oc_d%2Fn) [n:127.0.0.1:62605_oc_d%2Fn c:control_collection s:shard1 r:core_node1 x:collection1] o.a.s.c.SolrCore [[collection1] ] Opening new SolrCore at [/export/home/jenkins/workspace/Lucene-Solr-trunk-Solaris/solr/build/solr-core/test/J1/temp/solr.cloud.DistribDocExpirationUpdateProcessorTest_43F6DC65C75CC80D-001/control-001/cores/collection1], dataDir=[/export/home/jenkins/workspace/Lucene-Solr-trunk-Solaris/solr/build/solr-core/test/J1/temp/solr.cloud.DistribDocExpirationUpdateProcessorTest_43F6DC65C75CC80D-001/control-001/cores/collection1/data/]
   [junit4]   2> 381569 INFO  (coreLoadExecutor-759-thread-1-processing-n:127.0.0.1:62605_oc_d%2Fn) [n:127.0.0.1:62605_oc_d%2Fn c:control_collection s:shard1 r:core_node1 x:collection1] o.a.s.c.SolrCore JMX monitoring not detected for core: collection1
   [junit4]   2> 381570 INFO  (coreLoadExecutor-759-thread-1-processing-n:127.0.0.1:62605_oc_d%2Fn) [n:127.0.0.1:62605_oc_d%2Fn c:control_collection s:shard1 r:core_node1 x:collection1] o.a.s.c.CachingDirectoryFactory return new directory for /export/home/jenkins/workspace/Lucene-Solr-trunk-Solaris/solr/build/solr-core/test/J1/temp/solr.cloud.DistribDocExpirationUpdateProcessorTest_43F6DC65C75CC80D-001/control-001/cores/collection1/data
   [junit4]   2> 381570 INFO  (coreLoadExecutor-759-thread-1-processing-n:127.0.0.1:62605_oc_d%2Fn) [n:127.0.0.1:62605_oc_d%2Fn c:control_collection s:shard1 r:core_node1 x:collection1] o.a.s.c.SolrCore New index directory detected: old=null new=/export/home/jenkins/workspace/Lucene-Solr-trunk-Solaris/solr/build/solr-core/test/J1/temp/solr.cloud.DistribDocExpirationUpdateProcessorTest_43F6DC65C75CC80D-001/control-001/cores/collection1/data/index/
   [junit4]   2> 381570 WARN  (coreLoadExecutor-759-thread-1-processing-n:127.0.0.1:62605_oc_d%2Fn) [n:127.0.0.1:62605_oc_d%2Fn c:control_collection s:shard1 r:core_node1 x:collection1] o.a.s.c.SolrCore [collection1] Solr index directory '/export/home/jenkins/workspace/Lucene-Solr-trunk-Solaris/solr/build/solr-core/test/J1/temp/solr.cloud.DistribDocExpirationUpdateProcessorTest_43F6DC65C75CC80D-001/control-001/cores/collection1/data/index' doesn't exist. Creating new index...
   [junit4]   2> 381574 INFO  (coreLoadExecutor-759-thread-1-processing-n:127.0.0.1:62605_oc_d%2Fn) [n:127.0.0.1:62605_oc_d%2Fn c:control_collection s:shard1 r:core_node1 x:collection1] o.a.s.c.CachingDirectoryFactory return new directory for /export/home/jenkins/workspace/Lucene-Solr-trunk-Solaris/solr/build/solr-core/test/J1/temp/solr.cloud.DistribDocExpirationUpdateProcessorTest_43F6DC65C75CC80D-001/control-001/cores/collection1/data/index
   [junit4]   2> 381575 INFO  (coreLoadExecutor-759-thread-1-processing-n:127.0.0.1:62605_oc_d%2Fn) [n:127.0.0.1:62605_oc_d%2Fn c:control_collection s:shard1 r:core_node1 x:collection1] o.a.s.u.RandomMergePolicy RandomMergePolicy wrapping class org.apache.lucene.index.LogDocMergePolicy: [LogDocMergePolicy: minMergeSize=1000, mergeFactor=18, maxMergeSize=9223372036854775807, maxMergeSizeForForcedMerge=9223372036854775807, calibrateSizeByDeletes=false, maxMergeDocs=2147483647, maxCFSSegmentSizeMB=8.796093022207999E12, noCFSRatio=1.0]
   [junit4]   2> 381578 INFO  (coreLoadExecutor-759-thread-1-processing-n:127.0.0.1:62605_oc_d%2Fn) [n:127.0.0.1:62605_oc_d%2Fn c:control_collection s:shard1 r:core_node1 x:collection1] o.a.s.c.SolrDeletionPolicy SolrDeletionPolicy.onCommit: commits: num=1
   [junit4]   2> 	commit{dir=MockDirectoryWrapper(RAMDirectory@284c91db lockFactory=org.apache.lucene.store.SingleInstanceLockFactory@2169073b),segFN=segments_1,generation=1}
   [junit4]   2> 381578 INFO  (coreLoadExecutor-759-thread-1-processing-n:127.0.0.1:62605_oc_d%2Fn) [n:127.0.0.1:62605_oc_d%2Fn c:control_collection s:shard1 r:core_node1 x:collection1] o.a.s.c.SolrDeletionPolicy newest commit generation = 1
   [junit4]   2> 381580 INFO  (OldIndexDirectoryCleanupThreadForCore-collection1) [n:127.0.0.1:62605_oc_d%2Fn c:control_collection s:shard1 r:core_node1 x:collection1] o.a.s.c.SolrCore Looking for old index directories to cleanup for core collection1 in /export/home/jenkins/workspace/Lucene-Solr-trunk-Solaris/solr/build/solr-core/test/J1/temp/solr.cloud.DistribDocExpirationUpdateProcessorTest_43F6DC65C75CC80D-001/control-001/cores/collection1/data/
   [junit4]   2> 381580 WARN  (OldIndexDirectoryCleanupThreadForCore-collection1) [n:127.0.0.1:62605_oc_d%2Fn c:control_collection s:shard1 r:core_node1 x:collection1] o.a.s.c.DirectoryFactory /export/home/jenkins/workspace/Lucene-Solr-trunk-Solaris/solr/build/solr-core/test/J1/temp/solr.cloud.DistribDocExpirationUpdateProcessorTest_43F6DC65C75CC80D-001/control-001/cores/collection1/data/ does not point to a valid data directory; skipping clean-up of old index directories.
   [junit4]   2> 381581 INFO  (coreLoadExecutor-759-thread-1-processing-n:127.0.0.1:62605_oc_d%2Fn) [n:127.0.0.1:62605_oc_d%2Fn c:control_collection s:shard1 r:core_node1 x:collection1] o.a.s.u.p.UpdateRequestProcessorChain creating updateRequestProcessorChain "convert-ttl-defaults"
   [junit4]   2> 382021 INFO  (coreLoadExecutor-759-thread-1-processing-n:127.0.0.1:62605_oc_d%2Fn) [n:127.0.0.1:62605_oc_d%2Fn c:control_collection s:shard1 r:core_node1 x:collection1] o.a.s.u.p.UpdateRequestProcessorChain creating updateRequestProcessorChain "convert-ttl-field"
   [junit4]   2> 382022 INFO  (coreLoadExecutor-759-thread-1-processing-n:127.0.0.1:62605_oc_d%2Fn) [n:127.0.0.1:62605_oc_d%2Fn c:control_collection s:shard1 r:core_node1 x:collection1] o.a.s.u.p.UpdateRequestProcessorChain creating updateRequestProcessorChain "convert-ttl-param"
   [junit4]   2> 382022 INFO  (coreLoadExecutor-759-thread-1-processing-n:127.0.0.1:62605_oc_d%2Fn) [n:127.0.0.1:62605_oc_d%2Fn c:control_collection s:shard1 r:core_node1 x:collection1] o.a.s.u.p.UpdateRequestProcessorChain creating updateRequestProcessorChain "convert-ttl-field-with-param-default"
   [junit4]   2> 382022 INFO  (coreLoadExecutor-759-thread-1-processing-n:127.0.0.1:62605_oc_d%2Fn) [n:127.0.0.1:62605_oc_d%2Fn c:control_collection s:shard1 r:core_node1 x:collection1] o.a.s.u.p.UpdateRequestProcessorChain creating updateRequestProcessorChain "scheduled-delete" (default)
   [junit4]   2> 383255 INFO  (coreLoadExecutor-759-thread-1-processing-n:127.0.0.1:62605_oc_d%2Fn) [n:127.0.0.1:62605_oc_d%2Fn c:control_collection s:shard1 r:core_node1 x:collection1] o.a.s.u.p.UpdateRequestProcessorChain inserting DistributedUpdateProcessorFactory into updateRequestProcessorChain "scheduled-delete" (default)
   [junit4]   2> 383294 INFO  (coreLoadExecutor-759-thread-1-processing-n:127.0.0.1:62605_oc_d%2Fn) [n:127.0.0.1:62605_oc_d%2Fn c:control_collection s:shard1 r:core_node1 x:collection1] o.a.s.h.l.XMLLoader xsltCacheLifetimeSeconds=60
   [junit4]   2> 383297 INFO  (coreLoadExecutor-759-thread-1-processing-n:127.0.0.1:62605_oc_d%2Fn) [n:127.0.0.1:62605_oc_d%2Fn c:control_collection s:shard1 r:core_node1 x:collection1] o.a.s.h.l.XMLLoader xsltCacheLifetimeSeconds=60
   [junit4]   2> 383298 INFO  (coreLoadExecutor-759-thread-1-processing-n:127.0.0.1:62605_oc_d%2Fn) [n:127.0.0.1:62605_oc_d%2Fn c:control_collection s:shard1 r:core_node1 x:collection1] o.a.s.h.l.XMLLoader xsltCacheLifetimeSeconds=60
   [junit4]   2> 383300 INFO  (coreLoadExecutor-759-thread-1-processing-n:127.0.0.1:62605_oc_d%2Fn) [n:127.0.0.1:62605_oc_d%2Fn c:control_collection s:shard1 r:core_node1 x:collection1] o.a.s.h.l.XMLLoader xsltCacheLifetimeSeconds=60
   [junit4]   2> 383304 INFO  (coreLoadExecutor-759-thread-1-processing-n:127.0.0.1:62605_oc_d%2Fn) [n:127.0.0.1:62605_oc_d%2Fn c:control_collection s:shard1 r:core_node1 x:collection1] o.a.s.c.RequestHandlers Registered paths: /admin/mbeans,,/update/csv,/sql,/update/json/docs,/admin/luke,/export,/select,/admin/segments,/get,/admin/system,/replication,/admin/properties,/config,/stream,/schema,/admin/plugins,/admin/logging,/update/json,/admin/threads,/admin/ping,/update,/admin/file
   [junit4]   2> 383305 INFO  (coreLoadExecutor-759-thread-1-processing-n:127.0.0.1:62605_oc_d%2Fn) [n:127.0.0.1:62605_oc_d%2Fn c:control_collection s:shard1 r:core_node1 x:collection1] o.a.s.c.SolrCore Using default statsCache cache: org.apache.solr.search.stats.LocalStatsCache
   [junit4]   2> 383318 INFO  (coreLoadExecutor-759-thread-1-processing-n:127.0.0.1:62605_oc_d%2Fn) [n:127.0.0.1:62605_oc_d%2Fn c:control_collection s:shard1 r:core_node1 x:collection1] o.a.s.u.UpdateHandler Using UpdateLog implementation: org.apache.solr.update.UpdateLog
   [junit4]   2> 383318 INFO  (coreLoadExecutor-759-thread-1-processing-n:127.0.0.1:62605_oc_d%2Fn) [n:127.0.0.1:62605_oc_d%2Fn c:control_collection s:shard1 r:core_node1 x:collection1] o.a.s.u.UpdateLog Initializing UpdateLog: dataDir= defaultSyncLevel=FLUSH numRecordsToKeep=100 maxNumLogsToKeep=10 numVersionBuckets=65536
   [junit4]   2> 383355 INFO  (coreLoadExecutor-759-thread-1-processing-n:127.0.0.1:62605_oc_d%2Fn) [n:127.0.0.1:62605_oc_d%2Fn c:control_collection s:shard1 r:core_node1 x:collection1] o.a.s.u.CommitTracker Hard AutoCommit: disabled
   [junit4]   2> 383355 INFO  (coreLoadExecutor-759-thread-1-processing-n:127.0.0.1:62605_oc_d%2Fn) [n:127.0.0.1:62605_oc_d%2Fn c:control_collection s:shard1 r:core_node1 x:collection1] o.a.s.u.CommitTracker Soft AutoCommit: disabled
   [junit4]   2> 383356 INFO  (coreLoadExecutor-759-thread-1-processing-n:127.0.0.1:62605_oc_d%2Fn) [n:127.0.0.1:62605_oc_d%2Fn c:control_collection s:shard1 r:core_node1 x:collection1] o.a.s.u.RandomMergePolicy RandomMergePolicy wrapping class org.apache.lucene.index.TieredMergePolicy: [TieredMergePolicy: maxMergeAtOnce=28, maxMergeAtOnceExplicit=35, maxMergedSegmentMB=60.6689453125, floorSegmentMB=0.7060546875, forceMergeDeletesPctAllowed=28.69703485097408, segmentsPerTier=22.0, maxCFSSegmentSizeMB=1.779296875, noCFSRatio=0.16529553739438496
   [junit4]   2> 383356 INFO  (coreLoadExecutor-759-thread-1-processing-n:127.0.0.1:62605_oc_d%2Fn) [n:127.0.0.1:62605_oc_d%2Fn c:control_collection s:shard1 r:core_node1 x:collection1] o.a.s.c.SolrDeletionPolicy SolrDeletionPolicy.onInit: commits: num=1
   [junit4]   2> 	commit{dir=MockDirectoryWrapper(RAMDirectory@284c91db lockFactory=org.apache.lucene.store.SingleInstanceLockFactory@2169073b),segFN=segments_1,generation=1}
   [junit4]   2> 383356 INFO  (coreLoadExecutor-759-thread-1-processing-n:127.0.0.1:62605_oc_d%2Fn) [n:127.0.0.1:62605_oc_d%2Fn c:control_collection s:shard1 r:core_node1 x:collection1] o.a.s.c.SolrDeletionPolicy newest commit generation = 1
   [junit4]   2> 383356 INFO  (coreLoadExecutor-759-thread-1-processing-n:127.0.0.1:62605_oc_d%2Fn) [n:127.0.0.1:62605_oc_d%2Fn c:control_collection s:shard1 r:core_node1 x:collection1] o.a.s.s.SolrIndexSearcher Opening [Searcher@4d2976ba[collection1] main]
   [junit4]   2> 383357 INFO  (coreLoadExecutor-759-thread-1-processing-n:127.0.0.1:62605_oc_d%2Fn) [n:127.0.0.1:62605_oc_d%2Fn c:control_collection s:shard1 r:core_node1 x:collection1] o.a.s.c.c.ZkStateReader Load collection config from: [/collections/control_collection]
   [junit4]   2> 383368 INFO  (coreLoadExecutor-759-thread-1-processing-n:127.0.0.1:62605_oc_d%2Fn) [n:127.0.0.1:62605_oc_d%2Fn c:control_collection s:shard1 r:core_node1 x:collection1] o.a.s.c.c.ZkStateReader path=[/collections/control_collection] [configName]=[conf1] specified config exists in ZooKeeper
   [junit4]   2> 383368 INFO  (coreLoadExecutor-759-thread-1-processing-n:127.0.0.1:62605_oc_d%2Fn) [n:127.0.0.1:62605_oc_d%2Fn c:control_collection s:shard1 r:core_node1 x:collection1] o.a.s.r.ManagedResourceStorage Setting up ZooKeeper-based storage for the RestManager with znodeBase: /configs/conf1
   [junit4]   2> 383375 INFO  (coreLoadExecutor-759-thread-1-processing-n:127.0.0.1:62605_oc_d%2Fn) [n:127.0.0.1:62605_oc_d%2Fn c:control_collection s:shard1 r:core_node1 x:collection1] o.a.s.r.ManagedResourceStorage Configured ZooKeeperStorageIO with znodeBase: /configs/conf1
   [junit4]   2> 383375 INFO  (coreLoadExecutor-759-thread-1-processing-n:127.0.0.1:62605_oc_d%2Fn) [n:127.0.0.1:62605_oc_d%2Fn c:control_collection s:shard1 r:core_node1 x:collection1] o.a.s.r.RestManager Initializing RestManager with initArgs: {}
   [junit4]   2> 383375 INFO  (coreLoadExecutor-759-thread-1-processing-n:127.0.0.1:62605_oc_d%2Fn) [n:127.0.0.1:62605_oc_d%2Fn c:control_collection s:shard1 r:core_node1 x:collection1] o.a.s.r.ManagedResourceStorage Reading _rest_managed.json using ZooKeeperStorageIO:path=/configs/conf1
   [junit4]   2> 383377 INFO  (coreLoadExecutor-759-thread-1-processing-n:127.0.0.1:62605_oc_d%2Fn) [n:127.0.0.1:62605_oc_d%2Fn c:control_collection s:shard1 r:core_node1 x:collection1] o.a.s.r.ManagedResourceStorage No data found for znode /configs/conf1/_rest_managed.json
   [junit4]   2> 383378 INFO  (coreLoadExecutor-759-thread-1-processing-n:127.0.0.1:62605_oc_d%2Fn) [n:127.0.0.1:62605_oc_d%2Fn c:control_collection s:shard1 r:core_node1 x:collection1] o.a.s.r.ManagedResourceStorage Loaded null at path _rest_managed.json using ZooKeeperStorageIO:path=/configs/conf1
   [junit4]   2> 383378 INFO  (coreLoadExecutor-759-thread-1-processing-n:127.0.0.1:62605_oc_d%2Fn) [n:127.0.0.1:62605_oc_d%2Fn c:control_collection s:shard1 r:core_node1 x:collection1] o.a.s.r.RestManager Initializing 0 registered ManagedResources
   [junit4]   2> 383668 INFO  (coreLoadExecutor-759-thread-1-processing-n:127.0.0.1:62605_oc_d%2Fn) [n:127.0.0.1:62605_oc_d%2Fn c:control_collection s:shard1 r:core_node1 x:collection1] o.a.s.h.ReplicationHandler Commits will be reserved for  10000
   [junit4]   2> 383668 INFO  (searcherExecutor-760-thread-1-processing-n:127.0.0.1:62605_oc_d%2Fn x:collection1 s:shard1 c:control_collection r:core_node1) [n:127.0.0.1:62605_oc_d%2Fn c:control_collection s:shard1 r:core_node1 x:collection1] o.a.s.c.SolrCore [collection1] Registered new searcher Searcher@4d2976ba[collection1] main{ExitableDirectoryReader(UninvertingDirectoryReader())}
   [junit4]   2> 383668 INFO  (coreLoadExecutor-759-thread-1-processing-n:127.0.0.1:62605_oc_d%2Fn) [n:127.0.0.1:62605_oc_d%2Fn c:control_collection s:shard1 r:core_node1 x:collection1] o.a.s.u.UpdateLog Looking up max value of version field to seed version buckets
   [junit4]   2> 383668 INFO  (coreLoadExecutor-759-thread-1-processing-n:127.0.0.1:62605_oc_d%2Fn) [n:127.0.0.1:62605_oc_d%2Fn c:control_collection s:shard1 r:core_node1 x:collection1] o.a.s.u.VersionInfo Refreshing highest value of _version_ for 65536 version buckets from index
   [junit4]   2> 383668 INFO  (coreLoadExecutor-759-thread-1-processing-n:127.0.0.1:62605_oc_d%2Fn) [n:127.0.0.1:62605_oc_d%2Fn c:control_collection s:shard1 r:core_node1 x:collection1] o.a.s.u.VersionInfo No terms found for _version_, cannot seed version bucket highest value from index
   [junit4]   2> 383668 INFO  (coreLoadExecutor-759-thread-1-processing-n:127.0.0.1:62605_oc_d%2Fn) [n:127.0.0.1:62605_oc_d%2Fn c:control_collection s:shard1 r:core_node1 x:collection1] o.a.s.u.UpdateLog Could not find max version in index or recent updates, using new clock 1526426374242304000
   [junit4]   2> 383670 INFO  (coreLoadExecutor-759-thread-1-processing-n:127.0.0.1:62605_oc_d%2Fn) [n:127.0.0.1:62605_oc_d%2Fn c:control_collection s:shard1 r:core_node1 x:collection1] o.a.s.u.UpdateLog Took 1.0ms to seed version buckets with highest version 1526426374242304000
   [junit4]   2> 383670 INFO  (coreLoadExecutor-759-thread-1-processing-n:127.0.0.1:62605_oc_d%2Fn) [n:127.0.0.1:62605_oc_d%2Fn c:control_collection s:shard1 r:core_node1 x:collection1] o.a.s.c.ZkController watch zkdir /configs/conf1
   [junit4]   2> 383671 INFO  (coreLoadExecutor-759-thread-1-processing-n:127.0.0.1:62605_oc_d%2Fn) [n:127.0.0.1:62605_oc_d%2Fn c:control_collection s:shard1 r:core_node1 x:collection1] o.a.s.c.CoreContainer registering core: collection1
   [junit4]   2> 383672 INFO  (coreZkRegister-753-thread-1-processing-n:127.0.0.1:62605_oc_d%2Fn x:collection1 s:shard1 c:control_collection r:core_node1) [n:127.0.0.1:62605_oc_d%2Fn c:control_collection s:shard1 r:core_node1 x:collection1] o.a.s.c.ZkController Register replica - core:collection1 address:http://127.0.0.1:62605/oc_d/n collection:control_collection shard:shard1
   [junit4]   2> 383674 INFO  (coreZkRegister-753-thread-1-processing-n:127.0.0.1:62605_oc_d%2Fn x:collection1 s:shard1 c:control_collection r:core_node1) [n:127.0.0.1:62605_oc_d%2Fn c:control_collection s:shard1 r:core_node1 x:collection1] o.a.s.c.c.SolrZkClient makePath: /collections/control_collection/leader_elect/shard1/election
   [junit4]   2> 383704 INFO  (coreZkRegister-753-thread-1-processing-n:127.0.0.1:62605_oc_d%2Fn x:collection1 s:shard1 c:control_collection r:core_node1) [n:127.0.0.1:62605_oc_d%2Fn c:control_collection s:shard1 r:core_node1 x:collection1] o.a.s.c.LeaderElector Joined leadership election with path: /collections/control_collection/leader_elect/shard1/election/95401648072884228-core_node1-n_0000000000
   [junit4]   2> 383705 INFO  (coreZkRegister-753-thread-1-processing-n:127.0.0.1:62605_oc_d%2Fn x:collection1 s:shard1 c:control_collection r:core_node1) [n:127.0.0.1:62605_oc_d%2Fn c:control_collection s:shard1 r:core_node1 x:collection1] o.a.s.c.ShardLeaderElectionContext Running the leader process for shard=shard1 and weAreReplacement=false and leaderVoteWait=10000
   [junit4]   2> 383722 INFO  (OverseerStateUpdate-95401648072884228-127.0.0.1:62605_oc_d%2Fn-n_0000000000) [n:127.0.0.1:62605_oc_d%2Fn    ] o.a.s.c.Overseer processMessage: queueSize: 1, message = {
   [junit4]   2>   "operation":"leader",
   [junit4]   2>   "shard":"shard1",
   [junit4]   2>   "collection":"control_collection"} current state version: 1
   [junit4]   2> 383726 INFO  (coreZkRegister-753-thread-1-processing-n:127.0.0.1:62605_oc_d%2Fn x:collection1 s:shard1 c:control_collection r:core_node1) [n:127.0.0.1:62605_oc_d%2Fn c:control_collection s:shard1 r:core_node1 x:collection1] o.a.s.c.ShardLeaderElectionContext Enough replicas found to continue.
   [junit4]   2> 383726 INFO  (coreZkRegister-753-thread-1-processing-n:127.0.0.1:62605_oc_d%2Fn x:collection1 s:shard1 c:control_collection r:core_node1) [n:127.0.0.1:62605_oc_d%2Fn c:control_collection s:shard1 r:core_node1 x:collection1] o.a.s.c.ShardLeaderElectionContext I may be the new leader - try and sync
   [junit4]   2> 383726 INFO  (coreZkRegister-753-thread-1-processing-n:127.0.0.1:62605_oc_d%2Fn x:collection1 s:shard1 c:control_collection r:core_node1) [n:127.0.0.1:62605_oc_d%2Fn c:control_collection s:shard1 r:core_node1 x:collection1] o.a.s.c.SyncStrategy Sync replicas to http://127.0.0.1:62605/oc_d/n/collection1/
   [junit4]   2> 383726 INFO  (coreZkRegister-753-thread-1-processing-n:127.0.0.1:62605_oc_d%2Fn x:collection1 s:shard1 c:control_collection r:core_node1) [n:127.0.0.1:62605_oc_d%2Fn c:control_collection s:shard1 r:core_node1 x:collection1] o.a.s.c.SyncStrategy Sync Success - now sync replicas to me
   [junit4]   2> 383726 INFO  (coreZkRegister-753-thread-1-processing-n:127.0.0.1:62605_oc_d%2Fn x:collection1 s:shard1 c:control_collection r:core_node1) [n:127.0.0.1:62605_oc_d%2Fn c:control_collection s:shard1 r:core_node1 x:collection1] o.a.s.c.SyncStrategy http://127.0.0.1:62605/oc_d/n/collection1/ has no replicas
   [junit4]   2> 383727 INFO  (zkCallback-414-thread-1-processing-n:127.0.0.1:62605_oc_d%2Fn) [n:127.0.0.1:62605_oc_d%2Fn    ] o.a.s.c.c.ZkStateReader A cluster state change: [WatchedEvent state:SyncConnected type:NodeDataChanged path:/clusterstate.json], has occurred - updating... (live nodes size: [1])
   [junit4]   2> 383734 INFO  (coreZkRegister-753-thread-1-processing-n:127.0.0.1:62605_oc_d%2Fn x:collection1 s:shard1 c:control_collection r:core_node1) [n:127.0.0.1:62605_oc_d%2Fn c:control_collection s:shard1 r:core_node1 x:collection1] o.a.s.c.c.SolrZkClient makePath: /collections/control_collection/leaders/shard1
   [junit4]   2> 383744 INFO  (coreZkRegister-753-thread-1-processing-n:127.0.0.1:62605_oc_d%2Fn x:collection1 s:shard1 c:control_collection r:core_node1) [n:127.0.0.1:62605_oc_d%2Fn c:control_collection s:shard1 r:core_node1 x:collection1] o.a.s.c.ShardLeaderElectionContextBase Creating leader registration node
   [junit4]   2> 383749 INFO  (coreZkRegister-753-thread-1-processing-n:127.0.0.1:62605_oc_d%2Fn x:collection1 s:shard1 c:control_collection r:core_node1) [n:127.0.0.1:62605_oc_d%2Fn c:control_collection s:shard1 r:core_node1 x:collection1] o.a.s.c.ShardLeaderElectionContext I am the new leader: http://127.0.0.1:62605/oc_d/n/collection1/ shard1
   [junit4]   2> 383751 INFO  (OverseerStateUpdate-95401648072884228-127.0.0.1:62605_oc_d%2Fn-n_0000000000) [n:127.0.0.1:62605_oc_d%2Fn    ] o.a.s.c.Overseer processMessage: queueSize: 1, message = {
   [junit4]   2>   "operation":"leader",
   [junit4]   2>   "shard":"shard1",
   [junit4]   2>   "collection":"control_collection",
   [junit4]   2>   "base_url":"http://127.0.0.1:62605/oc_d/n",
   [junit4]   2>   "core":"collection1",
   [junit4]   2>   "state":"active"} current state version: 2
   [junit4]   2> 383874 INFO  (zkCallback-414-thread-1-processing-n:127.0.0.1:62605_oc_d%2Fn) [n:127.0.0.1:62605_oc_d%2Fn    ] o.a.s.c.c.ZkStateReader A cluster state change: [WatchedEvent state:SyncConnected type:NodeDataChanged path:/clusterstate.json], has occurred - updating... (live nodes size: [1])
   [junit4]   2> 383889 INFO  (TEST-DistribDocExpirationUpdateProcessorTest.test-seed#[43F6DC65C75CC80D]) [    ] o.a.s.c.c.SolrZkClient Using default ZkCredentialsProvider
   [junit4]   2> 383890 INFO  (TEST-DistribDocExpirationUpdateProcessorTest.test-seed#[43F6DC65C75CC80D]) [    ] o.a.s.c.c.ConnectionManager Waiting for client to connect to ZooKeeper
   [junit4]   2> 383898 INFO  (zkCallback-416-thread-1) [    ] o.a.s.c.c.ConnectionManager Watcher org.apache.solr.common.cloud.ConnectionManager@1e367a6a name:ZooKeeperConnection Watcher:127.0.0.1:63019/solr got event WatchedEvent state:SyncConnected type:None path:null path:null type:None
   [junit4]   2> 383899 INFO  (TEST-DistribDocExpirationUpdateProcessorTest.test-seed#[43F6DC65C75CC80D]) [    ] o.a.s.c.c.ConnectionManager Client is connected to ZooKeeper
   [junit4]   2> 383899 INFO  (TEST-DistribDocExpirationUpdateProcessorTest.test-seed#[43F6DC65C75CC80D]) [    ] o.a.s.c.c.SolrZkClient Using default ZkACLProvider
   [junit4]   2> 383899 INFO  (TEST-DistribDocExpirationUpdateProcessorTest.test-seed#[43F6DC65C75CC80D]) [    ] o.a.s.c.c.ZkStateReader Updating cluster state from ZooKeeper... 
   [junit4]   2> 383904 INFO  (coreZkRegister-753-thread-1-processing-n:127.0.0.1:62605_oc_d%2Fn x:collection1 s:shard1 c:control_collection r:core_node1) [n:127.0.0.1:62605_oc_d%2Fn c:control_collection s:shard1 r:core_node1 x:collection1] o.a.s.c.ZkController We are http://127.0.0.1:62605/oc_d/n/collection1/ and leader is http://127.0.0.1:62605/oc_d/n/collection1/
   [junit4]   2> 383904 INFO  (coreZkRegister-753-thread-1-processing-n:127.0.0.1:62605_oc_d%2Fn x:collection1 s:shard1 c:control_collection r:core_node1) [n:127.0.0.1:62605_oc_d%2Fn c:control_collection s:shard1 r:core_node1 x:collection1] o.a.s.c.ZkController No LogReplay needed for core=collection1 baseURL=http://127.0.0.1:62605/oc_d/n
   [junit4]   2> 383904 INFO  (coreZkRegister-753-thread-1-processing-n:127.0.0.1:62605_oc_d%2Fn x:collection1 s:shard1 c:control_collection r:core_node1) [n:127.0.0.1:62605_oc_d%2Fn c:control_collection s:shard1 r:core_node1 x:collection1] o.a.s.c.ZkController I am the leader, no recovery necessary
   [junit4]   2> 383904 INFO  (coreZkRegister-753-thread-1-processing-n:127.0.0.1:62605_oc_d%2Fn x:collection1 s:shard1 c:control_collection r:core_node1) [n:127.0.0.1:62605_oc_d%2Fn c:control_collection s:shard1 r:core_node1 x:collection1] o.a.s.c.ZkController publishing state=active
   [junit4]   2> 383904 INFO  (coreZkRegister-753-thread-1-processing-n:127.0.0.1:62605_oc_d%2Fn x:collection1 s:shard1 c:control_collection r:core_node1) [n:127.0.0.1:62605_oc_d%2Fn c:control_collection s:shard1 r:core_node1 x:collection1] o.a.s.c.ZkController numShards not found on descriptor - reading it from system property
   [junit4]   2> 383924 INFO  (OverseerStateUpdate-95401648072884228-127.0.0.1:62605_oc_d%2Fn-n_0000000000) [n:127.0.0.1:62605_oc_d%2Fn    ] o.a.s.c.Overseer processMessage: queueSize: 1, message = {
   [junit4]   2>   "core":"collection1",
   [junit4]   2>   "core_node_name":"core_node1",
   [junit4]   2>   "roles":null,
   [junit4]   2>   "base_url":"http://127.0.0.1:62605/oc_d/n",
   [junit4]   2>   "node_name":"127.0.0.1:62605_oc_d%2Fn",
   [junit4]   2>   "numShards":"2",
   [junit4]   2>   "state":"active",
   [junit4]   2>   "shard":"shard1",
   [junit4]   2>   "collection":"control_collection",
   [junit4]   2>   "operation":"state"} current state version: 3
   [junit4]   2> 383925 INFO  (OverseerStateUpdate-95401648072884228-127.0.0.1:62605_oc_d%2Fn-n_0000000000) [n:127.0.0.1:62605_oc_d%2Fn    ] o.a.s.c.o.ReplicaMutator Update state numShards=2 message={
   [junit4]   2>   "core":"collection1",
   [junit4]   2>   "core_node_name":"core_node1",
   [junit4]   2>   "roles":null,
   [junit4]   2>   "base_url":"http://127.0.0.1:62605/oc_d/n",
   [junit4]   2>   "node_name":"127.0.0.1:62605_oc_d%2Fn",
   [junit4]   2>   "numShards":"2",
   [junit4]   2>   "state":"active",
   [junit4]   2>   "shard":"shard1",
   [junit4]   2>   "collection":"control_collection",
   [junit4]   2>   "operation":"state"}
   [junit4]   2> 383954 INFO  (TEST-DistribDocExpirationUpdateProcessorTest.test-seed#[43F6DC65C75CC80D]) [    ] o.a.s.c.ChaosMonkey monkey: init - expire sessions:false cause connection loss:false
   [junit4]   2> 384037 INFO  (zkCallback-416-thread-1) [    ] o.a.s.c.c.ZkStateReader A cluster state change: [WatchedEvent state:SyncConnected type:NodeDataChanged path:/clusterstate.json], has occurred - updating... (live nodes size: [1])
   [junit4]   2> 384041 INFO  (zkCallback-414-thread-1-processing-n:127.0.0.1:62605_oc_d%2Fn) [n:127.0.0.1:62605_oc_d%2Fn    ] o.a.s.c.c.ZkStateReader A cluster state change: [WatchedEvent state:SyncConnected type:NodeDataChanged path:/clusterstate.json], has occurred - updating... (live nodes size: [1])
   [junit4]   2> 386668 INFO  (autoExpireDocs-765-thread-1) [n:127.0.0.1:62605_oc_d%2Fn c:control_collection s:shard1 r:core_node1 x:collection1] o.a.s.u.p.DocExpirationUpdateProcessorFactory Begining periodic deletion of expired docs
   [junit4]   2> 386723 INFO  (autoExpireDocs-765-thread-1) [n:127.0.0.1:62605_oc_d%2Fn c:control_collection s:shard1 r:core_node1 x:collection1] o.a.s.u.DirectUpdateHandler2 start commit{,optimize=false,openSearcher=true,waitSearcher=true,expungeDeletes=false,softCommit=true,prepareCommit=false}
   [junit4]   2> 386723 INFO  (autoExpireDocs-765-thread-1) [n:127.0.0.1:62605_oc_d%2Fn c:control_collection s:shard1 r:core_node1 x:collection1] o.a.s.c.SolrCore SolrIndexSearcher has not changed - not re-opening: org.apache.solr.search.SolrIndexSearcher
   [junit4]   2> 386724 INFO  (autoExpireDocs-765-thread-1) [n:127.0.0.1:62605_oc_d%2Fn c:control_collection s:shard1 r:core_node1 x:collection1] o.a.s.u.DirectUpdateHandler2 end_commit_flush
   [junit4]   2> 386724 INFO  (autoExpireDocs-765-thread-1) [n:127.0.0.1:62605_oc_d%2Fn c:control_collection s:shard1 r:core_node1 x:collection1] o.a.s.u.p.LogUpdateProcessorFactory [collection1] {deleteByQuery={!cache=false}eXpField_tdt:[* TO 2016-02-17T12:53:52Z] (-1526426377390129152),commit=} 0 55
   [junit4]   2> 386724 INFO  (autoExpireDocs-765-thread-1) [n:127.0.0.1:62605_oc_d%2Fn c:control_collection s:shard1 r:core_node1 x:collection1] o.a.s.u.p.DocExpirationUpdateProcessorFactory Finished periodic deletion of expired docs
   [junit4]   2> 387154 INFO  (TEST-DistribDocExpirationUpdateProcessorTest.test-seed#[43F6DC65C75CC80D]) [    ] o.a.s.SolrTestCaseJ4 Writing core.properties file to /export/home/jenkins/workspace/Lucene-Solr-trunk-Solaris/solr/build/solr-core/test/J1/temp/solr.cloud.DistribDocExpirationUpdateProcessorTest_43F6DC65C75CC80D-001/shard-1-001/cores/collection1
   [junit4]   2> 387159 INFO  (TEST-DistribDocExpirationUpdateProcessorTest.test-seed#[43F6DC65C75CC80D]) [    ] o.a.s.c.AbstractFullDistribZkTestBase create jetty 1 in directory /export/home/jenkins/workspace/Lucene-Solr-trunk-Solaris/solr/build/solr-core/test/J1/temp/solr.cloud.DistribDocExpirationUpdateProcessorTest_43F6DC65C75CC80D-001/shard-1-001
   [junit4]   2> 387160 INFO  (TEST-DistribDocExpirationUpdateProcessorTest.test-seed#[43F6DC65C75CC80D]) [    ] o.e.j.s.Server jetty-9.3.6.v20151106
   [junit4]   2> 387164 INFO  (TEST-DistribDocExpirationUpdateProcessorTest.test-seed#[43F6DC65C75CC80D]) [    ] o.e.j.s.h.ContextHandler Started o.e.j.s.ServletContextHandler@476617f6{/oc_d/n,null,AVAILABLE}
   [junit4]   2> 387166 INFO  (TEST-DistribDocExpirationUpdateProcessorTest.test-seed#[43F6DC65C75CC80D]) [    ] o.e.j.s.ServerConnector Started ServerConnector@1b6ec9e{HTTP/1.1,[http/1.1]}{127.0.0.1:52951}
   [junit4]   2> 387166 INFO  (TEST-DistribDocExpirationUpdateProcessorTest.test-seed#[43F6DC65C75CC80D]) [    ] o.e.j.s.Server Started @392911ms
   [junit4]   2> 387166 INFO  (TEST-DistribDocExpirationUpdateProcessorTest.test-seed#[43F6DC65C75CC80D]) [    ] o.a.s.c.s.e.JettySolrRunner Jetty properties: {solr.data.dir=/export/home/jenkins/workspace/Lucene-Solr-trunk-Solaris/solr/build/solr-core/test/J1/temp/solr.cloud.DistribDocExpirationUpdateProcessorTest_43F6DC65C75CC80D-001/tempDir-001/jetty1, solrconfig=solrconfig.xml, hostContext=/oc_d/n, hostPort=52951, coreRootDirectory=/export/home/jenkins/workspace/Lucene-Solr-trunk-Solaris/solr/build/solr-core/test/J1/../../../../../../../../../../export/home/jenkins/workspace/Lucene-Solr-trunk-Solaris/solr/build/solr-core/test/J1/temp/solr.cloud.DistribDocExpirationUpdateProcessorTest_43F6DC65C75CC80D-001/shard-1-001/cores}
   [junit4]   2> 387166 INFO  (TEST-DistribDocExpirationUpdateProcessorTest.test-seed#[43F6DC65C75CC80D]) [    ] o.a.s.s.SolrDispatchFilter SolrDispatchFilter.init(): sun.misc.Launcher$AppClassLoader@6d06d69c
   [junit4]   2> 387166 INFO  (TEST-DistribDocExpirationUpdateProcessorTest.test-seed#[43F6DC65C75CC80D]) [    ] o.a.s.c.SolrResourceLoader new SolrResourceLoader for directory: '/export/home/jenkins/workspace/Lucene-Solr-trunk-Solaris/solr/build/solr-core/test/J1/temp/solr.cloud.DistribDocExpirationUpdateProcessorTest_43F6DC65C75CC80D-001/shard-1-001'
   [junit4]   2> 387166 INFO  (TEST-DistribDocExpirationUpdateProcessorTest.test-seed#[43F6DC65C75CC80D]) [    ] o.a.s.c.SolrResourceLoader JNDI not configured for solr (NoInitialContextEx)
   [junit4]   2> 387167 INFO  (TEST-DistribDocExpirationUpdateProcessorTest.test-seed#[43F6DC65C75CC80D]) [    ] o.a.s.c.SolrResourceLoader solr home defaulted to 'solr/' (could not find system property or JNDI)
   [junit4]   2> 387167 INFO  (TEST-DistribDocExpirationUpdateProcessorTest.test-seed#[43F6DC65C75CC80D]) [    ] o.a.s.c.c.SolrZkClient Using default ZkCredentialsProvider
   [junit4]   2> 387168 INFO  (TEST-DistribDocExpirationUpdateProcessorTest.test-seed#[43F6DC65C75CC80D]) [    ] o.a.s.c.c.ConnectionManager Waiting for client to connect to ZooKeeper
   [junit4]   2> 387176 INFO  (zkCallback-417-thread-1) [    ] o.a.s.c.c.ConnectionManager Watcher org.apache.solr.common.cloud.ConnectionManager@1c04203e name:ZooKeeperConnection Watcher:127.0.0.1:63019/solr got event WatchedEvent state:SyncConnected type:None path:null path:null type:None
   [junit4]   2> 387176 INFO  (TEST-DistribDocExpirationUpdateProcessorTest.test-seed#[43F6DC65C75CC80D]) [    ] o.a.s.c.c.ConnectionManager Client is connected to ZooKeeper
   [junit4]   2> 387176 INFO  (TEST-DistribDocExpirationUpdateProcessorTest.test-seed#[43F6DC65C75CC80D]) [    ] o.a.s.c.c.SolrZkClient Using default ZkACLProvider
   [junit4]   2> 387179 INFO  (TEST-DistribDocExpirationUpdateProcessorTest.test-seed#[43F6DC65C75CC80D]) [    ] o.a.s.s.SolrDispatchFilter Loading solr.xml from SolrHome (not found in ZooKeeper)
   [junit4]   2> 387179 INFO  (TEST-DistribDocExpirationUpdateProcessorTest.test-seed#[43F6DC65C75CC80D]) [    ] o.a.s.c.SolrXmlConfig Loading container configuration from /export/home/jenkins/workspace/Lucene-Solr-trunk-Solaris/solr/build/solr-core/test/J1/temp/solr.cloud.DistribDocExpirationUpdateProcessorTest_43F6DC65C75CC80D-001/shard-1-001/solr.xml
   [junit4]   2> 387192 INFO  (TEST-DistribDocExpirationUpdateProcessorTest.test-seed#[43F6DC65C75CC80D]) [    ] o.a.s.c.CorePropertiesLocator Config-defined core root directory: /export/home/jenkins/workspace/Lucene-Solr-trunk-Solaris/solr/build/solr-core/test/J1/../../../../../../../../../../export/home/jenkins/workspace/Lucene-Solr-trunk-Solaris/solr/build/solr-core/test/J1/temp/solr.cloud.DistribDocExpirationUpdateProcessorTest_43F6DC65C75CC80D-001/shard-1-001/cores
   [junit4]   2> 387192 INFO  (TEST-DistribDocExpirationUpdateProcessorTest.test-seed#[43F6DC65C75CC80D]) [    ] o.a.s.c.CoreContainer New CoreContainer 208490624
   [junit4]   2> 387192 INFO  (TEST-DistribDocExpirationUpdateProcessorTest.test-seed#[43F6DC65C75CC80D]) [    ] o.a.s.c.CoreContainer Loading cores into CoreContainer [instanceDir=/export/home/jenkins/workspace/Lucene-Solr-trunk-Solaris/solr/build/solr-core/test/J1/temp/solr.cloud.DistribDocExpirationUpdateProcessorTest_43F6DC65C75CC80D-001/shard-1-001]
   [junit4]   2> 387193 WARN  (TEST-DistribDocExpirationUpdateProcessorTest.test-seed#[43F6DC65C75CC80D]) [    ] o.a.s.c.CoreContainer Couldn't add files from /export/home/jenkins/workspace/Lucene-Solr-trunk-Solaris/solr/build/solr-core/test/J1/temp/solr.cloud.DistribDocExpirationUpdateProcessorTest_43F6DC65C75CC80D-001/shard-1-001/lib to classpath: /export/home/jenkins/workspace/Lucene-Solr-trunk-Solaris/solr/build/solr-core/test/J1/temp/solr.cloud.DistribDocExpirationUpdateProcessorTest_43F6DC65C75CC80D-001/shard-1-001/lib
   [junit4]   2> 387193 INFO  (TEST-DistribDocExpirationUpdateProcessorTest.test-seed#[43F6DC65C75CC80D]) [    ] o.a.s.h.c.HttpShardHandlerFactory created with socketTimeout : 90000,urlScheme : ,connTimeout : 15000,maxConnectionsPerHost : 20,maxConnections : 10000,corePoolSize : 0,maximumPoolSize : 2147483647,maxThreadIdleTime : 5,sizeOfQueue : -1,fairnessPolicy : false,useRetries : false,
   [junit4]   2> 387197 INFO  (TEST-DistribDocExpirationUpdateProcessorTest.test-seed#[43F6DC65C75CC80D]) [    ] o.a.s.u.UpdateShardHandler Creating UpdateShardHandler HTTP client with params: socketTimeout=340000&connTimeout=45000&retry=true
   [junit4]   2> 387200 INFO  (TEST-DistribDocExpirationUpdateProcessorTest.test-seed#[43F6DC65C75CC80D]) [    ] o.a.s.l.LogWatcher SLF4J impl is org.slf4j.impl.Log4jLoggerFactory
   [junit4]   2> 387200 INFO  (TEST-DistribDocExpirationUpdateProcessorTest.test-seed#[43F6DC65C75CC80D]) [    ] o.a.s.l.LogWatcher Registering Log Listener [Log4j (org.slf4j.impl.Log4jLoggerFactory)]
   [junit4]   2> 387200 INFO  (TEST-DistribDocExpirationUpdateProcessorTest.test-seed#[43F6DC65C75CC80D]) [    ] o.a.s.c.ZkContainer Zookeeper client=127.0.0.1:63019/solr
   [junit4]   2> 387200 INFO  (TEST-DistribDocExpirationUpdateProcessorTest.test-seed#[43F6DC65C75CC80D]) [    ] o.a.s.c.ZkController zkHost includes chroot
   [junit4]   2> 387200 INFO  (TEST-DistribDocExpirationUpdateProcessorTest.test-seed#[43F6DC65C75CC80D]) [    ] o.a.s.c.c.SolrZkClient Using default ZkCredentialsProvider
   [junit4]   2> 387202 INFO  (TEST-DistribDocExpirationUpdateProcessorTest.test-seed#[43F6DC65C75CC80D]) [    ] o.a.s.c.c.ConnectionManager Waiting for client to connect to ZooKeeper
   [junit4]   2> 387206 INFO  (zkCallback-420-thread-1) [    ] o.a.s.c.c.ConnectionManager Watcher org.apache.solr.common.cloud.ConnectionManager@6643fb97 name:ZooKeeperConnection Watcher:127.0.0.1:63019 got event WatchedEvent state:SyncConnected type:None path:null path:null type:None
   [junit4]   2> 387207 INFO  (TEST-DistribDocExpirationUpdateProcessorTest.test-seed#[43F6DC65C75CC80D]) [    ] o.a.s.c.c.ConnectionManager Client is connected to ZooKeeper
   [junit4]   2> 387207 INFO  (TEST-DistribDocExpirationUpdateProcessorTest.test-seed#[43F6DC65C75CC80D]) [    ] o.a.s.c.c.SolrZkClient Using default ZkACLProvider
   [junit4]   2> 387211 INFO  (TEST-DistribDocExpirationUpdateProcessorTest.test-seed#[43F6DC65C75CC80D]) [n:127.0.0.1:52951_oc_d%2Fn    ] o.a.s.c.c.ConnectionManager Waiting for client to connect to ZooKeeper
   [junit4]   2> 387217 INFO  (zkCallback-421-thread-1-processing-n:127.0.0.1:52951_oc_d%2Fn) [n:127.0.0.1:52951_oc_d%2Fn    ] o.a.s.c.c.ConnectionManager Watcher org.apache.solr.common.cloud.ConnectionManager@11986a0f name:ZooKeeperConnection Watcher:127.0.0.1:63019/solr got event WatchedEvent state:SyncConnected type:None path:null path:null type:None
   [junit4]   2> 387217 INFO  (TEST-DistribDocExpirationUpdateProcessorTest.test-seed#[43F6DC65C75CC80D]) [n:127.0.0.1:52951_oc_d%2Fn    ] o.a.s.c.c.ConnectionManager Client is connected to ZooKeeper
   [junit4]   2> 387231 INFO  (TEST-DistribDocExpirationUpdateProcessorTest.test-seed#[43F6DC65C75CC80D]) [n:127.0.0.1:52951_oc_d%2Fn    ] o.a.s.c.c.ZkStateReader Updating cluster state from ZooKeeper... 
   [junit4]   2> 388247 INFO  (TEST-DistribDocExpirationUpdateProcessorTest.test-seed#[43F6DC65C75CC80D]) [n:127.0.0.1:52951_oc_d%2Fn    ] o.a.s.c.ZkController Register node as live in ZooKeeper:/live_nodes/127.0.0.1:52951_oc_d%2Fn
   [junit4]   2> 388248 INFO  (TEST-DistribDocExpirationUpdateProcessorTest.test-seed#[43F6DC65C75CC80D]) [n:127.0.0.1:52951_oc_d%2Fn    ] o.a.s.c.c.SolrZkClient makePath: /live_nodes/127.0.0.1:52951_oc_d%2Fn
   [junit4]   2> 388250 INFO  (zkCallback-416-thread-1) [    ] o.a.s.c.c.ZkStateReader A live node change: [WatchedEvent state:SyncConnected type:NodeChildrenChanged path:/live_nodes], has occurred - updating... (live nodes size: [1])
   [junit4]   2> 388250 INFO  (zkCallback-414-thread-1-processing-n:127.0.0.1:62605_oc_d%2Fn) [n:127.0.0.1:62605_oc_d%2Fn    ] o.a.s.c.c.ZkStateReader A live node change: [WatchedEvent state:SyncConnected type:NodeChildrenChanged path:/live_nodes], has occurred - updating... (live nodes size: [1])
   [junit4]   2> 388251 INFO  (zkCallback-421-thread-1-processing-n:127.0.0.1:52951_oc_d%2Fn) [n:127.0.0.1:52951_oc_d%2Fn    ] o.a.s.c.c.ZkStateReader A live node change: [WatchedEvent state:SyncConnected type:NodeChildrenChanged path:/live_nodes], has occurred - updating... (live nodes size: [1])
   [junit4]   2> 388254 INFO  (TEST-DistribDocExpirationUpdateProcessorTest.test-seed#[43F6DC65C75CC80D]) [n:127.0.0.1:52951_oc_d%2Fn    ] o.a.s.c.Overseer Overseer (id=null) closing
   [junit4]   2> 388255 INFO  (TEST-DistribDocExpirationUpdateProcessorTest.test-seed#[43F6DC65C75CC80D]) [n:127.0.0.1:52951_oc_d%2Fn    ] o.a.s.c.LeaderElector Joined leadership election with path: /overseer_elect/election/95401648072884232-127.0.0.1:52951_oc_d%2Fn-n_0000000001
   [junit4]   2> 388257 INFO  (TEST-DistribDocExpirationUpdateProcessorTest.test-seed#[43F6DC65C75CC80D]) [n:127.0.0.1:52951_oc_d%2Fn    ] o.a.s.c.LeaderElector Watching path /overseer_elect/election/95401648072884228-127.0.0.1:62605_oc_d%2Fn-n_0000000000 to know if I could be the leader
   [junit4]   2> 388287 INFO  (TEST-DistribDocExpirationUpdateProcessorTest.test-seed#[43F6DC65C75CC80D]) [n:127.0.0.1:52951_oc_d%2Fn    ] o.a.s.c.CoreContainer Security conf doesn't exist. Skipping setup for authorization module.
   [junit4]   2> 388287 INFO  (TEST-DistribDocExpirationUpdateProcessorTest.test-seed#[43F6DC65C75CC80D]) [n:127.0.0.1:52951_oc_d%2Fn    ] o.a.s.c.CoreContainer No authentication plugin used.
   [junit4]   2> 388288 INFO  (TEST-DistribDocExpirationUpdateProcessorTest.test-seed#[43F6DC65C75CC80D]) [n:127.0.0.1:52951_oc_d%2Fn    ] o.a.s.c.CorePropertiesLocator Looking for core definitions underneath /export/home/jenkins/workspace/Lucene-Solr-trunk-Solaris/solr/build/solr-core/test/J1/../../../../../../../../../../export/home/jenkins/workspace/Lucene-Solr-trunk-Solaris/solr/build/solr-core/test/J1/temp/solr.cloud.DistribDocExpirationUpdateProcessorTest_43F6DC65C75CC80D-001/shard-1-001/cores
   [junit4]   2> 388289 INFO  (TEST-DistribDocExpirationUpdateProcessorTest.test-seed#[43F6DC65C75CC80D]) [n:127.0.0.1:52951_oc_d%2Fn    ] o.a.s.c.CoreDescriptor Created CoreDescriptor: {name=collection1, config=solrconfig.xml, transient=false, schema=schema.xml, loadOnStartup=true, configSetProperties=configsetprops.json, collection=collection1, coreNodeName=, dataDir=data/, shard=}
   [junit4]   2> 388289 INFO  (TEST-DistribDocExpirationUpdateProcessorTest.test-seed#[43F6DC65C75CC80D]) [n:127.0.0.1:52951_oc_d%2Fn    ] o.a.s.c.CorePropertiesLocator Found core collection1 in /export/home/jenkins/workspace/Lucene-Solr-trunk-Solaris/solr/build/solr-core/test/J1/../../../../../../../../../../export/home/jenkins/workspace/Lucene-Solr-trunk-Solaris/solr/build/solr-core/test/J1/temp/solr.cloud.DistribDocExpirationUpdateProcessorTest_43F6DC65C75CC80D-001/shard-1-001/cores/collection1
   [junit4]   2> 388289 INFO  (TEST-DistribDocExpirationUpdateProcessorTest.test-seed#[43F6DC65C75CC80D]) [n:127.0.0.1:52951_oc_d%2Fn    ] o.a.s.c.CorePropertiesLocator Found 1 core definitions
   [junit4]   2> 388291 INFO  (TEST-DistribDocExpirationUpdateProcessorTest.test-seed#[43F6DC65C75CC80D]) [n:127.0.0.1:52951_oc_d%2Fn    ] o.a.s.s.SolrDispatchFilter user.dir=/export/home/jenkins/workspace/Lucene-Solr-trunk-Solaris/solr/build/solr-core/test/J1
   [junit4]   2> 388291 INFO  (TEST-DistribDocExpirationUpdateProcessorTest.test-seed#[43F6DC65C75CC80D]) [n:127.0.0.1:52951_oc_d%2Fn    ] o.a.s.s.SolrDispatchFilter SolrDispatchFilter.init() done
   [junit4]   2> 388291 INFO  (coreLoadExecutor-771-thread-1-processing-n:127.0.0.1:52951_oc_d%2Fn) [n:127.0.0.1:52951_oc_d%2Fn c:collection1   x:collection1] o.a.s.c.ZkController publishing state=down
   [junit4]   2> 388291 INFO  (coreLoadExecutor-771-thread-1-processing-n:127.0.0.1:52951_oc_d%2Fn) [n:127.0.0.1:52951_oc_d%2Fn c:collection1   x:collection1] o.a.s.c.ZkController numShards not found on descriptor - reading it from system property
   [junit4]   2> 388294 INFO  (OverseerStateUpdate-95401648072884228-127.0.0.1:62605_oc_d%2Fn-n_0000000000) [n:127.0.0.1:62605_oc_d%2Fn    ] o.a.s.c.Overseer processMessage: queueSize: 1, message = {
   [junit4]   2>   "core":"collection1",
   [junit4]   2>   "roles":null,
   [junit4]   2>   "base_url":"http://127.0.0.1:52951/oc_d/n",
   [junit4]   2>   "node_name":"127.0.0.1:52951_oc_d%2Fn",
   [junit4]   2>   "numShards":"2",
   [junit4]   2>   "state":"down",
   [junit4]   2>   "shard":null,
   [junit4]   2>   "collection":"collection1",
   [junit4]   2>   "operation":"state"} current state version: 4
   [junit4]   2> 388295 INFO  (OverseerStateUpdate-95401648072884228-127.0.0.1:62605_oc_d%2Fn-n_0000000000) [n:127.0.0.1:62605_oc_d%2Fn    ] o.a.s.c.o.ReplicaMutator Update state numShards=2 message={
   [junit4]   2>   "core":"collection1",
   [junit4]   2>   "roles":null,
   [junit4]   2>   "base_url":"http://127.0.0.1:52951/oc_d/n",
   [junit4]   2>   "node_name":"127.0.0.1:52951_oc_d%2Fn",
   [junit4]   2>   "numShards":"2",
   [junit4]   2>   "state":"down",
   [junit4]   2>   "shard":null,
   [junit4]   2>   "collection":"collection1",
   [junit4]   2>   "operation":"state"}
   [junit4]   2> 388295 INFO  (OverseerStateUpdate-95401648072884228-127.0.0.1:62605_oc_d%2Fn-n_0000000000) [n:127.0.0.1:62605_oc_d%2Fn    ] o.a.s.c.o.ClusterStateMutator building a new cName: collection1
   [junit4]   2> 388295 INFO  (coreLoadExecutor-771-thread-1-processing-n:127.0.0.1:52951_oc_d%2Fn) [n:127.0.0.1:52951_oc_d%2Fn c:collection1   x:collection1] o.a.s.c.ZkController look for our core node name
   [junit4]   2> 388295 INFO  (OverseerStateUpdate-95401648072884228-127.0.0.1:62605_oc_d%2Fn-n_0000000000) [n:127.0.0.1:62605_oc_d%2Fn    ] o.a.s.c.o.ReplicaMutator Assigning new node to shard shard=shard2
   [junit4]   2> 388296 INFO  (zkCallback-414-thread-1-processing-n:127.0.0.1:62605_oc_d%2Fn) [n:127.0.0.1:62605_oc_d%2Fn    ] o.a.s.c.c.ZkStateReader A cluster state change: [WatchedEvent state:SyncConnected type:NodeDataChanged path:/clusterstate.json], has occurred - updating... (live nodes size: [2])
   [junit4]   2> 388297 INFO  (zkCallback-421-thread-1-processing-n:127.0.0.1:52951_oc_d%2Fn) [n:127.0.0.1:52951_oc_d%2Fn    ] o.a.s.c.c.ZkStateReader A cluster state change: [WatchedEvent state:SyncConnected type:NodeDataChanged path:/clusterstate.json], has occurred - updating... (live nodes size: [2])
   [junit4]   2> 388297 INFO  (zkCallback-416-thread-1) [    ] o.a.s.c.c.ZkStateReader A cluster state change: [WatchedEvent state:SyncConnected type:NodeDataChanged path:/clusterstate.json], has occurred - updating... (live nodes size: [2])
   [junit4]   2> 389298 INFO  (coreLoadExecutor-771-thread-1-processing-n:127.0.0.1:52951_oc_d%2Fn) [n:127.0.0.1:52951_oc_d%2Fn c:collection1   x:collection1] o.a.s.c.ZkController waiting to find shard id in clusterstate for collection1
   [junit4]   2> 389298 INFO  (coreLoadExecutor-771-thread-1-processing-n:127.0.0.1:52951_oc_d%2Fn) [n:127.0.0.1:52951_oc_d%2Fn c:collection1   x:collection1] o.a.s.c.ZkController Check for collection zkNode:collection1
   [junit4]   2> 389301 INFO  (coreLoadExecutor-771-thread-1-processing-n:127.0.0.1:52951_oc_d%2Fn) [n:127.0.0.1:52951_oc_d%2Fn c:collection1   x:collection1] o.a.s.c.ZkController Collection zkNode exists
   [junit4]   2> 389301 INFO  (coreLoadExecutor-771-thread-1-processing-n:127.0.0.1:52951_oc_d%2Fn) [n:127.0.0.1:52951_oc_d%2Fn c:collection1   x:collection1] o.a.s.c.c.ZkStateReader Load collection config from: [/collections/collection1]
   [junit4]   2> 389303 INFO  (coreLoadExecutor-771-thread-1-processing-n:127.0.0.1:52951_oc_d%2Fn) [n:127.0.0.1:52951_oc_d%2Fn c:collection1   x:collection1] o.a.s.c.c.ZkStateReader path=[/collections/collection1] [configName]=[conf1] specified config exists in ZooKeeper
   [junit4]   2> 389303 INFO  (coreLoadExecutor-771-thread-1-processing-n:127.0.0.1:52951_oc_d%2Fn) [n:127.0.0.1:52951_oc_d%2Fn c:collection1   x:collection1] o.a.s.c.SolrResourceLoader new SolrResourceLoader for directory: '/export/home/jenkins/workspace/Lucene-Solr-trunk-Solaris/solr/build/solr-core/test/J1/temp/solr.cloud.DistribDocExpirationUpdateProcessorTest_43F6DC65C75CC80D-001/shard-1-001/cores/collection1'
   [junit4]   2> 389303 INFO  (coreLoadExecutor-771-thread-1-processing-n:127.0.0.1:52951_oc_d%2Fn) [n:127.0.0.1:52951_oc_d%2Fn c:collection1   x:collection1] o.a.s.c.SolrResourceLoader JNDI not configured for solr (NoInitialContextEx)
   [junit4]   2> 389303 INFO  (coreLoadExecutor-771-thread-1-processing-n:127.0.0.1:52951_oc_d%2Fn) [n:127.0.0.1:52951_oc_d%2Fn c:collection1   x:collection1] o.a.s.c.SolrResourceLoader solr home defaulted to 'solr/' (could not find system property or JNDI)
   [junit4]   2> 389306 INFO  (coreLoadExecutor-771-thread-1-processing-n:127.0.0.1:52951_oc_d%2Fn) [n:127.0.0.1:52951_oc_d%2Fn c:collection1   x:collection1] o.a.s.c.Config loaded config solrconfig.xml with version 0 
   [junit4]   2> 389330 INFO  (coreLoadExecutor-771-thread-1-processing-n:127.0.0.1:52951_oc_d%2Fn) [n:127.0.0.1:52951_oc_d%2Fn c:collection1   x:collection1] o.a.s.c.SolrConfig current version of requestparams : -1
   [junit4]   2> 389334 INFO  (coreLoadExecutor-771-thread-1-processing-n:127.0.0.1:52951_oc_d%2Fn) [n:127.0.0.1:52951_oc_d%2Fn c:collection1   x:collection1] o.a.s.c.SolrConfig Using Lucene MatchVersion: 6.0.0
   [junit4]   2> 389343 INFO  (coreLoadExecutor-771-thread-1-processing-n:127.0.0.1:52951_oc_d%2Fn) [n:127.0.0.1:52951_oc_d%2Fn c:collection1   x:collection1] o.a.s.c.SolrConfig Loaded SolrConfig: solrconfig.xml
   [junit4]   2> 389352 INFO  (coreLoadExecutor-771-thread-1-processing-n:127.0.0.1:52951_oc_d%2Fn) [n:127.0.0.1:52951_oc_d%2Fn c:collection1   x:collection1] o.a.s.s.IndexSchema [collection1] Schema name=test
   [junit4]   2> 389496 INFO  (coreLoadExecutor-771-thread-1-processing-n:127.0.0.1:52951_oc_d%2Fn) [n:127.0.0.1:52951_oc_d%2Fn c:collection1   x:collection1] o.a.s.s.IndexSchema default search field in schema is text
   [junit4]   2> 389497 INFO  (coreLoadExecutor-771-thread-1-processing-n:127.0.0.1:52951_oc_d%2Fn) [n:127.0.0.1:52951_oc_d%2Fn c:collection1   x:collection1] o.a.s.s.IndexSchema unique key field: id
   [junit4]   2> 389500 INFO  (coreLoadExecutor-771-thread-1-processing-n:127.0.0.1:52951_oc_d%2Fn) [n:127.0.0.1:52951_oc_d%2Fn c:collection1   x:collection1] o.a.s.s.FileExchangeRateProvider Reloading exchange rates from file currency.xml
   [junit4]   2> 389504 INFO  (coreLoadExecutor-771-thread-1-processing-n:127.0.0.1:52951_oc_d%2Fn) [n:127.0.0.1:52951_oc_d%2Fn c:collection1   x:collection1] o.a.s.s.FileExchangeRateProvider Reloading exchange rates from file currency.xml
   [junit4]   2> 389536 INFO  (coreLoadExecutor-771-thread-1-processing-n:127.0.0.1:52951_oc_d%2Fn) [n:127.0.0.1:52951_oc_d%2Fn c:collection1   x:collection1] o.a.s.c.ConfigSetProperties Did not find ConfigSet properties, assuming default properties: Can't find resource 'configsetprops.json' in classpath or '/configs/conf1', cwd=/export/home/jenkins/workspace/Lucene-Solr-trunk-Solaris/solr/build/solr-core/test/J1
   [junit4]   2> 389536 INFO  (coreLoadExecutor-771-thread-1-processing-n:127.0.0.1:52951_oc_d%2Fn) [n:127.0.0.1:52951_oc_d%2Fn c:collection1   x:collection1] o.a.s.c.CoreContainer Creating SolrCore 'collection1' using configuration from collection collection1
   [junit4]   2> 389536 INFO  (coreLoadExecutor-771-thread-1-processing-n:127.0.0.1:52951_oc_d%2Fn) [n:127.0.0.1:52951_oc_d%2Fn c:collection1 s:shard2 r:core_node1 x:collection1] o.a.s.c.SolrCore org.apache.solr.core.MockDirectoryFactory
   [junit4]   2> 389537 INFO  (coreLoadExecutor-771-thread-1-processing-n:127.0.0.1:52951_oc_d%2Fn) [n:127.0.0.1:52951_oc_d%2Fn c:collection1 s:shard2 r:core_node1 x:collection1] o.a.s.c.SolrCore [[collection1] ] Opening new SolrCore at [/export/home/jenkins/workspace/Lucene-Solr-trunk-Solaris/solr/build/solr-core/test/J1/temp/solr.cloud.DistribDocExpirationUpdateProcessorTest_43F6DC65C75CC80D-001/shard-1-001/cores/collection1], dataDir=[/export/home/jenkins/workspace/Lucene-Solr-trunk-Solaris/solr/build/solr-core/test/J1/../../../../../../../../../../export/home/jenkins/workspace/Lucene-Solr-trunk-Solaris/solr/build/solr-core/test/J1/temp/solr.cloud.DistribDocExpirationUpdateProcessorTest_43F6DC65C75CC80D-001/shard-1-001/cores/collection1/data/]
   [junit4]   2> 389537 INFO  (coreLoadExecutor-771-thread-1-processing-n:127.0.0.1:52951_oc_d%2Fn) [n:127.0.0.1:52951_oc_d%2Fn c:collection1 s:shard2 r:core_node1 x:collection1] o.a.s.c.SolrCore JMX monitoring not detected for core: collection1
   [junit4]   2> 389537 INFO  (coreLoadExecutor-771-thread-1-processing-n:127.0.0.1:52951_oc_d%2Fn) [n:127.0.0.1:52951_oc_d%2Fn c:collection1 s:shard2 r:core_node1 x:collection1] o.a.s.c.CachingDirectoryFactory return new directory for /export/home/jenkins/workspace/Lucene-Solr-trunk-Solaris/solr/build/solr-core/test/J1/../../../../../../../../../../export/home/jenkins/workspace/Lucene-Solr-trunk-Solaris/solr/build/solr-core/test/J1/temp/solr.cloud.DistribDocExpirationUpdateProcessorTest_43F6DC65C75CC80D-001/shard-1-001/cores/collection1/data
   [junit4]   2> 389537 INFO  (coreLoadExecutor-771-thread-1-processing-n:127.0.0.1:52951_oc_d%2Fn) [n:127.0.0.1:52951_oc_d%2Fn c:collection1 s:shard2 r:core_node1 x:collection1] o.a.s.c.SolrCore New index directory detected: old=null new=/export/home/jenkins/workspace/Lucene-Solr-trunk-Solaris/solr/build/solr-core/test/J1/../../../../../../../../../../export/home/jenkins/workspace/Lucene-Solr-trunk-Solaris/solr/build/solr-core/test/J1/temp/solr.cloud.DistribDocExpirationUpdateProcessorTest_43F6DC65C75CC80D-001/shard-1-001/cores/collection1/data/index/
   [junit4]   2> 389538 WARN  (coreLoadExecutor-771-thread-1-processing-n:127.0.0.1:52951_oc_d%2Fn) [n:127.0.0.1:529

[...truncated too long message...]

r DownNode state invoked for node: 127.0.0.1:37911_oc_d%2Fn
   [junit4]   2> 451119 INFO  (OverseerStateUpdate-95401648072884241-127.0.0.1:37911_oc_d%2Fn-n_0000000004) [n:127.0.0.1:37911_oc_d%2Fn    ] o.a.s.c.o.NodeMutator Update replica state for core_node4:{"core":"collection1","base_url":"http://127.0.0.1:37911/oc_d/n","node_name":"127.0.0.1:37911_oc_d%2Fn","state":"active","leader":"true"} to down
   [junit4]   2> 451121 INFO  (zkCallback-437-thread-2-processing-n:127.0.0.1:37911_oc_d%2Fn) [n:127.0.0.1:37911_oc_d%2Fn    ] o.a.s.c.c.ZkStateReader A cluster state change: [WatchedEvent state:SyncConnected type:NodeDataChanged path:/clusterstate.json], has occurred - updating... (live nodes size: [1])
   [junit4]   2> 451229 INFO  (zkCallback-437-thread-2-processing-n:127.0.0.1:37911_oc_d%2Fn) [n:127.0.0.1:37911_oc_d%2Fn    ] o.a.s.c.c.ZkStateReader A cluster state change: [WatchedEvent state:SyncConnected type:NodeDataChanged path:/clusterstate.json], has occurred - updating... (live nodes size: [1])
   [junit4]   2> 454625 INFO  (autoExpireDocs-813-thread-1) [n:127.0.0.1:37911_oc_d%2Fn c:collection1 s:shard1 r:core_node4 x:collection1] o.a.s.u.p.LogUpdateProcessorFactory [collection1] {} 0 4046
   [junit4]   2> 454625 ERROR (autoExpireDocs-813-thread-1) [n:127.0.0.1:37911_oc_d%2Fn c:collection1 s:shard1 r:core_node4 x:collection1] o.a.s.u.p.DocExpirationUpdateProcessorFactory Runtime error in periodic deletion of expired docs: No registered leader was found after waiting for 4000ms , collection: collection1 slice: shard2
   [junit4]   2> org.apache.solr.common.SolrException: No registered leader was found after waiting for 4000ms , collection: collection1 slice: shard2
   [junit4]   2> 	at org.apache.solr.common.cloud.ZkStateReader.getLeaderRetry(ZkStateReader.java:602)
   [junit4]   2> 	at org.apache.solr.common.cloud.ZkStateReader.getLeaderRetry(ZkStateReader.java:588)
   [junit4]   2> 	at org.apache.solr.update.processor.DistributedUpdateProcessor.doDeleteByQuery(DistributedUpdateProcessor.java:1266)
   [junit4]   2> 	at org.apache.solr.update.processor.DistributedUpdateProcessor.processDelete(DistributedUpdateProcessor.java:1135)
   [junit4]   2> 	at org.apache.solr.update.processor.LogUpdateProcessorFactory$LogUpdateProcessor.processDelete(LogUpdateProcessorFactory.java:124)
   [junit4]   2> 	at org.apache.solr.update.processor.UpdateRequestProcessor.processDelete(UpdateRequestProcessor.java:52)
   [junit4]   2> 	at org.apache.solr.update.processor.DocExpirationUpdateProcessorFactory$DeleteExpiredDocsRunnable.run(DocExpirationUpdateProcessorFactory.java:409)
   [junit4]   2> 	at java.util.concurrent.Executors$RunnableAdapter.call(Executors.java:511)
   [junit4]   2> 	at java.util.concurrent.FutureTask.runAndReset(FutureTask.java:308)
   [junit4]   2> 	at java.util.concurrent.ScheduledThreadPoolExecutor$ScheduledFutureTask.access$301(ScheduledThreadPoolExecutor.java:180)
   [junit4]   2> 	at java.util.concurrent.ScheduledThreadPoolExecutor$ScheduledFutureTask.run(ScheduledThreadPoolExecutor.java:294)
   [junit4]   2> 	at java.util.concurrent.ThreadPoolExecutor.runWorker(ThreadPoolExecutor.java:1142)
   [junit4]   2> 	at java.util.concurrent.ThreadPoolExecutor$Worker.run(ThreadPoolExecutor.java:617)
   [junit4]   2> 	at java.lang.Thread.run(Thread.java:745)
   [junit4]   2> 454628 INFO  (TEST-DistribDocExpirationUpdateProcessorTest.test-seed#[43F6DC65C75CC80D]) [    ] o.a.s.c.Overseer Overseer (id=95401648072884241-127.0.0.1:37911_oc_d%2Fn-n_0000000004) closing
   [junit4]   2> 454628 INFO  (OverseerStateUpdate-95401648072884241-127.0.0.1:37911_oc_d%2Fn-n_0000000004) [n:127.0.0.1:37911_oc_d%2Fn    ] o.a.s.c.Overseer Overseer Loop exiting : 127.0.0.1:37911_oc_d%2Fn
   [junit4]   2> 454630 INFO  (zkCallback-437-thread-1-processing-n:127.0.0.1:37911_oc_d%2Fn) [n:127.0.0.1:37911_oc_d%2Fn    ] o.a.s.c.c.ZkStateReader A live node change: [WatchedEvent state:SyncConnected type:NodeChildrenChanged path:/live_nodes], has occurred - updating... (live nodes size: [1])
   [junit4]   2> 454630 WARN  (zkCallback-437-thread-1-processing-n:127.0.0.1:37911_oc_d%2Fn) [n:127.0.0.1:37911_oc_d%2Fn    ] o.a.s.c.c.ZkStateReader ZooKeeper watch triggered, but Solr cannot talk to ZK: [KeeperErrorCode = Session expired for /live_nodes]
   [junit4]   2> 454634 INFO  (TEST-DistribDocExpirationUpdateProcessorTest.test-seed#[43F6DC65C75CC80D]) [    ] o.e.j.s.ServerConnector Stopped ServerConnector@551970ef{HTTP/1.1,[http/1.1]}{127.0.0.1:0}
   [junit4]   2> 454635 INFO  (TEST-DistribDocExpirationUpdateProcessorTest.test-seed#[43F6DC65C75CC80D]) [    ] o.e.j.s.h.ContextHandler Stopped o.e.j.s.ServletContextHandler@21b8750c{/oc_d/n,null,UNAVAILABLE}
   [junit4]   2> 454637 INFO  (TEST-DistribDocExpirationUpdateProcessorTest.test-seed#[43F6DC65C75CC80D]) [    ] o.a.s.c.ZkTestServer connecting to 127.0.0.1:63019 63019
   [junit4]   2> 454696 INFO  (Thread-2323) [    ] o.a.s.c.ZkTestServer connecting to 127.0.0.1:63019 63019
   [junit4]   2> 454697 WARN  (Thread-2323) [    ] o.a.s.c.ZkTestServer Watch limit violations: 
   [junit4]   2> Maximum concurrent create/delete watches above limit:
   [junit4]   2> 
   [junit4]   2> 	6	/solr/aliases.json
   [junit4]   2> 	5	/solr/security.json
   [junit4]   2> 	5	/solr/configs/conf1
   [junit4]   2> 
   [junit4]   2> Maximum concurrent data watches above limit:
   [junit4]   2> 
   [junit4]   2> 	6	/solr/clusterstate.json
   [junit4]   2> 
   [junit4]   2> Maximum concurrent children watches above limit:
   [junit4]   2> 
   [junit4]   2> 	6	/solr/live_nodes
   [junit4]   2> 	6	/solr/collections
   [junit4]   2> 	4	/solr/overseer/queue
   [junit4]   2> 	4	/solr/overseer/collection-queue-work
   [junit4]   2> 
   [junit4]   2> NOTE: reproduce with: ant test  -Dtestcase=DistribDocExpirationUpdateProcessorTest -Dtests.method=test -Dtests.seed=43F6DC65C75CC80D -Dtests.slow=true -Dtests.locale=hi -Dtests.timezone=Africa/Douala -Dtests.asserts=true -Dtests.file.encoding=UTF-8
   [junit4] FAILURE 75.9s J1 | DistribDocExpirationUpdateProcessorTest.test <<<
   [junit4]    > Throwable #1: java.lang.AssertionError: There are still nodes recoverying - waited for 45 seconds
   [junit4]    > 	at __randomizedtesting.SeedInfo.seed([43F6DC65C75CC80D:CBA2E3BF69A0A5F5]:0)
   [junit4]    > 	at org.apache.solr.cloud.AbstractDistribZkTestBase.waitForRecoveriesToFinish(AbstractDistribZkTestBase.java:174)
   [junit4]    > 	at org.apache.solr.cloud.AbstractFullDistribZkTestBase.waitForRecoveriesToFinish(AbstractFullDistribZkTestBase.java:856)
   [junit4]    > 	at org.apache.solr.cloud.DistribDocExpirationUpdateProcessorTest.test(DistribDocExpirationUpdateProcessorTest.java:73)
   [junit4]    > 	at org.apache.solr.BaseDistributedSearchTestCase$ShardsRepeatRule$ShardsFixedStatement.callStatement(BaseDistributedSearchTestCase.java:964)
   [junit4]    > 	at org.apache.solr.BaseDistributedSearchTestCase$ShardsRepeatRule$ShardsStatement.evaluate(BaseDistributedSearchTestCase.java:939)
   [junit4]    > 	at java.lang.Thread.run(Thread.java:745)
   [junit4]   2> 454704 INFO  (SUITE-DistribDocExpirationUpdateProcessorTest-seed#[43F6DC65C75CC80D]-worker) [    ] o.a.s.SolrTestCaseJ4 ###deleteCore
   [junit4]   2> NOTE: leaving temporary files on disk at: /export/home/jenkins/workspace/Lucene-Solr-trunk-Solaris/solr/build/solr-core/test/J1/temp/solr.cloud.DistribDocExpirationUpdateProcessorTest_43F6DC65C75CC80D-001
   [junit4]   2> Feb 17, 2016 12:55:00 PM com.carrotsearch.randomizedtesting.ThreadLeakControl checkThreadLeaks
   [junit4]   2> WARNING: Will linger awaiting termination of 1 leaked thread(s).
   [junit4]   2> NOTE: test params are: codec=Asserting(Lucene60): {_version_=PostingsFormat(name=MockRandom), id=PostingsFormat(name=LuceneVarGapDocFreqInterval)}, docValues:{}, sim=ClassicSimilarity, locale=hi, timezone=Africa/Douala
   [junit4]   2> NOTE: SunOS 5.11 amd64/Oracle Corporation 1.8.0_72 (64-bit)/cpus=3,threads=1,free=135901800,total=520093696
   [junit4]   2> NOTE: All tests run in this JVM: [TestJoin, CollectionReloadTest, ShowFileRequestHandlerTest, ResourceLoaderTest, TestMacros, SolrInfoMBeanTest, TestFreeTextSuggestions, TestTrieFacet, CloudMLTQParserTest, HdfsBasicDistributedZkTest, CheckHdfsIndexTest, ZkSolrClientTest, TestSolrIndexConfig, DefaultValueUpdateProcessorTest, MultiTermTest, TestBlendedInfixSuggestions, SuggesterTest, TestFastWriter, ConnectionManagerTest, TestSolrJ, ChaosMonkeySafeLeaderTest, TestSuggestSpellingConverter, TestDynamicLoading, TestCSVResponseWriter, DateFieldTest, DistribDocExpirationUpdateProcessorTest]
   [junit4] Completed [80/579 (1!)] on J1 in 76.19s, 1 test, 1 failure <<< FAILURES!

[...truncated 1614 lines...]
BUILD FAILED
/export/home/jenkins/workspace/Lucene-Solr-trunk-Solaris/build.xml:740: The following error occurred while executing this line:
/export/home/jenkins/workspace/Lucene-Solr-trunk-Solaris/build.xml:684: The following error occurred while executing this line:
/export/home/jenkins/workspace/Lucene-Solr-trunk-Solaris/build.xml:59: The following error occurred while executing this line:
/export/home/jenkins/workspace/Lucene-Solr-trunk-Solaris/solr/build.xml:233: The following error occurred while executing this line:
/export/home/jenkins/workspace/Lucene-Solr-trunk-Solaris/solr/common-build.xml:524: The following error occurred while executing this line:
/export/home/jenkins/workspace/Lucene-Solr-trunk-Solaris/lucene/common-build.xml:1457: The following error occurred while executing this line:
/export/home/jenkins/workspace/Lucene-Solr-trunk-Solaris/lucene/common-build.xml:1014: There were test failures: 579 suites (8 ignored), 2331 tests, 1 failure, 88 ignored (72 assumptions) [seed: 43F6DC65C75CC80D]

Total time: 73 minutes 44 seconds
Build step 'Invoke Ant' marked build as failure
Archiving artifacts
[WARNINGS] Skipping publisher since build result is FAILURE
Recording test results
Email was triggered for: Failure - Any
Sending email for trigger: Failure - Any



Mime
View raw message