lucene-dev mailing list archives

Site index · List index
Message view « Date » · « Thread »
Top « Date » · « Thread »
From Policeman Jenkins Server <jenk...@thetaphi.de>
Subject [JENKINS] Lucene-Solr-5.x-Linux (32bit/jdk1.7.0_80) - Build # 15522 - Failure!
Date Tue, 09 Feb 2016 14:42:41 GMT
Build: http://jenkins.thetaphi.de/job/Lucene-Solr-5.x-Linux/15522/
Java: 32bit/jdk1.7.0_80 -server -XX:+UseG1GC

1 tests failed.
FAILED:  org.apache.solr.core.TestNRTOpen.testSharedCores

Error Message:
expected:<3> but was:<2>

Stack Trace:
java.lang.AssertionError: expected:<3> but was:<2>
	at __randomizedtesting.SeedInfo.seed([6444A7AFAD933FD3:8247EDE0256512DC]:0)
	at org.junit.Assert.fail(Assert.java:93)
	at org.junit.Assert.failNotEquals(Assert.java:647)
	at org.junit.Assert.assertEquals(Assert.java:128)
	at org.junit.Assert.assertEquals(Assert.java:472)
	at org.junit.Assert.assertEquals(Assert.java:456)
	at org.apache.solr.core.TestNRTOpen.testSharedCores(TestNRTOpen.java:116)
	at sun.reflect.NativeMethodAccessorImpl.invoke0(Native Method)
	at sun.reflect.NativeMethodAccessorImpl.invoke(NativeMethodAccessorImpl.java:57)
	at sun.reflect.DelegatingMethodAccessorImpl.invoke(DelegatingMethodAccessorImpl.java:43)
	at java.lang.reflect.Method.invoke(Method.java:606)
	at com.carrotsearch.randomizedtesting.RandomizedRunner.invoke(RandomizedRunner.java:1764)
	at com.carrotsearch.randomizedtesting.RandomizedRunner$8.evaluate(RandomizedRunner.java:871)
	at com.carrotsearch.randomizedtesting.RandomizedRunner$9.evaluate(RandomizedRunner.java:907)
	at com.carrotsearch.randomizedtesting.RandomizedRunner$10.evaluate(RandomizedRunner.java:921)
	at com.carrotsearch.randomizedtesting.rules.SystemPropertiesRestoreRule$1.evaluate(SystemPropertiesRestoreRule.java:57)
	at org.apache.lucene.util.TestRuleSetupTeardownChained$1.evaluate(TestRuleSetupTeardownChained.java:49)
	at org.apache.lucene.util.AbstractBeforeAfterRule$1.evaluate(AbstractBeforeAfterRule.java:45)
	at org.apache.lucene.util.TestRuleThreadAndTestName$1.evaluate(TestRuleThreadAndTestName.java:48)
	at org.apache.lucene.util.TestRuleIgnoreAfterMaxFailures$1.evaluate(TestRuleIgnoreAfterMaxFailures.java:64)
	at org.apache.lucene.util.TestRuleMarkFailure$1.evaluate(TestRuleMarkFailure.java:47)
	at com.carrotsearch.randomizedtesting.rules.StatementAdapter.evaluate(StatementAdapter.java:36)
	at com.carrotsearch.randomizedtesting.ThreadLeakControl$StatementRunner.run(ThreadLeakControl.java:367)
	at com.carrotsearch.randomizedtesting.ThreadLeakControl.forkTimeoutingTask(ThreadLeakControl.java:809)
	at com.carrotsearch.randomizedtesting.ThreadLeakControl$3.evaluate(ThreadLeakControl.java:460)
	at com.carrotsearch.randomizedtesting.RandomizedRunner.runSingleTest(RandomizedRunner.java:880)
	at com.carrotsearch.randomizedtesting.RandomizedRunner$5.evaluate(RandomizedRunner.java:781)
	at com.carrotsearch.randomizedtesting.RandomizedRunner$6.evaluate(RandomizedRunner.java:816)
	at com.carrotsearch.randomizedtesting.RandomizedRunner$7.evaluate(RandomizedRunner.java:827)
	at com.carrotsearch.randomizedtesting.rules.StatementAdapter.evaluate(StatementAdapter.java:36)
	at com.carrotsearch.randomizedtesting.rules.SystemPropertiesRestoreRule$1.evaluate(SystemPropertiesRestoreRule.java:57)
	at org.apache.lucene.util.AbstractBeforeAfterRule$1.evaluate(AbstractBeforeAfterRule.java:45)
	at com.carrotsearch.randomizedtesting.rules.StatementAdapter.evaluate(StatementAdapter.java:36)
	at org.apache.lucene.util.TestRuleStoreClassName$1.evaluate(TestRuleStoreClassName.java:41)
	at com.carrotsearch.randomizedtesting.rules.NoShadowingOrOverridesOnMethodsRule$1.evaluate(NoShadowingOrOverridesOnMethodsRule.java:40)
	at com.carrotsearch.randomizedtesting.rules.NoShadowingOrOverridesOnMethodsRule$1.evaluate(NoShadowingOrOverridesOnMethodsRule.java:40)
	at com.carrotsearch.randomizedtesting.rules.StatementAdapter.evaluate(StatementAdapter.java:36)
	at com.carrotsearch.randomizedtesting.rules.StatementAdapter.evaluate(StatementAdapter.java:36)
	at com.carrotsearch.randomizedtesting.rules.StatementAdapter.evaluate(StatementAdapter.java:36)
	at org.apache.lucene.util.TestRuleAssertionsRequired$1.evaluate(TestRuleAssertionsRequired.java:53)
	at org.apache.lucene.util.TestRuleMarkFailure$1.evaluate(TestRuleMarkFailure.java:47)
	at org.apache.lucene.util.TestRuleIgnoreAfterMaxFailures$1.evaluate(TestRuleIgnoreAfterMaxFailures.java:64)
	at org.apache.lucene.util.TestRuleIgnoreTestSuites$1.evaluate(TestRuleIgnoreTestSuites.java:54)
	at com.carrotsearch.randomizedtesting.rules.StatementAdapter.evaluate(StatementAdapter.java:36)
	at com.carrotsearch.randomizedtesting.ThreadLeakControl$StatementRunner.run(ThreadLeakControl.java:367)
	at java.lang.Thread.run(Thread.java:745)




Build Log:
[...truncated 11226 lines...]
   [junit4] Suite: org.apache.solr.core.TestNRTOpen
   [junit4]   2> Creating dataDir: /home/jenkins/workspace/Lucene-Solr-5.x-Linux/solr/build/solr-core/test/J1/temp/solr.core.TestNRTOpen_6444A7AFAD933FD3-001/init-core-data-001
   [junit4]   2> 506570 INFO  (SUITE-TestNRTOpen-seed#[6444A7AFAD933FD3]-worker) [    ] o.a.s.SolrTestCaseJ4 Randomized ssl (false) and clientAuth (false)
   [junit4]   2> 506570 INFO  (SUITE-TestNRTOpen-seed#[6444A7AFAD933FD3]-worker) [    ] o.a.s.SolrTestCaseJ4 ####initCore
   [junit4]   2> 506570 INFO  (SUITE-TestNRTOpen-seed#[6444A7AFAD933FD3]-worker) [    ] o.a.s.c.SolrResourceLoader new SolrResourceLoader for directory: '/home/jenkins/workspace/Lucene-Solr-5.x-Linux/solr/core/src/test-files/solr/collection1'
   [junit4]   2> 506570 INFO  (SUITE-TestNRTOpen-seed#[6444A7AFAD933FD3]-worker) [    ] o.a.s.c.SolrResourceLoader JNDI not configured for solr (NoInitialContextEx)
   [junit4]   2> 506570 INFO  (SUITE-TestNRTOpen-seed#[6444A7AFAD933FD3]-worker) [    ] o.a.s.c.SolrResourceLoader using system property solr.solr.home: /home/jenkins/workspace/Lucene-Solr-5.x-Linux/solr/core/src/test-files/solr
   [junit4]   2> 506571 INFO  (SUITE-TestNRTOpen-seed#[6444A7AFAD933FD3]-worker) [    ] o.a.s.c.SolrResourceLoader Adding 'file:/home/jenkins/workspace/Lucene-Solr-5.x-Linux/solr/core/src/test-files/solr/collection1/lib/classes/' to classloader
   [junit4]   2> 506571 INFO  (SUITE-TestNRTOpen-seed#[6444A7AFAD933FD3]-worker) [    ] o.a.s.c.SolrResourceLoader Adding 'file:/home/jenkins/workspace/Lucene-Solr-5.x-Linux/solr/core/src/test-files/solr/collection1/lib/README' to classloader
   [junit4]   2> 506589 INFO  (SUITE-TestNRTOpen-seed#[6444A7AFAD933FD3]-worker) [    ] o.a.s.c.SolrConfig current version of requestparams : -1
   [junit4]   2> 506616 INFO  (SUITE-TestNRTOpen-seed#[6444A7AFAD933FD3]-worker) [    ] o.a.s.c.SolrConfig Using Lucene MatchVersion: 5.5.0
   [junit4]   2> 506631 INFO  (SUITE-TestNRTOpen-seed#[6444A7AFAD933FD3]-worker) [    ] o.a.s.c.SolrConfig Loaded SolrConfig: solrconfig-basic.xml
   [junit4]   2> 506634 INFO  (SUITE-TestNRTOpen-seed#[6444A7AFAD933FD3]-worker) [    ] o.a.s.s.IndexSchema [null] Schema name=minimal
   [junit4]   2> 506637 WARN  (SUITE-TestNRTOpen-seed#[6444A7AFAD933FD3]-worker) [    ] o.a.s.s.IndexSchema no uniqueKey specified in schema.
   [junit4]   2> 506637 INFO  (SUITE-TestNRTOpen-seed#[6444A7AFAD933FD3]-worker) [    ] o.a.s.c.SolrResourceLoader JNDI not configured for solr (NoInitialContextEx)
   [junit4]   2> 506638 INFO  (SUITE-TestNRTOpen-seed#[6444A7AFAD933FD3]-worker) [    ] o.a.s.c.SolrResourceLoader using system property solr.solr.home: /home/jenkins/workspace/Lucene-Solr-5.x-Linux/solr/core/src/test-files/solr
   [junit4]   2> 506638 INFO  (SUITE-TestNRTOpen-seed#[6444A7AFAD933FD3]-worker) [    ] o.a.s.c.SolrResourceLoader new SolrResourceLoader for directory: '/home/jenkins/workspace/Lucene-Solr-5.x-Linux/solr/core/src/test-files/solr'
   [junit4]   2> 506638 INFO  (SUITE-TestNRTOpen-seed#[6444A7AFAD933FD3]-worker) [    ] o.a.s.c.SolrResourceLoader JNDI not configured for solr (NoInitialContextEx)
   [junit4]   2> 506638 INFO  (SUITE-TestNRTOpen-seed#[6444A7AFAD933FD3]-worker) [    ] o.a.s.c.SolrResourceLoader using system property solr.solr.home: /home/jenkins/workspace/Lucene-Solr-5.x-Linux/solr/core/src/test-files/solr
   [junit4]   2> 506638 INFO  (SUITE-TestNRTOpen-seed#[6444A7AFAD933FD3]-worker) [    ] o.a.s.c.CoreContainer New CoreContainer 16537995
   [junit4]   2> 506638 INFO  (SUITE-TestNRTOpen-seed#[6444A7AFAD933FD3]-worker) [    ] o.a.s.c.CoreContainer Loading cores into CoreContainer [instanceDir=/home/jenkins/workspace/Lucene-Solr-5.x-Linux/solr/core/src/test-files/solr]
   [junit4]   2> 506638 WARN  (SUITE-TestNRTOpen-seed#[6444A7AFAD933FD3]-worker) [    ] o.a.s.c.CoreContainer Couldn't add files from /home/jenkins/workspace/Lucene-Solr-5.x-Linux/solr/core/src/test-files/solr/lib to classpath: /home/jenkins/workspace/Lucene-Solr-5.x-Linux/solr/core/src/test-files/solr/lib
   [junit4]   2> 506638 INFO  (SUITE-TestNRTOpen-seed#[6444A7AFAD933FD3]-worker) [    ] o.a.s.h.c.HttpShardHandlerFactory created with socketTimeout : 600000,connTimeout : 60000,maxConnectionsPerHost : 20,maxConnections : 10000,corePoolSize : 0,maximumPoolSize : 2147483647,maxThreadIdleTime : 5,sizeOfQueue : -1,fairnessPolicy : false,useRetries : false,
   [junit4]   2> 506639 INFO  (SUITE-TestNRTOpen-seed#[6444A7AFAD933FD3]-worker) [    ] o.a.s.u.UpdateShardHandler Creating UpdateShardHandler HTTP client with params: socketTimeout=30000&connTimeout=30000&retry=true
   [junit4]   2> 506639 INFO  (SUITE-TestNRTOpen-seed#[6444A7AFAD933FD3]-worker) [    ] o.a.s.l.LogWatcher SLF4J impl is org.slf4j.impl.Log4jLoggerFactory
   [junit4]   2> 506640 INFO  (SUITE-TestNRTOpen-seed#[6444A7AFAD933FD3]-worker) [    ] o.a.s.l.LogWatcher Registering Log Listener [Log4j (org.slf4j.impl.Log4jLoggerFactory)]
   [junit4]   2> 506640 INFO  (SUITE-TestNRTOpen-seed#[6444A7AFAD933FD3]-worker) [    ] o.a.s.c.CoreContainer Security conf doesn't exist. Skipping setup for authorization module.
   [junit4]   2> 506640 INFO  (SUITE-TestNRTOpen-seed#[6444A7AFAD933FD3]-worker) [    ] o.a.s.c.CoreContainer No authentication plugin used.
   [junit4]   2> 506640 INFO  (SUITE-TestNRTOpen-seed#[6444A7AFAD933FD3]-worker) [    ] o.a.s.c.CoreDescriptor Created CoreDescriptor: {schema=schema-minimal.xml, transient=false, loadOnStartup=true, dataDir=/home/jenkins/workspace/Lucene-Solr-5.x-Linux/solr/build/solr-core/test/J1/temp/solr.core.TestNRTOpen_6444A7AFAD933FD3-001/init-core-data-001, collection=collection1, name=collection1, config=solrconfig-basic.xml, shard=shard1, configSetProperties=configsetprops.json}
   [junit4]   2> 506640 INFO  (coreLoadExecutor-1699-thread-1) [    ] o.a.s.c.SolrResourceLoader new SolrResourceLoader for directory: '/home/jenkins/workspace/Lucene-Solr-5.x-Linux/solr/core/src/test-files/solr/collection1'
   [junit4]   2> 506640 INFO  (coreLoadExecutor-1699-thread-1) [    ] o.a.s.c.SolrResourceLoader JNDI not configured for solr (NoInitialContextEx)
   [junit4]   2> 506641 INFO  (coreLoadExecutor-1699-thread-1) [    ] o.a.s.c.SolrResourceLoader using system property solr.solr.home: /home/jenkins/workspace/Lucene-Solr-5.x-Linux/solr/core/src/test-files/solr
   [junit4]   2> 506641 INFO  (coreLoadExecutor-1699-thread-1) [    ] o.a.s.c.SolrResourceLoader Adding 'file:/home/jenkins/workspace/Lucene-Solr-5.x-Linux/solr/core/src/test-files/solr/collection1/lib/classes/' to classloader
   [junit4]   2> 506641 INFO  (coreLoadExecutor-1699-thread-1) [    ] o.a.s.c.SolrResourceLoader Adding 'file:/home/jenkins/workspace/Lucene-Solr-5.x-Linux/solr/core/src/test-files/solr/collection1/lib/README' to classloader
   [junit4]   2> 506659 INFO  (coreLoadExecutor-1699-thread-1) [    ] o.a.s.c.SolrConfig current version of requestparams : -1
   [junit4]   2> 506667 INFO  (coreLoadExecutor-1699-thread-1) [    ] o.a.s.c.SolrConfig Using Lucene MatchVersion: 5.5.0
   [junit4]   2> 506682 INFO  (coreLoadExecutor-1699-thread-1) [    ] o.a.s.c.SolrConfig Loaded SolrConfig: solrconfig-basic.xml
   [junit4]   2> 506685 INFO  (coreLoadExecutor-1699-thread-1) [    ] o.a.s.s.IndexSchema [collection1] Schema name=minimal
   [junit4]   2> 506688 WARN  (coreLoadExecutor-1699-thread-1) [    ] o.a.s.s.IndexSchema no uniqueKey specified in schema.
   [junit4]   2> 506689 INFO  (coreLoadExecutor-1699-thread-1) [    ] o.a.s.c.ConfigSetProperties Did not find ConfigSet properties, assuming default properties: Can't find resource 'configsetprops.json' in classpath or '/home/jenkins/workspace/Lucene-Solr-5.x-Linux/solr/core/src/test-files/solr/collection1'
   [junit4]   2> 506689 INFO  (coreLoadExecutor-1699-thread-1) [    ] o.a.s.c.CoreContainer Creating SolrCore 'collection1' using configuration from instancedir /home/jenkins/workspace/Lucene-Solr-5.x-Linux/solr/core/src/test-files/solr/collection1
   [junit4]   2> 506690 INFO  (coreLoadExecutor-1699-thread-1) [    x:collection1] o.a.s.c.SolrCore solr.StandardDirectoryFactory
   [junit4]   2> 506690 INFO  (coreLoadExecutor-1699-thread-1) [    x:collection1] o.a.s.c.SolrCore [[collection1] ] Opening new SolrCore at [/home/jenkins/workspace/Lucene-Solr-5.x-Linux/solr/core/src/test-files/solr/collection1], dataDir=[/home/jenkins/workspace/Lucene-Solr-5.x-Linux/solr/build/solr-core/test/J1/temp/solr.core.TestNRTOpen_6444A7AFAD933FD3-001/init-core-data-001/]
   [junit4]   2> 506690 INFO  (coreLoadExecutor-1699-thread-1) [    x:collection1] o.a.s.c.SolrCore JMX monitoring not detected for core: collection1
   [junit4]   2> 506690 INFO  (coreLoadExecutor-1699-thread-1) [    x:collection1] o.a.s.c.CachingDirectoryFactory return new directory for /home/jenkins/workspace/Lucene-Solr-5.x-Linux/solr/build/solr-core/test/J1/temp/solr.core.TestNRTOpen_6444A7AFAD933FD3-001/init-core-data-001
   [junit4]   2> 506690 INFO  (coreLoadExecutor-1699-thread-1) [    x:collection1] o.a.s.c.SolrCore New index directory detected: old=null new=/home/jenkins/workspace/Lucene-Solr-5.x-Linux/solr/build/solr-core/test/J1/temp/solr.core.TestNRTOpen_6444A7AFAD933FD3-001/init-core-data-001/index/
   [junit4]   2> 506690 WARN  (coreLoadExecutor-1699-thread-1) [    x:collection1] o.a.s.c.SolrCore [collection1] Solr index directory '/home/jenkins/workspace/Lucene-Solr-5.x-Linux/solr/build/solr-core/test/J1/temp/solr.core.TestNRTOpen_6444A7AFAD933FD3-001/init-core-data-001/index' doesn't exist. Creating new index...
   [junit4]   2> 506690 INFO  (coreLoadExecutor-1699-thread-1) [    x:collection1] o.a.s.c.CachingDirectoryFactory return new directory for /home/jenkins/workspace/Lucene-Solr-5.x-Linux/solr/build/solr-core/test/J1/temp/solr.core.TestNRTOpen_6444A7AFAD933FD3-001/init-core-data-001/index
   [junit4]   2> 506691 INFO  (coreLoadExecutor-1699-thread-1) [    x:collection1] o.a.s.u.RandomMergePolicy RandomMergePolicy wrapping class org.apache.lucene.index.MockRandomMergePolicy: org.apache.lucene.index.MockRandomMergePolicy@b3f8bb
   [junit4]   2> 506752 INFO  (coreLoadExecutor-1699-thread-1) [    x:collection1] o.a.s.c.SolrDeletionPolicy SolrDeletionPolicy.onCommit: commits: num=1
   [junit4]   2> 	commit{dir=/home/jenkins/workspace/Lucene-Solr-5.x-Linux/solr/build/solr-core/test/J1/temp/solr.core.TestNRTOpen_6444A7AFAD933FD3-001/init-core-data-001/index,segFN=segments_1,generation=1}
   [junit4]   2> 506752 INFO  (coreLoadExecutor-1699-thread-1) [    x:collection1] o.a.s.c.SolrDeletionPolicy newest commit generation = 1
   [junit4]   2> 506753 INFO  (OldIndexDirectoryCleanupThreadForCore-collection1) [    x:collection1] o.a.s.c.SolrCore Looking for old index directories to cleanup for core collection1 in /home/jenkins/workspace/Lucene-Solr-5.x-Linux/solr/build/solr-core/test/J1/temp/solr.core.TestNRTOpen_6444A7AFAD933FD3-001/init-core-data-001/
   [junit4]   2> 506754 INFO  (coreLoadExecutor-1699-thread-1) [    x:collection1] o.a.s.c.SolrCore no updateRequestProcessorChain defined as default, creating implicit default
   [junit4]   2> 506756 INFO  (coreLoadExecutor-1699-thread-1) [    x:collection1] o.a.s.h.l.XMLLoader xsltCacheLifetimeSeconds=60
   [junit4]   2> 506757 INFO  (coreLoadExecutor-1699-thread-1) [    x:collection1] o.a.s.h.l.XMLLoader xsltCacheLifetimeSeconds=60
   [junit4]   2> 506758 INFO  (coreLoadExecutor-1699-thread-1) [    x:collection1] o.a.s.h.l.XMLLoader xsltCacheLifetimeSeconds=60
   [junit4]   2> 506758 INFO  (coreLoadExecutor-1699-thread-1) [    x:collection1] o.a.s.h.l.XMLLoader xsltCacheLifetimeSeconds=60
   [junit4]   2> 506759 INFO  (coreLoadExecutor-1699-thread-1) [    x:collection1] o.a.s.c.RequestHandlers Registered paths: /update/json/docs,/admin/properties,/admin/file,/update,/admin/threads,/schema,/admin/plugins,/get,/admin/segments,/config,/admin/luke,/update/json,/admin/ping,/admin/logging,standard,/replication,/update/csv,/admin/system,/admin/mbeans
   [junit4]   2> 506760 INFO  (coreLoadExecutor-1699-thread-1) [    x:collection1] o.a.s.c.SolrCore Using default statsCache cache: org.apache.solr.search.stats.LocalStatsCache
   [junit4]   2> 506760 INFO  (coreLoadExecutor-1699-thread-1) [    x:collection1] o.a.s.u.CommitTracker Hard AutoCommit: disabled
   [junit4]   2> 506760 INFO  (coreLoadExecutor-1699-thread-1) [    x:collection1] o.a.s.u.CommitTracker Soft AutoCommit: disabled
   [junit4]   2> 506761 INFO  (coreLoadExecutor-1699-thread-1) [    x:collection1] o.a.s.u.RandomMergePolicy RandomMergePolicy wrapping class org.apache.lucene.index.TieredMergePolicy: [TieredMergePolicy: maxMergeAtOnce=32, maxMergeAtOnceExplicit=34, maxMergedSegmentMB=68.4541015625, floorSegmentMB=1.931640625, forceMergeDeletesPctAllowed=3.4624987752439518, segmentsPerTier=23.0, maxCFSSegmentSizeMB=8.796093022207999E12, noCFSRatio=1.0
   [junit4]   2> 506761 INFO  (coreLoadExecutor-1699-thread-1) [    x:collection1] o.a.s.c.SolrDeletionPolicy SolrDeletionPolicy.onInit: commits: num=1
   [junit4]   2> 	commit{dir=/home/jenkins/workspace/Lucene-Solr-5.x-Linux/solr/build/solr-core/test/J1/temp/solr.core.TestNRTOpen_6444A7AFAD933FD3-001/init-core-data-001/index,segFN=segments_1,generation=1}
   [junit4]   2> 506761 INFO  (coreLoadExecutor-1699-thread-1) [    x:collection1] o.a.s.c.SolrDeletionPolicy newest commit generation = 1
   [junit4]   2> 506761 INFO  (coreLoadExecutor-1699-thread-1) [    x:collection1] o.a.s.s.SolrIndexSearcher Opening Searcher@10147fa[collection1] main
   [junit4]   2> 506761 WARN  (coreLoadExecutor-1699-thread-1) [    x:collection1] o.a.s.r.ManagedResourceStorage Cannot write to config directory /home/jenkins/workspace/Lucene-Solr-5.x-Linux/solr/core/src/test-files/solr/collection1/conf; switching to use InMemory storage instead.
   [junit4]   2> 506761 INFO  (coreLoadExecutor-1699-thread-1) [    x:collection1] o.a.s.r.RestManager Initializing RestManager with initArgs: {}
   [junit4]   2> 506761 INFO  (coreLoadExecutor-1699-thread-1) [    x:collection1] o.a.s.r.ManagedResourceStorage Reading _rest_managed.json using InMemoryStorage
   [junit4]   2> 506761 INFO  (coreLoadExecutor-1699-thread-1) [    x:collection1] o.a.s.r.RestManager Initializing 0 registered ManagedResources
   [junit4]   2> 506761 INFO  (coreLoadExecutor-1699-thread-1) [    x:collection1] o.a.s.h.ReplicationHandler Commits will be reserved for  10000
   [junit4]   2> 506761 INFO  (searcherExecutor-1700-thread-1-processing-x:collection1) [    x:collection1] o.a.s.c.SolrCore [collection1] Registered new searcher Searcher@10147fa[collection1] main{ExitableDirectoryReader(UninvertingDirectoryReader())}
   [junit4]   2> 506762 INFO  (coreLoadExecutor-1699-thread-1) [    x:collection1] o.a.s.c.CoreContainer registering core: collection1
   [junit4]   2> 506762 INFO  (SUITE-TestNRTOpen-seed#[6444A7AFAD933FD3]-worker) [    ] o.a.s.SolrTestCaseJ4 ####initCore end
   [junit4]   2> 506764 INFO  (SUITE-TestNRTOpen-seed#[6444A7AFAD933FD3]-worker) [    ] o.a.s.u.p.LogUpdateProcessorFactory [collection1]  webapp=null path=null params={}{add=[(null)]} 0 1
   [junit4]   2> 506765 INFO  (SUITE-TestNRTOpen-seed#[6444A7AFAD933FD3]-worker) [    ] o.a.s.u.DirectUpdateHandler2 start commit{,optimize=false,openSearcher=true,waitSearcher=true,expungeDeletes=false,softCommit=false,prepareCommit=false}
   [junit4]   2> 506917 INFO  (SUITE-TestNRTOpen-seed#[6444A7AFAD933FD3]-worker) [    ] o.a.s.c.SolrDeletionPolicy SolrDeletionPolicy.onCommit: commits: num=2
   [junit4]   2> 	commit{dir=/home/jenkins/workspace/Lucene-Solr-5.x-Linux/solr/build/solr-core/test/J1/temp/solr.core.TestNRTOpen_6444A7AFAD933FD3-001/init-core-data-001/index,segFN=segments_1,generation=1}
   [junit4]   2> 	commit{dir=/home/jenkins/workspace/Lucene-Solr-5.x-Linux/solr/build/solr-core/test/J1/temp/solr.core.TestNRTOpen_6444A7AFAD933FD3-001/init-core-data-001/index,segFN=segments_2,generation=2}
   [junit4]   2> 506918 INFO  (SUITE-TestNRTOpen-seed#[6444A7AFAD933FD3]-worker) [    ] o.a.s.c.SolrDeletionPolicy newest commit generation = 2
   [junit4]   2> 506919 INFO  (SUITE-TestNRTOpen-seed#[6444A7AFAD933FD3]-worker) [    ] o.a.s.s.SolrIndexSearcher Opening Searcher@cbc09d[collection1] main
   [junit4]   2> 506919 INFO  (SUITE-TestNRTOpen-seed#[6444A7AFAD933FD3]-worker) [    ] o.a.s.u.DirectUpdateHandler2 end_commit_flush
   [junit4]   2> 506919 INFO  (searcherExecutor-1700-thread-1) [    ] o.a.s.c.SolrCore [collection1] Registered new searcher Searcher@cbc09d[collection1] main{ExitableDirectoryReader(UninvertingDirectoryReader(Uninverting(_0(5.5.0):C1)))}
   [junit4]   2> 506919 INFO  (SUITE-TestNRTOpen-seed#[6444A7AFAD933FD3]-worker) [    ] o.a.s.u.p.LogUpdateProcessorFactory [collection1]  webapp=null path=null params={}{commit=} 0 154
   [junit4]   2> 506920 INFO  (SUITE-TestNRTOpen-seed#[6444A7AFAD933FD3]-worker) [    ] o.a.s.SolrTestCaseJ4 ###deleteCore
   [junit4]   2> 506920 INFO  (SUITE-TestNRTOpen-seed#[6444A7AFAD933FD3]-worker) [    ] o.a.s.c.CoreContainer Shutting down CoreContainer instance=16537995
   [junit4]   2> 506921 INFO  (coreCloseExecutor-1704-thread-1) [    x:collection1] o.a.s.c.SolrCore [collection1]  CLOSING SolrCore org.apache.solr.core.SolrCore@1d6ccb0
   [junit4]   2> 506921 INFO  (coreCloseExecutor-1704-thread-1) [    x:collection1] o.a.s.u.DirectUpdateHandler2 closing DirectUpdateHandler2{commits=1,autocommits=0,soft autocommits=0,optimizes=0,rollbacks=0,expungeDeletes=0,docsPending=0,adds=0,deletesById=0,deletesByQuery=0,errors=0,cumulative_adds=1,cumulative_deletesById=0,cumulative_deletesByQuery=0,cumulative_errors=0}
   [junit4]   2> 506921 INFO  (coreCloseExecutor-1704-thread-1) [    x:collection1] o.a.s.u.SolrCoreState Closing SolrCoreState
   [junit4]   2> 506921 INFO  (coreCloseExecutor-1704-thread-1) [    x:collection1] o.a.s.u.DefaultSolrCoreState SolrCoreState ref count has reached 0 - closing IndexWriter
   [junit4]   2> 506921 INFO  (coreCloseExecutor-1704-thread-1) [    x:collection1] o.a.s.u.DefaultSolrCoreState closing IndexWriter with IndexWriterCloser
   [junit4]   2> 506922 INFO  (coreCloseExecutor-1704-thread-1) [    x:collection1] o.a.s.c.SolrCore [collection1] Closing main searcher on request.
   [junit4]   2> 506922 INFO  (coreCloseExecutor-1704-thread-1) [    x:collection1] o.a.s.c.CachingDirectoryFactory Closing StandardDirectoryFactory - 2 directories currently being tracked
   [junit4]   2> 506922 INFO  (coreCloseExecutor-1704-thread-1) [    x:collection1] o.a.s.c.CachingDirectoryFactory looking to close /home/jenkins/workspace/Lucene-Solr-5.x-Linux/solr/build/solr-core/test/J1/temp/solr.core.TestNRTOpen_6444A7AFAD933FD3-001/init-core-data-001 [CachedDir<<refCount=0;path=/home/jenkins/workspace/Lucene-Solr-5.x-Linux/solr/build/solr-core/test/J1/temp/solr.core.TestNRTOpen_6444A7AFAD933FD3-001/init-core-data-001;done=false>>]
   [junit4]   2> 506922 INFO  (coreCloseExecutor-1704-thread-1) [    x:collection1] o.a.s.c.CachingDirectoryFactory Closing directory: /home/jenkins/workspace/Lucene-Solr-5.x-Linux/solr/build/solr-core/test/J1/temp/solr.core.TestNRTOpen_6444A7AFAD933FD3-001/init-core-data-001
   [junit4]   2> 506922 INFO  (coreCloseExecutor-1704-thread-1) [    x:collection1] o.a.s.c.CachingDirectoryFactory looking to close /home/jenkins/workspace/Lucene-Solr-5.x-Linux/solr/build/solr-core/test/J1/temp/solr.core.TestNRTOpen_6444A7AFAD933FD3-001/init-core-data-001/index [CachedDir<<refCount=0;path=/home/jenkins/workspace/Lucene-Solr-5.x-Linux/solr/build/solr-core/test/J1/temp/solr.core.TestNRTOpen_6444A7AFAD933FD3-001/init-core-data-001/index;done=false>>]
   [junit4]   2> 506922 INFO  (coreCloseExecutor-1704-thread-1) [    x:collection1] o.a.s.c.CachingDirectoryFactory Closing directory: /home/jenkins/workspace/Lucene-Solr-5.x-Linux/solr/build/solr-core/test/J1/temp/solr.core.TestNRTOpen_6444A7AFAD933FD3-001/init-core-data-001/index
   [junit4]   2> 506923 INFO  (SUITE-TestNRTOpen-seed#[6444A7AFAD933FD3]-worker) [    ] o.a.s.SolrTestCaseJ4 ####initCore
   [junit4]   2> 506923 INFO  (SUITE-TestNRTOpen-seed#[6444A7AFAD933FD3]-worker) [    ] o.a.s.c.SolrResourceLoader new SolrResourceLoader for directory: '/home/jenkins/workspace/Lucene-Solr-5.x-Linux/solr/core/src/test-files/solr/collection1'
   [junit4]   2> 506923 INFO  (SUITE-TestNRTOpen-seed#[6444A7AFAD933FD3]-worker) [    ] o.a.s.c.SolrResourceLoader JNDI not configured for solr (NoInitialContextEx)
   [junit4]   2> 506923 INFO  (SUITE-TestNRTOpen-seed#[6444A7AFAD933FD3]-worker) [    ] o.a.s.c.SolrResourceLoader using system property solr.solr.home: /home/jenkins/workspace/Lucene-Solr-5.x-Linux/solr/core/src/test-files/solr
   [junit4]   2> 506923 INFO  (SUITE-TestNRTOpen-seed#[6444A7AFAD933FD3]-worker) [    ] o.a.s.c.SolrResourceLoader Adding 'file:/home/jenkins/workspace/Lucene-Solr-5.x-Linux/solr/core/src/test-files/solr/collection1/lib/classes/' to classloader
   [junit4]   2> 506923 INFO  (SUITE-TestNRTOpen-seed#[6444A7AFAD933FD3]-worker) [    ] o.a.s.c.SolrResourceLoader Adding 'file:/home/jenkins/workspace/Lucene-Solr-5.x-Linux/solr/core/src/test-files/solr/collection1/lib/README' to classloader
   [junit4]   2> 506940 INFO  (SUITE-TestNRTOpen-seed#[6444A7AFAD933FD3]-worker) [    ] o.a.s.c.SolrConfig current version of requestparams : -1
   [junit4]   2> 506948 INFO  (SUITE-TestNRTOpen-seed#[6444A7AFAD933FD3]-worker) [    ] o.a.s.c.SolrConfig Using Lucene MatchVersion: 5.5.0
   [junit4]   2> 506962 INFO  (SUITE-TestNRTOpen-seed#[6444A7AFAD933FD3]-worker) [    ] o.a.s.c.SolrConfig Loaded SolrConfig: solrconfig-basic.xml
   [junit4]   2> 506965 INFO  (SUITE-TestNRTOpen-seed#[6444A7AFAD933FD3]-worker) [    ] o.a.s.s.IndexSchema [null] Schema name=minimal
   [junit4]   2> 506968 WARN  (SUITE-TestNRTOpen-seed#[6444A7AFAD933FD3]-worker) [    ] o.a.s.s.IndexSchema no uniqueKey specified in schema.
   [junit4]   2> 506969 INFO  (SUITE-TestNRTOpen-seed#[6444A7AFAD933FD3]-worker) [    ] o.a.s.c.SolrResourceLoader JNDI not configured for solr (NoInitialContextEx)
   [junit4]   2> 506969 INFO  (SUITE-TestNRTOpen-seed#[6444A7AFAD933FD3]-worker) [    ] o.a.s.c.SolrResourceLoader using system property solr.solr.home: /home/jenkins/workspace/Lucene-Solr-5.x-Linux/solr/core/src/test-files/solr
   [junit4]   2> 506969 INFO  (SUITE-TestNRTOpen-seed#[6444A7AFAD933FD3]-worker) [    ] o.a.s.c.SolrResourceLoader new SolrResourceLoader for directory: '/home/jenkins/workspace/Lucene-Solr-5.x-Linux/solr/core/src/test-files/solr'
   [junit4]   2> 506969 INFO  (SUITE-TestNRTOpen-seed#[6444A7AFAD933FD3]-worker) [    ] o.a.s.c.SolrResourceLoader JNDI not configured for solr (NoInitialContextEx)
   [junit4]   2> 506969 INFO  (SUITE-TestNRTOpen-seed#[6444A7AFAD933FD3]-worker) [    ] o.a.s.c.SolrResourceLoader using system property solr.solr.home: /home/jenkins/workspace/Lucene-Solr-5.x-Linux/solr/core/src/test-files/solr
   [junit4]   2> 506969 INFO  (SUITE-TestNRTOpen-seed#[6444A7AFAD933FD3]-worker) [    ] o.a.s.c.CoreContainer New CoreContainer 29446291
   [junit4]   2> 506969 INFO  (SUITE-TestNRTOpen-seed#[6444A7AFAD933FD3]-worker) [    ] o.a.s.c.CoreContainer Loading cores into CoreContainer [instanceDir=/home/jenkins/workspace/Lucene-Solr-5.x-Linux/solr/core/src/test-files/solr]
   [junit4]   2> 506969 WARN  (SUITE-TestNRTOpen-seed#[6444A7AFAD933FD3]-worker) [    ] o.a.s.c.CoreContainer Couldn't add files from /home/jenkins/workspace/Lucene-Solr-5.x-Linux/solr/core/src/test-files/solr/lib to classpath: /home/jenkins/workspace/Lucene-Solr-5.x-Linux/solr/core/src/test-files/solr/lib
   [junit4]   2> 506969 INFO  (SUITE-TestNRTOpen-seed#[6444A7AFAD933FD3]-worker) [    ] o.a.s.h.c.HttpShardHandlerFactory created with socketTimeout : 600000,connTimeout : 60000,maxConnectionsPerHost : 20,maxConnections : 10000,corePoolSize : 0,maximumPoolSize : 2147483647,maxThreadIdleTime : 5,sizeOfQueue : -1,fairnessPolicy : false,useRetries : false,
   [junit4]   2> 506970 INFO  (SUITE-TestNRTOpen-seed#[6444A7AFAD933FD3]-worker) [    ] o.a.s.u.UpdateShardHandler Creating UpdateShardHandler HTTP client with params: socketTimeout=30000&connTimeout=30000&retry=true
   [junit4]   2> 506970 INFO  (SUITE-TestNRTOpen-seed#[6444A7AFAD933FD3]-worker) [    ] o.a.s.l.LogWatcher SLF4J impl is org.slf4j.impl.Log4jLoggerFactory
   [junit4]   2> 506970 INFO  (SUITE-TestNRTOpen-seed#[6444A7AFAD933FD3]-worker) [    ] o.a.s.l.LogWatcher Registering Log Listener [Log4j (org.slf4j.impl.Log4jLoggerFactory)]
   [junit4]   2> 506971 INFO  (SUITE-TestNRTOpen-seed#[6444A7AFAD933FD3]-worker) [    ] o.a.s.c.CoreContainer Security conf doesn't exist. Skipping setup for authorization module.
   [junit4]   2> 506971 INFO  (SUITE-TestNRTOpen-seed#[6444A7AFAD933FD3]-worker) [    ] o.a.s.c.CoreContainer No authentication plugin used.
   [junit4]   2> 506971 INFO  (SUITE-TestNRTOpen-seed#[6444A7AFAD933FD3]-worker) [    ] o.a.s.c.CoreDescriptor Created CoreDescriptor: {schema=schema-minimal.xml, config=solrconfig-basic.xml, collection=collection1, dataDir=/home/jenkins/workspace/Lucene-Solr-5.x-Linux/solr/build/solr-core/test/J1/temp/solr.core.TestNRTOpen_6444A7AFAD933FD3-001/init-core-data-001, configSetProperties=configsetprops.json, shard=shard1, loadOnStartup=true, transient=false, name=collection1}
   [junit4]   2> 506971 INFO  (coreLoadExecutor-1710-thread-1) [    ] o.a.s.c.SolrResourceLoader new SolrResourceLoader for directory: '/home/jenkins/workspace/Lucene-Solr-5.x-Linux/solr/core/src/test-files/solr/collection1'
   [junit4]   2> 506972 INFO  (coreLoadExecutor-1710-thread-1) [    ] o.a.s.c.SolrResourceLoader JNDI not configured for solr (NoInitialContextEx)
   [junit4]   2> 506972 INFO  (coreLoadExecutor-1710-thread-1) [    ] o.a.s.c.SolrResourceLoader using system property solr.solr.home: /home/jenkins/workspace/Lucene-Solr-5.x-Linux/solr/core/src/test-files/solr
   [junit4]   2> 506972 INFO  (coreLoadExecutor-1710-thread-1) [    ] o.a.s.c.SolrResourceLoader Adding 'file:/home/jenkins/workspace/Lucene-Solr-5.x-Linux/solr/core/src/test-files/solr/collection1/lib/classes/' to classloader
   [junit4]   2> 506972 INFO  (coreLoadExecutor-1710-thread-1) [    ] o.a.s.c.SolrResourceLoader Adding 'file:/home/jenkins/workspace/Lucene-Solr-5.x-Linux/solr/core/src/test-files/solr/collection1/lib/README' to classloader
   [junit4]   2> 506989 INFO  (coreLoadExecutor-1710-thread-1) [    ] o.a.s.c.SolrConfig current version of requestparams : -1
   [junit4]   2> 506996 INFO  (coreLoadExecutor-1710-thread-1) [    ] o.a.s.c.SolrConfig Using Lucene MatchVersion: 5.5.0
   [junit4]   2> 507011 INFO  (coreLoadExecutor-1710-thread-1) [    ] o.a.s.c.SolrConfig Loaded SolrConfig: solrconfig-basic.xml
   [junit4]   2> 507014 INFO  (coreLoadExecutor-1710-thread-1) [    ] o.a.s.s.IndexSchema [collection1] Schema name=minimal
   [junit4]   2> 507017 WARN  (coreLoadExecutor-1710-thread-1) [    ] o.a.s.s.IndexSchema no uniqueKey specified in schema.
   [junit4]   2> 507018 INFO  (coreLoadExecutor-1710-thread-1) [    ] o.a.s.c.ConfigSetProperties Did not find ConfigSet properties, assuming default properties: Can't find resource 'configsetprops.json' in classpath or '/home/jenkins/workspace/Lucene-Solr-5.x-Linux/solr/core/src/test-files/solr/collection1'
   [junit4]   2> 507018 INFO  (coreLoadExecutor-1710-thread-1) [    ] o.a.s.c.CoreContainer Creating SolrCore 'collection1' using configuration from instancedir /home/jenkins/workspace/Lucene-Solr-5.x-Linux/solr/core/src/test-files/solr/collection1
   [junit4]   2> 507019 INFO  (coreLoadExecutor-1710-thread-1) [    x:collection1] o.a.s.c.SolrCore solr.StandardDirectoryFactory
   [junit4]   2> 507019 INFO  (coreLoadExecutor-1710-thread-1) [    x:collection1] o.a.s.c.SolrCore [[collection1] ] Opening new SolrCore at [/home/jenkins/workspace/Lucene-Solr-5.x-Linux/solr/core/src/test-files/solr/collection1], dataDir=[/home/jenkins/workspace/Lucene-Solr-5.x-Linux/solr/build/solr-core/test/J1/temp/solr.core.TestNRTOpen_6444A7AFAD933FD3-001/init-core-data-001/]
   [junit4]   2> 507019 INFO  (coreLoadExecutor-1710-thread-1) [    x:collection1] o.a.s.c.SolrCore JMX monitoring not detected for core: collection1
   [junit4]   2> 507019 INFO  (coreLoadExecutor-1710-thread-1) [    x:collection1] o.a.s.c.CachingDirectoryFactory return new directory for /home/jenkins/workspace/Lucene-Solr-5.x-Linux/solr/build/solr-core/test/J1/temp/solr.core.TestNRTOpen_6444A7AFAD933FD3-001/init-core-data-001
   [junit4]   2> 507019 INFO  (coreLoadExecutor-1710-thread-1) [    x:collection1] o.a.s.c.SolrCore New index directory detected: old=null new=/home/jenkins/workspace/Lucene-Solr-5.x-Linux/solr/build/solr-core/test/J1/temp/solr.core.TestNRTOpen_6444A7AFAD933FD3-001/init-core-data-001/index/
   [junit4]   2> 507020 INFO  (OldIndexDirectoryCleanupThreadForCore-collection1) [    x:collection1] o.a.s.c.SolrCore Looking for old index directories to cleanup for core collection1 in /home/jenkins/workspace/Lucene-Solr-5.x-Linux/solr/build/solr-core/test/J1/temp/solr.core.TestNRTOpen_6444A7AFAD933FD3-001/init-core-data-001/
   [junit4]   2> 507021 INFO  (coreLoadExecutor-1710-thread-1) [    x:collection1] o.a.s.c.SolrCore no updateRequestProcessorChain defined as default, creating implicit default
   [junit4]   2> 507023 INFO  (coreLoadExecutor-1710-thread-1) [    x:collection1] o.a.s.h.l.XMLLoader xsltCacheLifetimeSeconds=60
   [junit4]   2> 507023 INFO  (coreLoadExecutor-1710-thread-1) [    x:collection1] o.a.s.h.l.XMLLoader xsltCacheLifetimeSeconds=60
   [junit4]   2> 507024 INFO  (coreLoadExecutor-1710-thread-1) [    x:collection1] o.a.s.h.l.XMLLoader xsltCacheLifetimeSeconds=60
   [junit4]   2> 507025 INFO  (coreLoadExecutor-1710-thread-1) [    x:collection1] o.a.s.h.l.XMLLoader xsltCacheLifetimeSeconds=60
   [junit4]   2> 507025 INFO  (coreLoadExecutor-1710-thread-1) [    x:collection1] o.a.s.c.RequestHandlers Registered paths: /update/json/docs,/admin/properties,/admin/file,/update,/admin/threads,/schema,/admin/plugins,/get,/admin/segments,/config,/admin/luke,/update/json,/admin/ping,/admin/logging,standard,/replication,/update/csv,/admin/system,/admin/mbeans
   [junit4]   2> 507026 INFO  (coreLoadExecutor-1710-thread-1) [    x:collection1] o.a.s.c.SolrCore Using default statsCache cache: org.apache.solr.search.stats.LocalStatsCache
   [junit4]   2> 507026 INFO  (coreLoadExecutor-1710-thread-1) [    x:collection1] o.a.s.u.CommitTracker Hard AutoCommit: disabled
   [junit4]   2> 507026 INFO  (coreLoadExecutor-1710-thread-1) [    x:collection1] o.a.s.u.CommitTracker Soft AutoCommit: disabled
   [junit4]   2> 507026 INFO  (coreLoadExecutor-1710-thread-1) [    x:collection1] o.a.s.c.CachingDirectoryFactory return new directory for /home/jenkins/workspace/Lucene-Solr-5.x-Linux/solr/build/solr-core/test/J1/temp/solr.core.TestNRTOpen_6444A7AFAD933FD3-001/init-core-data-001/index
   [junit4]   2> 507027 INFO  (coreLoadExecutor-1710-thread-1) [    x:collection1] o.a.s.u.RandomMergePolicy RandomMergePolicy wrapping class org.apache.lucene.index.MockRandomMergePolicy: org.apache.lucene.index.MockRandomMergePolicy@e92a2
   [junit4]   2> 507027 INFO  (coreLoadExecutor-1710-thread-1) [    x:collection1] o.a.s.c.SolrDeletionPolicy SolrDeletionPolicy.onInit: commits: num=1
   [junit4]   2> 	commit{dir=/home/jenkins/workspace/Lucene-Solr-5.x-Linux/solr/build/solr-core/test/J1/temp/solr.core.TestNRTOpen_6444A7AFAD933FD3-001/init-core-data-001/index,segFN=segments_2,generation=2}
   [junit4]   2> 507027 INFO  (coreLoadExecutor-1710-thread-1) [    x:collection1] o.a.s.c.SolrDeletionPolicy newest commit generation = 2
   [junit4]   2> 507028 INFO  (coreLoadExecutor-1710-thread-1) [    x:collection1] o.a.s.s.SolrIndexSearcher Opening Searcher@15f2c7b[collection1] main
   [junit4]   2> 507029 WARN  (coreLoadExecutor-1710-thread-1) [    x:collection1] o.a.s.r.ManagedResourceStorage Cannot write to config directory /home/jenkins/workspace/Lucene-Solr-5.x-Linux/solr/core/src/test-files/solr/collection1/conf; switching to use InMemory storage instead.
   [junit4]   2> 507029 INFO  (coreLoadExecutor-1710-thread-1) [    x:collection1] o.a.s.r.RestManager Initializing RestManager with initArgs: {}
   [junit4]   2> 507029 INFO  (coreLoadExecutor-1710-thread-1) [    x:collection1] o.a.s.r.ManagedResourceStorage Reading _rest_managed.json using InMemoryStorage
   [junit4]   2> 507029 INFO  (coreLoadExecutor-1710-thread-1) [    x:collection1] o.a.s.r.RestManager Initializing 0 registered ManagedResources
   [junit4]   2> 507029 INFO  (coreLoadExecutor-1710-thread-1) [    x:collection1] o.a.s.h.ReplicationHandler Commits will be reserved for  10000
   [junit4]   2> 507029 INFO  (searcherExecutor-1711-thread-1-processing-x:collection1) [    x:collection1] o.a.s.c.SolrCore [collection1] Registered new searcher Searcher@15f2c7b[collection1] main{ExitableDirectoryReader(UninvertingDirectoryReader(Uninverting(_0(5.5.0):C1)))}
   [junit4]   2> 507029 INFO  (coreLoadExecutor-1710-thread-1) [    x:collection1] o.a.s.c.CoreContainer registering core: collection1
   [junit4]   2> 507030 INFO  (SUITE-TestNRTOpen-seed#[6444A7AFAD933FD3]-worker) [    ] o.a.s.SolrTestCaseJ4 ####initCore end
   [junit4]   2> 507033 INFO  (TEST-TestNRTOpen.testSharedCores-seed#[6444A7AFAD933FD3]) [    ] o.a.s.SolrTestCaseJ4 ###Starting testSharedCores
   [junit4]   2> 507033 INFO  (TEST-TestNRTOpen.testSharedCores-seed#[6444A7AFAD933FD3]) [    ] o.a.s.u.DirectUpdateHandler2 [collection1] REMOVING ALL DOCUMENTS FROM INDEX
   [junit4]   2> 507033 INFO  (TEST-TestNRTOpen.testSharedCores-seed#[6444A7AFAD933FD3]) [    ] o.a.s.u.p.LogUpdateProcessorFactory [collection1]  webapp=null path=null params={}{deleteByQuery=*:*} 0 0
   [junit4]   2> 507034 INFO  (TEST-TestNRTOpen.testSharedCores-seed#[6444A7AFAD933FD3]) [    ] o.a.s.u.p.LogUpdateProcessorFactory [collection1]  webapp=null path=null params={}{add=[(null)]} 0 0
   [junit4]   2> 507035 INFO  (TEST-TestNRTOpen.testSharedCores-seed#[6444A7AFAD933FD3]) [    ] o.a.s.u.DirectUpdateHandler2 start commit{,optimize=false,openSearcher=true,waitSearcher=true,expungeDeletes=false,softCommit=false,prepareCommit=false}
   [junit4]   2> 507110 INFO  (TEST-TestNRTOpen.testSharedCores-seed#[6444A7AFAD933FD3]) [    ] o.a.s.c.SolrDeletionPolicy SolrDeletionPolicy.onCommit: commits: num=2
   [junit4]   2> 	commit{dir=/home/jenkins/workspace/Lucene-Solr-5.x-Linux/solr/build/solr-core/test/J1/temp/solr.core.TestNRTOpen_6444A7AFAD933FD3-001/init-core-data-001/index,segFN=segments_2,generation=2}
   [junit4]   2> 	commit{dir=/home/jenkins/workspace/Lucene-Solr-5.x-Linux/solr/build/solr-core/test/J1/temp/solr.core.TestNRTOpen_6444A7AFAD933FD3-001/init-core-data-001/index,segFN=segments_3,generation=3}
   [junit4]   2> 507110 INFO  (TEST-TestNRTOpen.testSharedCores-seed#[6444A7AFAD933FD3]) [    ] o.a.s.c.SolrDeletionPolicy newest commit generation = 3
   [junit4]   2> 507112 INFO  (TEST-TestNRTOpen.testSharedCores-seed#[6444A7AFAD933FD3]) [    ] o.a.s.s.SolrIndexSearcher Opening Searcher@751f36[collection1] main
   [junit4]   2> 507112 INFO  (TEST-TestNRTOpen.testSharedCores-seed#[6444A7AFAD933FD3]) [    ] o.a.s.u.DirectUpdateHandler2 end_commit_flush
   [junit4]   2> 507112 INFO  (searcherExecutor-1711-thread-1) [    ] o.a.s.c.SolrCore [collection1] Registered new searcher Searcher@751f36[collection1] main{ExitableDirectoryReader(UninvertingDirectoryReader(Uninverting(_1(5.5.0):C1)))}
   [junit4]   2> 507112 INFO  (TEST-TestNRTOpen.testSharedCores-seed#[6444A7AFAD933FD3]) [    ] o.a.s.u.p.LogUpdateProcessorFactory [collection1]  webapp=null path=null params={}{commit=} 0 77
   [junit4]   2> 507113 INFO  (TEST-TestNRTOpen.testSharedCores-seed#[6444A7AFAD933FD3]) [    ] o.a.s.u.DirectUpdateHandler2 start commit{,optimize=true,openSearcher=true,waitSearcher=true,expungeDeletes=false,softCommit=false,prepareCommit=false}
   [junit4]   2> 507113 INFO  (TEST-TestNRTOpen.testSharedCores-seed#[6444A7AFAD933FD3]) [    ] o.a.s.u.DirectUpdateHandler2 No uncommitted changes. Skipping IW.commit.
   [junit4]   2> 507113 INFO  (TEST-TestNRTOpen.testSharedCores-seed#[6444A7AFAD933FD3]) [    ] o.a.s.c.SolrCore SolrIndexSearcher has not changed - not re-opening: org.apache.solr.search.SolrIndexSearcher
   [junit4]   2> 507113 INFO  (TEST-TestNRTOpen.testSharedCores-seed#[6444A7AFAD933FD3]) [    ] o.a.s.u.DirectUpdateHandler2 end_commit_flush
   [junit4]   2> 507113 INFO  (TEST-TestNRTOpen.testSharedCores-seed#[6444A7AFAD933FD3]) [    ] o.a.s.u.p.LogUpdateProcessorFactory [collection1]  webapp=null path=null params={}{optimize=} 0 0
   [junit4]   2> 507114 INFO  (TEST-TestNRTOpen.testSharedCores-seed#[6444A7AFAD933FD3]) [    ] o.a.s.u.p.LogUpdateProcessorFactory [collection1]  webapp=null path=null params={}{add=[(null)]} 0 0
   [junit4]   2> 507115 INFO  (TEST-TestNRTOpen.testSharedCores-seed#[6444A7AFAD933FD3]) [    ] o.a.s.u.DirectUpdateHandler2 start commit{,optimize=false,openSearcher=true,waitSearcher=true,expungeDeletes=false,softCommit=true,prepareCommit=false}
   [junit4]   2> 507126 INFO  (TEST-TestNRTOpen.testSharedCores-seed#[6444A7AFAD933FD3]) [    ] o.a.s.s.SolrIndexSearcher Opening Searcher@4a6106[collection1] main
   [junit4]   2> 507126 INFO  (TEST-TestNRTOpen.testSharedCores-seed#[6444A7AFAD933FD3]) [    ] o.a.s.u.DirectUpdateHandler2 end_commit_flush
   [junit4]   2> 507126 INFO  (searcherExecutor-1711-thread-1) [    ] o.a.s.c.SolrCore [collection1] Registered new searcher Searcher@4a6106[collection1] main{ExitableDirectoryReader(UninvertingDirectoryReader(Uninverting(_1(5.5.0):C1) Uninverting(_2(5.5.0):C1)))}
   [junit4]   2> 507126 INFO  (TEST-TestNRTOpen.testSharedCores-seed#[6444A7AFAD933FD3]) [    ] o.a.s.u.p.LogUpdateProcessorFactory [collection1]  webapp=null path=null params={}{commit=} 0 11
   [junit4]   2> 507128 INFO  (TEST-TestNRTOpen.testSharedCores-seed#[6444A7AFAD933FD3]) [    ] o.a.s.u.p.LogUpdateProcessorFactory [collection1]  webapp=null path=null params={}{add=[(null)]} 0 0
   [junit4]   2> 507128 INFO  (TEST-TestNRTOpen.testSharedCores-seed#[6444A7AFAD933FD3]) [    ] o.a.s.u.p.LogUpdateProcessorFactory [collection1]  webapp=null path=null params={}{add=[(null)]} 0 0
   [junit4]   2> 507129 INFO  (TEST-TestNRTOpen.testSharedCores-seed#[6444A7AFAD933FD3]) [    ] o.a.s.u.DirectUpdateHandler2 start commit{,optimize=false,openSearcher=true,waitSearcher=true,expungeDeletes=false,softCommit=false,prepareCommit=false}
   [junit4]   2> 507304 INFO  (TEST-TestNRTOpen.testSharedCores-seed#[6444A7AFAD933FD3]) [    ] o.a.s.c.SolrDeletionPolicy SolrDeletionPolicy.onCommit: commits: num=2
   [junit4]   2> 	commit{dir=/home/jenkins/workspace/Lucene-Solr-5.x-Linux/solr/build/solr-core/test/J1/temp/solr.core.TestNRTOpen_6444A7AFAD933FD3-001/init-core-data-001/index,segFN=segments_3,generation=3}
   [junit4]   2> 	commit{dir=/home/jenkins/workspace/Lucene-Solr-5.x-Linux/solr/build/solr-core/test/J1/temp/solr.core.TestNRTOpen_6444A7AFAD933FD3-001/init-core-data-001/index,segFN=segments_4,generation=4}
   [junit4]   2> 507304 INFO  (TEST-TestNRTOpen.testSharedCores-seed#[6444A7AFAD933FD3]) [    ] o.a.s.c.SolrDeletionPolicy newest commit generation = 4
   [junit4]   2> 507305 INFO  (TEST-TestNRTOpen.testSharedCores-seed#[6444A7AFAD933FD3]) [    ] o.a.s.s.SolrIndexSearcher Opening Searcher@129b9bf[collection1] main
   [junit4]   2> 507305 INFO  (TEST-TestNRTOpen.testSharedCores-seed#[6444A7AFAD933FD3]) [    ] o.a.s.u.DirectUpdateHandler2 end_commit_flush
   [junit4]   2> 507305 INFO  (searcherExecutor-1711-thread-1) [    ] o.a.s.c.SolrCore [collection1] Registered new searcher Searcher@129b9bf[collection1] main{ExitableDirectoryReader(UninvertingDirectoryReader(Uninverting(_3(5.5.0):c2) Uninverting(_4(5.5.0):C2)))}
   [junit4]   2> 507306 INFO  (TEST-TestNRTOpen.testSharedCores-seed#[6444A7AFAD933FD3]) [    ] o.a.s.u.p.LogUpdateProcessorFactory [collection1]  webapp=null path=null params={}{commit=} 0 177
   [junit4]   2> 507307 INFO  (TEST-TestNRTOpen.testSharedCores-seed#[6444A7AFAD933FD3]) [    ] o.a.s.SolrTestCaseJ4 ###Ending testSharedCores
   [junit4]   2> NOTE: reproduce with: ant test  -Dtestcase=TestNRTOpen -Dtests.method=testSharedCores -Dtests.seed=6444A7AFAD933FD3 -Dtests.multiplier=3 -Dtests.slow=true -Dtests.locale=es-NI -Dtests.timezone=America/Costa_Rica -Dtests.asserts=true -Dtests.file.encoding=UTF-8
   [junit4] FAILURE 0.28s J1 | TestNRTOpen.testSharedCores <<<
   [junit4]    > Throwable #1: java.lang.AssertionError: expected:<3> but was:<2>
   [junit4]    > 	at __randomizedtesting.SeedInfo.seed([6444A7AFAD933FD3:8247EDE0256512DC]:0)
   [junit4]    > 	at org.apache.solr.core.TestNRTOpen.testSharedCores(TestNRTOpen.java:116)
   [junit4]    > 	at java.lang.Thread.run(Thread.java:745)
   [junit4]   2> 507311 INFO  (TEST-TestNRTOpen.testReaderIsNRT-seed#[6444A7AFAD933FD3]) [    ] o.a.s.SolrTestCaseJ4 ###Starting testReaderIsNRT
   [junit4]   2> 507311 INFO  (TEST-TestNRTOpen.testReaderIsNRT-seed#[6444A7AFAD933FD3]) [    ] o.a.s.u.DirectUpdateHandler2 [collection1] REMOVING ALL DOCUMENTS FROM INDEX
   [junit4]   2> 507311 INFO  (TEST-TestNRTOpen.testReaderIsNRT-seed#[6444A7AFAD933FD3]) [    ] o.a.s.u.p.LogUpdateProcessorFactory [collection1]  webapp=null path=null params={}{deleteByQuery=*:*} 0 0
   [junit4]   2> 507313 INFO  (TEST-TestNRTOpen.testReaderIsNRT-seed#[6444A7AFAD933FD3]) [    ] o.a.s.u.p.LogUpdateProcessorFactory [collection1]  webapp=null path=null params={}{add=[(null)]} 0 0
   [junit4]   2> 507313 INFO  (TEST-TestNRTOpen.testReaderIsNRT-seed#[6444A7AFAD933FD3]) [    ] o.a.s.u.DirectUpdateHandler2 start commit{,optimize=false,openSearcher=true,waitSearcher=true,expungeDeletes=false,softCommit=false,prepareCommit=false}
   [junit4]   2> 507441 INFO  (TEST-TestNRTOpen.testReaderIsNRT-seed#[6444A7AFAD933FD3]) [    ] o.a.s.c.SolrDeletionPolicy SolrDeletionPolicy.onCommit: commits: num=2
   [junit4]   2> 	commit{dir=/home/jenkins/workspace/Lucene-Solr-5.x-Linux/solr/build/solr-core/test/J1/temp/solr.core.TestNRTOpen_6444A7AFAD933FD3-001/init-core-data-001/index,segFN=segments_4,generation=4}
   [junit4]   2> 	commit{dir=/home/jenkins/workspace/Lucene-Solr-5.x-Linux/solr/build/solr-core/test/J1/temp/solr.core.TestNRTOpen_6444A7AFAD933FD3-001/init-core-data-001/index,segFN=segments_5,generation=5}
   [junit4]   2> 507441 INFO  (TEST-TestNRTOpen.testReaderIsNRT-seed#[6444A7AFAD933FD3]) [    ] o.a.s.c.SolrDeletionPolicy newest commit generation = 5
   [junit4]   2> 507442 INFO  (TEST-TestNRTOpen.testReaderIsNRT-seed#[6444A7AFAD933FD3]) [    ] o.a.s.s.SolrIndexSearcher Opening Searcher@105a99e[collection1] main
   [junit4]   2> 507442 INFO  (TEST-TestNRTOpen.testReaderIsNRT-seed#[6444A7AFAD933FD3]) [    ] o.a.s.u.DirectUpdateHandler2 end_commit_flush
   [junit4]   2> 507442 INFO  (searcherExecutor-1711-thread-1) [    ] o.a.s.c.SolrCore [collection1] Registered new searcher Searcher@105a99e[collection1] main{ExitableDirectoryReader(UninvertingDirectoryReader(Uninverting(_5(5.5.0):C1)))}
   [junit4]   2> 507443 INFO  (TEST-TestNRTOpen.testReaderIsNRT-seed#[6444A7AFAD933FD3]) [    ] o.a.s.u.p.LogUpdateProcessorFactory [collection1]  webapp=null path=null params={}{commit=} 0 130
   [junit4]   2> 507445 INFO  (TEST-TestNRTOpen.testReaderIsNRT-seed#[6444A7AFAD933FD3]) [    ] o.a.s.c.SolrResourceLoader new SolrResourceLoader for directory: '/home/jenkins/workspace/Lucene-Solr-5.x-Linux/solr/core/src/test-files/solr/collection1'
   [junit4]   2> 507445 INFO  (TEST-TestNRTOpen.testReaderIsNRT-seed#[6444A7AFAD933FD3]) [    ] o.a.s.c.SolrResourceLoader JNDI not configured for solr (NoInitialContextEx)
   [junit4]   2> 507445 INFO  (TEST-TestNRTOpen.testReaderIsNRT-seed#[6444A7AFAD933FD3]) [    ] o.a.s.c.SolrResourceLoader using system property solr.solr.home: /home/jenkins/workspace/Lucene-Solr-5.x-Linux/solr/core/src/test-files/solr
   [junit4]   2> 507445 INFO  (TEST-TestNRTOpen.testReaderIsNRT-seed#[6444A7AFAD933FD3]) [    ] o.a.s.c.SolrResourceLoader Adding 'file:/home/jenkins/workspace/Lucene-Solr-5.x-Linux/solr/core/src/test-files/solr/collection1/lib/classes/' to classloader
   [junit4]   2> 507445 INFO  (TEST-TestNRTOpen.testReaderIsNRT-seed#[6444A7AFAD933FD3]) [    ] o.a.s.c.SolrResourceLoader Adding 'file:/home/jenkins/workspace/Lucene-Solr-5.x-Linux/solr/core/src/test-files/solr/collection1/lib/README' to classloader
   [junit4]   2> 507464 INFO  (TEST-TestNRTOpen.testReaderIsNRT-seed#[6444A7AFAD933FD3]) [    ] o.a.s.c.SolrConfig current version of requestparams : -1
   [junit4]   2> 507473 INFO  (TEST-TestNRTOpen.testReaderIsNRT-seed#[6444A7AFAD933FD3]) [    ] o.a.s.c.SolrConfig Using Lucene MatchVersion: 5.5.0
   [junit4]   2> 507488 INFO  (TEST-TestNRTOpen.testReaderIsNRT-seed#[6444A7AFAD933FD3]) [    ] o.a.s.c.SolrConfig Loaded SolrConfig: solrconfig-basic.xml
   [junit4]   2> 507491 INFO  (TEST-TestNRTOpen.testReaderIsNRT-seed#[6444A7AFAD933FD3]) [    ] o.a.s.s.IndexSchema [collection1] Schema name=minimal
   [junit4]   2> 507494 WARN  (TEST-TestNRTOpen.testReaderIsNRT-seed#[6444A7AFAD933FD3]) [    ] o.a.s.s.IndexSchema no uniqueKey specified in schema.
   [junit4]   2> 507496 INFO  (TEST-TestNRTOpen.testReaderIsNRT-seed#[6444A7AFAD933FD3]) [    ] o.a.s.c.ConfigSetProperties Did not find ConfigSet properties, assuming default properties: Can't find resource 'configsetprops.json' in classpath or '/home/jenkins/workspace/Lucene-Solr-5.x-Linux/solr/core/src/test-files/solr/collection1'
   [junit4]   2> 507496 INFO  (TEST-TestNRTOpen.testReaderIsNRT-seed#[6444A7AFAD933FD3]) [    ] o.a.s.c.CoreContainer Reloading SolrCore 'collection1' using configuration from instancedir /home/jenkins/workspace/Lucene-Solr-5.x-Linux/solr/core/src/test-files/solr/collection1
   [junit4]   2> 507496 INFO  (TEST-TestNRTOpen.testReaderIsNRT-seed#[6444A7AFAD933FD3]) [    x:collection1] o.a.s.c.SolrCore [[collection1] ] Opening new SolrCore at [/home/jenkins/workspace/Lucene-Solr-5.x-Linux/solr/core/src/test-files/solr/collection1], dataDir=[/home/jenkins/workspace/Lucene-Solr-5.x-Linux/solr/build/solr-core/test/J1/temp/solr.core.TestNRTOpen_6444A7AFAD933FD3-001/init-core-data-001/]
   [junit4]   2> 507496 INFO  (TEST-TestNRTOpen.testReaderIsNRT-seed#[6444A7AFAD933FD3]) [    x:collection1] o.a.s.c.SolrCore JMX monitoring not detected for core: collection1
   [junit4]   2> 507496 INFO  (TEST-TestNRTOpen.testReaderIsNRT-seed#[6444A7AFAD933FD3]) [    x:collection1] o.a.s.c.SolrCore New index directory detected: old=null new=/home/jenkins/workspace/Lucene-Solr-5.x-Linux/solr/build/solr-core/test/J1/temp/solr.core.TestNRTOpen_6444A7AFAD933FD3-001/init-core-data-001/index/
   [junit4]   2> 507497 INFO  (OldIndexDirectoryCleanupThreadForCore-collection1) [    x:collection1] o.a.s.c.SolrCore Looking for old index directories to cleanup for core collection1 in /home/jenkins/workspace/Lucene-Solr-5.x-Linux/solr/build/solr-core/test/J1/temp/solr.core.TestNRTOpen_6444A7AFAD933FD3-001/init-core-data-001/
   [junit4]   2> 507498 INFO  (TEST-TestNRTOpen.testReaderIsNRT-seed#[6444A7AFAD933FD3]) [    x:collection1] o.a.s.c.SolrCore no updateRequestProcessorChain defined as default, creating implicit default
   [junit4]   2> 507500 INFO  (TEST-TestNRTOpen.testReaderIsNRT-seed#[6444A7AFAD933FD3]) [    x:collection1] o.a.s.h.l.XMLLoader xsltCacheLifetimeSeconds=60
   [junit4]   2> 507501 INFO  (TEST-TestNRTOpen.testReaderIsNRT-seed#[6444A7AFAD933FD3]) [    x:collection1] o.a.s.h.l.XMLLoader xsltCacheLifetimeSeconds=60
   [junit4]   2> 507501 INFO  (TEST-TestNRTOpen.testReaderIsNRT-seed#[6444A7AFAD933FD3]) [    x:collection1] o.a.s.h.l.XMLLoader xsltCacheLifetimeSeconds=60
   [junit4]   2> 507502 INFO  (TEST-TestNRTOpen.testReaderIsNRT-seed#[6444A7AFAD933FD3]) [    x:collection1] o.a.s.h.l.XMLLoader xsltCacheLifetimeSeconds=60
   [junit4]   2> 507503 INFO  (TEST-TestNRTOpen.testReaderIsNRT-seed#[6444A7AFAD933FD3]) [    x:collection1] o.a.s.c.RequestHandlers Registered paths: /update/json/docs,/admin/properties,/admin/file,/update,/admin/threads,/schema,/admin/plugins,/get,/admin/segments,/config,/admin/luke,/update/json,/admin/ping,/admin/logging,standard,/replication,/update/csv,/admin/system,/admin/mbeans
   [junit4]   2> 507504 INFO  (TEST-TestNRTOpen.testReaderIsNRT-seed#[6444A7AFAD933FD3]) [    x:collection1] o.a.s.c.SolrCore Using default statsCache cache: org.apache.solr.search.stats.LocalStatsCache
   [junit4]   2> 507504 INFO  (TEST-TestNRTOpen.testReaderIsNRT-seed#[6444A7AFAD933FD3]) [    x:collection1] o.a.s.u.CommitTracker Hard AutoCommit: disabled
   [junit4]   2> 507504 INFO  (TEST-TestNRTOpen.testReaderIsNRT-seed#[6444A7AFAD933FD3]) [    x:collection1] o.a.s.u.CommitTracker Soft AutoCommit: disabled
   [junit4]   2> 507504 INFO  (TEST-TestNRTOpen.testReaderIsNRT-seed#[6444A7AFAD933FD3]) [    x:collection1] o.a.s.s.SolrIndexSearcher Opening Searcher@95f180[collection1] main
   [junit4]   2> 507504 WARN  (TEST-TestNRTOpen.testReaderIsNRT-seed#[6444A7AFAD933FD3]) [    x:collection1] o.a.s.r.ManagedResourceStorage Cannot write to config directory /home/jenkins/workspace/Lucene-Solr-5.x-Linux/solr/core/src/test-files/solr/collection1/conf; switching to use InMemory storage instead.
   [junit4]   2> 507504 INFO  (TEST-TestNRTOpen.testReaderIsNRT-seed#[6444A7AFAD933FD3]) [    x:collection1] o.a.s.r.RestManager Initializing RestManager with initArgs: {}
   [junit4]   2> 507504 INFO  (TEST-TestNRTOpen.testReaderIsNRT-seed#[6444A7AFAD933FD3]) [    x:collection1] o.a.s.r.ManagedResourceStorage Reading _rest_managed.json using InMemoryStorage
   [junit4]   2> 507504 INFO  (TEST-TestNRTOpen.testReaderIsNRT-seed#[6444A7AFAD933FD3]) [    x:collection1] o.a.s.r.RestManager Initializing 0 registered ManagedResources
   [junit4]   2> 507505 INFO  (TEST-TestNRTOpen.testReaderIsNRT-seed#[6444A7AFAD933FD3]) [    x:collection1] o.a.s.h.ReplicationHandler Commits will be reserved for  10000
   [junit4]   2> 507505 INFO  (searcherExecutor-1715-thread-1-processing-x:collection1) [    x:collection1] o.a.s.c.SolrCore [collection1] Registered new searcher Searcher@95f180[collection1] main{ExitableDirectoryReader(UninvertingDirectoryReader(Uninverting(_5(5.5.0):C1)))}
   [junit4]   2> 507505 INFO  (TEST-TestNRTOpen.testReaderIsNRT-seed#[6444A7AFAD933FD3]) [    x:collection1] o.a.s.u.DefaultSolrCoreState Closing old IndexWriter... core=collection1
   [junit4]   2> 507505 INFO  (TEST-TestNRTOpen.testReaderIsNRT-seed#[6444A7AFAD933FD3]) [    x:collection1] o.a.s.u.RandomMergePolicy RandomMergePolicy wrapping class org.apache.lucene.index.TieredMergePolicy: [TieredMergePolicy: maxMergeAtOnce=13, maxMergeAtOnceExplicit=38, maxMergedSegmentMB=52.830078125, floorSegmentMB=0.998046875, forceMergeDeletesPctAllowed=20.5942647412374, segmentsPerTier=5.0, maxCFSSegmentSizeMB=8.796093022207999E12, noCFSRatio=0.7078812363164557
   [junit4]   2> 507506 INFO  (TEST-TestNRTOpen.testReaderIsNRT-seed#[6444A7AFAD933FD3]) [    x:collection1] o.a.s.c.SolrDeletionPolicy SolrDeletionPolicy.onInit: commits: num=1
   [junit4]   2> 	commit{dir=/home/jenkins/workspace/Lucene-Solr-5.x-Linux/solr/build/solr-core/test/J1/temp/solr.core.TestNRTOpen_6444A7AFAD933FD3-001/init-core-data-001/index,segFN=segments_5,generation=5}
   [junit4]   2> 507506 INFO  (TEST-TestNRTOpen.testReaderIsNRT-seed#[6444A7AFAD933FD3]) [    x:collection1] o.a.s.c.SolrDeletionPolicy newest commit generation = 5
   [junit4]   2> 507506 INFO  (TEST-TestNRTOpen.testReaderIsNRT-seed#[6444A7AFAD933FD3]) [    x:collection1] o.a.s.u.DefaultSolrCoreState New IndexWriter is ready to be used.
   [junit4]   2> 507507 INFO  (TEST-TestNRTOpen.testReaderIsNRT-seed#[6444A7AFAD933FD3]) [    x:collection1] o.a.s.s.SolrIndexSearcher Opening Searcher@1b4deb[collection1] main
   [junit4]   2> 507507 INFO  (TEST-TestNRTOpen.testReaderIsNRT-seed#[6444A7AFAD933FD3]) [    x:collection1] o.a.s.c.CoreContainer replacing core: collection1
   [junit4]   2> 507507 INFO  (TEST-TestNRTOpen.testReaderIsNRT-seed#[6444A7AFAD933FD3]) [    x:collection1] o.a.s.c.SolrCore [collection1]  CLOSING SolrCore org.apache.solr.core.SolrCore@32d3f1
   [junit4]   2> 507507 INFO  (searcherExecutor-1715-thread-1-processing-x:collection1) [    x:collection1] o.a.s.c.SolrCore [collection1] Registered new searcher Searcher@1b4deb[collection1] main{ExitableDirectoryReader(UninvertingDirectoryReader(Uninverting(_5(5.5.0):C1)))}
   [junit4]   2> 507507 INFO  (TEST-TestNRTOpen.testReaderIsNRT-seed#[6444A7AFAD933FD3]) [    x:collection1] o.a.s.u.DirectUpdateHandler2 closing DirectUpdateHandler2{commits=4,autocommits=0,soft autocommits=0,optimizes=1,rollbacks=0,expungeDeletes=0,docsPending=0,adds=0,deletesById=0,deletesByQuery=0,errors=0,cumulative_adds=5,cumulative_deletesById=0,cumulative_deletesByQuery=2,cumulative_errors=0}
   [junit4]   2> 507507 INFO  (TEST-TestNRTOpen.testReaderIsNRT-seed#[6444A7AFAD933FD3]) [    x:collection1] o.a.s.c.SolrCore [collection1] Closing main searcher on request.
   [junit4]   2> 507508 INFO  (TEST-TestNRTOpen.testReaderIsNRT-seed#[6444A7AFAD933FD3]) [    x:collection1] o.a.s.u.p.LogUpdateProcessorFactory [collection1]  webapp=null path=null params={}{add=[(null)]} 0 0
   [junit4]   2> 507509 INFO  (TEST-TestNRTOpen.testReaderIsNRT-seed#[6444A7AFAD933FD3]) [    x:collection1] o.a.s.u.DirectUpdateHandler2 start commit{,optimize=false,openSearcher=true,waitSearcher=true,expungeDeletes=false,softCommit=true,prepareCommit=false}
   [junit4]   2> 507511 INFO  (TEST-TestNRTOpen.testReaderIsNRT-seed#[6444A7AFAD933FD3]) [    x:collection1] o.a.s.s.SolrIndexSearcher Opening Searcher@1ed1851[collection1] main
   [junit4]   2> 507511 INFO  (TEST-TestNRTOpen.testReaderIsNRT-seed#[6444A7AFAD933FD3]) [    x:collection1] o.a.s.u.DirectUpdateHandler2 end_commit_flush
   [junit4]   2> 507511 INFO  (searcherExecutor-1715-thread-1-processing-x:collection1) [    x:collection1] o.a.s.c.SolrCore [collection1] Registered new searcher Searcher@1ed1851[collection1] main{ExitableDirectoryReader(UninvertingDirectoryReader(Uninverting(_5(5.5.0):C1) Uninverting(_6(5.5.0):C1)))}
   [junit4]   2> 507511 INFO  (TEST-TestNRTOpen.testReaderIsNRT-seed#[6444A7AFAD933FD3]) [    x:collection1] o.a.s.u.p.LogUpdateProcessorFactory [collection1]  webapp=null path=null params={}{commit=} 0 2
   [junit4]   2> 507513 INFO  (TEST-TestNRTOpen.testReaderIsNRT-seed#[6444A7AFAD933FD3]) [    x:collection1] o.a.s.u.p.LogUpdateProcessorFactory [collection1]  webapp=null path=null params={}{add=[(null)]} 0 0
   [junit4]   2> 507513 INFO  (TEST-TestNRTOpen.testReaderIsNRT-seed#[6444A7AFAD933FD3]) [    x:collection1] o.a.s.u.DirectUpdateHandler2 start commit{,optimize=false,openSearcher=true,waitSearcher=true,expungeDeletes=false,softCommit=false,prepareCommit=false}
   [junit4]   2> 507858 INFO  (TEST-TestNRTOpen.testReaderIsNRT-seed#[6444A7AFAD933FD3]) [    x:collection1] o.a.s.c.SolrDeletionPolicy SolrDeletionPolicy.onCommit: commits: num=2
   [junit4]   2> 	commit{dir=/home/jenkins/workspace/Lucene-Solr-5.x-Linux/solr/build/solr-core/test/J1/temp/solr.core.TestNRTOpen_6444A7AFAD933FD3-001/init-core-data-001/index,segFN=segments_5,generation=5}
   [junit4]   2> 	commit{dir=/home/jenkins/workspace/Lucene-Solr-5.x-Linux/solr/build/solr-core/test/J1/temp/solr.core.TestNRTOpen_6444A7AFAD933FD3-001/init-core-data-001/index,segFN=segments_6,generation=6}
   [junit4]   2> 507858 INFO  (TEST-TestNRTOpen.testReaderIsNRT-seed#[6444A7AFAD933FD3]) [    x:collection1] o.a.s.c.SolrDeletionPolicy newest commit generation = 6
   [junit4]   2> 507859 INFO  (TEST-TestNRTOpen.testReaderIsNRT-seed#[6444A7AFAD933FD3]) [    x:collection1] o.a.s.s.SolrIndexSearcher Opening Searcher@120a17f[collection1] main
   [junit4]   2> 507860 INFO  (TEST-TestNRTOpen.testReaderIsNRT-seed#[6444A7AFAD933FD3]) [    x:collection1] o.a.s.u.DirectUpdateHandler2 end_commit_flush
   [junit4]   2> 507860 INFO  (searcherExecutor-1715-thread-1-processing-x:collection1) [    x:collection1] o.a.s.c.SolrCore [collection1] Registered new searcher Searcher@120a17f[collection1] main{ExitableDirectoryReader(UninvertingDirectoryReader(Uninverting(_5(5.5.0):C1) Uninverting(_6(5.5.0):C1) Uninverting(_7(5.5.0):C1)))}
   [junit4]   2> 507860 INFO  (TEST-TestNRTOpen.testReaderIsNRT-seed#[6444A7AFAD933FD3]) [    x:collection1] o.a.s.u.p.LogUpdateProcessorFactory [collection1]  webapp=null path=null params={}{commit=} 0 346
   [junit4]   2> 507870 INFO  (TEST-TestNRTOpen.testReaderIsNRT-seed#[6444A7AFAD933FD3]) [    x:collection1] o.a.s.u.p.LogUpdateProcessorFactory [collection1]  webapp=null path=null params={}{add=[(null)]} 0 0
   [junit4]   2> 507871 INFO  (TEST-TestNRTOpen.testReaderIsNRT-seed#[6444A7AFAD933FD3]) [    x:collection1] o.a.s.c.SolrResourceLoader new SolrResourceLoader for directory: '/home/jenkins/workspace/Lucene-Solr-5.x-Linux/solr/core/src/test-files/solr/collection1'
   [junit4]   2> 507871 INFO  (TEST-TestNRTOpen.testReaderIsNRT-seed#[6444A7AFAD933FD3]) [    x:collection1] o.a.s.c.SolrResourceLoader JNDI not configured for solr (NoInitialContextEx)
   [junit4]   2> 507871 INFO  (TEST-TestNRTOpen.testReaderIsNRT-seed#[6444A7AFAD933FD3]) [    x:collection1] o.a.s.c.SolrResourceLoader using system property solr.solr.home: /home/jenkins/workspace/Lucene-Solr-5.x-Linux/solr/core/src/test-files/solr
   [junit4]   2> 507871 INFO  (TEST-TestNRTOpen.testReaderIsNRT-seed#[6444A7AFAD933FD3]) [    x:collection1] o.a.s.c.SolrResourceLoader Adding 'file:/home/jenkins/workspace/Lucene-Solr-5.x-Linux/solr/core/src/test-files/solr/collection1/lib/classes/' to classloader
   [junit4]   2> 507871 INFO  (TEST-TestNRTOpen.testReaderIsNRT-seed#[6444A7AFAD933FD3]) [    x:collection1] o.a.s.c.SolrResourceLoader Adding 'file:/home/jenkins/workspace/Lucene-Solr-5.x-Linux/solr/core/src/test-files/solr/collection1/lib/README' to classloader
   [junit4]   2> 507889 INFO  (TEST-TestNRTOpen.testReaderIsNRT-seed#[6444A7AFAD933FD3]) [    x:collection1] o.a.s.c.SolrConfig current version of requestparams : -1
   [junit4]   2> 507897 INFO  (TEST-TestNRTOpen.testReaderIsNRT-seed#[6444A7AFAD933FD3]) [    x:collection1] o.a.s.c.SolrConfig Using Lucene MatchVersion: 5.5.0
   [junit4]   2> 507911 INFO  (TEST-TestNRTOpen.testReaderIsNRT-seed#[6444A7AFAD933FD3]) [    x:collection1] o.a.s.c.SolrConfig Loaded SolrConfig: solrconfig-basic.xml
   [junit4]   2> 507914 INFO  (TEST-TestNRTOpen.testReaderIsNRT-seed#[6444A7AFAD933FD3]) [    x:collection1] o.a.s.s.IndexSchema [collection1] Schema name=minimal
   [junit4]   2> 507917 WARN  (TEST-TestNRTOpen.testReaderIsNRT-seed#[6444A7AFAD933FD3]) [    x:collection1] o.a.s.s.IndexSchema no uniqueKey specified in schema.
   [junit4]   2> 507918 INFO  (TEST-TestNRTOpen.testReaderIsNRT-seed#[6444A7AFAD933FD3]) [    x:collection1] o.a.s.c.ConfigSetProperties Did not find ConfigSet properties, assuming default properties: Can't find resource 'configsetprops.json' in classpath or '/home/jenkins/workspace/Lucene-Solr-5.x-Linux/solr/core/src/test-files/solr/collection1'
   [junit4]   2> 507918 INFO  (TEST-TestNRTOpen.testReaderIsNRT-seed#[6444A7AFAD933FD3]) [    x:collection1] o.a.s.c.CoreContainer Reloading SolrCore 'collection1' using configuration from instancedir /home/jenkins/workspace/Lucene-Solr-5.x-Linux/solr/core/src/test-files/solr/collection1
   [junit4]   2> 507919 INFO  (TEST-TestNRTOpen.testReaderIsNRT-seed#[6444A7AFAD933FD3]) [    x:collection1] o.a.s.c.SolrCore [[collection1] ] Opening new SolrCore at [/home/jenkins/workspace/Lucene-Solr-5.x-Linux/solr/core/src/test-files/solr/collection1], dataDir=[/home/jenkins/workspace/Lucene-Solr-5.x-Linux/solr/build/solr-core/test/J1/temp/solr.core.TestNRTOpen_6444A7AFAD933FD3-001/init-core-data-001/]
   [junit4]   2> 507919 INFO  (TEST-TestNRTOpen.testReaderIsNRT-seed#[6444A7AFAD933FD3]) [    x:collection1] o.a.s.c.SolrCore JMX monitoring not detected for core: collection1
   [junit4]   2> 507919 INFO  (TEST-TestNRTOpen.testReaderIsNRT-seed#[6444A7AFAD933FD3]) [    x:collection1] o.a.s.c.SolrCore New index directory detected: old=null new=/home/jenkins/workspace/Lucene-Solr-5.x-Linux/solr/build/solr-core/test/J1/temp/solr.core.TestNRTOpen_6444A7AFAD933FD3-001/init-core-data-001/index/
   [junit4]   2> 507919 INFO  (OldIndexDirectoryCleanupThreadForCore-collection1) [    x:collection1] o.a.s.c.SolrCore Looking for old index directories to cleanup for core collection1 in /home/jenkins/workspace/Lucene-Solr-5.x-Linux/solr/build/solr-core/test/J1/temp/solr.core.TestNRTOpen_6444A7AFAD933FD3-001/init-core-data-001/
   [junit4]   2> 507921 INFO  (TEST-TestNRTOpen.testReaderIsNRT-seed#[6444A7AFAD933FD3]) [    x:collection1] o.a.s.c.SolrCore no updateRequestProcessorChain defined as default, creating implicit default
   [junit4]   2> 507922 INFO  (TEST-TestNRTOpen.testReaderIsNRT-seed#[6444A7AFAD933FD3]) [    x:collection1] o.a.s.h.l.XMLLoader xsltCacheLifetimeSeconds=60
   [junit4]   2> 507923 INFO  (TEST-TestNRTOpen.testReaderIsNRT-seed#[6444A7AFAD933FD3]) [    x:collection1] o.a.s.h.l.XMLLoader xsltCacheLifetimeSeconds=60
   [junit4]   2> 507923 INFO  (TEST-TestNRTOpen.testReaderIsNRT-seed#[6444A7AFAD933FD3]) [    x:collection1] o.a.s.h.l.XMLLoader xsltCacheLifetimeSeconds=60
   [junit4]   2> 507924 INFO  (TEST-TestNRTOpen.testReaderIsNRT-seed#[6444A7AFAD933FD3]) [    x:collection1] o.a.s.h.l.XMLLoader xsltCacheLifetimeSeconds=60
   [junit4]   2> 507925 INFO  (TEST-TestNRTOpen.testReaderIsNRT-seed#[6444A7AFAD933FD3]) [    x:collection1] o.a.s.c.RequestHandlers Registered paths: /update/json/docs,/admin/properties,/admin/file,/update,/admin/threads,/schema,/admin/plugins,/get,/admin/segments,/config,/admin/luke,/update/json,/admin/ping,/admin/logging,standard,/replication,/update/csv,/admin/system,/admin/mbeans
   [junit4]   2> 507925 INFO  (TEST-TestNRTOpen.testReaderIsNRT-seed#[6444A7AFAD933FD3]) [    x:collection1] o.a.s.c.SolrCore Using default statsCache cache: org.apache.solr.search.stats.LocalStatsCache
   [junit4]   2> 507926 INFO  (TEST-TestNRTOpen.testReaderIsNRT-seed#[6444A7AFAD933FD3]) [    x:collection1] o.a.s.u.CommitTracker Hard AutoCommit: disabled
   [junit4]   2> 507926 INFO  (TEST-TestNRTOpen.testReaderIsNRT-seed#[6444A7AFAD933FD3]) [    x:collection1] o.a.s.u.CommitTracker Soft AutoCommit: disabled
   [junit4]   2> 507928 INFO  (TEST-TestNRTOpen.testReaderIsNRT-seed#[6444A7AFAD933FD3]) [    x:collection1] o.a.s.s.SolrIndexSearcher Opening Searcher@14daab1[collection1] main
   [junit4]   2> 507929 WARN  (TEST-TestNRTOpen.testReaderIsNRT-seed#[6444A7AFAD933FD3]) [    x:collection1] o.a.s.r.ManagedResourceStorage Cannot write to config directory /home/jenkins/workspace/Lucene-Solr-5.x-Linux/solr/core/src/test-files/solr/collection1/conf; switching to use InMemory storage instead.
   [junit4]   2> 507929 INFO  (TEST-TestNRTOpen.testReaderIsNRT-seed#[6444A7AFAD933FD3]) [    x:collection1] o.a.s.r.RestManager Initializing RestManager with initArgs: {}
   [junit4]   2> 507929 INFO  (TEST-TestNRTOpen.testReaderIsNRT-seed#[6444A7AFAD933FD3]) [    x:collection1] o.a.s.r.ManagedResourceStorage Reading _rest_managed.json using InMemoryStorage
   [junit4]   2> 507929 INFO  (TEST-TestNRTOpen.testReaderIsNRT-seed#[6444A7AFAD933FD3]) [    x:collection1] o.a.s.r.RestManager Initializing 0 registered ManagedResources
   [junit4]   2> 507929 INFO  (TEST-TestNRTOpen.testReaderIsNRT-seed#[6444A7AFAD933FD3]) [    x:collection1] o.a.s.h.ReplicationHandler Commits will be reserved for  10000
   [junit4]   2> 507929 INFO  (searcherExecutor-1719-thread-1-processing-x:collection1) [    x:collection1] o.a.s.c.SolrCore [collection1] Registered new searcher Searcher@14daab1[collection1] main{ExitableDirectoryReader(UninvertingDirectoryReader(Uninverting(_5(5.5.0):C1) Uninverting(_6(5.5.0):C1) Uninverting(_7(5.5.0):C1) Uninverting(_8(5.5.0):C1)))}
   [junit4]   2> 507929 INFO  (TEST-TestNRTOpen.testReaderIsNRT-seed#[6444A7AFAD933FD3]) [    x:collection1] o.a.s.u.DefaultSolrCoreState Closing old IndexWriter... core=collection1
   [junit4]   2> 508036 INFO  (TEST-TestNRTOpen.testReaderIsNRT-seed#[6444A7AFAD933FD3]) [    x:collection1] o.a.s.c.SolrDeletionPolicy SolrDeletionPolicy.onCommit: commits: num=2
   [junit4]   2> 	commit{dir=/home/jenkins/workspace/Lucene-Solr-5.x-Linux/solr/build/solr-core/test/J1/temp/solr.core.TestNRTOpen_6444A7AFAD933FD3-001/init-core-data-001/index,segFN=segments_6,generation=6}
   [junit4]   2> 	commit{dir=/home/jenkins/workspace/Lucene-Solr-5.x-Linux/solr/build/solr-core/test/J1/temp/solr.core.TestNRTOpen_6444A7AFAD933FD3-001/init-core-data-001/index,segFN=segments_7,generation=7}
   [junit4]   2> 508036 INFO  (TEST-TestNRTOpen.testReaderIsNRT-seed#[6444A7AFAD933FD3]) [    x:collection1] o.a.s.c.SolrDeletionPolicy newest commit generation = 7
   [junit4]   2> 508036 INFO  (TEST-TestNRTOpen.testReaderIsNRT-seed#[6444A7AFAD933FD3]) [    x:collection1] o.a.s.u.RandomMergePolicy RandomMergePolicy wrapping class org.apache.lucene.index.LogByteSizeMergePolicy: [LogByteSizeMergePolicy: minMergeSize=1677721, mergeFactor=31, maxMergeSize=2147483648, maxMergeSizeForForcedMerge=9223372036854775807, calibrateSizeByDeletes=true, maxMergeDocs=2147483647, maxCFSSegmentSizeMB=8.796093022207999E12, noCFSRatio=0.4323233613467695]
   [junit4]   2> 508038 INFO  (TEST-TestNRTOpen.testReaderIsNRT-seed#[6444A7AFAD933FD3]) [    x:collection1] o.a.s.c.SolrDeletionPolicy SolrDeletionPolicy.onInit: commits: num=1
   [junit4]   2> 	commit{dir=/home/jenkins/workspace/Lucene-Solr-5.x-Linux/solr/build/solr-core/test/J1/temp/solr.core.TestNRTOpen_6444A7AFAD933FD3-001/init-core-data-001/index,segFN=segments_7,generation=7}
   [junit4]   2> 508038 INFO  (TEST-TestNRTOpen.testReaderIsNRT-seed#[6444A7AFAD933FD3]) [    x:collection1] o.a.s.c.SolrDeletionPolicy newest commit generation = 7
   [junit4]   2> 508039 INFO  (TEST-TestNRTOpen.testReaderIsNRT-seed#[6444A7AFAD933FD3]) [    x:collection1] o.a.s.u.DefaultSolrCoreState New IndexWriter is ready to be used.
   [junit4]   2> 508042 INFO  (TEST-TestNRTOpen.testReaderIsNRT-seed#[6444A7AFAD933FD3]) [    x:collection1] o.a.s.s.SolrIndexSearcher Opening Searcher@816dbe[collection1] main
   [junit4]   2> 508042 INFO  (TEST-TestNRTOpen.testReaderIsNRT-seed#[6444A7AFAD933FD3]) [    x:collection1] o.a.s.c.CoreContainer replacing core: collection1
   [junit4]   2> 508042 INFO  (searcherExecutor-1719-thread-1-processing-x:collection1) [    x:collection1] o.a.s.c.SolrCore [collection1] Registered new searcher Searcher@816dbe[collection1] main{ExitableDirectoryReader(UninvertingDirectoryReader(Uninverting(_5(5.5.0):C1) Uninverting(_6(5.5.0):C1) Uninverting(_7(5.5.0):C1) Uninverting(_8(5.5.0):C1)))}
   [junit4]   2> 508042 INFO  (TEST-TestNRTOpen.testReaderIsNRT-seed#[6444A7AFAD933FD3]) [    x:collection1] o.a.s.c.SolrCore [collection1]  CLOSING SolrCore org.apache.solr.core.SolrCore@1ae8637
   [junit4]   2> 508042 INFO  (TEST-TestNRTOpen.testReaderIsNRT-seed#[6444A7AFAD933FD3]) [    x:collection1] o.a.s.u.DirectUpdateHandler2 closing DirectUpdateHandler2{commits=2,autocommits=0,soft autocommits=0,optimizes=0,rollbacks=0,expungeDeletes=0,docsPending=1,adds=1,deletesById=0,deletesByQuery=0,errors=0,cumulative_adds=3,cumulative_deletesById=0,cumulative_deletesByQuery=0,cumulative_errors=0}
   [junit4]   2> 508042 INFO  (TEST-TestNRTOpen.testReaderIsNRT-seed#[6444A7AFAD933FD3]) [    x:collection1] o.a.s.c.SolrCore [collection1] Closing main searcher on request.
   [junit4]   2> 508043 INFO  (TEST-TestNRTOpen.testReaderIsNRT-seed#[6444A7AFAD933FD3]) [    x:collection1] o.a.s.SolrTestCaseJ4 ###Ending testReaderIsNRT
   [junit4]   2> 508043 INFO  (SUITE-TestNRTOpen-seed#[6444A7AFAD933FD3]-worker) [    x:collection1] o.a.s.SolrTestCaseJ4 ###deleteCore
   [junit4]   2> 508043 INFO  (SUITE-TestNRTOpen-seed#[6444A7AFAD933FD3]-worker) [    x:collection1] o.a.s.c.CoreContainer Shutting down CoreContainer instance=29446291
   [junit4]   2> 508043 INFO  (coreCloseExecutor-1723-thread-1-processing-x:collection1) [    x:collection1] o.a.s.c.SolrCore [collection1]  CLOSING SolrCore org.apache.solr.core.SolrCore@9a8b4e
   [junit4]   2> 508043 INFO  (coreCloseExecutor-1723-thread-1-processing-x:collection1) [    x:collection1] o.a.s.u.DirectUpdateHandler2 closing DirectUpdateHandler2{commits=0,autocommits=0,soft autocommits=0,optimizes=0,rollbacks=0,expungeDeletes=0,docsPending=0,adds=0,deletesById=0,deletesByQuery=0,errors=0,cumulative_adds=0,cumulative_deletesById=0,cumulative_deletesByQuery=0,cumulative_errors=0}
   [junit4]   2> 508043 INFO  (coreCloseExecutor-1723-thread-1-processing-x:collection1) [    x:collection1] o.a.s.u.SolrCoreState Closing SolrCoreState
   [junit4]   2> 508043 INFO  (coreCloseExecutor-1723-thread-1-processing-x:collection1) [    x:collection1] o.a.s.u.DefaultSolrCoreState SolrCoreState ref count has reached 0 - closing IndexWriter
   [junit4]   2> 508043 INFO  (coreCloseExecutor-1723-thread-1-processing-x:collection1) [    x:collection1] o.a.s.u.DefaultSolrCoreState closing IndexWriter with IndexWriterCloser
   [junit4]   2> 508044 INFO  (coreCloseExecutor-1723-thread-1-processing-x:collection1) [    x:collection1] o.a.s.c.SolrCore [collection1] Closing main searcher on request.
   [junit4]   2> 508044 INFO  (coreCloseExecutor-1723-thread-1-processing-x:collection1) [    x:collection1] o.a.s.c.CachingDirectoryFactory Closing StandardDirectoryFactory - 2 directories currently being tracked
   [junit4]   2> 508045 INFO  (coreCloseExecutor-1723-thread-1-processing-x:collection1) [    x:collection1] o.a.s.c.CachingDirectoryFactory looking to close /home/jenkins/workspace/Lucene-Solr-5.x-Linux/solr/build/solr-core/test/J1/temp/solr.core.TestNRTOpen_6444A7AFAD933FD3-001/init-core-data-001 [CachedDir<<refCount=0;path=/home/jenkins/workspace/Lucene-Solr-5.x-Linux/solr/build/solr-core/test/J1/temp/solr.core.TestNRTOpen_6444A7AFAD933FD3-001/init-core-data-001;done=false>>]
   [junit4]   2> 508045 INFO  (coreCloseExecutor-1723-thread-1-processing-x:collection1) [    x:collection1] o.a.s.c.CachingDirectoryFactory Closing directory: /home/jenkins/workspace/Lucene-Solr-5.x-Linux/solr/build/solr-core/test/J1/temp/solr.core.TestNRTOpen_6444A7AFAD933FD3-001/init-core-data-001
   [junit4]   2> 508045 INFO  (coreCloseExecutor-1723-thread-1-processing-x:collection1) [    x:collection1] o.a.s.c.CachingDirectoryFactory looking to close /home/jenkins/workspace/Lucene-Solr-5.x-Linux/solr/build/solr-core/test/J1/temp/solr.core.TestNRTOpen_6444A7AFAD933FD3-001/init-core-data-001/index [CachedDir<<refCount=0;path=/home/jenkins/workspace/Lucene-Solr-5.x-Linux/solr/build/solr-core/test/J1/temp/solr.core.TestNRTOpen_6444A7AFAD933FD3-001/init-core-data-001/index;done=false>>]
   [junit4]   2> 508045 INFO  (coreCloseExecutor-1723-thread-1-processing-x:collection1) [    x:collection1] o.a.s.c.CachingDirectoryFactory Closing directory: /home/jenkins/workspace/Lucene-Solr-5.x-Linux/solr/build/solr-core/test/J1/temp/solr.core.TestNRTOpen_6444A7AFAD933FD3-001/init-core-data-001/index
   [junit4]   2> NOTE: leaving temporary files on disk at: /home/jenkins/workspace/Lucene-Solr-5.x-Linux/solr/build/solr-core/test/J1/temp/solr.core.TestNRTOpen_6444A7AFAD933FD3-001
   [junit4]   2> NOTE: test params are: codec=Lucene54, sim=DefaultSimilarity, locale=es-NI, timezone=America/Costa_Rica
   [junit4]   2> NOTE: Linux 3.19.0-47-generic i386/Oracle Corporation 1.7.0_80 (32-bit)/cpus=12,threads=1,free=264670368,total=536870912
   [junit4]   2> NOTE: All tests run in this JVM: [TestDownShardTolerantSearch, DateRangeFieldTest, TestConfigSetProperties, SpellingQueryConverterTest, ChaosMonkeySafeLeaderTest, TestFiltering, DataDrivenBlockJoinTest, TestSearcherReuse, TestReplicationHandlerBackup, SortByFunctionTest, HdfsBasicDistributedZk2Test, ChaosMonkeyNothingIsSafeTest, TestRequestStatusCollectionAPI, TestCloudManagedSchemaConcurrent, TestQuerySenderNoQuery, TestOverriddenPrefixQueryForCustomFieldType, OpenCloseCoreStressTest, HighlighterTest, TestAuthorizationFramework, HLLSerializationTest, IndexBasedSpellCheckerTest, SuggesterFSTTest, SpellCheckCollatorTest, DOMUtilTest, FastVectorHighlighterTest, ConvertedLegacyTest, SolrInfoMBeanTest, SpatialFilterTest, TestHdfsUpdateLog, TestNamedUpdateProcessors, DistributedFacetPivotSmallAdvancedTest, TestRestManager, TestTrieFacet, HdfsSyncSliceTest, ClusterStateUpdateTest, HdfsLockFactoryTest, TestObjectReleaseTracker, TestMacros, TestAnalyzeInfixSuggestions, TestBM25SimilarityFactory, SchemaVersionSpecificBehaviorTest, MultiTermTest, NotRequiredUniqueKeyTest, DocValuesTest, TestDocumentBuilder, UpdateRequestProcessorFactoryTest, TestQueryUtils, CoreAdminRequestStatusTest, SuggestComponentTest, HdfsChaosMonkeySafeLeaderTest, UniqFieldsUpdateProcessorFactoryTest, TestCoreContainer, DocumentBuilderTest, DistributedVersionInfoTest, TestSurroundQueryParser, TestQuerySenderListener, TestNRTOpen]
   [junit4] Completed [195/568 (1!)] on J1 in 1.49s, 2 tests, 1 failure <<< FAILURES!

[...truncated 1166 lines...]
BUILD FAILED
/home/jenkins/workspace/Lucene-Solr-5.x-Linux/build.xml:750: The following error occurred while executing this line:
/home/jenkins/workspace/Lucene-Solr-5.x-Linux/build.xml:694: The following error occurred while executing this line:
/home/jenkins/workspace/Lucene-Solr-5.x-Linux/build.xml:59: The following error occurred while executing this line:
/home/jenkins/workspace/Lucene-Solr-5.x-Linux/solr/build.xml:233: The following error occurred while executing this line:
/home/jenkins/workspace/Lucene-Solr-5.x-Linux/solr/common-build.xml:534: The following error occurred while executing this line:
/home/jenkins/workspace/Lucene-Solr-5.x-Linux/lucene/common-build.xml:1477: The following error occurred while executing this line:
/home/jenkins/workspace/Lucene-Solr-5.x-Linux/lucene/common-build.xml:1033: There were test failures: 568 suites (7 ignored), 2273 tests, 1 failure, 85 ignored (41 assumptions) [seed: 6444A7AFAD933FD3]

Total time: 55 minutes 22 seconds
Build step 'Invoke Ant' marked build as failure
Archiving artifacts
[WARNINGS] Skipping publisher since build result is FAILURE
Recording test results
Email was triggered for: Failure - Any
Sending email for trigger: Failure - Any



Mime
View raw message