lucene-dev mailing list archives

Site index · List index
Message view « Date » · « Thread »
Top « Date » · « Thread »
From Policeman Jenkins Server <jenk...@thetaphi.de>
Subject [JENKINS] Lucene-Solr-5.x-MacOSX (64bit/jdk1.7.0) - Build # 3032 - Still Failing!
Date Mon, 15 Feb 2016 05:17:29 GMT
Build: http://jenkins.thetaphi.de/job/Lucene-Solr-5.x-MacOSX/3032/
Java: 64bit/jdk1.7.0 -XX:+UseCompressedOops -XX:+UseG1GC

1 tests failed.
FAILED:  org.apache.solr.cloud.AsyncMigrateRouteKeyTest.test

Error Message:
There are still nodes recoverying - waited for 15 seconds

Stack Trace:
java.lang.AssertionError: There are still nodes recoverying - waited for 15 seconds
	at __randomizedtesting.SeedInfo.seed([3131F272555117E2:B965CDA8FBAD7A1A]:0)
	at org.junit.Assert.fail(Assert.java:93)
	at org.apache.solr.cloud.AbstractDistribZkTestBase.waitForRecoveriesToFinish(AbstractDistribZkTestBase.java:174)
	at org.apache.solr.cloud.AbstractFullDistribZkTestBase.waitForRecoveriesToFinish(AbstractFullDistribZkTestBase.java:836)
	at org.apache.solr.cloud.AbstractFullDistribZkTestBase.waitForThingsToLevelOut(AbstractFullDistribZkTestBase.java:1392)
	at org.apache.solr.cloud.AsyncMigrateRouteKeyTest.test(AsyncMigrateRouteKeyTest.java:42)
	at sun.reflect.NativeMethodAccessorImpl.invoke0(Native Method)
	at sun.reflect.NativeMethodAccessorImpl.invoke(NativeMethodAccessorImpl.java:57)
	at sun.reflect.DelegatingMethodAccessorImpl.invoke(DelegatingMethodAccessorImpl.java:43)
	at java.lang.reflect.Method.invoke(Method.java:606)
	at com.carrotsearch.randomizedtesting.RandomizedRunner.invoke(RandomizedRunner.java:1764)
	at com.carrotsearch.randomizedtesting.RandomizedRunner$8.evaluate(RandomizedRunner.java:871)
	at com.carrotsearch.randomizedtesting.RandomizedRunner$9.evaluate(RandomizedRunner.java:907)
	at com.carrotsearch.randomizedtesting.RandomizedRunner$10.evaluate(RandomizedRunner.java:921)
	at org.apache.solr.BaseDistributedSearchTestCase$ShardsRepeatRule$ShardsFixedStatement.callStatement(BaseDistributedSearchTestCase.java:964)
	at org.apache.solr.BaseDistributedSearchTestCase$ShardsRepeatRule$ShardsStatement.evaluate(BaseDistributedSearchTestCase.java:939)
	at com.carrotsearch.randomizedtesting.rules.SystemPropertiesRestoreRule$1.evaluate(SystemPropertiesRestoreRule.java:57)
	at org.apache.lucene.util.TestRuleSetupTeardownChained$1.evaluate(TestRuleSetupTeardownChained.java:49)
	at org.apache.lucene.util.AbstractBeforeAfterRule$1.evaluate(AbstractBeforeAfterRule.java:45)
	at org.apache.lucene.util.TestRuleThreadAndTestName$1.evaluate(TestRuleThreadAndTestName.java:48)
	at org.apache.lucene.util.TestRuleIgnoreAfterMaxFailures$1.evaluate(TestRuleIgnoreAfterMaxFailures.java:64)
	at org.apache.lucene.util.TestRuleMarkFailure$1.evaluate(TestRuleMarkFailure.java:47)
	at com.carrotsearch.randomizedtesting.rules.StatementAdapter.evaluate(StatementAdapter.java:36)
	at com.carrotsearch.randomizedtesting.ThreadLeakControl$StatementRunner.run(ThreadLeakControl.java:367)
	at com.carrotsearch.randomizedtesting.ThreadLeakControl.forkTimeoutingTask(ThreadLeakControl.java:809)
	at com.carrotsearch.randomizedtesting.ThreadLeakControl$3.evaluate(ThreadLeakControl.java:460)
	at com.carrotsearch.randomizedtesting.RandomizedRunner.runSingleTest(RandomizedRunner.java:880)
	at com.carrotsearch.randomizedtesting.RandomizedRunner$5.evaluate(RandomizedRunner.java:781)
	at com.carrotsearch.randomizedtesting.RandomizedRunner$6.evaluate(RandomizedRunner.java:816)
	at com.carrotsearch.randomizedtesting.RandomizedRunner$7.evaluate(RandomizedRunner.java:827)
	at com.carrotsearch.randomizedtesting.rules.StatementAdapter.evaluate(StatementAdapter.java:36)
	at com.carrotsearch.randomizedtesting.rules.SystemPropertiesRestoreRule$1.evaluate(SystemPropertiesRestoreRule.java:57)
	at org.apache.lucene.util.AbstractBeforeAfterRule$1.evaluate(AbstractBeforeAfterRule.java:45)
	at com.carrotsearch.randomizedtesting.rules.StatementAdapter.evaluate(StatementAdapter.java:36)
	at org.apache.lucene.util.TestRuleStoreClassName$1.evaluate(TestRuleStoreClassName.java:41)
	at com.carrotsearch.randomizedtesting.rules.NoShadowingOrOverridesOnMethodsRule$1.evaluate(NoShadowingOrOverridesOnMethodsRule.java:40)
	at com.carrotsearch.randomizedtesting.rules.NoShadowingOrOverridesOnMethodsRule$1.evaluate(NoShadowingOrOverridesOnMethodsRule.java:40)
	at com.carrotsearch.randomizedtesting.rules.StatementAdapter.evaluate(StatementAdapter.java:36)
	at com.carrotsearch.randomizedtesting.rules.StatementAdapter.evaluate(StatementAdapter.java:36)
	at com.carrotsearch.randomizedtesting.rules.StatementAdapter.evaluate(StatementAdapter.java:36)
	at org.apache.lucene.util.TestRuleAssertionsRequired$1.evaluate(TestRuleAssertionsRequired.java:53)
	at org.apache.lucene.util.TestRuleMarkFailure$1.evaluate(TestRuleMarkFailure.java:47)
	at org.apache.lucene.util.TestRuleIgnoreAfterMaxFailures$1.evaluate(TestRuleIgnoreAfterMaxFailures.java:64)
	at org.apache.lucene.util.TestRuleIgnoreTestSuites$1.evaluate(TestRuleIgnoreTestSuites.java:54)
	at com.carrotsearch.randomizedtesting.rules.StatementAdapter.evaluate(StatementAdapter.java:36)
	at com.carrotsearch.randomizedtesting.ThreadLeakControl$StatementRunner.run(ThreadLeakControl.java:367)
	at java.lang.Thread.run(Thread.java:745)




Build Log:
[...truncated 11791 lines...]
   [junit4] Suite: org.apache.solr.cloud.AsyncMigrateRouteKeyTest
   [junit4]   2> Creating dataDir: /Users/jenkins/workspace/Lucene-Solr-5.x-MacOSX@2/solr/build/solr-core/test/J0/temp/solr.cloud.AsyncMigrateRouteKeyTest_3131F272555117E2-001/init-core-data-001
   [junit4]   2> 2311331 INFO  (SUITE-AsyncMigrateRouteKeyTest-seed#[3131F272555117E2]-worker) [    ] o.a.s.BaseDistributedSearchTestCase Setting hostContext system property: /r_/
   [junit4]   2> 2311334 INFO  (TEST-AsyncMigrateRouteKeyTest.test-seed#[3131F272555117E2]) [    ] o.a.s.c.ZkTestServer STARTING ZK TEST SERVER
   [junit4]   2> 2311334 INFO  (Thread-5738) [    ] o.a.s.c.ZkTestServer client port:0.0.0.0/0.0.0.0:0
   [junit4]   2> 2311334 INFO  (Thread-5738) [    ] o.a.s.c.ZkTestServer Starting server
   [junit4]   2> 2311435 INFO  (TEST-AsyncMigrateRouteKeyTest.test-seed#[3131F272555117E2]) [    ] o.a.s.c.ZkTestServer start zk server on port:54546
   [junit4]   2> 2311435 INFO  (TEST-AsyncMigrateRouteKeyTest.test-seed#[3131F272555117E2]) [    ] o.a.s.c.c.SolrZkClient Using default ZkCredentialsProvider
   [junit4]   2> 2311436 INFO  (TEST-AsyncMigrateRouteKeyTest.test-seed#[3131F272555117E2]) [    ] o.a.s.c.c.ConnectionManager Waiting for client to connect to ZooKeeper
   [junit4]   2> 2311444 INFO  (zkCallback-3488-thread-1) [    ] o.a.s.c.c.ConnectionManager Watcher org.apache.solr.common.cloud.ConnectionManager@43421903 name:ZooKeeperConnection Watcher:127.0.0.1:54546 got event WatchedEvent state:SyncConnected type:None path:null path:null type:None
   [junit4]   2> 2311445 INFO  (TEST-AsyncMigrateRouteKeyTest.test-seed#[3131F272555117E2]) [    ] o.a.s.c.c.ConnectionManager Client is connected to ZooKeeper
   [junit4]   2> 2311445 INFO  (TEST-AsyncMigrateRouteKeyTest.test-seed#[3131F272555117E2]) [    ] o.a.s.c.c.SolrZkClient Using default ZkACLProvider
   [junit4]   2> 2311445 INFO  (TEST-AsyncMigrateRouteKeyTest.test-seed#[3131F272555117E2]) [    ] o.a.s.c.c.SolrZkClient makePath: /solr
   [junit4]   2> 2311452 INFO  (TEST-AsyncMigrateRouteKeyTest.test-seed#[3131F272555117E2]) [    ] o.a.s.c.c.SolrZkClient Using default ZkCredentialsProvider
   [junit4]   2> 2311452 INFO  (TEST-AsyncMigrateRouteKeyTest.test-seed#[3131F272555117E2]) [    ] o.a.s.c.c.ConnectionManager Waiting for client to connect to ZooKeeper
   [junit4]   2> 2311455 INFO  (zkCallback-3489-thread-1) [    ] o.a.s.c.c.ConnectionManager Watcher org.apache.solr.common.cloud.ConnectionManager@4ebc02d4 name:ZooKeeperConnection Watcher:127.0.0.1:54546/solr got event WatchedEvent state:SyncConnected type:None path:null path:null type:None
   [junit4]   2> 2311455 INFO  (TEST-AsyncMigrateRouteKeyTest.test-seed#[3131F272555117E2]) [    ] o.a.s.c.c.ConnectionManager Client is connected to ZooKeeper
   [junit4]   2> 2311455 INFO  (TEST-AsyncMigrateRouteKeyTest.test-seed#[3131F272555117E2]) [    ] o.a.s.c.c.SolrZkClient Using default ZkACLProvider
   [junit4]   2> 2311455 INFO  (TEST-AsyncMigrateRouteKeyTest.test-seed#[3131F272555117E2]) [    ] o.a.s.c.c.SolrZkClient makePath: /collections/collection1
   [junit4]   2> 2311459 INFO  (TEST-AsyncMigrateRouteKeyTest.test-seed#[3131F272555117E2]) [    ] o.a.s.c.c.SolrZkClient makePath: /collections/collection1/shards
   [junit4]   2> 2311463 INFO  (TEST-AsyncMigrateRouteKeyTest.test-seed#[3131F272555117E2]) [    ] o.a.s.c.c.SolrZkClient makePath: /collections/control_collection
   [junit4]   2> 2311466 INFO  (TEST-AsyncMigrateRouteKeyTest.test-seed#[3131F272555117E2]) [    ] o.a.s.c.c.SolrZkClient makePath: /collections/control_collection/shards
   [junit4]   2> 2311470 INFO  (TEST-AsyncMigrateRouteKeyTest.test-seed#[3131F272555117E2]) [    ] o.a.s.c.AbstractZkTestCase put /Users/jenkins/workspace/Lucene-Solr-5.x-MacOSX@2/solr/core/src/test-files/solr/collection1/conf/solrconfig-tlog.xml to /configs/conf1/solrconfig.xml
   [junit4]   2> 2311470 INFO  (TEST-AsyncMigrateRouteKeyTest.test-seed#[3131F272555117E2]) [    ] o.a.s.c.c.SolrZkClient makePath: /configs/conf1/solrconfig.xml
   [junit4]   2> 2311476 INFO  (TEST-AsyncMigrateRouteKeyTest.test-seed#[3131F272555117E2]) [    ] o.a.s.c.AbstractZkTestCase put /Users/jenkins/workspace/Lucene-Solr-5.x-MacOSX@2/solr/core/src/test-files/solr/collection1/conf/schema15.xml to /configs/conf1/schema.xml
   [junit4]   2> 2311476 INFO  (TEST-AsyncMigrateRouteKeyTest.test-seed#[3131F272555117E2]) [    ] o.a.s.c.c.SolrZkClient makePath: /configs/conf1/schema.xml
   [junit4]   2> 2311480 INFO  (TEST-AsyncMigrateRouteKeyTest.test-seed#[3131F272555117E2]) [    ] o.a.s.c.AbstractZkTestCase put /Users/jenkins/workspace/Lucene-Solr-5.x-MacOSX@2/solr/core/src/test-files/solr/collection1/conf/solrconfig.snippet.randomindexconfig.xml to /configs/conf1/solrconfig.snippet.randomindexconfig.xml
   [junit4]   2> 2311480 INFO  (TEST-AsyncMigrateRouteKeyTest.test-seed#[3131F272555117E2]) [    ] o.a.s.c.c.SolrZkClient makePath: /configs/conf1/solrconfig.snippet.randomindexconfig.xml
   [junit4]   2> 2311484 INFO  (TEST-AsyncMigrateRouteKeyTest.test-seed#[3131F272555117E2]) [    ] o.a.s.c.AbstractZkTestCase put /Users/jenkins/workspace/Lucene-Solr-5.x-MacOSX@2/solr/core/src/test-files/solr/collection1/conf/stopwords.txt to /configs/conf1/stopwords.txt
   [junit4]   2> 2311484 INFO  (TEST-AsyncMigrateRouteKeyTest.test-seed#[3131F272555117E2]) [    ] o.a.s.c.c.SolrZkClient makePath: /configs/conf1/stopwords.txt
   [junit4]   2> 2311488 INFO  (TEST-AsyncMigrateRouteKeyTest.test-seed#[3131F272555117E2]) [    ] o.a.s.c.AbstractZkTestCase put /Users/jenkins/workspace/Lucene-Solr-5.x-MacOSX@2/solr/core/src/test-files/solr/collection1/conf/protwords.txt to /configs/conf1/protwords.txt
   [junit4]   2> 2311488 INFO  (TEST-AsyncMigrateRouteKeyTest.test-seed#[3131F272555117E2]) [    ] o.a.s.c.c.SolrZkClient makePath: /configs/conf1/protwords.txt
   [junit4]   2> 2311491 INFO  (TEST-AsyncMigrateRouteKeyTest.test-seed#[3131F272555117E2]) [    ] o.a.s.c.AbstractZkTestCase put /Users/jenkins/workspace/Lucene-Solr-5.x-MacOSX@2/solr/core/src/test-files/solr/collection1/conf/currency.xml to /configs/conf1/currency.xml
   [junit4]   2> 2311492 INFO  (TEST-AsyncMigrateRouteKeyTest.test-seed#[3131F272555117E2]) [    ] o.a.s.c.c.SolrZkClient makePath: /configs/conf1/currency.xml
   [junit4]   2> 2311495 INFO  (TEST-AsyncMigrateRouteKeyTest.test-seed#[3131F272555117E2]) [    ] o.a.s.c.AbstractZkTestCase put /Users/jenkins/workspace/Lucene-Solr-5.x-MacOSX@2/solr/core/src/test-files/solr/collection1/conf/enumsConfig.xml to /configs/conf1/enumsConfig.xml
   [junit4]   2> 2311496 INFO  (TEST-AsyncMigrateRouteKeyTest.test-seed#[3131F272555117E2]) [    ] o.a.s.c.c.SolrZkClient makePath: /configs/conf1/enumsConfig.xml
   [junit4]   2> 2311499 INFO  (TEST-AsyncMigrateRouteKeyTest.test-seed#[3131F272555117E2]) [    ] o.a.s.c.AbstractZkTestCase put /Users/jenkins/workspace/Lucene-Solr-5.x-MacOSX@2/solr/core/src/test-files/solr/collection1/conf/open-exchange-rates.json to /configs/conf1/open-exchange-rates.json
   [junit4]   2> 2311499 INFO  (TEST-AsyncMigrateRouteKeyTest.test-seed#[3131F272555117E2]) [    ] o.a.s.c.c.SolrZkClient makePath: /configs/conf1/open-exchange-rates.json
   [junit4]   2> 2311504 INFO  (TEST-AsyncMigrateRouteKeyTest.test-seed#[3131F272555117E2]) [    ] o.a.s.c.AbstractZkTestCase put /Users/jenkins/workspace/Lucene-Solr-5.x-MacOSX@2/solr/core/src/test-files/solr/collection1/conf/mapping-ISOLatin1Accent.txt to /configs/conf1/mapping-ISOLatin1Accent.txt
   [junit4]   2> 2311504 INFO  (TEST-AsyncMigrateRouteKeyTest.test-seed#[3131F272555117E2]) [    ] o.a.s.c.c.SolrZkClient makePath: /configs/conf1/mapping-ISOLatin1Accent.txt
   [junit4]   2> 2311507 INFO  (TEST-AsyncMigrateRouteKeyTest.test-seed#[3131F272555117E2]) [    ] o.a.s.c.AbstractZkTestCase put /Users/jenkins/workspace/Lucene-Solr-5.x-MacOSX@2/solr/core/src/test-files/solr/collection1/conf/old_synonyms.txt to /configs/conf1/old_synonyms.txt
   [junit4]   2> 2311508 INFO  (TEST-AsyncMigrateRouteKeyTest.test-seed#[3131F272555117E2]) [    ] o.a.s.c.c.SolrZkClient makePath: /configs/conf1/old_synonyms.txt
   [junit4]   2> 2311511 INFO  (TEST-AsyncMigrateRouteKeyTest.test-seed#[3131F272555117E2]) [    ] o.a.s.c.AbstractZkTestCase put /Users/jenkins/workspace/Lucene-Solr-5.x-MacOSX@2/solr/core/src/test-files/solr/collection1/conf/synonyms.txt to /configs/conf1/synonyms.txt
   [junit4]   2> 2311511 INFO  (TEST-AsyncMigrateRouteKeyTest.test-seed#[3131F272555117E2]) [    ] o.a.s.c.c.SolrZkClient makePath: /configs/conf1/synonyms.txt
   [junit4]   2> 2311767 INFO  (TEST-AsyncMigrateRouteKeyTest.test-seed#[3131F272555117E2]) [    ] o.a.s.SolrTestCaseJ4 Writing core.properties file to /Users/jenkins/workspace/Lucene-Solr-5.x-MacOSX@2/solr/build/solr-core/test/J0/temp/solr.cloud.AsyncMigrateRouteKeyTest_3131F272555117E2-001/control-001/cores/collection1
   [junit4]   2> 2311769 INFO  (TEST-AsyncMigrateRouteKeyTest.test-seed#[3131F272555117E2]) [    ] o.e.j.s.Server jetty-9.2.13.v20150730
   [junit4]   2> 2311772 INFO  (TEST-AsyncMigrateRouteKeyTest.test-seed#[3131F272555117E2]) [    ] o.e.j.s.h.ContextHandler Started o.e.j.s.ServletContextHandler@2af3f526{/r_,null,AVAILABLE}
   [junit4]   2> 2311775 INFO  (TEST-AsyncMigrateRouteKeyTest.test-seed#[3131F272555117E2]) [    ] o.e.j.s.ServerConnector Started ServerConnector@7663a7d1{HTTP/1.1}{127.0.0.1:54550}
   [junit4]   2> 2311775 INFO  (TEST-AsyncMigrateRouteKeyTest.test-seed#[3131F272555117E2]) [    ] o.e.j.s.Server Started @2316032ms
   [junit4]   2> 2311775 INFO  (TEST-AsyncMigrateRouteKeyTest.test-seed#[3131F272555117E2]) [    ] o.a.s.c.s.e.JettySolrRunner Jetty properties: {hostContext=/r_, solr.data.dir=/Users/jenkins/workspace/Lucene-Solr-5.x-MacOSX@2/solr/build/solr-core/test/J0/temp/solr.cloud.AsyncMigrateRouteKeyTest_3131F272555117E2-001/tempDir-001/control/data, hostPort=54550, coreRootDirectory=/Users/jenkins/workspace/Lucene-Solr-5.x-MacOSX@2/solr/build/solr-core/test/J0/temp/solr.cloud.AsyncMigrateRouteKeyTest_3131F272555117E2-001/control-001/cores}
   [junit4]   2> 2311775 INFO  (TEST-AsyncMigrateRouteKeyTest.test-seed#[3131F272555117E2]) [    ] o.a.s.s.SolrDispatchFilter SolrDispatchFilter.init(): sun.misc.Launcher$AppClassLoader@3033b503
   [junit4]   2> 2311775 INFO  (TEST-AsyncMigrateRouteKeyTest.test-seed#[3131F272555117E2]) [    ] o.a.s.c.SolrResourceLoader new SolrResourceLoader for directory: '/Users/jenkins/workspace/Lucene-Solr-5.x-MacOSX@2/solr/build/solr-core/test/J0/temp/solr.cloud.AsyncMigrateRouteKeyTest_3131F272555117E2-001/control-001'
   [junit4]   2> 2311775 INFO  (TEST-AsyncMigrateRouteKeyTest.test-seed#[3131F272555117E2]) [    ] o.a.s.c.SolrResourceLoader JNDI not configured for solr (NoInitialContextEx)
   [junit4]   2> 2311775 INFO  (TEST-AsyncMigrateRouteKeyTest.test-seed#[3131F272555117E2]) [    ] o.a.s.c.SolrResourceLoader solr home defaulted to 'solr/' (could not find system property or JNDI)
   [junit4]   2> 2311776 INFO  (TEST-AsyncMigrateRouteKeyTest.test-seed#[3131F272555117E2]) [    ] o.a.s.c.c.SolrZkClient Using default ZkCredentialsProvider
   [junit4]   2> 2311776 INFO  (TEST-AsyncMigrateRouteKeyTest.test-seed#[3131F272555117E2]) [    ] o.a.s.c.c.ConnectionManager Waiting for client to connect to ZooKeeper
   [junit4]   2> 2311778 INFO  (zkCallback-3490-thread-1) [    ] o.a.s.c.c.ConnectionManager Watcher org.apache.solr.common.cloud.ConnectionManager@5cefb2da name:ZooKeeperConnection Watcher:127.0.0.1:54546/solr got event WatchedEvent state:SyncConnected type:None path:null path:null type:None
   [junit4]   2> 2311778 INFO  (TEST-AsyncMigrateRouteKeyTest.test-seed#[3131F272555117E2]) [    ] o.a.s.c.c.ConnectionManager Client is connected to ZooKeeper
   [junit4]   2> 2311779 INFO  (TEST-AsyncMigrateRouteKeyTest.test-seed#[3131F272555117E2]) [    ] o.a.s.c.c.SolrZkClient Using default ZkACLProvider
   [junit4]   2> 2311780 INFO  (TEST-AsyncMigrateRouteKeyTest.test-seed#[3131F272555117E2]) [    ] o.a.s.s.SolrDispatchFilter Loading solr.xml from SolrHome (not found in ZooKeeper)
   [junit4]   2> 2311780 INFO  (TEST-AsyncMigrateRouteKeyTest.test-seed#[3131F272555117E2]) [    ] o.a.s.c.SolrXmlConfig Loading container configuration from /Users/jenkins/workspace/Lucene-Solr-5.x-MacOSX@2/solr/build/solr-core/test/J0/temp/solr.cloud.AsyncMigrateRouteKeyTest_3131F272555117E2-001/control-001/solr.xml
   [junit4]   2> 2311809 INFO  (TEST-AsyncMigrateRouteKeyTest.test-seed#[3131F272555117E2]) [    ] o.a.s.c.CorePropertiesLocator Config-defined core root directory: /Users/jenkins/workspace/Lucene-Solr-5.x-MacOSX@2/solr/build/solr-core/test/J0/temp/solr.cloud.AsyncMigrateRouteKeyTest_3131F272555117E2-001/control-001/cores
   [junit4]   2> 2311809 INFO  (TEST-AsyncMigrateRouteKeyTest.test-seed#[3131F272555117E2]) [    ] o.a.s.c.CoreContainer New CoreContainer 257902238
   [junit4]   2> 2311810 INFO  (TEST-AsyncMigrateRouteKeyTest.test-seed#[3131F272555117E2]) [    ] o.a.s.c.CoreContainer Loading cores into CoreContainer [instanceDir=/Users/jenkins/workspace/Lucene-Solr-5.x-MacOSX@2/solr/build/solr-core/test/J0/temp/solr.cloud.AsyncMigrateRouteKeyTest_3131F272555117E2-001/control-001]
   [junit4]   2> 2311811 WARN  (TEST-AsyncMigrateRouteKeyTest.test-seed#[3131F272555117E2]) [    ] o.a.s.c.CoreContainer Couldn't add files from /Users/jenkins/workspace/Lucene-Solr-5.x-MacOSX@2/solr/build/solr-core/test/J0/temp/solr.cloud.AsyncMigrateRouteKeyTest_3131F272555117E2-001/control-001/lib to classpath: /Users/jenkins/workspace/Lucene-Solr-5.x-MacOSX@2/solr/build/solr-core/test/J0/temp/solr.cloud.AsyncMigrateRouteKeyTest_3131F272555117E2-001/control-001/lib
   [junit4]   2> 2311811 INFO  (TEST-AsyncMigrateRouteKeyTest.test-seed#[3131F272555117E2]) [    ] o.a.s.h.c.HttpShardHandlerFactory created with socketTimeout : 90000,urlScheme : ,connTimeout : 15000,maxConnectionsPerHost : 20,maxConnections : 10000,corePoolSize : 0,maximumPoolSize : 2147483647,maxThreadIdleTime : 5,sizeOfQueue : -1,fairnessPolicy : false,useRetries : false,
   [junit4]   2> 2311813 INFO  (TEST-AsyncMigrateRouteKeyTest.test-seed#[3131F272555117E2]) [    ] o.a.s.u.UpdateShardHandler Creating UpdateShardHandler HTTP client with params: socketTimeout=340000&connTimeout=45000&retry=true
   [junit4]   2> 2311813 INFO  (TEST-AsyncMigrateRouteKeyTest.test-seed#[3131F272555117E2]) [    ] o.a.s.l.LogWatcher SLF4J impl is org.slf4j.impl.Log4jLoggerFactory
   [junit4]   2> 2311814 INFO  (TEST-AsyncMigrateRouteKeyTest.test-seed#[3131F272555117E2]) [    ] o.a.s.l.LogWatcher Registering Log Listener [Log4j (org.slf4j.impl.Log4jLoggerFactory)]
   [junit4]   2> 2311814 INFO  (TEST-AsyncMigrateRouteKeyTest.test-seed#[3131F272555117E2]) [    ] o.a.s.c.ZkContainer Zookeeper client=127.0.0.1:54546/solr
   [junit4]   2> 2311814 INFO  (TEST-AsyncMigrateRouteKeyTest.test-seed#[3131F272555117E2]) [    ] o.a.s.c.ZkController zkHost includes chroot
   [junit4]   2> 2311814 INFO  (TEST-AsyncMigrateRouteKeyTest.test-seed#[3131F272555117E2]) [    ] o.a.s.c.c.SolrZkClient Using default ZkCredentialsProvider
   [junit4]   2> 2311815 INFO  (TEST-AsyncMigrateRouteKeyTest.test-seed#[3131F272555117E2]) [    ] o.a.s.c.c.ConnectionManager Waiting for client to connect to ZooKeeper
   [junit4]   2> 2311817 INFO  (zkCallback-3493-thread-1) [    ] o.a.s.c.c.ConnectionManager Watcher org.apache.solr.common.cloud.ConnectionManager@2a430c03 name:ZooKeeperConnection Watcher:127.0.0.1:54546 got event WatchedEvent state:SyncConnected type:None path:null path:null type:None
   [junit4]   2> 2311817 INFO  (TEST-AsyncMigrateRouteKeyTest.test-seed#[3131F272555117E2]) [    ] o.a.s.c.c.ConnectionManager Client is connected to ZooKeeper
   [junit4]   2> 2311817 INFO  (TEST-AsyncMigrateRouteKeyTest.test-seed#[3131F272555117E2]) [    ] o.a.s.c.c.SolrZkClient Using default ZkACLProvider
   [junit4]   2> 2311819 INFO  (TEST-AsyncMigrateRouteKeyTest.test-seed#[3131F272555117E2]) [n:127.0.0.1:54550_r_    ] o.a.s.c.c.ConnectionManager Waiting for client to connect to ZooKeeper
   [junit4]   2> 2311821 INFO  (zkCallback-3494-thread-1-processing-n:127.0.0.1:54550_r_) [n:127.0.0.1:54550_r_    ] o.a.s.c.c.ConnectionManager Watcher org.apache.solr.common.cloud.ConnectionManager@11b8086d name:ZooKeeperConnection Watcher:127.0.0.1:54546/solr got event WatchedEvent state:SyncConnected type:None path:null path:null type:None
   [junit4]   2> 2311821 INFO  (TEST-AsyncMigrateRouteKeyTest.test-seed#[3131F272555117E2]) [n:127.0.0.1:54550_r_    ] o.a.s.c.c.ConnectionManager Client is connected to ZooKeeper
   [junit4]   2> 2311823 INFO  (TEST-AsyncMigrateRouteKeyTest.test-seed#[3131F272555117E2]) [n:127.0.0.1:54550_r_    ] o.a.s.c.c.SolrZkClient makePath: /overseer/queue
   [junit4]   2> 2311828 INFO  (TEST-AsyncMigrateRouteKeyTest.test-seed#[3131F272555117E2]) [n:127.0.0.1:54550_r_    ] o.a.s.c.c.SolrZkClient makePath: /overseer/collection-queue-work
   [junit4]   2> 2311833 INFO  (TEST-AsyncMigrateRouteKeyTest.test-seed#[3131F272555117E2]) [n:127.0.0.1:54550_r_    ] o.a.s.c.c.SolrZkClient makePath: /overseer/collection-map-running
   [junit4]   2> 2311839 INFO  (TEST-AsyncMigrateRouteKeyTest.test-seed#[3131F272555117E2]) [n:127.0.0.1:54550_r_    ] o.a.s.c.c.SolrZkClient makePath: /overseer/collection-map-completed
   [junit4]   2> 2311843 INFO  (TEST-AsyncMigrateRouteKeyTest.test-seed#[3131F272555117E2]) [n:127.0.0.1:54550_r_    ] o.a.s.c.c.SolrZkClient makePath: /overseer/collection-map-failure
   [junit4]   2> 2311848 INFO  (TEST-AsyncMigrateRouteKeyTest.test-seed#[3131F272555117E2]) [n:127.0.0.1:54550_r_    ] o.a.s.c.c.SolrZkClient makePath: /live_nodes
   [junit4]   2> 2311851 INFO  (TEST-AsyncMigrateRouteKeyTest.test-seed#[3131F272555117E2]) [n:127.0.0.1:54550_r_    ] o.a.s.c.c.SolrZkClient makePath: /aliases.json
   [junit4]   2> 2311854 INFO  (TEST-AsyncMigrateRouteKeyTest.test-seed#[3131F272555117E2]) [n:127.0.0.1:54550_r_    ] o.a.s.c.c.SolrZkClient makePath: /clusterstate.json
   [junit4]   2> 2311856 INFO  (TEST-AsyncMigrateRouteKeyTest.test-seed#[3131F272555117E2]) [n:127.0.0.1:54550_r_    ] o.a.s.c.c.SolrZkClient makePath: /security.json
   [junit4]   2> 2311859 INFO  (TEST-AsyncMigrateRouteKeyTest.test-seed#[3131F272555117E2]) [n:127.0.0.1:54550_r_    ] o.a.s.c.ZkController Register node as live in ZooKeeper:/live_nodes/127.0.0.1:54550_r_
   [junit4]   2> 2311859 INFO  (TEST-AsyncMigrateRouteKeyTest.test-seed#[3131F272555117E2]) [n:127.0.0.1:54550_r_    ] o.a.s.c.c.SolrZkClient makePath: /live_nodes/127.0.0.1:54550_r_
   [junit4]   2> 2311862 INFO  (TEST-AsyncMigrateRouteKeyTest.test-seed#[3131F272555117E2]) [n:127.0.0.1:54550_r_    ] o.a.s.c.c.SolrZkClient makePath: /overseer_elect
   [junit4]   2> 2311865 INFO  (TEST-AsyncMigrateRouteKeyTest.test-seed#[3131F272555117E2]) [n:127.0.0.1:54550_r_    ] o.a.s.c.c.SolrZkClient makePath: /overseer_elect/election
   [junit4]   2> 2311868 INFO  (TEST-AsyncMigrateRouteKeyTest.test-seed#[3131F272555117E2]) [n:127.0.0.1:54550_r_    ] o.a.s.c.Overseer Overseer (id=null) closing
   [junit4]   2> 2311869 INFO  (TEST-AsyncMigrateRouteKeyTest.test-seed#[3131F272555117E2]) [n:127.0.0.1:54550_r_    ] o.a.s.c.LeaderElector Joined leadership election with path: /overseer_elect/election/95388456739012612-127.0.0.1:54550_r_-n_0000000000
   [junit4]   2> 2311870 INFO  (TEST-AsyncMigrateRouteKeyTest.test-seed#[3131F272555117E2]) [n:127.0.0.1:54550_r_    ] o.a.s.c.OverseerElectionContext I am going to be the leader 127.0.0.1:54550_r_
   [junit4]   2> 2311870 INFO  (TEST-AsyncMigrateRouteKeyTest.test-seed#[3131F272555117E2]) [n:127.0.0.1:54550_r_    ] o.a.s.c.c.SolrZkClient makePath: /overseer_elect/leader
   [junit4]   2> 2311873 INFO  (TEST-AsyncMigrateRouteKeyTest.test-seed#[3131F272555117E2]) [n:127.0.0.1:54550_r_    ] o.a.s.c.Overseer Overseer (id=95388456739012612-127.0.0.1:54550_r_-n_0000000000) starting
   [junit4]   2> 2311876 INFO  (TEST-AsyncMigrateRouteKeyTest.test-seed#[3131F272555117E2]) [n:127.0.0.1:54550_r_    ] o.a.s.c.c.SolrZkClient makePath: /overseer/queue-work
   [junit4]   2> 2311890 INFO  (TEST-AsyncMigrateRouteKeyTest.test-seed#[3131F272555117E2]) [n:127.0.0.1:54550_r_    ] o.a.s.c.OverseerAutoReplicaFailoverThread Starting OverseerAutoReplicaFailoverThread autoReplicaFailoverWorkLoopDelay=10000 autoReplicaFailoverWaitAfterExpiration=30000 autoReplicaFailoverBadNodeExpiration=60000
   [junit4]   2> 2311891 INFO  (TEST-AsyncMigrateRouteKeyTest.test-seed#[3131F272555117E2]) [n:127.0.0.1:54550_r_    ] o.a.s.c.c.ZkStateReader Updating cluster state from ZooKeeper... 
   [junit4]   2> 2311891 INFO  (OverseerCollectionConfigSetProcessor-95388456739012612-127.0.0.1:54550_r_-n_0000000000) [n:127.0.0.1:54550_r_    ] o.a.s.c.OverseerTaskProcessor Process current queue of overseer operations
   [junit4]   2> 2311891 INFO  (OverseerStateUpdate-95388456739012612-127.0.0.1:54550_r_-n_0000000000) [n:127.0.0.1:54550_r_    ] o.a.s.c.Overseer Starting to work on the main queue
   [junit4]   2> 2311913 INFO  (TEST-AsyncMigrateRouteKeyTest.test-seed#[3131F272555117E2]) [n:127.0.0.1:54550_r_    ] o.a.s.c.CoreContainer Security conf doesn't exist. Skipping setup for authorization module.
   [junit4]   2> 2311913 INFO  (TEST-AsyncMigrateRouteKeyTest.test-seed#[3131F272555117E2]) [n:127.0.0.1:54550_r_    ] o.a.s.c.CoreContainer No authentication plugin used.
   [junit4]   2> 2311915 INFO  (TEST-AsyncMigrateRouteKeyTest.test-seed#[3131F272555117E2]) [n:127.0.0.1:54550_r_    ] o.a.s.c.CorePropertiesLocator Looking for core definitions underneath /Users/jenkins/workspace/Lucene-Solr-5.x-MacOSX@2/solr/build/solr-core/test/J0/temp/solr.cloud.AsyncMigrateRouteKeyTest_3131F272555117E2-001/control-001/cores
   [junit4]   2> 2311916 INFO  (TEST-AsyncMigrateRouteKeyTest.test-seed#[3131F272555117E2]) [n:127.0.0.1:54550_r_    ] o.a.s.c.CoreDescriptor Created CoreDescriptor: {name=collection1, collection=control_collection, config=solrconfig.xml, schema=schema.xml, loadOnStartup=true, configSetProperties=configsetprops.json, shard=, dataDir=data/, transient=false, coreNodeName=}
   [junit4]   2> 2311916 INFO  (TEST-AsyncMigrateRouteKeyTest.test-seed#[3131F272555117E2]) [n:127.0.0.1:54550_r_    ] o.a.s.c.CorePropertiesLocator Found core collection1 in /Users/jenkins/workspace/Lucene-Solr-5.x-MacOSX@2/solr/build/solr-core/test/J0/temp/solr.cloud.AsyncMigrateRouteKeyTest_3131F272555117E2-001/control-001/cores/collection1
   [junit4]   2> 2311916 INFO  (TEST-AsyncMigrateRouteKeyTest.test-seed#[3131F272555117E2]) [n:127.0.0.1:54550_r_    ] o.a.s.c.CorePropertiesLocator Found 1 core definitions
   [junit4]   2> 2311917 INFO  (TEST-AsyncMigrateRouteKeyTest.test-seed#[3131F272555117E2]) [n:127.0.0.1:54550_r_    ] o.a.s.s.SolrDispatchFilter user.dir=/Users/jenkins/workspace/Lucene-Solr-5.x-MacOSX@2/solr/build/solr-core/test/J0
   [junit4]   2> 2311917 INFO  (TEST-AsyncMigrateRouteKeyTest.test-seed#[3131F272555117E2]) [n:127.0.0.1:54550_r_    ] o.a.s.s.SolrDispatchFilter SolrDispatchFilter.init() done
   [junit4]   2> 2311918 INFO  (coreLoadExecutor-7655-thread-1-processing-n:127.0.0.1:54550_r_) [n:127.0.0.1:54550_r_ c:control_collection   x:collection1] o.a.s.c.ZkController publishing state=down
   [junit4]   2> 2311918 INFO  (coreLoadExecutor-7655-thread-1-processing-n:127.0.0.1:54550_r_) [n:127.0.0.1:54550_r_ c:control_collection   x:collection1] o.a.s.c.ZkController numShards not found on descriptor - reading it from system property
   [junit4]   2> 2311921 INFO  (OverseerStateUpdate-95388456739012612-127.0.0.1:54550_r_-n_0000000000) [n:127.0.0.1:54550_r_    ] o.a.s.c.Overseer processMessage: queueSize: 1, message = {
   [junit4]   2>   "operation":"state",
   [junit4]   2>   "shard":null,
   [junit4]   2>   "roles":null,
   [junit4]   2>   "state":"down",
   [junit4]   2>   "node_name":"127.0.0.1:54550_r_",
   [junit4]   2>   "collection":"control_collection",
   [junit4]   2>   "numShards":"1",
   [junit4]   2>   "base_url":"http://127.0.0.1:54550/r_",
   [junit4]   2>   "core":"collection1"} current state version: 0
   [junit4]   2> 2311922 INFO  (coreLoadExecutor-7655-thread-1-processing-n:127.0.0.1:54550_r_) [n:127.0.0.1:54550_r_ c:control_collection   x:collection1] o.a.s.c.ZkController look for our core node name
   [junit4]   2> 2311922 INFO  (OverseerStateUpdate-95388456739012612-127.0.0.1:54550_r_-n_0000000000) [n:127.0.0.1:54550_r_    ] o.a.s.c.o.ReplicaMutator Update state numShards=1 message={
   [junit4]   2>   "operation":"state",
   [junit4]   2>   "shard":null,
   [junit4]   2>   "roles":null,
   [junit4]   2>   "state":"down",
   [junit4]   2>   "node_name":"127.0.0.1:54550_r_",
   [junit4]   2>   "collection":"control_collection",
   [junit4]   2>   "numShards":"1",
   [junit4]   2>   "base_url":"http://127.0.0.1:54550/r_",
   [junit4]   2>   "core":"collection1"}
   [junit4]   2> 2311923 INFO  (OverseerStateUpdate-95388456739012612-127.0.0.1:54550_r_-n_0000000000) [n:127.0.0.1:54550_r_    ] o.a.s.c.o.ClusterStateMutator building a new cName: control_collection
   [junit4]   2> 2311924 INFO  (OverseerStateUpdate-95388456739012612-127.0.0.1:54550_r_-n_0000000000) [n:127.0.0.1:54550_r_    ] o.a.s.c.o.ReplicaMutator Assigning new node to shard shard=shard1
   [junit4]   2> 2311927 INFO  (zkCallback-3494-thread-1-processing-n:127.0.0.1:54550_r_) [n:127.0.0.1:54550_r_    ] o.a.s.c.c.ZkStateReader A cluster state change: [WatchedEvent state:SyncConnected type:NodeDataChanged path:/clusterstate.json], has occurred - updating... (live nodes size: [1])
   [junit4]   2> 2312924 INFO  (coreLoadExecutor-7655-thread-1-processing-n:127.0.0.1:54550_r_) [n:127.0.0.1:54550_r_ c:control_collection   x:collection1] o.a.s.c.ZkController waiting to find shard id in clusterstate for collection1
   [junit4]   2> 2312924 INFO  (coreLoadExecutor-7655-thread-1-processing-n:127.0.0.1:54550_r_) [n:127.0.0.1:54550_r_ c:control_collection   x:collection1] o.a.s.c.ZkController Check for collection zkNode:control_collection
   [junit4]   2> 2312925 INFO  (coreLoadExecutor-7655-thread-1-processing-n:127.0.0.1:54550_r_) [n:127.0.0.1:54550_r_ c:control_collection   x:collection1] o.a.s.c.ZkController Collection zkNode exists
   [junit4]   2> 2312925 INFO  (coreLoadExecutor-7655-thread-1-processing-n:127.0.0.1:54550_r_) [n:127.0.0.1:54550_r_ c:control_collection   x:collection1] o.a.s.c.c.ZkStateReader Load collection config from: [/collections/control_collection]
   [junit4]   2> 2312927 INFO  (coreLoadExecutor-7655-thread-1-processing-n:127.0.0.1:54550_r_) [n:127.0.0.1:54550_r_ c:control_collection   x:collection1] o.a.s.c.c.ZkStateReader path=[/collections/control_collection] [configName]=[conf1] specified config exists in ZooKeeper
   [junit4]   2> 2312927 INFO  (coreLoadExecutor-7655-thread-1-processing-n:127.0.0.1:54550_r_) [n:127.0.0.1:54550_r_ c:control_collection   x:collection1] o.a.s.c.SolrResourceLoader new SolrResourceLoader for directory: '/Users/jenkins/workspace/Lucene-Solr-5.x-MacOSX@2/solr/build/solr-core/test/J0/temp/solr.cloud.AsyncMigrateRouteKeyTest_3131F272555117E2-001/control-001/cores/collection1'
   [junit4]   2> 2312927 INFO  (coreLoadExecutor-7655-thread-1-processing-n:127.0.0.1:54550_r_) [n:127.0.0.1:54550_r_ c:control_collection   x:collection1] o.a.s.c.SolrResourceLoader JNDI not configured for solr (NoInitialContextEx)
   [junit4]   2> 2312927 INFO  (coreLoadExecutor-7655-thread-1-processing-n:127.0.0.1:54550_r_) [n:127.0.0.1:54550_r_ c:control_collection   x:collection1] o.a.s.c.SolrResourceLoader solr home defaulted to 'solr/' (could not find system property or JNDI)
   [junit4]   2> 2312930 INFO  (coreLoadExecutor-7655-thread-1-processing-n:127.0.0.1:54550_r_) [n:127.0.0.1:54550_r_ c:control_collection   x:collection1] o.a.s.c.Config loaded config solrconfig.xml with version 0 
   [junit4]   2> 2312938 INFO  (coreLoadExecutor-7655-thread-1-processing-n:127.0.0.1:54550_r_) [n:127.0.0.1:54550_r_ c:control_collection   x:collection1] o.a.s.c.SolrConfig current version of requestparams : -1
   [junit4]   2> 2312952 INFO  (coreLoadExecutor-7655-thread-1-processing-n:127.0.0.1:54550_r_) [n:127.0.0.1:54550_r_ c:control_collection   x:collection1] o.a.s.c.SolrConfig Using Lucene MatchVersion: 5.6.0
   [junit4]   2> 2312980 INFO  (coreLoadExecutor-7655-thread-1-processing-n:127.0.0.1:54550_r_) [n:127.0.0.1:54550_r_ c:control_collection   x:collection1] o.a.s.c.SolrConfig Loaded SolrConfig: solrconfig.xml
   [junit4]   2> 2312988 INFO  (coreLoadExecutor-7655-thread-1-processing-n:127.0.0.1:54550_r_) [n:127.0.0.1:54550_r_ c:control_collection   x:collection1] o.a.s.s.IndexSchema [collection1] Schema name=test
   [junit4]   2> 2313198 INFO  (coreLoadExecutor-7655-thread-1-processing-n:127.0.0.1:54550_r_) [n:127.0.0.1:54550_r_ c:control_collection   x:collection1] o.a.s.s.IndexSchema default search field in schema is text
   [junit4]   2> 2313199 INFO  (coreLoadExecutor-7655-thread-1-processing-n:127.0.0.1:54550_r_) [n:127.0.0.1:54550_r_ c:control_collection   x:collection1] o.a.s.s.IndexSchema unique key field: id
   [junit4]   2> 2313200 INFO  (coreLoadExecutor-7655-thread-1-processing-n:127.0.0.1:54550_r_) [n:127.0.0.1:54550_r_ c:control_collection   x:collection1] o.a.s.s.FileExchangeRateProvider Reloading exchange rates from file currency.xml
   [junit4]   2> 2313204 INFO  (coreLoadExecutor-7655-thread-1-processing-n:127.0.0.1:54550_r_) [n:127.0.0.1:54550_r_ c:control_collection   x:collection1] o.a.s.s.FileExchangeRateProvider Reloading exchange rates from file currency.xml
   [junit4]   2> 2313244 INFO  (coreLoadExecutor-7655-thread-1-processing-n:127.0.0.1:54550_r_) [n:127.0.0.1:54550_r_ c:control_collection   x:collection1] o.a.s.c.ConfigSetProperties Did not find ConfigSet properties, assuming default properties: Can't find resource 'configsetprops.json' in classpath or '/configs/conf1', cwd=/Users/jenkins/workspace/Lucene-Solr-5.x-MacOSX@2/solr/build/solr-core/test/J0
   [junit4]   2> 2313244 INFO  (coreLoadExecutor-7655-thread-1-processing-n:127.0.0.1:54550_r_) [n:127.0.0.1:54550_r_ c:control_collection   x:collection1] o.a.s.c.CoreContainer Creating SolrCore 'collection1' using configuration from collection control_collection
   [junit4]   2> 2313245 INFO  (coreLoadExecutor-7655-thread-1-processing-n:127.0.0.1:54550_r_) [n:127.0.0.1:54550_r_ c:control_collection s:shard1 r:core_node1 x:collection1] o.a.s.c.SolrCore org.apache.solr.core.MockDirectoryFactory
   [junit4]   2> 2313245 INFO  (coreLoadExecutor-7655-thread-1-processing-n:127.0.0.1:54550_r_) [n:127.0.0.1:54550_r_ c:control_collection s:shard1 r:core_node1 x:collection1] o.a.s.c.SolrCore [[collection1] ] Opening new SolrCore at [/Users/jenkins/workspace/Lucene-Solr-5.x-MacOSX@2/solr/build/solr-core/test/J0/temp/solr.cloud.AsyncMigrateRouteKeyTest_3131F272555117E2-001/control-001/cores/collection1], dataDir=[/Users/jenkins/workspace/Lucene-Solr-5.x-MacOSX@2/solr/build/solr-core/test/J0/temp/solr.cloud.AsyncMigrateRouteKeyTest_3131F272555117E2-001/control-001/cores/collection1/data/]
   [junit4]   2> 2313245 INFO  (coreLoadExecutor-7655-thread-1-processing-n:127.0.0.1:54550_r_) [n:127.0.0.1:54550_r_ c:control_collection s:shard1 r:core_node1 x:collection1] o.a.s.c.JmxMonitoredMap JMX monitoring is enabled. Adding Solr mbeans to JMX Server: com.sun.jmx.mbeanserver.JmxMBeanServer@6d4d63ba
   [junit4]   2> 2313246 INFO  (coreLoadExecutor-7655-thread-1-processing-n:127.0.0.1:54550_r_) [n:127.0.0.1:54550_r_ c:control_collection s:shard1 r:core_node1 x:collection1] o.a.s.c.CachingDirectoryFactory return new directory for /Users/jenkins/workspace/Lucene-Solr-5.x-MacOSX@2/solr/build/solr-core/test/J0/temp/solr.cloud.AsyncMigrateRouteKeyTest_3131F272555117E2-001/control-001/cores/collection1/data
   [junit4]   2> 2313246 INFO  (coreLoadExecutor-7655-thread-1-processing-n:127.0.0.1:54550_r_) [n:127.0.0.1:54550_r_ c:control_collection s:shard1 r:core_node1 x:collection1] o.a.s.c.SolrCore New index directory detected: old=null new=/Users/jenkins/workspace/Lucene-Solr-5.x-MacOSX@2/solr/build/solr-core/test/J0/temp/solr.cloud.AsyncMigrateRouteKeyTest_3131F272555117E2-001/control-001/cores/collection1/data/index/
   [junit4]   2> 2313246 WARN  (coreLoadExecutor-7655-thread-1-processing-n:127.0.0.1:54550_r_) [n:127.0.0.1:54550_r_ c:control_collection s:shard1 r:core_node1 x:collection1] o.a.s.c.SolrCore [collection1] Solr index directory '/Users/jenkins/workspace/Lucene-Solr-5.x-MacOSX@2/solr/build/solr-core/test/J0/temp/solr.cloud.AsyncMigrateRouteKeyTest_3131F272555117E2-001/control-001/cores/collection1/data/index' doesn't exist. Creating new index...
   [junit4]   2> 2313246 INFO  (coreLoadExecutor-7655-thread-1-processing-n:127.0.0.1:54550_r_) [n:127.0.0.1:54550_r_ c:control_collection s:shard1 r:core_node1 x:collection1] o.a.s.c.CachingDirectoryFactory return new directory for /Users/jenkins/workspace/Lucene-Solr-5.x-MacOSX@2/solr/build/solr-core/test/J0/temp/solr.cloud.AsyncMigrateRouteKeyTest_3131F272555117E2-001/control-001/cores/collection1/data/index
   [junit4]   2> 2313247 INFO  (coreLoadExecutor-7655-thread-1-processing-n:127.0.0.1:54550_r_) [n:127.0.0.1:54550_r_ c:control_collection s:shard1 r:core_node1 x:collection1] o.a.s.u.RandomMergePolicy RandomMergePolicy wrapping class org.apache.lucene.index.LogByteSizeMergePolicy: [LogByteSizeMergePolicy: minMergeSize=1677721, mergeFactor=24, maxMergeSize=2147483648, maxMergeSizeForForcedMerge=9223372036854775807, calibrateSizeByDeletes=false, maxMergeDocs=2147483647, maxCFSSegmentSizeMB=8.796093022207999E12, noCFSRatio=0.0]
   [junit4]   2> 2313247 INFO  (coreLoadExecutor-7655-thread-1-processing-n:127.0.0.1:54550_r_) [n:127.0.0.1:54550_r_ c:control_collection s:shard1 r:core_node1 x:collection1] o.a.s.c.SolrDeletionPolicy SolrDeletionPolicy.onCommit: commits: num=1
   [junit4]   2> 	commit{dir=MockDirectoryWrapper(RAMDirectory@532c97b8 lockFactory=org.apache.lucene.store.SingleInstanceLockFactory@149cdbb1),segFN=segments_1,generation=1}
   [junit4]   2> 2313247 INFO  (coreLoadExecutor-7655-thread-1-processing-n:127.0.0.1:54550_r_) [n:127.0.0.1:54550_r_ c:control_collection s:shard1 r:core_node1 x:collection1] o.a.s.c.SolrDeletionPolicy newest commit generation = 1
   [junit4]   2> 2313248 INFO  (OldIndexDirectoryCleanupThreadForCore-collection1) [n:127.0.0.1:54550_r_ c:control_collection s:shard1 r:core_node1 x:collection1] o.a.s.c.SolrCore Looking for old index directories to cleanup for core collection1 in /Users/jenkins/workspace/Lucene-Solr-5.x-MacOSX@2/solr/build/solr-core/test/J0/temp/solr.cloud.AsyncMigrateRouteKeyTest_3131F272555117E2-001/control-001/cores/collection1/data/
   [junit4]   2> 2313248 WARN  (OldIndexDirectoryCleanupThreadForCore-collection1) [n:127.0.0.1:54550_r_ c:control_collection s:shard1 r:core_node1 x:collection1] o.a.s.c.DirectoryFactory /Users/jenkins/workspace/Lucene-Solr-5.x-MacOSX@2/solr/build/solr-core/test/J0/temp/solr.cloud.AsyncMigrateRouteKeyTest_3131F272555117E2-001/control-001/cores/collection1/data/ does not point to a valid data directory; skipping clean-up of old index directories.
   [junit4]   2> 2313253 INFO  (coreLoadExecutor-7655-thread-1-processing-n:127.0.0.1:54550_r_) [n:127.0.0.1:54550_r_ c:control_collection s:shard1 r:core_node1 x:collection1] o.a.s.u.p.UpdateRequestProcessorChain creating updateRequestProcessorChain "nodistrib"
   [junit4]   2> 2313253 INFO  (coreLoadExecutor-7655-thread-1-processing-n:127.0.0.1:54550_r_) [n:127.0.0.1:54550_r_ c:control_collection s:shard1 r:core_node1 x:collection1] o.a.s.u.p.UpdateRequestProcessorChain creating updateRequestProcessorChain "dedupe"
   [junit4]   2> 2313253 INFO  (coreLoadExecutor-7655-thread-1-processing-n:127.0.0.1:54550_r_) [n:127.0.0.1:54550_r_ c:control_collection s:shard1 r:core_node1 x:collection1] o.a.s.u.p.UpdateRequestProcessorChain inserting DistributedUpdateProcessorFactory into updateRequestProcessorChain "dedupe"
   [junit4]   2> 2313253 INFO  (coreLoadExecutor-7655-thread-1-processing-n:127.0.0.1:54550_r_) [n:127.0.0.1:54550_r_ c:control_collection s:shard1 r:core_node1 x:collection1] o.a.s.u.p.UpdateRequestProcessorChain creating updateRequestProcessorChain "stored_sig"
   [junit4]   2> 2313253 INFO  (coreLoadExecutor-7655-thread-1-processing-n:127.0.0.1:54550_r_) [n:127.0.0.1:54550_r_ c:control_collection s:shard1 r:core_node1 x:collection1] o.a.s.u.p.UpdateRequestProcessorChain inserting DistributedUpdateProcessorFactory into updateRequestProcessorChain "stored_sig"
   [junit4]   2> 2313254 INFO  (coreLoadExecutor-7655-thread-1-processing-n:127.0.0.1:54550_r_) [n:127.0.0.1:54550_r_ c:control_collection s:shard1 r:core_node1 x:collection1] o.a.s.u.p.UpdateRequestProcessorChain creating updateRequestProcessorChain "distrib-dup-test-chain-explicit"
   [junit4]   2> 2313254 INFO  (coreLoadExecutor-7655-thread-1-processing-n:127.0.0.1:54550_r_) [n:127.0.0.1:54550_r_ c:control_collection s:shard1 r:core_node1 x:collection1] o.a.s.u.p.UpdateRequestProcessorChain creating updateRequestProcessorChain "distrib-dup-test-chain-implicit"
   [junit4]   2> 2313254 INFO  (coreLoadExecutor-7655-thread-1-processing-n:127.0.0.1:54550_r_) [n:127.0.0.1:54550_r_ c:control_collection s:shard1 r:core_node1 x:collection1] o.a.s.u.p.UpdateRequestProcessorChain inserting DistributedUpdateProcessorFactory into updateRequestProcessorChain "distrib-dup-test-chain-implicit"
   [junit4]   2> 2313254 INFO  (coreLoadExecutor-7655-thread-1-processing-n:127.0.0.1:54550_r_) [n:127.0.0.1:54550_r_ c:control_collection s:shard1 r:core_node1 x:collection1] o.a.s.c.SolrCore no updateRequestProcessorChain defined as default, creating implicit default
   [junit4]   2> 2313254 WARN  (coreLoadExecutor-7655-thread-1-processing-n:127.0.0.1:54550_r_) [n:127.0.0.1:54550_r_ c:control_collection s:shard1 r:core_node1 x:collection1] o.a.s.c.RequestHandlers INVALID paramSet a in requestHandler {type = requestHandler,name = /dump,class = DumpRequestHandler,args = {defaults={a=A,b=B}}}
   [junit4]   2> 2313263 INFO  (coreLoadExecutor-7655-thread-1-processing-n:127.0.0.1:54550_r_) [n:127.0.0.1:54550_r_ c:control_collection s:shard1 r:core_node1 x:collection1] o.a.s.h.l.XMLLoader xsltCacheLifetimeSeconds=60
   [junit4]   2> 2313266 INFO  (coreLoadExecutor-7655-thread-1-processing-n:127.0.0.1:54550_r_) [n:127.0.0.1:54550_r_ c:control_collection s:shard1 r:core_node1 x:collection1] o.a.s.h.l.XMLLoader xsltCacheLifetimeSeconds=60
   [junit4]   2> 2313267 INFO  (coreLoadExecutor-7655-thread-1-processing-n:127.0.0.1:54550_r_) [n:127.0.0.1:54550_r_ c:control_collection s:shard1 r:core_node1 x:collection1] o.a.s.h.l.XMLLoader xsltCacheLifetimeSeconds=60
   [junit4]   2> 2313269 INFO  (coreLoadExecutor-7655-thread-1-processing-n:127.0.0.1:54550_r_) [n:127.0.0.1:54550_r_ c:control_collection s:shard1 r:core_node1 x:collection1] o.a.s.h.l.XMLLoader xsltCacheLifetimeSeconds=60
   [junit4]   2> 2313275 INFO  (coreLoadExecutor-7655-thread-1-processing-n:127.0.0.1:54550_r_) [n:127.0.0.1:54550_r_ c:control_collection s:shard1 r:core_node1 x:collection1] o.a.s.c.RequestHandlers Registered paths: /update/csv,/admin/segments,/admin/ping,/admin/system,/admin/properties,/admin/luke,/admin/file,/admin/logging,/config,/update,standard,/admin/threads,/replication,/admin/plugins,/get,/update/json/docs,/schema,/dump,/update/json,/admin/mbeans
   [junit4]   2> 2313277 INFO  (coreLoadExecutor-7655-thread-1-processing-n:127.0.0.1:54550_r_) [n:127.0.0.1:54550_r_ c:control_collection s:shard1 r:core_node1 x:collection1] o.a.s.c.SolrCore Using default statsCache cache: org.apache.solr.search.stats.LocalStatsCache
   [junit4]   2> 2313278 INFO  (coreLoadExecutor-7655-thread-1-processing-n:127.0.0.1:54550_r_) [n:127.0.0.1:54550_r_ c:control_collection s:shard1 r:core_node1 x:collection1] o.a.s.u.UpdateHandler Using UpdateLog implementation: org.apache.solr.update.UpdateLog
   [junit4]   2> 2313278 INFO  (coreLoadExecutor-7655-thread-1-processing-n:127.0.0.1:54550_r_) [n:127.0.0.1:54550_r_ c:control_collection s:shard1 r:core_node1 x:collection1] o.a.s.u.UpdateLog Initializing UpdateLog: dataDir= defaultSyncLevel=FLUSH numRecordsToKeep=100 maxNumLogsToKeep=10 numVersionBuckets=65536
   [junit4]   2> 2313279 INFO  (coreLoadExecutor-7655-thread-1-processing-n:127.0.0.1:54550_r_) [n:127.0.0.1:54550_r_ c:control_collection s:shard1 r:core_node1 x:collection1] o.a.s.u.CommitTracker Hard AutoCommit: disabled
   [junit4]   2> 2313279 INFO  (coreLoadExecutor-7655-thread-1-processing-n:127.0.0.1:54550_r_) [n:127.0.0.1:54550_r_ c:control_collection s:shard1 r:core_node1 x:collection1] o.a.s.u.CommitTracker Soft AutoCommit: disabled
   [junit4]   2> 2313279 INFO  (coreLoadExecutor-7655-thread-1-processing-n:127.0.0.1:54550_r_) [n:127.0.0.1:54550_r_ c:control_collection s:shard1 r:core_node1 x:collection1] o.a.s.u.RandomMergePolicy RandomMergePolicy wrapping class org.apache.lucene.index.TieredMergePolicy: [TieredMergePolicy: maxMergeAtOnce=17, maxMergeAtOnceExplicit=11, maxMergedSegmentMB=97.251953125, floorSegmentMB=2.0849609375, forceMergeDeletesPctAllowed=23.80829380477501, segmentsPerTier=15.0, maxCFSSegmentSizeMB=8.796093022207999E12, noCFSRatio=0.15731913430766556
   [junit4]   2> 2313279 INFO  (coreLoadExecutor-7655-thread-1-processing-n:127.0.0.1:54550_r_) [n:127.0.0.1:54550_r_ c:control_collection s:shard1 r:core_node1 x:collection1] o.a.s.c.SolrDeletionPolicy SolrDeletionPolicy.onInit: commits: num=1
   [junit4]   2> 	commit{dir=MockDirectoryWrapper(RAMDirectory@532c97b8 lockFactory=org.apache.lucene.store.SingleInstanceLockFactory@149cdbb1),segFN=segments_1,generation=1}
   [junit4]   2> 2313280 INFO  (coreLoadExecutor-7655-thread-1-processing-n:127.0.0.1:54550_r_) [n:127.0.0.1:54550_r_ c:control_collection s:shard1 r:core_node1 x:collection1] o.a.s.c.SolrDeletionPolicy newest commit generation = 1
   [junit4]   2> 2313280 INFO  (coreLoadExecutor-7655-thread-1-processing-n:127.0.0.1:54550_r_) [n:127.0.0.1:54550_r_ c:control_collection s:shard1 r:core_node1 x:collection1] o.a.s.s.SolrIndexSearcher Opening Searcher@43512726[collection1] main
   [junit4]   2> 2313280 INFO  (coreLoadExecutor-7655-thread-1-processing-n:127.0.0.1:54550_r_) [n:127.0.0.1:54550_r_ c:control_collection s:shard1 r:core_node1 x:collection1] o.a.s.c.c.ZkStateReader Load collection config from: [/collections/control_collection]
   [junit4]   2> 2313281 INFO  (coreLoadExecutor-7655-thread-1-processing-n:127.0.0.1:54550_r_) [n:127.0.0.1:54550_r_ c:control_collection s:shard1 r:core_node1 x:collection1] o.a.s.c.c.ZkStateReader path=[/collections/control_collection] [configName]=[conf1] specified config exists in ZooKeeper
   [junit4]   2> 2313281 INFO  (coreLoadExecutor-7655-thread-1-processing-n:127.0.0.1:54550_r_) [n:127.0.0.1:54550_r_ c:control_collection s:shard1 r:core_node1 x:collection1] o.a.s.r.ManagedResourceStorage Setting up ZooKeeper-based storage for the RestManager with znodeBase: /configs/conf1
   [junit4]   2> 2313282 INFO  (coreLoadExecutor-7655-thread-1-processing-n:127.0.0.1:54550_r_) [n:127.0.0.1:54550_r_ c:control_collection s:shard1 r:core_node1 x:collection1] o.a.s.r.ManagedResourceStorage Configured ZooKeeperStorageIO with znodeBase: /configs/conf1
   [junit4]   2> 2313282 INFO  (coreLoadExecutor-7655-thread-1-processing-n:127.0.0.1:54550_r_) [n:127.0.0.1:54550_r_ c:control_collection s:shard1 r:core_node1 x:collection1] o.a.s.r.RestManager Initializing RestManager with initArgs: {}
   [junit4]   2> 2313282 INFO  (coreLoadExecutor-7655-thread-1-processing-n:127.0.0.1:54550_r_) [n:127.0.0.1:54550_r_ c:control_collection s:shard1 r:core_node1 x:collection1] o.a.s.r.ManagedResourceStorage Reading _rest_managed.json using ZooKeeperStorageIO:path=/configs/conf1
   [junit4]   2> 2313283 INFO  (coreLoadExecutor-7655-thread-1-processing-n:127.0.0.1:54550_r_) [n:127.0.0.1:54550_r_ c:control_collection s:shard1 r:core_node1 x:collection1] o.a.s.r.ManagedResourceStorage No data found for znode /configs/conf1/_rest_managed.json
   [junit4]   2> 2313283 INFO  (coreLoadExecutor-7655-thread-1-processing-n:127.0.0.1:54550_r_) [n:127.0.0.1:54550_r_ c:control_collection s:shard1 r:core_node1 x:collection1] o.a.s.r.ManagedResourceStorage Loaded null at path _rest_managed.json using ZooKeeperStorageIO:path=/configs/conf1
   [junit4]   2> 2313284 INFO  (coreLoadExecutor-7655-thread-1-processing-n:127.0.0.1:54550_r_) [n:127.0.0.1:54550_r_ c:control_collection s:shard1 r:core_node1 x:collection1] o.a.s.r.RestManager Initializing 0 registered ManagedResources
   [junit4]   2> 2313284 INFO  (coreLoadExecutor-7655-thread-1-processing-n:127.0.0.1:54550_r_) [n:127.0.0.1:54550_r_ c:control_collection s:shard1 r:core_node1 x:collection1] o.a.s.h.ReplicationHandler Commits will be reserved for  10000
   [junit4]   2> 2313285 INFO  (searcherExecutor-7656-thread-1-processing-s:shard1 n:127.0.0.1:54550_r_ c:control_collection r:core_node1 x:collection1) [n:127.0.0.1:54550_r_ c:control_collection s:shard1 r:core_node1 x:collection1] o.a.s.c.SolrCore [collection1] Registered new searcher Searcher@43512726[collection1] main{ExitableDirectoryReader(UninvertingDirectoryReader())}
   [junit4]   2> 2313285 INFO  (coreLoadExecutor-7655-thread-1-processing-n:127.0.0.1:54550_r_) [n:127.0.0.1:54550_r_ c:control_collection s:shard1 r:core_node1 x:collection1] o.a.s.u.UpdateLog Looking up max value of version field to seed version buckets
   [junit4]   2> 2313285 INFO  (coreLoadExecutor-7655-thread-1-processing-n:127.0.0.1:54550_r_) [n:127.0.0.1:54550_r_ c:control_collection s:shard1 r:core_node1 x:collection1] o.a.s.u.VersionInfo Refreshing highest value of _version_ for 65536 version buckets from index
   [junit4]   2> 2313285 INFO  (coreLoadExecutor-7655-thread-1-processing-n:127.0.0.1:54550_r_) [n:127.0.0.1:54550_r_ c:control_collection s:shard1 r:core_node1 x:collection1] o.a.s.u.VersionInfo No terms found for _version_, cannot seed version bucket highest value from index
   [junit4]   2> 2313285 INFO  (coreLoadExecutor-7655-thread-1-processing-n:127.0.0.1:54550_r_) [n:127.0.0.1:54550_r_ c:control_collection s:shard1 r:core_node1 x:collection1] o.a.s.u.UpdateLog Could not find max version in index or recent updates, using new clock 1526215309866827776
   [junit4]   2> 2313288 INFO  (coreLoadExecutor-7655-thread-1-processing-n:127.0.0.1:54550_r_) [n:127.0.0.1:54550_r_ c:control_collection s:shard1 r:core_node1 x:collection1] o.a.s.u.UpdateLog Took 2.0ms to seed version buckets with highest version 1526215309866827776
   [junit4]   2> 2313288 INFO  (coreLoadExecutor-7655-thread-1-processing-n:127.0.0.1:54550_r_) [n:127.0.0.1:54550_r_ c:control_collection s:shard1 r:core_node1 x:collection1] o.a.s.c.ZkController watch zkdir /configs/conf1
   [junit4]   2> 2313289 INFO  (coreLoadExecutor-7655-thread-1-processing-n:127.0.0.1:54550_r_) [n:127.0.0.1:54550_r_ c:control_collection s:shard1 r:core_node1 x:collection1] o.a.s.c.CoreContainer registering core: collection1
   [junit4]   2> 2313290 INFO  (coreZkRegister-7649-thread-1-processing-s:shard1 n:127.0.0.1:54550_r_ c:control_collection r:core_node1 x:collection1) [n:127.0.0.1:54550_r_ c:control_collection s:shard1 r:core_node1 x:collection1] o.a.s.c.ZkController Register replica - core:collection1 address:http://127.0.0.1:54550/r_ collection:control_collection shard:shard1
   [junit4]   2> 2313297 INFO  (coreZkRegister-7649-thread-1-processing-s:shard1 n:127.0.0.1:54550_r_ c:control_collection r:core_node1 x:collection1) [n:127.0.0.1:54550_r_ c:control_collection s:shard1 r:core_node1 x:collection1] o.a.s.c.c.SolrZkClient makePath: /collections/control_collection/leader_elect/shard1/election
   [junit4]   2> 2313306 INFO  (coreZkRegister-7649-thread-1-processing-s:shard1 n:127.0.0.1:54550_r_ c:control_collection r:core_node1 x:collection1) [n:127.0.0.1:54550_r_ c:control_collection s:shard1 r:core_node1 x:collection1] o.a.s.c.LeaderElector Joined leadership election with path: /collections/control_collection/leader_elect/shard1/election/95388456739012612-core_node1-n_0000000000
   [junit4]   2> 2313307 INFO  (coreZkRegister-7649-thread-1-processing-s:shard1 n:127.0.0.1:54550_r_ c:control_collection r:core_node1 x:collection1) [n:127.0.0.1:54550_r_ c:control_collection s:shard1 r:core_node1 x:collection1] o.a.s.c.ShardLeaderElectionContext Running the leader process for shard=shard1 and weAreReplacement=false and leaderVoteWait=10000
   [junit4]   2> 2313311 INFO  (coreZkRegister-7649-thread-1-processing-s:shard1 n:127.0.0.1:54550_r_ c:control_collection r:core_node1 x:collection1) [n:127.0.0.1:54550_r_ c:control_collection s:shard1 r:core_node1 x:collection1] o.a.s.c.ShardLeaderElectionContext Enough replicas found to continue.
   [junit4]   2> 2313311 INFO  (coreZkRegister-7649-thread-1-processing-s:shard1 n:127.0.0.1:54550_r_ c:control_collection r:core_node1 x:collection1) [n:127.0.0.1:54550_r_ c:control_collection s:shard1 r:core_node1 x:collection1] o.a.s.c.ShardLeaderElectionContext I may be the new leader - try and sync
   [junit4]   2> 2313311 INFO  (coreZkRegister-7649-thread-1-processing-s:shard1 n:127.0.0.1:54550_r_ c:control_collection r:core_node1 x:collection1) [n:127.0.0.1:54550_r_ c:control_collection s:shard1 r:core_node1 x:collection1] o.a.s.c.SyncStrategy Sync replicas to http://127.0.0.1:54550/r_/collection1/
   [junit4]   2> 2313311 INFO  (coreZkRegister-7649-thread-1-processing-s:shard1 n:127.0.0.1:54550_r_ c:control_collection r:core_node1 x:collection1) [n:127.0.0.1:54550_r_ c:control_collection s:shard1 r:core_node1 x:collection1] o.a.s.c.SyncStrategy Sync Success - now sync replicas to me
   [junit4]   2> 2313312 INFO  (coreZkRegister-7649-thread-1-processing-s:shard1 n:127.0.0.1:54550_r_ c:control_collection r:core_node1 x:collection1) [n:127.0.0.1:54550_r_ c:control_collection s:shard1 r:core_node1 x:collection1] o.a.s.c.SyncStrategy http://127.0.0.1:54550/r_/collection1/ has no replicas
   [junit4]   2> 2313312 INFO  (OverseerStateUpdate-95388456739012612-127.0.0.1:54550_r_-n_0000000000) [n:127.0.0.1:54550_r_    ] o.a.s.c.Overseer processMessage: queueSize: 1, message = {
   [junit4]   2>   "operation":"leader",
   [junit4]   2>   "shard":"shard1",
   [junit4]   2>   "collection":"control_collection"} current state version: 1
   [junit4]   2> 2313313 INFO  (coreZkRegister-7649-thread-1-processing-s:shard1 n:127.0.0.1:54550_r_ c:control_collection r:core_node1 x:collection1) [n:127.0.0.1:54550_r_ c:control_collection s:shard1 r:core_node1 x:collection1] o.a.s.c.c.SolrZkClient makePath: /collections/control_collection/leaders/shard1
   [junit4]   2> 2313319 INFO  (coreZkRegister-7649-thread-1-processing-s:shard1 n:127.0.0.1:54550_r_ c:control_collection r:core_node1 x:collection1) [n:127.0.0.1:54550_r_ c:control_collection s:shard1 r:core_node1 x:collection1] o.a.s.c.ShardLeaderElectionContextBase Creating leader registration node
   [junit4]   2> 2313322 INFO  (coreZkRegister-7649-thread-1-processing-s:shard1 n:127.0.0.1:54550_r_ c:control_collection r:core_node1 x:collection1) [n:127.0.0.1:54550_r_ c:control_collection s:shard1 r:core_node1 x:collection1] o.a.s.c.ShardLeaderElectionContext I am the new leader: http://127.0.0.1:54550/r_/collection1/ shard1
   [junit4]   2> 2313324 INFO  (OverseerStateUpdate-95388456739012612-127.0.0.1:54550_r_-n_0000000000) [n:127.0.0.1:54550_r_    ] o.a.s.c.Overseer processMessage: queueSize: 1, message = {
   [junit4]   2>   "operation":"leader",
   [junit4]   2>   "shard":"shard1",
   [junit4]   2>   "collection":"control_collection",
   [junit4]   2>   "base_url":"http://127.0.0.1:54550/r_",
   [junit4]   2>   "core":"collection1",
   [junit4]   2>   "state":"active"} current state version: 1
   [junit4]   2> 2313422 INFO  (TEST-AsyncMigrateRouteKeyTest.test-seed#[3131F272555117E2]) [    ] o.a.s.c.c.SolrZkClient Using default ZkCredentialsProvider
   [junit4]   2> 2313423 INFO  (TEST-AsyncMigrateRouteKeyTest.test-seed#[3131F272555117E2]) [    ] o.a.s.c.c.ConnectionManager Waiting for client to connect to ZooKeeper
   [junit4]   2> 2313425 INFO  (zkCallback-3496-thread-1) [    ] o.a.s.c.c.ConnectionManager Watcher org.apache.solr.common.cloud.ConnectionManager@533b00a8 name:ZooKeeperConnection Watcher:127.0.0.1:54546/solr got event WatchedEvent state:SyncConnected type:None path:null path:null type:None
   [junit4]   2> 2313425 INFO  (TEST-AsyncMigrateRouteKeyTest.test-seed#[3131F272555117E2]) [    ] o.a.s.c.c.ConnectionManager Client is connected to ZooKeeper
   [junit4]   2> 2313426 INFO  (TEST-AsyncMigrateRouteKeyTest.test-seed#[3131F272555117E2]) [    ] o.a.s.c.c.SolrZkClient Using default ZkACLProvider
   [junit4]   2> 2313426 INFO  (TEST-AsyncMigrateRouteKeyTest.test-seed#[3131F272555117E2]) [    ] o.a.s.c.c.ZkStateReader Updating cluster state from ZooKeeper... 
   [junit4]   2> 2313431 INFO  (zkCallback-3494-thread-1-processing-n:127.0.0.1:54550_r_) [n:127.0.0.1:54550_r_    ] o.a.s.c.c.ZkStateReader A cluster state change: [WatchedEvent state:SyncConnected type:NodeDataChanged path:/clusterstate.json], has occurred - updating... (live nodes size: [1])
   [junit4]   2> 2313431 INFO  (zkCallback-3496-thread-1) [    ] o.a.s.c.c.ZkStateReader A cluster state change: [WatchedEvent state:SyncConnected type:NodeDataChanged path:/clusterstate.json], has occurred - updating... (live nodes size: [1])
   [junit4]   2> 2313431 INFO  (TEST-AsyncMigrateRouteKeyTest.test-seed#[3131F272555117E2]) [    ] o.a.s.c.ChaosMonkey monkey: init - expire sessions:false cause connection loss:false
   [junit4]   2> 2313478 INFO  (coreZkRegister-7649-thread-1-processing-s:shard1 n:127.0.0.1:54550_r_ c:control_collection r:core_node1 x:collection1) [n:127.0.0.1:54550_r_ c:control_collection s:shard1 r:core_node1 x:collection1] o.a.s.c.ZkController We are http://127.0.0.1:54550/r_/collection1/ and leader is http://127.0.0.1:54550/r_/collection1/
   [junit4]   2> 2313478 INFO  (coreZkRegister-7649-thread-1-processing-s:shard1 n:127.0.0.1:54550_r_ c:control_collection r:core_node1 x:collection1) [n:127.0.0.1:54550_r_ c:control_collection s:shard1 r:core_node1 x:collection1] o.a.s.c.ZkController No LogReplay needed for core=collection1 baseURL=http://127.0.0.1:54550/r_
   [junit4]   2> 2313478 INFO  (coreZkRegister-7649-thread-1-processing-s:shard1 n:127.0.0.1:54550_r_ c:control_collection r:core_node1 x:collection1) [n:127.0.0.1:54550_r_ c:control_collection s:shard1 r:core_node1 x:collection1] o.a.s.c.ZkController I am the leader, no recovery necessary
   [junit4]   2> 2313478 INFO  (coreZkRegister-7649-thread-1-processing-s:shard1 n:127.0.0.1:54550_r_ c:control_collection r:core_node1 x:collection1) [n:127.0.0.1:54550_r_ c:control_collection s:shard1 r:core_node1 x:collection1] o.a.s.c.ZkController publishing state=active
   [junit4]   2> 2313478 INFO  (coreZkRegister-7649-thread-1-processing-s:shard1 n:127.0.0.1:54550_r_ c:control_collection r:core_node1 x:collection1) [n:127.0.0.1:54550_r_ c:control_collection s:shard1 r:core_node1 x:collection1] o.a.s.c.ZkController numShards not found on descriptor - reading it from system property
   [junit4]   2> 2313482 INFO  (OverseerStateUpdate-95388456739012612-127.0.0.1:54550_r_-n_0000000000) [n:127.0.0.1:54550_r_    ] o.a.s.c.Overseer processMessage: queueSize: 1, message = {
   [junit4]   2>   "operation":"state",
   [junit4]   2>   "shard":"shard1",
   [junit4]   2>   "roles":null,
   [junit4]   2>   "state":"active",
   [junit4]   2>   "node_name":"127.0.0.1:54550_r_",
   [junit4]   2>   "collection":"control_collection",
   [junit4]   2>   "core_node_name":"core_node1",
   [junit4]   2>   "numShards":"2",
   [junit4]   2>   "base_url":"http://127.0.0.1:54550/r_",
   [junit4]   2>   "core":"collection1"} current state version: 2
   [junit4]   2> 2313482 INFO  (OverseerStateUpdate-95388456739012612-127.0.0.1:54550_r_-n_0000000000) [n:127.0.0.1:54550_r_    ] o.a.s.c.o.ReplicaMutator Update state numShards=2 message={
   [junit4]   2>   "operation":"state",
   [junit4]   2>   "shard":"shard1",
   [junit4]   2>   "roles":null,
   [junit4]   2>   "state":"active",
   [junit4]   2>   "node_name":"127.0.0.1:54550_r_",
   [junit4]   2>   "collection":"control_collection",
   [junit4]   2>   "core_node_name":"core_node1",
   [junit4]   2>   "numShards":"2",
   [junit4]   2>   "base_url":"http://127.0.0.1:54550/r_",
   [junit4]   2>   "core":"collection1"}
   [junit4]   2> 2313588 INFO  (zkCallback-3494-thread-1-processing-n:127.0.0.1:54550_r_) [n:127.0.0.1:54550_r_    ] o.a.s.c.c.ZkStateReader A cluster state change: [WatchedEvent state:SyncConnected type:NodeDataChanged path:/clusterstate.json], has occurred - updating... (live nodes size: [1])
   [junit4]   2> 2313588 INFO  (zkCallback-3496-thread-1) [    ] o.a.s.c.c.ZkStateReader A cluster state change: [WatchedEvent state:SyncConnected type:NodeDataChanged path:/clusterstate.json], has occurred - updating... (live nodes size: [1])
   [junit4]   2> 2313672 INFO  (TEST-AsyncMigrateRouteKeyTest.test-seed#[3131F272555117E2]) [    ] o.a.s.SolrTestCaseJ4 Writing core.properties file to /Users/jenkins/workspace/Lucene-Solr-5.x-MacOSX@2/solr/build/solr-core/test/J0/temp/solr.cloud.AsyncMigrateRouteKeyTest_3131F272555117E2-001/shard-1-001/cores/collection1
   [junit4]   2> 2313673 INFO  (TEST-AsyncMigrateRouteKeyTest.test-seed#[3131F272555117E2]) [    ] o.a.s.c.AbstractFullDistribZkTestBase create jetty 1 in directory /Users/jenkins/workspace/Lucene-Solr-5.x-MacOSX@2/solr/build/solr-core/test/J0/temp/solr.cloud.AsyncMigrateRouteKeyTest_3131F272555117E2-001/shard-1-001
   [junit4]   2> 2313674 INFO  (TEST-AsyncMigrateRouteKeyTest.test-seed#[3131F272555117E2]) [    ] o.e.j.s.Server jetty-9.2.13.v20150730
   [junit4]   2> 2313677 INFO  (TEST-AsyncMigrateRouteKeyTest.test-seed#[3131F272555117E2]) [    ] o.e.j.s.h.ContextHandler Started o.e.j.s.ServletContextHandler@306d6be9{/r_,null,AVAILABLE}
   [junit4]   2> 2313677 INFO  (TEST-AsyncMigrateRouteKeyTest.test-seed#[3131F272555117E2]) [    ] o.e.j.s.ServerConnector Started ServerConnector@5fc7a6d5{HTTP/1.1}{127.0.0.1:54555}
   [junit4]   2> 2313677 INFO  (TEST-AsyncMigrateRouteKeyTest.test-seed#[3131F272555117E2]) [    ] o.e.j.s.Server Started @2317934ms
   [junit4]   2> 2313677 INFO  (TEST-AsyncMigrateRouteKeyTest.test-seed#[3131F272555117E2]) [    ] o.a.s.c.s.e.JettySolrRunner Jetty properties: {solrconfig=solrconfig.xml, hostContext=/r_, solr.data.dir=/Users/jenkins/workspace/Lucene-Solr-5.x-MacOSX@2/solr/build/solr-core/test/J0/temp/solr.cloud.AsyncMigrateRouteKeyTest_3131F272555117E2-001/tempDir-001/jetty1, hostPort=54555, coreRootDirectory=/Users/jenkins/workspace/Lucene-Solr-5.x-MacOSX@2/solr/build/solr-core/test/J0/temp/solr.cloud.AsyncMigrateRouteKeyTest_3131F272555117E2-001/shard-1-001/cores}
   [junit4]   2> 2313678 INFO  (TEST-AsyncMigrateRouteKeyTest.test-seed#[3131F272555117E2]) [    ] o.a.s.s.SolrDispatchFilter SolrDispatchFilter.init(): sun.misc.Launcher$AppClassLoader@3033b503
   [junit4]   2> 2313678 INFO  (TEST-AsyncMigrateRouteKeyTest.test-seed#[3131F272555117E2]) [    ] o.a.s.c.SolrResourceLoader new SolrResourceLoader for directory: '/Users/jenkins/workspace/Lucene-Solr-5.x-MacOSX@2/solr/build/solr-core/test/J0/temp/solr.cloud.AsyncMigrateRouteKeyTest_3131F272555117E2-001/shard-1-001'
   [junit4]   2> 2313678 INFO  (TEST-AsyncMigrateRouteKeyTest.test-seed#[3131F272555117E2]) [    ] o.a.s.c.SolrResourceLoader JNDI not configured for solr (NoInitialContextEx)
   [junit4]   2> 2313678 INFO  (TEST-AsyncMigrateRouteKeyTest.test-seed#[3131F272555117E2]) [    ] o.a.s.c.SolrResourceLoader solr home defaulted to 'solr/' (could not find system property or JNDI)
   [junit4]   2> 2313678 INFO  (TEST-AsyncMigrateRouteKeyTest.test-seed#[3131F272555117E2]) [    ] o.a.s.c.c.SolrZkClient Using default ZkCredentialsProvider
   [junit4]   2> 2313679 INFO  (TEST-AsyncMigrateRouteKeyTest.test-seed#[3131F272555117E2]) [    ] o.a.s.c.c.ConnectionManager Waiting for client to connect to ZooKeeper
   [junit4]   2> 2313681 INFO  (zkCallback-3497-thread-1) [    ] o.a.s.c.c.ConnectionManager Watcher org.apache.solr.common.cloud.ConnectionManager@6ec3e743 name:ZooKeeperConnection Watcher:127.0.0.1:54546/solr got event WatchedEvent state:SyncConnected type:None path:null path:null type:None
   [junit4]   2> 2313681 INFO  (TEST-AsyncMigrateRouteKeyTest.test-seed#[3131F272555117E2]) [    ] o.a.s.c.c.ConnectionManager Client is connected to ZooKeeper
   [junit4]   2> 2313681 INFO  (TEST-AsyncMigrateRouteKeyTest.test-seed#[3131F272555117E2]) [    ] o.a.s.c.c.SolrZkClient Using default ZkACLProvider
   [junit4]   2> 2313683 INFO  (TEST-AsyncMigrateRouteKeyTest.test-seed#[3131F272555117E2]) [    ] o.a.s.s.SolrDispatchFilter Loading solr.xml from SolrHome (not found in ZooKeeper)
   [junit4]   2> 2313683 INFO  (TEST-AsyncMigrateRouteKeyTest.test-seed#[3131F272555117E2]) [    ] o.a.s.c.SolrXmlConfig Loading container configuration from /Users/jenkins/workspace/Lucene-Solr-5.x-MacOSX@2/solr/build/solr-core/test/J0/temp/solr.cloud.AsyncMigrateRouteKeyTest_3131F272555117E2-001/shard-1-001/solr.xml
   [junit4]   2> 2313740 INFO  (TEST-AsyncMigrateRouteKeyTest.test-seed#[3131F272555117E2]) [    ] o.a.s.c.CorePropertiesLocator Config-defined core root directory: /Users/jenkins/workspace/Lucene-Solr-5.x-MacOSX@2/solr/build/solr-core/test/J0/temp/solr.cloud.AsyncMigrateRouteKeyTest_3131F272555117E2-001/shard-1-001/cores
   [junit4]   2> 2313740 INFO  (TEST-AsyncMigrateRouteKeyTest.test-seed#[3131F272555117E2]) [    ] o.a.s.c.CoreContainer New CoreContainer 893125243
   [junit4]   2> 2313740 INFO  (TEST-AsyncMigrateRouteKeyTest.test-seed#[3131F272555117E2]) [    ] o.a.s.c.CoreContainer Loading cores into CoreContainer [instanceDir=/Users/jenkins/workspace/Lucene-Solr-5.x-MacOSX@2/solr/build/solr-core/test/J0/temp/solr.cloud.AsyncMigrateRouteKeyTest_3131F272555117E2-001/shard-1-001]
   [junit4]   2> 2313740 WARN  (TEST-AsyncMigrateRouteKeyTest.test-seed#[3131F272555117E2]) [    ] o.a.s.c.CoreContainer Couldn't add files from /Users/jenkins/workspace/Lucene-Solr-5.x-MacOSX@2/solr/build/solr-core/test/J0/temp/solr.cloud.AsyncMigrateRouteKeyTest_3131F272555117E2-001/shard-1-001/lib to classpath: /Users/jenkins/workspace/Lucene-Solr-5.x-MacOSX@2/solr/build/solr-core/test/J0/temp/solr.cloud.AsyncMigrateRouteKeyTest_3131F272555117E2-001/shard-1-001/lib
   [junit4]   2> 2313741 INFO  (TEST-AsyncMigrateRouteKeyTest.test-seed#[3131F272555117E2]) [    ] o.a.s.h.c.HttpShardHandlerFactory created with socketTimeout : 90000,urlScheme : ,connTimeout : 15000,maxConnectionsPerHost : 20,maxConnections : 10000,corePoolSize : 0,maximumPoolSize : 2147483647,maxThreadIdleTime : 5,sizeOfQueue : -1,fairnessPolicy : false,useRetries : false,
   [junit4]   2> 2313741 INFO  (TEST-AsyncMigrateRouteKeyTest.test-seed#[3131F272555117E2]) [    ] o.a.s.u.UpdateShardHandler Creating UpdateShardHandler HTTP client with params: socketTimeout=340000&connTimeout=45000&retry=true
   [junit4]   2> 2313741 INFO  (TEST-AsyncMigrateRouteKeyTest.test-seed#[3131F272555117E2]) [    ] o.a.s.l.LogWatcher SLF4J impl is org.slf4j.impl.Log4jLoggerFactory
   [junit4]   2> 2313741 INFO  (TEST-AsyncMigrateRouteKeyTest.test-seed#[3131F272555117E2]) [    ] o.a.s.l.LogWatcher Registering Log Listener [Log4j (org.slf4j.impl.Log4jLoggerFactory)]
   [junit4]   2> 2313741 INFO  (TEST-AsyncMigrateRouteKeyTest.test-seed#[3131F272555117E2]) [    ] o.a.s.c.ZkContainer Zookeeper client=127.0.0.1:54546/solr
   [junit4]   2> 2313741 INFO  (TEST-AsyncMigrateRouteKeyTest.test-seed#[3131F272555117E2]) [    ] o.a.s.c.ZkController zkHost includes chroot
   [junit4]   2> 2313744 INFO  (TEST-AsyncMigrateRouteKeyTest.test-seed#[3131F272555117E2]) [    ] o.a.s.c.c.SolrZkClient Using default ZkCredentialsProvider
   [junit4]   2> 2313747 INFO  (TEST-AsyncMigrateRouteKeyTest.test-seed#[3131F272555117E2]) [    ] o.a.s.c.c.ConnectionManager Waiting for client to connect to ZooKeeper
   [junit4]   2> 2313749 INFO  (zkCallback-3500-thread-1) [    ] o.a.s.c.c.ConnectionManager Watcher org.apache.solr.common.cloud.ConnectionManager@71dedf82 name:ZooKeeperConnection Watcher:127.0.0.1:54546 got event WatchedEvent state:SyncConnected type:None path:null path:null type:None
   [junit4]   2> 2313749 INFO  (TEST-AsyncMigrateRouteKeyTest.test-seed#[3131F272555117E2]) [    ] o.a.s.c.c.ConnectionManager Client is connected to ZooKeeper
   [junit4]   2> 2313749 INFO  (TEST-AsyncMigrateRouteKeyTest.test-seed#[3131F272555117E2]) [    ] o.a.s.c.c.SolrZkClient Using default ZkACLProvider
   [junit4]   2> 2313752 INFO  (TEST-AsyncMigrateRouteKeyTest.test-seed#[3131F272555117E2]) [n:127.0.0.1:54555_r_    ] o.a.s.c.c.ConnectionManager Waiting for client to connect to ZooKeeper
   [junit4]   2> 2313755 INFO  (zkCallback-3501-thread-1-processing-n:127.0.0.1:54555_r_) [n:127.0.0.1:54555_r_    ] o.a.s.c.c.ConnectionManager Watcher org.apache.solr.common.cloud.ConnectionManager@5672bc9e name:ZooKeeperConnection Watcher:127.0.0.1:54546/solr got event WatchedEvent state:SyncConnected type:None path:null path:null type:None
   [junit4]   2> 2313755 INFO  (TEST-AsyncMigrateRouteKeyTest.test-seed#[3131F272555117E2]) [n:127.0.0.1:54555_r_    ] o.a.s.c.c.ConnectionManager Client is connected to ZooKeeper
   [junit4]   2> 2313765 INFO  (TEST-AsyncMigrateRouteKeyTest.test-seed#[3131F272555117E2]) [n:127.0.0.1:54555_r_    ] o.a.s.c.c.ZkStateReader Updating cluster state from ZooKeeper... 
   [junit4]   2> 2314778 INFO  (TEST-AsyncMigrateRouteKeyTest.test-seed#[3131F272555117E2]) [n:127.0.0.1:54555_r_    ] o.a.s.c.ZkController Register node as live in ZooKeeper:/live_nodes/127.0.0.1:54555_r_
   [junit4]   2> 2314780 INFO  (TEST-AsyncMigrateRouteKeyTest.test-seed#[3131F272555117E2]) [n:127.0.0.1:54555_r_    ] o.a.s.c.c.SolrZkClient makePath: /live_nodes/127.0.0.1:54555_r_
   [junit4]   2> 2314782 INFO  (zkCallback-3494-thread-1-processing-n:127.0.0.1:54550_r_) [n:127.0.0.1:54550_r_    ] o.a.s.c.c.ZkStateReader A live node change: [WatchedEvent state:SyncConnected type:NodeChildrenChanged path:/live_nodes], has occurred - updating... (live nodes size: [1])
   [junit4]   2> 2314782 INFO  (zkCallback-3501-thread-1-processing-n:127.0.0.1:54555_r_) [n:127.0.0.1:54555_r_    ] o.a.s.c.c.ZkStateReader A live node change: [WatchedEvent state:SyncConnected type:NodeChildrenChanged path:/live_nodes], has occurred - updating... (live nodes size: [1])
   [junit4]   2> 2314782 INFO  (zkCallback-3496-thread-1) [    ] o.a.s.c.c.ZkStateReader A live node change: [WatchedEvent state:SyncConnected type:NodeChildrenChanged path:/live_nodes], has occurred - updating... (live nodes size: [1])
   [junit4]   2> 2314786 INFO  (TEST-AsyncMigrateRouteKeyTest.test-seed#[3131F272555117E2]) [n:127.0.0.1:54555_r_    ] o.a.s.c.Overseer Overseer (id=null) closing
   [junit4]   2> 2314787 INFO  (TEST-AsyncMigrateRouteKeyTest.test-seed#[3131F272555117E2]) [n:127.0.0.1:54555_r_    ] o.a.s.c.LeaderElector Joined leadership election with path: /overseer_elect/election/95388456739012616-127.0.0.1:54555_r_-n_0000000001
   [junit4]   2> 2314788 INFO  (TEST-AsyncMigrateRouteKeyTest.test-seed#[3131F272555117E2]) [n:127.0.0.1:54555_r_    ] o.a.s.c.LeaderElector Watching path /overseer_elect/election/95388456739012612-127.0.0.1:54550_r_-n_0000000000 to know if I could be the leader
   [junit4]   2> 2314800 INFO  (TEST-AsyncMigrateRouteKeyTest.test-seed#[3131F272555117E2]) [n:127.0.0.1:54555_r_    ] o.a.s.c.CoreContainer Security conf doesn't exist. Skipping setup for authorization module.
   [junit4]   2> 2314800 INFO  (TEST-AsyncMigrateRouteKeyTest.test-seed#[3131F272555117E2]) [n:127.0.0.1:54555_r_    ] o.a.s.c.CoreContainer No authentication plugin used.
   [junit4]   2> 2314802 INFO  (TEST-AsyncMigrateRouteKeyTest.test-seed#[3131F272555117E2]) [n:127.0.0.1:54555_r_    ] o.a.s.c.CorePropertiesLocator Looking for core definitions underneath /Users/jenkins/workspace/Lucene-Solr-5.x-MacOSX@2/solr/build/solr-core/test/J0/temp/solr.cloud.AsyncMigrateRouteKeyTest_3131F272555117E2-001/shard-1-001/cores
   [junit4]   2> 2314803 INFO  (TEST-AsyncMigrateRouteKeyTest.test-seed#[3131F272555117E2]) [n:127.0.0.1:54555_r_    ] o.a.s.c.CoreDescriptor Created CoreDescriptor: {configSetProperties=configsetprops.json, transient=false, shard=, collection=collection1, name=collection1, dataDir=data/, loadOnStartup=true, config=solrconfig.xml, coreNodeName=, schema=schema.xml}
   [junit4]   2> 2314803 INFO  (TEST-AsyncMigrateRouteKeyTest.test-seed#[3131F272555117E2]) [n:127.0.0.1:54555_r_    ] o.a.s.c.CorePropertiesLocator Found core collection1 in /Users/jenkins/workspace/Lucene-Solr-5.x-MacOSX@2/solr/build/solr-core/test/J0/temp/solr.cloud.AsyncMigrateRouteKeyTest_3131F272555117E2-001/shard-1-001/cores/collection1
   [junit4]   2> 2314803 INFO  (TEST-AsyncMigrateRouteKeyTest.test-seed#[3131F272555117E2]) [n:127.0.0.1:54555_r_    ] o.a.s.c.CorePropertiesLocator Found 1 core definitions
   [junit4]   2> 2314805 INFO  (TEST-AsyncMigrateRouteKeyTest.test-seed#[3131F272555117E2]) [n:127.0.0.1:54555_r_    ] o.a.s.s.SolrDispatchFilter user.dir=/Users/jenkins/workspace/Lucene-Solr-5.x-MacOSX@2/solr/build/solr-core/test/J0
   [junit4]   2> 2314805 INFO  (coreLoadExecutor-7666-thread-1-processing-n:127.0.0.1:54555_r_) [n:127.0.0.1:54555_r_ c:collection1   x:collection1] o.a.s.c.ZkController publishing state=down
   [junit4]   2> 2314805 INFO  (TEST-AsyncMigrateRouteKeyTest.test-seed#[3131F272555117E2]) [n:127.0.0.1:54555_r_    ] o.a.s.s.SolrDispatchFilter SolrDispatchFilter.init() done
   [junit4]   2> 2314805 INFO  (coreLoadExecutor-7666-thread-1-processing-n:127.0.0.1:54555_r_) [n:127.0.0.1:54555_r_ c:collection1   x:collection1] o.a.s.c.ZkController numShards not found on descriptor - reading it from system property
   [junit4]   2> 2314808 INFO  (coreLoadExecutor-7666-thread-1-processing-n:127.0.0.1:54555_r_) [n:127.0.0.1:54555_r_ c:collection1   x:collection1] o.a.s.c.ZkController look for our core node name
   [junit4]   2> 2314809 INFO  (OverseerStateUpdate-95388456739012612-127.0.0.1:54550_r_-n_0000000000) [n:127.0.0.1:54550_r_    ] o.a.s.c.Overseer processMessage: queueSize: 1, message = {
   [junit4]   2>   "operation":"state",
   [junit4]   2>   "shard":null,
   [junit4]   2>   "roles":null,
   [junit4]   2>   "state":"down",
   [junit4]   2>   "node_name":"127.0.0.1:54555_r_",
   [junit4]   2>   "collection":"collection1",
   [junit4]   2>   "numShards":"2",
   [junit4]   2>   "base_url":"http://127.0.0.1:54555/r_",
   [junit4]   2>   "core":"collection1"} current state version: 3
   [junit4]   2> 2314810 INFO  (OverseerStateUpdate-95388456739012612-127.0.0.1:54550_r_-n_0000000000) [n:127.0.0.1:54550_r_    ] o.a.s.c.o.ReplicaMutator Update state numShards=2 message={
   [junit4]   2>   "operation":"state",
   [junit4]   2>   "shard":null,
   [junit4]   2>   "roles":null,
   [junit4]   2>   "state":"down",
   [junit4]   2>   "node_name":"127.0.0.1:54555_r_",
   [junit4]   2>   "collection":"collection1",
   [junit4]   2>   "numShards":"2",
   [junit4]   2>   "base_url":"http://127.0.0.1:54555/r_",
   [junit4]   2>   "core":"collection1"}
   [junit4]   2> 2314810 INFO  (OverseerStateUpdate-95388456739012612-127.0.0.1:54550_r_-n_0000000000) [n:127.0.0.1:54550_r_    ] o.a.s.c.o.ClusterStateMutator building a new cName: collection1
   [junit4]   2> 2314810 INFO  (OverseerStateUpdate-95388456739012612-127.0.0.1:54550_r_-n_0000000000) [n:127.0.0.1:54550_r_    ] o.a.s.c.o.ReplicaMutator Assigning new node to shard shard=shard1
   [junit4]   2> 2314916 INFO  (zkCallback-3496-thread-1) [    ] o.a.s.c.c.ZkStateReader A cluster state change: [WatchedEvent state:SyncConnected type:NodeDataChanged path:/clusterstate.json], has occurred - updating... (live nodes size: [2])
   [junit4]   2> 2314916 INFO  (zkCallback-3501-thread-1-processing-n:127.0.0.1:54555_r_) [n:127.0.0.1:54555_r_    ] o.a.s.c.c.ZkStateReader A cluster state change: [WatchedEvent state:SyncConnected type:NodeDataChanged path:/clusterstate.json], has occurred - updating... (live nodes size: [2])
   [junit4]   2> 2314916 INFO  (zkCallback-3494-thread-1-processing-n:127.0.0.1:54550_r_) [n:127.0.0.1:54550_r_    ] o.a.s.c.c.ZkStateReader A cluster state change: [WatchedEvent state:SyncConnected type:NodeDataChanged path:/clusterstate.json], has occurred - updating... (live nodes size: [2])
   [junit4]   2> 2315810 INFO  (coreLoadExecutor-7666-thread-1-processing-n:127.0.0.1:54555_r_) [n:127.0.0.1:54555_r_ c:collection1   x:collection1] o.a.s.c.ZkController waiting to find shard id in clusterstate for collection1
   [junit4]   2> 2315810 INFO  (coreLoadExecutor-7666-thread-1-processing-n:127.0.0.1:54555_r_) [n:127.0.0.1:54555_r_ c:collection1   x:collection1] o.a.s.c.ZkController Check for collection zkNode:collection1
   [junit4]   2> 2315811 INFO  (coreLoadExecutor-7666-thread-1-processing-n:127.0.0.1:54555_r_) [n:127.0.0.1:54555_r_ c:collection1   x:collection1] o.a.s.c.ZkController Collection zkNode exists
   [junit4]   2> 2315811 INFO  (coreLoadExecutor-7666-thread-1-processing-n:127.0.0.1:54555_r_) [n:127.0.0.1:54555_r_ c:collection1   x:collection1] o.a.s.c.c.ZkStateReader Load collection config from: [/collections/collection1]
   [junit4]   2> 2315813 INFO  (coreLoadExecutor-7666-thread-1-processing-n:127.0.0.1:54555_r_) [n:127.0.0.1:54555_r_ c:collection1   x:collection1] o.a.s.c.c.ZkStateReader path=[/collections/collection1] [configName]=[conf1] specified config exists in ZooKeeper
   [junit4]   2> 2315813 INFO  (coreLoadExecutor-7666-thread-1-processing-n:127.0.0.1:54555_r_) [n:127.0.0.1:54555_r_ c:collection1   x:collection1] o.a.s.c.SolrResourceLoader new SolrResourceLoader for directory: '/Users/jenkins/workspace/Lucene-Solr-5.x-MacOSX@2/solr/build/solr-core/test/J0/temp/solr.cloud.AsyncMigrateRouteKeyTest_3131F272555117E2-001/shard-1-001/cores/collection1'
   [junit4]   2> 2315813 INFO  (coreLoadExecutor-7666-thread-1-processing-n:127.0.0.1:54555_r_) [n:127.0.0.1:54555_r_ c:collection1   x:collection1] o.a.s.c.SolrResourceLoader JNDI not configured for solr (NoInitialContextEx)
   [junit4]   2> 2315813 INFO  (coreLoadExecutor-7666-thread-1-processing-n:127.0.0.1:54555_r_) [n:127.0.0.1:54555_r_ c:collection1   x:collection1] o.a.s.c.SolrResourceLoader solr home defaulted to 'solr/' (could not find system property or JNDI)
   [junit4]   2> 2315817 INFO  (coreLoadExecutor-7666-thread-1-processing-n:127.0.0.1:54555_r_) [n:127.0.0.1:54555_r_ c:collection1   x:collection1] o.a.s.c.Config loaded config solrconfig.xml with version 0 
   [junit4]   2> 2315827 INFO  (coreLoadExecutor-7666-thread-1-processing-n:127.0.0.1:54555_r_) [n:127.0.0.1:54555_r_ c:collection1   x:collection1] o.a.s.c.SolrConfig current version of requestparams : -1
   [junit4]   2> 2315839 INFO  (coreLoadExecutor-7666-thread-1-processing-n:127.0.0.1:54555_r_) [n:127.0.0.1:54555_r_ c:collection1   x:collection1] o.a.s.c.SolrConfig Using Lucene MatchVersion: 5.6.0
   [junit4]   2> 2315866 INFO  (coreLoadExecutor-7666-thread-1-processing-n:127.0.0.1:54555_r_) [n:127.0.0.1:54555_r_ c:collection1   x:collection1] o.a.s.c.SolrConfig Loaded SolrConfig: solrconfig.xml
   [junit4]   2> 2315873 INFO  (coreLoadExecutor-7666-thread-1-processing-n:127.0.0.1:54555_r_) [n:127.0.0.1:54555_r_ c:collection1   x:collection1] o.a.s.s.IndexSchema [collection1] Schema name=test
   [junit4]   2> 2316082 INFO  (coreLoadExecutor-7666-thread-1-processing-n:127.0.0.1:54555_r_) [n:127.0.0.1:54555_r_ c:collection1   x:collection1] o.a.s.s.IndexSchema default search field in schema is text
   [junit4]   2> 2316083 INFO  (coreLoadExecutor-7666-thread-1-processing-n:127.0.0.1:54555_r_) [n:127.0.0.1:54555_r_ c:collection1   x:collection1] o.a.s.s.IndexSchema unique key field: id
   [junit4]   2> 2316084 INFO  (coreLoadExecutor-7666-thread-1-processing-n:127.0.0.1:54555_r_) [n:127.0.0.1:54555_r_ c:collection1   x:collection1] o.a.s.s.FileExchangeRateProvider Reloading exchange rates from file currency.xml
   [junit4]   2> 2316088 INFO  (coreLoadExecutor-7666-thread-1-processing-n:127.0.0.1:54555_r_) [n:127.0.0.1:54555_r_ c:collection1   x:collection1] o.a.s.s.FileExchangeRateProvider Reloading exchange rates from file currency.xml
   [junit4]   2> 2316123 INFO  (coreLoadExecutor-7666-thread-1-processing-n:127.0.0.1:54555_r_) [n:127.0.0.1:54555_r_ c:collection1   x:collection1] o.a.s.c.ConfigSetProperties Did not find ConfigSet properties, assuming default properties: Can't find resource 'configsetprops.json' in classpath or '/configs/conf1', cwd=/Users/jenkins/workspace/Lucene-Solr-5.x-MacOSX@2/solr/build/solr-core/test/J0
   [junit4]   2> 2316123 INFO  (coreLoadExecutor-7666-thread-1-processing-n:127.0.0.1:54555_r_) [n:127.0.0.1:54555_r_ c:collection1   x:collection1] o.a.s.c.CoreContainer Creating SolrCore 'collection1' using configuration from collection collection1
   [junit4]   2> 2316124 INFO  (coreLoadExecutor-7666-thread-1-processing-n:127.0.0.1:54555_r_) [n:127.0.0.1:54555_r_ c:collection1 s:shard1 r:core_node1 x:collection1] o.a.s.c.SolrCore org.apache.solr.core.MockDirectoryFactory
   [junit4]   2> 2316124 INFO  (coreLoadExecutor-7666-thread-1-processing-n:127.0.0.1:54555_r_) [n:127.0.0.1:54555_r_ c:collection1 s:shard1 r:core_node1 x:collection1] o.a.s.c.SolrCore [[collection1] ] Opening new SolrCore at [/Users/jenkins/workspace/Lucene-Solr-5.x-MacOSX@2/solr/build/solr-core/test/J0/temp/solr.cloud.AsyncMigrateRouteKeyTest_3131F272555117E2-001/shard-1-001/cores/collection1], dataDir=[/Users/jenkins/workspace/Lucene-Solr-5.x-MacOSX@2/solr/build/solr-core/test/J0/temp/solr.cloud.AsyncMigrateRouteKeyTest_3131F272555117E2-001/shard-1-001/cores/collection1/data/]
   [junit4]   2> 2316124 INFO  (coreLoadExecutor-7666-thread-1-processing-n:127.0.0.1:54555_r_) [n:127.0.0.1:54555_r_ c:collection1 s:shard1 r:core_node1 x:collection1] o.a.s.c.JmxMonitoredMap JMX monitoring is enabled. Adding Solr mbeans to JMX Server: com.sun.jmx.mbeanserver.JmxMBeanServer@6d4d63ba
   [junit4]   2> 2316124 INFO  (coreLoadExecutor-7666-thread-1-processing-n:127.0.0.1:54555_r_) [n:127.0.0.1:54555_r_ c:collection1 s:shard1 r:core_node1 x:collection1] o.a.s.c.CachingDirectoryFactory return new directory for /Users/jenkins/workspace/Lucene-Solr-5.x-MacOSX@2/solr/build/solr-core/test/J0/temp/solr.cloud.AsyncMigrateRouteKeyTest_3131F272555117E2-001/shard-1-001/cores/collection1/data
   [junit4]   2> 2316125 INFO  (coreLoadExecutor-7666-thread-1-processing-n:127.0.0.1:54555_r_) [n:127.0.0.1:54555_r_ c:collection1 s:shard1 r:core_node1 x:collection1] o.a.s.c.SolrCore New index directory detected: old=null new=/Users/jenkins/workspace/Lucene-Solr-5.x-MacOSX@2/solr/build/solr-core/test/J0/temp/solr.cloud.AsyncMigrateRouteKeyTest_3131F272555117E2-001/shard-1-001/cores/collection1/data/index/
   [junit4]   2> 2316125 WARN  (coreLoadExecutor-7666-thread-1-processing-n:127.0.0.1:54555_r_) [n:127.0.0.1:54555_r_ c:collection1 s:shard1 r:core_node1 x:collection1] o.a.s.c.SolrCore [collection1] Solr index directory '/Users/jenkins/workspace/Lucene-Solr-5.x-MacOSX@2/solr/build/solr-core/test/J0/temp/solr.cloud.AsyncMigrateRouteKeyTest_3131F272555117E2-001/shard-1-001/cores/collection1/data/index' doesn't exist. Creating new index...
   [junit4]   2> 2316125 INFO  (coreLoadExecutor-7666-thread-1-processing-n:127.0.0.1:54555_r_) [n:127.0.0.1:54555_r_ c:collection1 s:shard1 r:core_node1 x:collection1] o.a.s.c.CachingDirectoryFactory return new directory for /Users/jenkins/workspace/Lucene-Solr-5.x-MacOSX@2/solr/build/solr-core/test/J0/temp/solr.cloud.AsyncMigrateRouteKeyTest_3131F272555117E2-001/shard-1-001/cores/collection1/data/index
   [junit4]   2> 2316125 INFO  (coreLoadExecutor-7666-thread-1-processing-n:127.0.0.1:54555_r_) [n:127.0.0.1:54555_r_ c:collection1 s:shard1 r:core_node1 x:collection1] o.a.s.u.RandomMergePolicy RandomMergePolicy wrapping class org.apache.lucene.index.LogByteSizeMergePolicy: [LogByteSizeMergePolicy: minMergeSize=1677721, mergeFactor=24, maxMergeSize=2147483648, maxMergeSizeForForcedMerge=9223372036854775807, calibrateSizeByDeletes=false, maxMergeDocs=2147483647, maxCFSSegmentSizeMB=8.796093022207999E12, noCFSRatio=0.0]
   [junit4]   2> 2316126 INFO  (coreLoadExecutor-7666-thread-1-processing-n:127.0.0.1:54555_r_) [n:127.0.0.1:54555_r_ c:collection1 s:shard1 r:core_node1 x:collection1] o.a.s.c.SolrDeletionPolicy SolrDeletionPolicy.onCommit: commits: num=1
   [junit4]   2> 	commit{dir=MockDirectoryWrapper(RAMDirectory@5c2c35af lockFactory=org.apache.lucene.store.SingleInstanceLockFactory@5a78a36f),segFN=segments_1,generation=1}
   [junit4]   2> 2316126 INFO  (coreLoadExecutor-7666-thread-1-processing-n:127.0.0.1:54555_r_) [n:127.0.0.1:54555_r_ c:collection1 s:shard1 r:core_node1 x:collection1] o.a.s.c.SolrDeletionPolicy newest commit generation = 1
   [junit4]   2> 2316126 INFO  (OldIndexDirectoryCleanupThreadForCore-collection1) [n:127.0.0.1:54555_r_ c:collection1 s:shard1 r:core_node1 x:collection1] o.a.s.c.SolrCore Looking for old index directories to cleanup for core collection1 in /Users/jenkins/workspace/Lucene-Solr-5.x-MacOSX@2/solr/build/solr-core/test/J0/temp/solr.cloud.AsyncMigrateRouteKeyTest_3131F272555117E2-001/shard-1-001/cores/collection1/data/
   [junit4]   2> 2316127 WARN  (OldIndexDirectoryCleanupThreadForCore-collection1) [n:127.0.0.1:54555_r_ c:collection1 s:shard1 r:core_node1 x:collection1] o.a.s.c.DirectoryFactory /Users/jenkins/workspace/Lucene-Solr-5.x-MacOSX@2/solr/build/solr-core/test/J0/temp/solr.cloud.AsyncMigrateRouteKeyTest_3131F272555117E2-001/shard-1-001/cores/collection1/data/ does not point to a valid data directory; skipping clean-up of old index directories.
   [junit4]   2> 2316131 INFO  (coreLoadExecutor-7666-thread-1-processing-n:127.0.0.1:54555_r_) [n:127.0.0.1:54555_r_ c:collection1 s:shard1 r:core_node1 x:collection1] o.a.s.u.p.UpdateRequestProcessorChain creating updateRequestProcessorChain "nodistrib"
   [junit4]   2> 2316131 INFO  (coreLoadExecutor-7666-thread-1-processing-n:127.0.0.1:54555_r_) [n:127.0.0.1:54555_r_ c:collection1 s:shard1 r:core_node1 x:collection1] o.a.s.u.p.UpdateRequestProcessorChain creating updateRequestProcessorChain "dedupe"
   [junit4]   2> 2316132 INFO  (coreLoadExecutor-7666-thread-1-processing-n:127.0.0.1:54555_r_) [n:127.0.0.1:54555_r_ c:collection1 s:shard1 r:core_node1 x:collection1] o.a.s.u.p.UpdateRequestProcessorChain inserting DistributedUpdateProcessorFactory into updateRequestProcessorChain "dedupe"
   [junit4]   2> 2316132 INFO  (coreLoadExecutor-7666-thread-1-processing-n:127.0.0.1:54555_r_) [n:127.0.0.1:54555_r_ c:collection1 s:shard1 r:core_node1 x:collection1] o.a.s.u.p.UpdateRequestProcessorChain creating updateRequestProcessorChain "stored_sig"
   [junit4]   2> 2316132 INFO  (coreLoadExecutor-7666-thread-1-processing-n:127.0.0.1:54555_r_) [n:127.0.0.1:54555_r_ c:collection1 s:shard1 r:core_node1 x:collection1] o.a.s.u.p.UpdateRequestProcessorChain inserting DistributedUpdateProcessorFactory into updateRequestProcessorChain "stored_sig"
   [junit4]   2> 2316132 INFO  (coreLoadExecutor-7666-thread-1-processing-n:127.0.0.1:54555_r_) [n:127.0.0.1:54555_r_ c:collection1 s:shard1 r:core_node1 x:collection1] o.a.s.u.p.UpdateRequestProcessorChain creating updateRequestProcessorChain "distrib-dup-test-chain-explicit"
   [junit4]   2> 2316132 INFO  (coreLoadExecutor-7666-thread-1-processing-n:127.0.0.1:54555_r_) [n:127.0.0.1:54555_r_ c:collection1 s:shard1 r:core_node1 x:collection1] o.a.s.u.p.UpdateRequestProcessorChain creating updateRequestProcessorChain "distrib-dup-test-chain-implicit"
   [junit4]   2> 2316132 INFO  (coreLoadExecutor-7666-thread-1-processing-n:127.0.0.1:54555_r_) [n:127.0.0.1:54555_r_ c:collection1 s:shard1 r:core_node1 x:collection1] o.a.s.u.p.UpdateRequestProcessorChain inserting DistributedUpdateProcessorFactory into updateRequestProcessorChain "distrib-dup-test-chain-implicit"
   [junit4]   2> 2316132 INFO  (coreLoadExecutor-7666-thread-1-processing-n:127.0.0.1:54555_r_) [n:127.0.0.1:54555_r_ c:collection1 s:shard1 r:core_node1 x:collection1] o.a.s.c.SolrCore no updateRequestProcessorChain defined as default, creating implicit default
   [junit4]   2> 2316132 WARN  (coreLoadExecutor-7666-thread-1-processing-n:127.0.0.1:54555_r_) [n:127.0.0.1:54555_r_ c:collection1 s:shard1 r:core_node1 x:collection1] o.a.s.c.RequestHandlers INVALID paramSet a in requestHandler {type = requestHandler,name = /dump,class = DumpRequestHandler,args = {defaults={a=A,b=B}}}
   [junit4]   2> 2316139 INFO  (coreLoadExecutor-7666-thread-1-processing-n:127.0.0.1:54555_r_) [n:127.0.0.1:54555_r_ c:collection1 s:shard1 r:core_node1 x:collection1] o.a.s.h.l.XMLLoader xsltCacheLifetimeSeconds=60
   [junit4]   2> 2316140 INFO  (coreLoadExecutor-7666-thread-1-processing-n:127.0.0.1:54555_r_) [n:127.0.0.1:54555_r_ c:collection1 s:shard1 r:core_node1 x:collection1] o.a.s.h.l.XMLLoader xsltCacheLifetimeSeconds=60
   [junit4]   2> 2316141 INFO  (coreLoadExecutor-7666-thread-1-processing-n:127.0.0.1:54555_r_) [n:127.0.0.1:54555_r_ c:

[...truncated too long message...]

1)
   [junit4]   2> 	at java.util.concurrent.ThreadPoolExecutor.runWorker(ThreadPoolExecutor.java:1145)
   [junit4]   2> 	at java.util.concurrent.ThreadPoolExecutor$Worker.run(ThreadPoolExecutor.java:615)
   [junit4]   2> 	at java.lang.Thread.run(Thread.java:745)
   [junit4]   2> 2343974 INFO  (TEST-AsyncMigrateRouteKeyTest.test-seed#[3131F272555117E2]) [    ] o.e.j.s.ServerConnector Stopped ServerConnector@72968638{HTTP/1.1}{127.0.0.1:0}
   [junit4]   2> 2343974 INFO  (TEST-AsyncMigrateRouteKeyTest.test-seed#[3131F272555117E2]) [    ] o.e.j.s.h.ContextHandler Stopped o.e.j.s.ServletContextHandler@51bf7cbd{/r_,null,UNAVAILABLE}
   [junit4]   2> 2343976 INFO  (TEST-AsyncMigrateRouteKeyTest.test-seed#[3131F272555117E2]) [    ] o.a.s.c.ZkTestServer connecting to 127.0.0.1:54546 54546
   [junit4]   2> 2344074 INFO  (Thread-5738) [    ] o.a.s.c.ZkTestServer connecting to 127.0.0.1:54546 54546
   [junit4]   2> 2345975 WARN  (Thread-5738) [    ] o.a.s.c.ZkTestServer Watch limit violations: 
   [junit4]   2> Maximum concurrent create/delete watches above limit:
   [junit4]   2> 
   [junit4]   2> 	6	/solr/aliases.json
   [junit4]   2> 	5	/solr/security.json
   [junit4]   2> 	5	/solr/configs/conf1
   [junit4]   2> 
   [junit4]   2> Maximum concurrent data watches above limit:
   [junit4]   2> 
   [junit4]   2> 	6	/solr/clusterstate.json
   [junit4]   2> 
   [junit4]   2> Maximum concurrent children watches above limit:
   [junit4]   2> 
   [junit4]   2> 	6	/solr/collections
   [junit4]   2> 	6	/solr/live_nodes
   [junit4]   2> 	2	/solr/overseer/queue
   [junit4]   2> 	2	/solr/overseer/queue-work
   [junit4]   2> 	2	/solr/overseer/collection-queue-work
   [junit4]   2> 
   [junit4]   2> NOTE: reproduce with: ant test  -Dtestcase=AsyncMigrateRouteKeyTest -Dtests.method=test -Dtests.seed=3131F272555117E2 -Dtests.slow=true -Dtests.locale=sr-Latn-RS -Dtests.timezone=Australia/Sydney -Dtests.asserts=true -Dtests.file.encoding=US-ASCII
   [junit4] FAILURE 34.7s J0 | AsyncMigrateRouteKeyTest.test <<<
   [junit4]    > Throwable #1: java.lang.AssertionError: There are still nodes recoverying - waited for 15 seconds
   [junit4]    > 	at __randomizedtesting.SeedInfo.seed([3131F272555117E2:B965CDA8FBAD7A1A]:0)
   [junit4]    > 	at org.apache.solr.cloud.AbstractDistribZkTestBase.waitForRecoveriesToFinish(AbstractDistribZkTestBase.java:174)
   [junit4]    > 	at org.apache.solr.cloud.AbstractFullDistribZkTestBase.waitForRecoveriesToFinish(AbstractFullDistribZkTestBase.java:836)
   [junit4]    > 	at org.apache.solr.cloud.AbstractFullDistribZkTestBase.waitForThingsToLevelOut(AbstractFullDistribZkTestBase.java:1392)
   [junit4]    > 	at org.apache.solr.cloud.AsyncMigrateRouteKeyTest.test(AsyncMigrateRouteKeyTest.java:42)
   [junit4]    > 	at org.apache.solr.BaseDistributedSearchTestCase$ShardsRepeatRule$ShardsFixedStatement.callStatement(BaseDistributedSearchTestCase.java:964)
   [junit4]    > 	at org.apache.solr.BaseDistributedSearchTestCase$ShardsRepeatRule$ShardsStatement.evaluate(BaseDistributedSearchTestCase.java:939)
   [junit4]    > 	at java.lang.Thread.run(Thread.java:745)
   [junit4]   2> 2345984 INFO  (SUITE-AsyncMigrateRouteKeyTest-seed#[3131F272555117E2]-worker) [    ] o.a.s.SolrTestCaseJ4 ###deleteCore
   [junit4]   2> NOTE: leaving temporary files on disk at: /Users/jenkins/workspace/Lucene-Solr-5.x-MacOSX@2/solr/build/solr-core/test/J0/temp/solr.cloud.AsyncMigrateRouteKeyTest_3131F272555117E2-001
   [junit4]   2> NOTE: test params are: codec=Lucene54, sim=RandomSimilarity(queryNorm=false,coord=crazy): {}, locale=sr-Latn-RS, timezone=Australia/Sydney
   [junit4]   2> NOTE: Mac OS X 10.8.5 x86_64/Oracle Corporation 1.7.0_80 (64-bit)/cpus=3,threads=1,free=145576272,total=536870912
   [junit4]   2> NOTE: All tests run in this JVM: [TestLeaderInitiatedRecoveryThread, ScriptEngineTest, TestEmbeddedSolrServerConstructors, ActionThrottleTest, ClusterStateUpdateTest, SoftAutoCommitTest, CurrencyFieldXmlFileTest, SpatialRPTFieldTypeTest, TestSolrDeletionPolicy1, DeleteInactiveReplicaTest, TimeZoneUtilsTest, TestJmxIntegration, TestManagedResource, TermsComponentTest, TestRemoveLastDynamicCopyField, IndexBasedSpellCheckerTest, SolrCoreTest, TestConfigReload, BlockJoinFacetSimpleTest, TestJmxMonitoredMap, HdfsCollectionsAPIDistributedZkTest, PeerSyncTest, ZkControllerTest, CollectionReloadTest, TestWordDelimiterFilterFactory, TestCloudManagedSchema, TestRandomCollapseQParserPlugin, TestSchemaVersionResource, TestScoreJoinQPScore, TestManagedSchemaFieldResource, TestFieldResource, TestTolerantSearch, UnloadDistributedZkTest, TestHashPartitioner, TestSearchPerf, BadComponentTest, TestXIncludeConfig, JavabinLoaderTest, AddBlockUpdateTest, DistributedSpellCheckComponentTest, TestFunctionQuery, TestDocSet, QueryEqualityTest, HdfsDirectoryTest, TestSolrQueryResponse, DistributedQueueTest, TestHighlightDedupGrouping, TestSolr4Spatial2, DistributedFacetPivotWhiteBoxTest, TestSolrDynamicMBean, SpatialFilterTest, TestSortByMinMaxFunction, ParsingFieldUpdateProcessorsTest, TestCoreContainer, OverriddenZkACLAndCredentialsProvidersTest, TestSurroundQueryParser, TestMinMaxOnMultiValuedField, PrimUtilsTest, DocumentBuilderTest, TestRTimerTree, TestChildDocTransformer, TestFieldTypeResource, TestConfig, SolrRequestParserTest, DocumentAnalysisRequestHandlerTest, TestFaceting, TestNRTOpen, TestStressVersions, TestClassNameShortening, TestAddFieldRealTimeGet, DOMUtilTest, CollectionTooManyReplicasTest, TestCloudSchemaless, TestComponentsName, AlternateDirectoryTest, AnalyticsMergeStrategyTest, TestDefaultSearchFieldResource, TestPseudoReturnFields, ClusterStateTest, SOLR749Test, TestSort, TestUseDocValuesAsStored, DeleteReplicaTest, ConcurrentDeleteAndCreateCollectionTest, TestElisionMultitermQuery, ForceLeaderTest, TestQuerySenderNoQuery, PolyFieldTest, XmlUpdateRequestHandlerTest, TestDynamicLoading, TriLevelCompositeIdRoutingTest, TestDistribIDF, CoreAdminCreateDiscoverTest, SchemaVersionSpecificBehaviorTest, TestXmlQParser, ConnectionManagerTest, BlockDirectoryTest, DocValuesMissingTest, DistanceUnitsTest, ZkStateWriterTest, TestClassicSimilarityFactory, ChaosMonkeyNothingIsSafeTest, DistributedQueryComponentOptimizationTest, ExternalFileFieldSortTest, TestRandomDVFaceting, CoreMergeIndexesAdminHandlerTest, TestAuthorizationFramework, OverseerTaskQueueTest, RestartWhileUpdatingTest, SliceStateTest, TestShortCircuitedRequests, DistributedFacetPivotLargeTest, TestIBSimilarityFactory, BasicDistributedZkTest, UUIDFieldTest, CleanupOldIndexTest, TestRawResponseWriter, HdfsWriteToMultipleCollectionsTest, TestDocumentBuilder, TestConfigSetsAPIZkFailure, TestExactStatsCache, TestReplicationHandler, HdfsBasicDistributedZk2Test, TestPhraseSuggestions, AnalysisAfterCoreReloadTest, ReturnFieldsTest, TestSolrConfigHandlerCloud, TestDFRSimilarityFactory, TestStressUserVersions, TestLFUCache, HdfsRestartWhileUpdatingTest, QueryElevationComponentTest, CloudMLTQParserTest, SampleTest, FastVectorHighlighterTest, TestMiniSolrCloudClusterBase, XsltUpdateRequestHandlerTest, TestSolrQueryParserDefaultOperatorResource, HardAutoCommitTest, SyncSliceTest, ShardRoutingTest, FullSolrCloudDistribCmdsTest, ZkCLITest, AutoCommitTest, TestDistributedGrouping, TestRecovery, TermVectorComponentDistributedTest, TestRealTimeGet, TestStressReorder, TestReload, DistributedTermsComponentTest, SimpleFacetsTest, SpellCheckComponentTest, TestGroupingSearch, ConvertedLegacyTest, TestLazyCores, DirectUpdateHandlerTest, HighlighterTest, ShowFileRequestHandlerTest, DistributedQueryElevationComponentTest, SimplePostToolTest, TestExtendedDismaxParser, SpellCheckCollatorTest, CoreAdminHandlerTest, DocValuesTest, SuggesterTest, TestStressLucene, TestCSVLoader, SolrCoreCheckLockOnStartupTest, SortByFunctionTest, DocValuesMultiTest, SolrInfoMBeanTest, StandardRequestHandlerTest, PrimitiveFieldTypeTest, PathHierarchyTokenizerFactoryTest, MoreLikeThisHandlerTest, TestSolrQueryParser, IndexSchemaRuntimeFieldTest, RegexBoostProcessorTest, TestCollationField, UpdateRequestProcessorFactoryTest, MBeansHandlerTest, TestAnalyzedSuggestions, BinaryUpdateRequestHandlerTest, TestPartialUpdateDeduplication, PingRequestHandlerTest, TestSolrDeletionPolicy2, MinimalSchemaTest, TestSolrCoreProperties, TestLuceneMatchVersion, SpellPossibilityIteratorTest, SynonymTokenizerTest, TestSweetSpotSimilarityFactory, TestLMDirichletSimilarityFactory, ResourceLoaderTest, OpenExchangeRatesOrgProviderTest, URLClassifyProcessorTest, TestFastLRUCache, PreAnalyzedFieldTest, SystemInfoHandlerTest, FileUtilsTest, DistributedIntervalFacetingTest, TestJettySolrRunner, AssignTest, AsyncMigrateRouteKeyTest]
   [junit4] Completed [408/566 (1!)] on J0 in 34.68s, 1 test, 1 failure <<< FAILURES!

[...truncated 513 lines...]
BUILD FAILED
/Users/jenkins/workspace/Lucene-Solr-5.x-MacOSX@2/build.xml:750: The following error occurred while executing this line:
/Users/jenkins/workspace/Lucene-Solr-5.x-MacOSX@2/build.xml:694: The following error occurred while executing this line:
/Users/jenkins/workspace/Lucene-Solr-5.x-MacOSX@2/build.xml:59: The following error occurred while executing this line:
/Users/jenkins/workspace/Lucene-Solr-5.x-MacOSX@2/solr/build.xml:233: The following error occurred while executing this line:
/Users/jenkins/workspace/Lucene-Solr-5.x-MacOSX@2/solr/common-build.xml:534: The following error occurred while executing this line:
/Users/jenkins/workspace/Lucene-Solr-5.x-MacOSX@2/lucene/common-build.xml:1477: The following error occurred while executing this line:
/Users/jenkins/workspace/Lucene-Solr-5.x-MacOSX@2/lucene/common-build.xml:1033: There were test failures: 566 suites (7 ignored), 2279 tests, 1 failure, 89 ignored (38 assumptions) [seed: 3131F272555117E2]

Total time: 84 minutes 1 second
Build step 'Invoke Ant' marked build as failure
Archiving artifacts
[WARNINGS] Skipping publisher since build result is FAILURE
Recording test results
Email was triggered for: Failure - Any
Sending email for trigger: Failure - Any



Mime
View raw message