lucene-dev mailing list archives

Site index · List index
Message view « Date » · « Thread »
Top « Date » · « Thread »
From Policeman Jenkins Server <jenk...@thetaphi.de>
Subject [JENKINS-EA] Lucene-Solr-5.5-Linux (64bit/jdk-9-ea+105) - Build # 59 - Failure!
Date Sun, 21 Feb 2016 05:42:18 GMT
Build: http://jenkins.thetaphi.de/job/Lucene-Solr-5.5-Linux/59/
Java: 64bit/jdk-9-ea+105 -XX:-UseCompressedOops -XX:+UseParallelGC -XX:-UseSuperWord

2 tests failed.
FAILED:  org.apache.lucene.index.TestDuelingCodecs.testEquals

Error Message:
8

Stack Trace:
java.lang.ArrayIndexOutOfBoundsException: 8
	at __randomizedtesting.SeedInfo.seed([21451227B354CF9E:252A41BC7D6D9F9C]:0)
	at org.apache.lucene.util.automaton.MinimizationOperations.minimize(MinimizationOperations.java:235)
	at org.apache.lucene.util.automaton.RegExp.toAutomatonInternal(RegExp.java:515)
	at org.apache.lucene.util.automaton.RegExp.toAutomaton(RegExp.java:495)
	at org.apache.lucene.util.automaton.RegExp.toAutomaton(RegExp.java:426)
	at org.apache.lucene.util.LuceneTestCase.assertTermsEquals(LuceneTestCase.java:1964)
	at org.apache.lucene.util.LuceneTestCase.assertFieldsEquals(LuceneTestCase.java:1926)
	at org.apache.lucene.util.LuceneTestCase.assertReaderEquals(LuceneTestCase.java:1887)
	at org.apache.lucene.index.TestDuelingCodecs.testEquals(TestDuelingCodecs.java:157)
	at sun.reflect.NativeMethodAccessorImpl.invoke0(Native Method)
	at sun.reflect.NativeMethodAccessorImpl.invoke(NativeMethodAccessorImpl.java:62)
	at sun.reflect.DelegatingMethodAccessorImpl.invoke(DelegatingMethodAccessorImpl.java:43)
	at java.lang.reflect.Method.invoke(Method.java:520)
	at com.carrotsearch.randomizedtesting.RandomizedRunner.invoke(RandomizedRunner.java:1764)
	at com.carrotsearch.randomizedtesting.RandomizedRunner$8.evaluate(RandomizedRunner.java:871)
	at com.carrotsearch.randomizedtesting.RandomizedRunner$9.evaluate(RandomizedRunner.java:907)
	at com.carrotsearch.randomizedtesting.RandomizedRunner$10.evaluate(RandomizedRunner.java:921)
	at org.apache.lucene.util.TestRuleSetupTeardownChained$1.evaluate(TestRuleSetupTeardownChained.java:49)
	at org.apache.lucene.util.AbstractBeforeAfterRule$1.evaluate(AbstractBeforeAfterRule.java:45)
	at org.apache.lucene.util.TestRuleThreadAndTestName$1.evaluate(TestRuleThreadAndTestName.java:48)
	at org.apache.lucene.util.TestRuleIgnoreAfterMaxFailures$1.evaluate(TestRuleIgnoreAfterMaxFailures.java:64)
	at org.apache.lucene.util.TestRuleMarkFailure$1.evaluate(TestRuleMarkFailure.java:47)
	at com.carrotsearch.randomizedtesting.rules.StatementAdapter.evaluate(StatementAdapter.java:36)
	at com.carrotsearch.randomizedtesting.ThreadLeakControl$StatementRunner.run(ThreadLeakControl.java:367)
	at com.carrotsearch.randomizedtesting.ThreadLeakControl.forkTimeoutingTask(ThreadLeakControl.java:809)
	at com.carrotsearch.randomizedtesting.ThreadLeakControl$3.evaluate(ThreadLeakControl.java:460)
	at com.carrotsearch.randomizedtesting.RandomizedRunner.runSingleTest(RandomizedRunner.java:880)
	at com.carrotsearch.randomizedtesting.RandomizedRunner$5.evaluate(RandomizedRunner.java:781)
	at com.carrotsearch.randomizedtesting.RandomizedRunner$6.evaluate(RandomizedRunner.java:816)
	at com.carrotsearch.randomizedtesting.RandomizedRunner$7.evaluate(RandomizedRunner.java:827)
	at org.apache.lucene.util.AbstractBeforeAfterRule$1.evaluate(AbstractBeforeAfterRule.java:45)
	at com.carrotsearch.randomizedtesting.rules.StatementAdapter.evaluate(StatementAdapter.java:36)
	at org.apache.lucene.util.TestRuleStoreClassName$1.evaluate(TestRuleStoreClassName.java:41)
	at com.carrotsearch.randomizedtesting.rules.NoShadowingOrOverridesOnMethodsRule$1.evaluate(NoShadowingOrOverridesOnMethodsRule.java:40)
	at com.carrotsearch.randomizedtesting.rules.NoShadowingOrOverridesOnMethodsRule$1.evaluate(NoShadowingOrOverridesOnMethodsRule.java:40)
	at com.carrotsearch.randomizedtesting.rules.StatementAdapter.evaluate(StatementAdapter.java:36)
	at com.carrotsearch.randomizedtesting.rules.StatementAdapter.evaluate(StatementAdapter.java:36)
	at com.carrotsearch.randomizedtesting.rules.StatementAdapter.evaluate(StatementAdapter.java:36)
	at org.apache.lucene.util.TestRuleAssertionsRequired$1.evaluate(TestRuleAssertionsRequired.java:53)
	at org.apache.lucene.util.TestRuleMarkFailure$1.evaluate(TestRuleMarkFailure.java:47)
	at org.apache.lucene.util.TestRuleIgnoreAfterMaxFailures$1.evaluate(TestRuleIgnoreAfterMaxFailures.java:64)
	at org.apache.lucene.util.TestRuleIgnoreTestSuites$1.evaluate(TestRuleIgnoreTestSuites.java:54)
	at com.carrotsearch.randomizedtesting.rules.StatementAdapter.evaluate(StatementAdapter.java:36)
	at com.carrotsearch.randomizedtesting.ThreadLeakControl$StatementRunner.run(ThreadLeakControl.java:367)
	at java.lang.Thread.run(Thread.java:804)


FAILED:  org.apache.lucene.util.automaton.TestUTF32ToUTF8.testRandomRegexes

Error Message:
5

Stack Trace:
java.lang.ArrayIndexOutOfBoundsException: 5
	at __randomizedtesting.SeedInfo.seed([21451227B354CF9E:DDE16724DA3DD1F7]:0)
	at org.apache.lucene.util.automaton.MinimizationOperations.minimize(MinimizationOperations.java:235)
	at org.apache.lucene.util.automaton.RegExp.toAutomatonInternal(RegExp.java:515)
	at org.apache.lucene.util.automaton.RegExp.toAutomaton(RegExp.java:495)
	at org.apache.lucene.util.automaton.RegExp.toAutomaton(RegExp.java:426)
	at org.apache.lucene.util.automaton.TestUTF32ToUTF8.testRandomRegexes(TestUTF32ToUTF8.java:207)
	at sun.reflect.NativeMethodAccessorImpl.invoke0(Native Method)
	at sun.reflect.NativeMethodAccessorImpl.invoke(NativeMethodAccessorImpl.java:62)
	at sun.reflect.DelegatingMethodAccessorImpl.invoke(DelegatingMethodAccessorImpl.java:43)
	at java.lang.reflect.Method.invoke(Method.java:520)
	at com.carrotsearch.randomizedtesting.RandomizedRunner.invoke(RandomizedRunner.java:1764)
	at com.carrotsearch.randomizedtesting.RandomizedRunner$8.evaluate(RandomizedRunner.java:871)
	at com.carrotsearch.randomizedtesting.RandomizedRunner$9.evaluate(RandomizedRunner.java:907)
	at com.carrotsearch.randomizedtesting.RandomizedRunner$10.evaluate(RandomizedRunner.java:921)
	at org.apache.lucene.util.TestRuleSetupTeardownChained$1.evaluate(TestRuleSetupTeardownChained.java:49)
	at org.apache.lucene.util.AbstractBeforeAfterRule$1.evaluate(AbstractBeforeAfterRule.java:45)
	at org.apache.lucene.util.TestRuleThreadAndTestName$1.evaluate(TestRuleThreadAndTestName.java:48)
	at org.apache.lucene.util.TestRuleIgnoreAfterMaxFailures$1.evaluate(TestRuleIgnoreAfterMaxFailures.java:64)
	at org.apache.lucene.util.TestRuleMarkFailure$1.evaluate(TestRuleMarkFailure.java:47)
	at com.carrotsearch.randomizedtesting.rules.StatementAdapter.evaluate(StatementAdapter.java:36)
	at com.carrotsearch.randomizedtesting.ThreadLeakControl$StatementRunner.run(ThreadLeakControl.java:367)
	at com.carrotsearch.randomizedtesting.ThreadLeakControl.forkTimeoutingTask(ThreadLeakControl.java:809)
	at com.carrotsearch.randomizedtesting.ThreadLeakControl$3.evaluate(ThreadLeakControl.java:460)
	at com.carrotsearch.randomizedtesting.RandomizedRunner.runSingleTest(RandomizedRunner.java:880)
	at com.carrotsearch.randomizedtesting.RandomizedRunner$5.evaluate(RandomizedRunner.java:781)
	at com.carrotsearch.randomizedtesting.RandomizedRunner$6.evaluate(RandomizedRunner.java:816)
	at com.carrotsearch.randomizedtesting.RandomizedRunner$7.evaluate(RandomizedRunner.java:827)
	at org.apache.lucene.util.AbstractBeforeAfterRule$1.evaluate(AbstractBeforeAfterRule.java:45)
	at com.carrotsearch.randomizedtesting.rules.StatementAdapter.evaluate(StatementAdapter.java:36)
	at org.apache.lucene.util.TestRuleStoreClassName$1.evaluate(TestRuleStoreClassName.java:41)
	at com.carrotsearch.randomizedtesting.rules.NoShadowingOrOverridesOnMethodsRule$1.evaluate(NoShadowingOrOverridesOnMethodsRule.java:40)
	at com.carrotsearch.randomizedtesting.rules.NoShadowingOrOverridesOnMethodsRule$1.evaluate(NoShadowingOrOverridesOnMethodsRule.java:40)
	at com.carrotsearch.randomizedtesting.rules.StatementAdapter.evaluate(StatementAdapter.java:36)
	at com.carrotsearch.randomizedtesting.rules.StatementAdapter.evaluate(StatementAdapter.java:36)
	at com.carrotsearch.randomizedtesting.rules.StatementAdapter.evaluate(StatementAdapter.java:36)
	at org.apache.lucene.util.TestRuleAssertionsRequired$1.evaluate(TestRuleAssertionsRequired.java:53)
	at org.apache.lucene.util.TestRuleMarkFailure$1.evaluate(TestRuleMarkFailure.java:47)
	at org.apache.lucene.util.TestRuleIgnoreAfterMaxFailures$1.evaluate(TestRuleIgnoreAfterMaxFailures.java:64)
	at org.apache.lucene.util.TestRuleIgnoreTestSuites$1.evaluate(TestRuleIgnoreTestSuites.java:54)
	at com.carrotsearch.randomizedtesting.rules.StatementAdapter.evaluate(StatementAdapter.java:36)
	at com.carrotsearch.randomizedtesting.ThreadLeakControl$StatementRunner.run(ThreadLeakControl.java:367)
	at java.lang.Thread.run(Thread.java:804)




Build Log:
[...truncated 970 lines...]
   [junit4] Suite: org.apache.lucene.index.TestDuelingCodecs
   [junit4]   2> NOTE: reproduce with: ant test  -Dtestcase=TestDuelingCodecs -Dtests.method=testEquals
-Dtests.seed=21451227B354CF9E -Dtests.multiplier=3 -Dtests.slow=true -Dtests.locale=smn -Dtests.timezone=Asia/Vladivostok
-Dtests.asserts=true -Dtests.file.encoding=US-ASCII
   [junit4] ERROR   5.05s J0 | TestDuelingCodecs.testEquals <<<
   [junit4]    > Throwable #1: java.lang.ArrayIndexOutOfBoundsException: 8
   [junit4]    > 	at __randomizedtesting.SeedInfo.seed([21451227B354CF9E:252A41BC7D6D9F9C]:0)
   [junit4]    > 	at org.apache.lucene.util.automaton.MinimizationOperations.minimize(MinimizationOperations.java:235)
   [junit4]    > 	at org.apache.lucene.util.automaton.RegExp.toAutomatonInternal(RegExp.java:515)
   [junit4]    > 	at org.apache.lucene.util.automaton.RegExp.toAutomaton(RegExp.java:495)
   [junit4]    > 	at org.apache.lucene.util.automaton.RegExp.toAutomaton(RegExp.java:426)
   [junit4]    > 	at org.apache.lucene.util.LuceneTestCase.assertTermsEquals(LuceneTestCase.java:1964)
   [junit4]    > 	at org.apache.lucene.util.LuceneTestCase.assertFieldsEquals(LuceneTestCase.java:1926)
   [junit4]    > 	at org.apache.lucene.util.LuceneTestCase.assertReaderEquals(LuceneTestCase.java:1887)
   [junit4]    > 	at org.apache.lucene.index.TestDuelingCodecs.testEquals(TestDuelingCodecs.java:157)
   [junit4]    > 	at java.lang.Thread.run(Thread.java:804)
   [junit4]   2> NOTE: leaving temporary files on disk at: /home/jenkins/workspace/Lucene-Solr-5.5-Linux/lucene/build/core/test/J0/temp/lucene.index.TestDuelingCodecs_21451227B354CF9E-001
   [junit4]   2> NOTE: test params are: codec=Asserting(Lucene54): {}, docValues:{}, sim=DefaultSimilarity,
locale=smn, timezone=Asia/Vladivostok
   [junit4]   2> NOTE: Linux 3.19.0-47-generic amd64/Oracle Corporation 9-ea (64-bit)/cpus=12,threads=1,free=171660352,total=396361728
   [junit4]   2> NOTE: All tests run in this JVM: [TestNearSpansOrdered, TestTotalHitCountCollector,
TestRegexpRandom2, TestReusableStringReader, TestBooleanQuery, TestQueryRescorer, TestNot,
TestSortedNumericSortField, TestPerSegmentDeletes, TestBooleanScorer, TestEarlyTermination,
TestFieldValueFilter, TestLevenshteinAutomata, TestOrdinalMap, TestDateFilter, TestIndexWriterMergePolicy,
TestMergePolicyWrapper, TestDirectPacked, TestConjunctionDISI, Test2BNumericDocValues, TestDocBoost,
TestBlockPostingsFormat2, TestCustomNorms, Test2BPostings, TestDocValues, TestBooleanRewrites,
TestLucene50CompoundFormat, TestSegmentInfos, TestSimilarityProvider, TestSpansAdvanced, TestBufferedChecksum,
TestMultiTermQueryRewrites, TestTermVectors, TestForTooMuchCloning, TestRegExp, TestMultiPhraseQuery,
TestStressNRT, TestIndexFileDeleter, TestHugeRamFile, TestParallelTermEnum, TestMultiFields,
TestFixedBitDocIdSet, TestFilterLeafReader, TestConstantScoreQuery, TestIntsRef, TestPersistentSnapshotDeletionPolicy,
TestCustomSearcherSort, TestDateSort, TestCodecUtil, TestSpanContainQuery, TestRoaringDocIdSet,
TestSimpleFSDirectory, TestMultiTermConstantScore, TestIndexReaderClose, Test2BPositions,
TestSentinelIntSet, TestAllFilesDetectTruncation, TestMultiThreadTermVectors, TestIsCurrent,
TestVirtualMethod, TestLongBitSet, TestIndexWriter, TestIndexWriterNRTIsCurrent, TestFilterSpans,
TestPhrasePrefixQuery, TestSleepingLockWrapper, TestMinShouldMatch2, TestLRUFilterCache, TestVersion,
Test2BBinaryDocValues, TestCachingCollector, TestMinimize, TestShardSearching, TestDuelingCodecs]
   [junit4] Completed [181/421 (1!)] on J0 in 9.46s, 2 tests, 1 error <<< FAILURES!

[...truncated 122 lines...]
   [junit4] Suite: org.apache.lucene.util.automaton.TestUTF32ToUTF8
   [junit4]   2> NOTE: reproduce with: ant test  -Dtestcase=TestUTF32ToUTF8 -Dtests.method=testRandomRegexes
-Dtests.seed=21451227B354CF9E -Dtests.multiplier=3 -Dtests.slow=true -Dtests.locale=fr-GF
-Dtests.timezone=PRC -Dtests.asserts=true -Dtests.file.encoding=US-ASCII
   [junit4] ERROR   2.38s J2 | TestUTF32ToUTF8.testRandomRegexes <<<
   [junit4]    > Throwable #1: java.lang.ArrayIndexOutOfBoundsException: 5
   [junit4]    > 	at __randomizedtesting.SeedInfo.seed([21451227B354CF9E:DDE16724DA3DD1F7]:0)
   [junit4]    > 	at org.apache.lucene.util.automaton.MinimizationOperations.minimize(MinimizationOperations.java:235)
   [junit4]    > 	at org.apache.lucene.util.automaton.RegExp.toAutomatonInternal(RegExp.java:515)
   [junit4]    > 	at org.apache.lucene.util.automaton.RegExp.toAutomaton(RegExp.java:495)
   [junit4]    > 	at org.apache.lucene.util.automaton.RegExp.toAutomaton(RegExp.java:426)
   [junit4]    > 	at org.apache.lucene.util.automaton.TestUTF32ToUTF8.testRandomRegexes(TestUTF32ToUTF8.java:207)
   [junit4]    > 	at java.lang.Thread.run(Thread.java:804)
   [junit4]   2> NOTE: test params are: codec=FastDecompressionCompressingStoredFields(storedFieldsFormat=CompressingStoredFieldsFormat(compressionMode=FAST_DECOMPRESSION,
chunkSize=3, maxDocsPerChunk=8, blockSize=3), termVectorsFormat=CompressingTermVectorsFormat(compressionMode=FAST_DECOMPRESSION,
chunkSize=3, blockSize=3)), sim=DefaultSimilarity, locale=fr-GF, timezone=PRC
   [junit4]   2> NOTE: Linux 3.19.0-47-generic amd64/Oracle Corporation 9-ea (64-bit)/cpus=12,threads=1,free=398137248,total=518520832
   [junit4]   2> NOTE: All tests run in this JVM: [TestIndexSearcher, TestFilteredQuery,
TestCompiledAutomaton, MultiCollectorTest, TestSloppyMath, TestSearchForDuplicates, TestBinaryDocValuesUpdates,
TestPackedTokenAttributeImpl, TestPagedBytes, TestPerFieldPostingsFormat, TestCodecHoldsOpenFiles,
TestNRTThreads, TestDefaultSimilarity, TestInPlaceMergeSorter, TestSimpleExplanations, TestStringHelper,
TestByteArrayDataInput, TestWildcard, TestBitDocIdSetBuilder, TestDirectMonotonic, TestCachingWrapperQuery,
TestMergedIterator, TestFilterIterator, TestSpansEnum, FuzzyTermOnShortTermsTest, TestForUtil,
FiniteStringsIteratorTest, TestField, TestOmitTf, TestSimpleExplanationsOfNonMatches, TestRegexpRandom,
TestBooleanCoord, TestDocValuesRewriteMethod, TestMultiDocValues, TestFieldType, TestBooleanQueryVisitSubscorers,
TestMaxTermFrequency, TestMatchNoDocsQuery, TestMaxPosition, TestBlockPostingsFormat, TestBooleanOr,
TestWildcardRandom, TestSortedSetSortField, TestSegmentTermEnum, TestRollingUpdates, TestSpanFirstQuery,
TestScoreCachingWrappingScorer, TestIndexWriterUnicode, TestCloseableThreadLocal, TestAllFilesCheckIndexHeader,
TestDocInverterPerFieldErrorInfo, TestSingleInstanceLockFactory, TestAtomicUpdate, TestCrashCausesCorruptIndex,
TestMultiMMap, TestBagOfPostings, TestDocumentWriter, TestInfoStream, TestMmapDirectory, TestQueryCachingPolicy,
TestPerFieldPostingsFormat2, TestTermVectorsWriter, TestSearchWithThreads, TestLSBRadixSorter,
TestLiveFieldValues, TestSpanCollection, TestConsistentFieldNumbers, TestTopDocsMerge, TestDocCount,
TestSortRescorer, TestIndexWriterReader, TestIndexWriterMerging, TestFSTs, TestNumericRangeQuery64,
TestBytesStore, TestIndexWriterWithThreads, TestNumericRangeQuery32, TestSearcherManager,
TestDeletionPolicy, TestBasics, TestSloppyPhraseQuery, TestIndexWriterDelete, TestBoolean2,
TestStressAdvance, TestNorms, TestIndexWriterCommit, TestTimeLimitingCollector, TestHighCompressionMode,
TestNeverDelete, TestLongPostings, TestNRTReaderWithThreads, TestArrayUtil, TestWeakIdentityMap,
TestDirectoryReader, TestLockFactory, TestSegmentMerger, TestPhraseQuery, TestCollectionUtil,
TestBagOfPositions, TestOmitNorms, TestComplexExplanations, TestSegmentReader, TestParallelCompositeReader,
TestTransactions, TestSegmentTermDocs, TestSort, TestToken, TestFieldsReader, TestSimpleSearchEquivalence,
TestDocValuesIndexing, TestSimilarityBase, TestBooleanMinShouldMatch, TestNumericUtils, TestDeterminizeLexicon,
TestSpans, TestPostingsOffsets, TestMixedCodecs, TestFlex, TestUTF32ToUTF8]
   [junit4] Completed [222/421 (2!)] on J2 in 2.42s, 6 tests, 1 error <<< FAILURES!

[...truncated 667 lines...]
BUILD FAILED
/home/jenkins/workspace/Lucene-Solr-5.5-Linux/build.xml:750: The following error occurred
while executing this line:
/home/jenkins/workspace/Lucene-Solr-5.5-Linux/build.xml:694: The following error occurred
while executing this line:
/home/jenkins/workspace/Lucene-Solr-5.5-Linux/build.xml:59: The following error occurred while
executing this line:
/home/jenkins/workspace/Lucene-Solr-5.5-Linux/lucene/build.xml:50: The following error occurred
while executing this line:
/home/jenkins/workspace/Lucene-Solr-5.5-Linux/lucene/common-build.xml:1477: The following
error occurred while executing this line:
/home/jenkins/workspace/Lucene-Solr-5.5-Linux/lucene/common-build.xml:1033: There were test
failures: 421 suites (1 ignored), 3386 tests, 2 errors, 144 ignored (140 assumptions) [seed:
21451227B354CF9E]

Total time: 6 minutes 44 seconds
Build step 'Invoke Ant' marked build as failure
Archiving artifacts
[WARNINGS] Skipping publisher since build result is FAILURE
Recording test results
Email was triggered for: Failure - Any
Sending email for trigger: Failure - Any



Mime
View raw message