lucene-dev mailing list archives

Site index · List index
Message view « Date » · « Thread »
Top « Date » · « Thread »
From Apache Jenkins Server <jenk...@builds.apache.org>
Subject [JENKINS] Lucene-Solr-NightlyTests-5.5 - Build # 3 - Still Failing
Date Mon, 15 Feb 2016 04:40:40 GMT
Build: https://builds.apache.org/job/Lucene-Solr-NightlyTests-5.5/3/

2 tests failed.
FAILED:  org.apache.solr.cloud.hdfs.HdfsCollectionsAPIDistributedZkTest.test

Error Message:
Error from server at http://127.0.0.1:58946/awholynewcollection_1: non ok status: 500, message:Server Error

Stack Trace:
org.apache.solr.client.solrj.impl.HttpSolrClient$RemoteSolrException: Error from server at http://127.0.0.1:58946/awholynewcollection_1: non ok status: 500, message:Server Error
	at __randomizedtesting.SeedInfo.seed([B0A0DB0EFD174CC8:38F4E4D453EB2130]:0)
	at org.apache.solr.client.solrj.impl.HttpSolrClient.executeMethod(HttpSolrClient.java:510)
	at org.apache.solr.client.solrj.impl.HttpSolrClient.request(HttpSolrClient.java:240)
	at org.apache.solr.client.solrj.impl.HttpSolrClient.request(HttpSolrClient.java:229)
	at org.apache.solr.client.solrj.SolrRequest.process(SolrRequest.java:149)
	at org.apache.solr.client.solrj.SolrClient.query(SolrClient.java:942)
	at org.apache.solr.client.solrj.SolrClient.query(SolrClient.java:957)
	at org.apache.solr.cloud.AbstractFullDistribZkTestBase.waitForNon403or404or503(AbstractFullDistribZkTestBase.java:1753)
	at org.apache.solr.cloud.CollectionsAPIDistributedZkTest.testCollectionsAPI(CollectionsAPIDistributedZkTest.java:737)
	at org.apache.solr.cloud.CollectionsAPIDistributedZkTest.test(CollectionsAPIDistributedZkTest.java:160)
	at sun.reflect.NativeMethodAccessorImpl.invoke0(Native Method)
	at sun.reflect.NativeMethodAccessorImpl.invoke(NativeMethodAccessorImpl.java:57)
	at sun.reflect.DelegatingMethodAccessorImpl.invoke(DelegatingMethodAccessorImpl.java:43)
	at java.lang.reflect.Method.invoke(Method.java:606)
	at com.carrotsearch.randomizedtesting.RandomizedRunner.invoke(RandomizedRunner.java:1764)
	at com.carrotsearch.randomizedtesting.RandomizedRunner$8.evaluate(RandomizedRunner.java:871)
	at com.carrotsearch.randomizedtesting.RandomizedRunner$9.evaluate(RandomizedRunner.java:907)
	at com.carrotsearch.randomizedtesting.RandomizedRunner$10.evaluate(RandomizedRunner.java:921)
	at org.apache.solr.BaseDistributedSearchTestCase$ShardsRepeatRule$ShardsFixedStatement.callStatement(BaseDistributedSearchTestCase.java:964)
	at org.apache.solr.BaseDistributedSearchTestCase$ShardsRepeatRule$ShardsStatement.evaluate(BaseDistributedSearchTestCase.java:939)
	at com.carrotsearch.randomizedtesting.rules.SystemPropertiesRestoreRule$1.evaluate(SystemPropertiesRestoreRule.java:57)
	at org.apache.lucene.util.TestRuleSetupTeardownChained$1.evaluate(TestRuleSetupTeardownChained.java:49)
	at org.apache.lucene.util.AbstractBeforeAfterRule$1.evaluate(AbstractBeforeAfterRule.java:45)
	at org.apache.lucene.util.TestRuleThreadAndTestName$1.evaluate(TestRuleThreadAndTestName.java:48)
	at org.apache.lucene.util.TestRuleIgnoreAfterMaxFailures$1.evaluate(TestRuleIgnoreAfterMaxFailures.java:64)
	at org.apache.lucene.util.TestRuleMarkFailure$1.evaluate(TestRuleMarkFailure.java:47)
	at com.carrotsearch.randomizedtesting.rules.StatementAdapter.evaluate(StatementAdapter.java:36)
	at com.carrotsearch.randomizedtesting.ThreadLeakControl$StatementRunner.run(ThreadLeakControl.java:367)
	at com.carrotsearch.randomizedtesting.ThreadLeakControl.forkTimeoutingTask(ThreadLeakControl.java:809)
	at com.carrotsearch.randomizedtesting.ThreadLeakControl$3.evaluate(ThreadLeakControl.java:460)
	at com.carrotsearch.randomizedtesting.RandomizedRunner.runSingleTest(RandomizedRunner.java:880)
	at com.carrotsearch.randomizedtesting.RandomizedRunner$5.evaluate(RandomizedRunner.java:781)
	at com.carrotsearch.randomizedtesting.RandomizedRunner$6.evaluate(RandomizedRunner.java:816)
	at com.carrotsearch.randomizedtesting.RandomizedRunner$7.evaluate(RandomizedRunner.java:827)
	at com.carrotsearch.randomizedtesting.rules.StatementAdapter.evaluate(StatementAdapter.java:36)
	at com.carrotsearch.randomizedtesting.rules.SystemPropertiesRestoreRule$1.evaluate(SystemPropertiesRestoreRule.java:57)
	at org.apache.lucene.util.AbstractBeforeAfterRule$1.evaluate(AbstractBeforeAfterRule.java:45)
	at com.carrotsearch.randomizedtesting.rules.StatementAdapter.evaluate(StatementAdapter.java:36)
	at org.apache.lucene.util.TestRuleStoreClassName$1.evaluate(TestRuleStoreClassName.java:41)
	at com.carrotsearch.randomizedtesting.rules.NoShadowingOrOverridesOnMethodsRule$1.evaluate(NoShadowingOrOverridesOnMethodsRule.java:40)
	at com.carrotsearch.randomizedtesting.rules.NoShadowingOrOverridesOnMethodsRule$1.evaluate(NoShadowingOrOverridesOnMethodsRule.java:40)
	at com.carrotsearch.randomizedtesting.rules.StatementAdapter.evaluate(StatementAdapter.java:36)
	at com.carrotsearch.randomizedtesting.rules.StatementAdapter.evaluate(StatementAdapter.java:36)
	at com.carrotsearch.randomizedtesting.rules.StatementAdapter.evaluate(StatementAdapter.java:36)
	at org.apache.lucene.util.TestRuleAssertionsRequired$1.evaluate(TestRuleAssertionsRequired.java:53)
	at org.apache.lucene.util.TestRuleMarkFailure$1.evaluate(TestRuleMarkFailure.java:47)
	at org.apache.lucene.util.TestRuleIgnoreAfterMaxFailures$1.evaluate(TestRuleIgnoreAfterMaxFailures.java:64)
	at org.apache.lucene.util.TestRuleIgnoreTestSuites$1.evaluate(TestRuleIgnoreTestSuites.java:54)
	at com.carrotsearch.randomizedtesting.rules.StatementAdapter.evaluate(StatementAdapter.java:36)
	at com.carrotsearch.randomizedtesting.ThreadLeakControl$StatementRunner.run(ThreadLeakControl.java:367)
	at java.lang.Thread.run(Thread.java:745)


FAILED:  junit.framework.TestSuite.org.apache.solr.handler.TestReplicationHandler

Error Message:
ObjectTracker found 1 object(s) that were not released!!! [NRTCachingDirectory]

Stack Trace:
java.lang.AssertionError: ObjectTracker found 1 object(s) that were not released!!! [NRTCachingDirectory]
	at __randomizedtesting.SeedInfo.seed([B0A0DB0EFD174CC8]:0)
	at org.junit.Assert.fail(Assert.java:93)
	at org.junit.Assert.assertTrue(Assert.java:43)
	at org.junit.Assert.assertNull(Assert.java:551)
	at org.apache.solr.SolrTestCaseJ4.afterClass(SolrTestCaseJ4.java:228)
	at sun.reflect.GeneratedMethodAccessor19.invoke(Unknown Source)
	at sun.reflect.DelegatingMethodAccessorImpl.invoke(DelegatingMethodAccessorImpl.java:43)
	at java.lang.reflect.Method.invoke(Method.java:606)
	at com.carrotsearch.randomizedtesting.RandomizedRunner.invoke(RandomizedRunner.java:1764)
	at com.carrotsearch.randomizedtesting.RandomizedRunner$7.evaluate(RandomizedRunner.java:834)
	at com.carrotsearch.randomizedtesting.rules.StatementAdapter.evaluate(StatementAdapter.java:36)
	at com.carrotsearch.randomizedtesting.rules.SystemPropertiesRestoreRule$1.evaluate(SystemPropertiesRestoreRule.java:57)
	at org.apache.lucene.util.AbstractBeforeAfterRule$1.evaluate(AbstractBeforeAfterRule.java:45)
	at com.carrotsearch.randomizedtesting.rules.StatementAdapter.evaluate(StatementAdapter.java:36)
	at org.apache.lucene.util.TestRuleStoreClassName$1.evaluate(TestRuleStoreClassName.java:41)
	at com.carrotsearch.randomizedtesting.rules.NoShadowingOrOverridesOnMethodsRule$1.evaluate(NoShadowingOrOverridesOnMethodsRule.java:40)
	at com.carrotsearch.randomizedtesting.rules.NoShadowingOrOverridesOnMethodsRule$1.evaluate(NoShadowingOrOverridesOnMethodsRule.java:40)
	at com.carrotsearch.randomizedtesting.rules.StatementAdapter.evaluate(StatementAdapter.java:36)
	at com.carrotsearch.randomizedtesting.rules.StatementAdapter.evaluate(StatementAdapter.java:36)
	at com.carrotsearch.randomizedtesting.rules.StatementAdapter.evaluate(StatementAdapter.java:36)
	at org.apache.lucene.util.TestRuleAssertionsRequired$1.evaluate(TestRuleAssertionsRequired.java:53)
	at org.apache.lucene.util.TestRuleMarkFailure$1.evaluate(TestRuleMarkFailure.java:47)
	at org.apache.lucene.util.TestRuleIgnoreAfterMaxFailures$1.evaluate(TestRuleIgnoreAfterMaxFailures.java:64)
	at org.apache.lucene.util.TestRuleIgnoreTestSuites$1.evaluate(TestRuleIgnoreTestSuites.java:54)
	at com.carrotsearch.randomizedtesting.rules.StatementAdapter.evaluate(StatementAdapter.java:36)
	at com.carrotsearch.randomizedtesting.ThreadLeakControl$StatementRunner.run(ThreadLeakControl.java:367)
	at java.lang.Thread.run(Thread.java:745)




Build Log:
[...truncated 11772 lines...]
   [junit4] Suite: org.apache.solr.handler.TestReplicationHandler
   [junit4]   2> Creating dataDir: /x1/jenkins/jenkins-slave/workspace/Lucene-Solr-NightlyTests-5.5/solr/build/solr-core/test/J2/temp/solr.handler.TestReplicationHandler_B0A0DB0EFD174CC8-001/init-core-data-001
   [junit4]   2> 1686490 INFO  (TEST-TestReplicationHandler.doTestStressReplication-seed#[B0A0DB0EFD174CC8]) [    ] o.a.s.SolrTestCaseJ4 ###Starting doTestStressReplication
   [junit4]   2> 1686490 INFO  (TEST-TestReplicationHandler.doTestStressReplication-seed#[B0A0DB0EFD174CC8]) [    ] o.a.s.SolrTestCaseJ4 Writing core.properties file to /x1/jenkins/jenkins-slave/workspace/Lucene-Solr-NightlyTests-5.5/solr/build/solr-core/test/J2/temp/solr.handler.TestReplicationHandler_B0A0DB0EFD174CC8-001/solr-instance-001/collection1
   [junit4]   2> 1686493 INFO  (TEST-TestReplicationHandler.doTestStressReplication-seed#[B0A0DB0EFD174CC8]) [    ] o.e.j.s.Server jetty-9.2.13.v20150730
   [junit4]   2> 1686570 INFO  (TEST-TestReplicationHandler.doTestStressReplication-seed#[B0A0DB0EFD174CC8]) [    ] o.e.j.s.h.ContextHandler Started o.e.j.s.ServletContextHandler@68401ab{/solr,null,AVAILABLE}
   [junit4]   2> 1686572 INFO  (TEST-TestReplicationHandler.doTestStressReplication-seed#[B0A0DB0EFD174CC8]) [    ] o.e.j.s.ServerConnector Started ServerConnector@2073b7e3{HTTP/1.1}{127.0.0.1:49141}
   [junit4]   2> 1686572 INFO  (TEST-TestReplicationHandler.doTestStressReplication-seed#[B0A0DB0EFD174CC8]) [    ] o.e.j.s.Server Started @1689328ms
   [junit4]   2> 1686572 INFO  (TEST-TestReplicationHandler.doTestStressReplication-seed#[B0A0DB0EFD174CC8]) [    ] o.a.s.c.s.e.JettySolrRunner Jetty properties: {hostPort=49141, solr.data.dir=/x1/jenkins/jenkins-slave/workspace/Lucene-Solr-NightlyTests-5.5/solr/build/solr-core/test/J2/temp/solr.handler.TestReplicationHandler_B0A0DB0EFD174CC8-001/solr-instance-001/collection1/data, hostContext=/solr}
   [junit4]   2> 1686572 INFO  (TEST-TestReplicationHandler.doTestStressReplication-seed#[B0A0DB0EFD174CC8]) [    ] o.a.s.s.SolrDispatchFilter SolrDispatchFilter.init(): sun.misc.Launcher$AppClassLoader@3827de24
   [junit4]   2> 1686572 INFO  (TEST-TestReplicationHandler.doTestStressReplication-seed#[B0A0DB0EFD174CC8]) [    ] o.a.s.c.SolrResourceLoader new SolrResourceLoader for directory: '/x1/jenkins/jenkins-slave/workspace/Lucene-Solr-NightlyTests-5.5/solr/build/solr-core/test/J2/temp/solr.handler.TestReplicationHandler_B0A0DB0EFD174CC8-001/solr-instance-001'
   [junit4]   2> 1686572 INFO  (TEST-TestReplicationHandler.doTestStressReplication-seed#[B0A0DB0EFD174CC8]) [    ] o.a.s.c.SolrResourceLoader JNDI not configured for solr (NoInitialContextEx)
   [junit4]   2> 1686572 INFO  (TEST-TestReplicationHandler.doTestStressReplication-seed#[B0A0DB0EFD174CC8]) [    ] o.a.s.c.SolrResourceLoader solr home defaulted to 'solr/' (could not find system property or JNDI)
   [junit4]   2> 1686573 INFO  (TEST-TestReplicationHandler.doTestStressReplication-seed#[B0A0DB0EFD174CC8]) [    ] o.a.s.c.SolrXmlConfig Loading container configuration from /x1/jenkins/jenkins-slave/workspace/Lucene-Solr-NightlyTests-5.5/solr/build/solr-core/test/J2/temp/solr.handler.TestReplicationHandler_B0A0DB0EFD174CC8-001/solr-instance-001/solr.xml
   [junit4]   2> 1686596 INFO  (TEST-TestReplicationHandler.doTestStressReplication-seed#[B0A0DB0EFD174CC8]) [    ] o.a.s.c.CorePropertiesLocator Config-defined core root directory: /x1/jenkins/jenkins-slave/workspace/Lucene-Solr-NightlyTests-5.5/solr/build/solr-core/test/J2/temp/solr.handler.TestReplicationHandler_B0A0DB0EFD174CC8-001/solr-instance-001/.
   [junit4]   2> 1686597 INFO  (TEST-TestReplicationHandler.doTestStressReplication-seed#[B0A0DB0EFD174CC8]) [    ] o.a.s.c.CoreContainer New CoreContainer 1812678688
   [junit4]   2> 1686597 INFO  (TEST-TestReplicationHandler.doTestStressReplication-seed#[B0A0DB0EFD174CC8]) [    ] o.a.s.c.CoreContainer Loading cores into CoreContainer [instanceDir=/x1/jenkins/jenkins-slave/workspace/Lucene-Solr-NightlyTests-5.5/solr/build/solr-core/test/J2/temp/solr.handler.TestReplicationHandler_B0A0DB0EFD174CC8-001/solr-instance-001]
   [junit4]   2> 1686597 WARN  (TEST-TestReplicationHandler.doTestStressReplication-seed#[B0A0DB0EFD174CC8]) [    ] o.a.s.c.CoreContainer Couldn't add files from /x1/jenkins/jenkins-slave/workspace/Lucene-Solr-NightlyTests-5.5/solr/build/solr-core/test/J2/temp/solr.handler.TestReplicationHandler_B0A0DB0EFD174CC8-001/solr-instance-001/lib to classpath: /x1/jenkins/jenkins-slave/workspace/Lucene-Solr-NightlyTests-5.5/solr/build/solr-core/test/J2/temp/solr.handler.TestReplicationHandler_B0A0DB0EFD174CC8-001/solr-instance-001/lib
   [junit4]   2> 1686597 INFO  (TEST-TestReplicationHandler.doTestStressReplication-seed#[B0A0DB0EFD174CC8]) [    ] o.a.s.h.c.HttpShardHandlerFactory created with socketTimeout : 90000,urlScheme : ,connTimeout : 15000,maxConnectionsPerHost : 20,maxConnections : 10000,corePoolSize : 0,maximumPoolSize : 2147483647,maxThreadIdleTime : 5,sizeOfQueue : -1,fairnessPolicy : false,useRetries : false,
   [junit4]   2> 1686603 INFO  (TEST-TestReplicationHandler.doTestStressReplication-seed#[B0A0DB0EFD174CC8]) [    ] o.a.s.u.UpdateShardHandler Creating UpdateShardHandler HTTP client with params: socketTimeout=340000&connTimeout=45000&retry=true
   [junit4]   2> 1686603 INFO  (TEST-TestReplicationHandler.doTestStressReplication-seed#[B0A0DB0EFD174CC8]) [    ] o.a.s.l.LogWatcher SLF4J impl is org.slf4j.impl.Log4jLoggerFactory
   [junit4]   2> 1686603 INFO  (TEST-TestReplicationHandler.doTestStressReplication-seed#[B0A0DB0EFD174CC8]) [    ] o.a.s.l.LogWatcher Registering Log Listener [Log4j (org.slf4j.impl.Log4jLoggerFactory)]
   [junit4]   2> 1686603 INFO  (TEST-TestReplicationHandler.doTestStressReplication-seed#[B0A0DB0EFD174CC8]) [    ] o.a.s.c.CoreContainer Security conf doesn't exist. Skipping setup for authorization module.
   [junit4]   2> 1686603 INFO  (TEST-TestReplicationHandler.doTestStressReplication-seed#[B0A0DB0EFD174CC8]) [    ] o.a.s.c.CoreContainer No authentication plugin used.
   [junit4]   2> 1686604 INFO  (TEST-TestReplicationHandler.doTestStressReplication-seed#[B0A0DB0EFD174CC8]) [    ] o.a.s.c.CorePropertiesLocator Looking for core definitions underneath /x1/jenkins/jenkins-slave/workspace/Lucene-Solr-NightlyTests-5.5/solr/build/solr-core/test/J2/temp/solr.handler.TestReplicationHandler_B0A0DB0EFD174CC8-001/solr-instance-001/.
   [junit4]   2> 1686611 INFO  (TEST-TestReplicationHandler.doTestStressReplication-seed#[B0A0DB0EFD174CC8]) [    ] o.a.s.c.CoreDescriptor Created CoreDescriptor: {name=collection1, schema=schema.xml, dataDir=data/, loadOnStartup=true, transient=false, configSetProperties=configsetprops.json, config=solrconfig.xml}
   [junit4]   2> 1686611 INFO  (TEST-TestReplicationHandler.doTestStressReplication-seed#[B0A0DB0EFD174CC8]) [    ] o.a.s.c.CorePropertiesLocator Found core collection1 in /x1/jenkins/jenkins-slave/workspace/Lucene-Solr-NightlyTests-5.5/solr/build/solr-core/test/J2/temp/solr.handler.TestReplicationHandler_B0A0DB0EFD174CC8-001/solr-instance-001/./collection1
   [junit4]   2> 1686611 INFO  (TEST-TestReplicationHandler.doTestStressReplication-seed#[B0A0DB0EFD174CC8]) [    ] o.a.s.c.CorePropertiesLocator Found 1 core definitions
   [junit4]   2> 1686619 INFO  (coreLoadExecutor-4009-thread-1) [    ] o.a.s.c.SolrResourceLoader new SolrResourceLoader for directory: '/x1/jenkins/jenkins-slave/workspace/Lucene-Solr-NightlyTests-5.5/solr/build/solr-core/test/J2/temp/solr.handler.TestReplicationHandler_B0A0DB0EFD174CC8-001/solr-instance-001/collection1'
   [junit4]   2> 1686631 INFO  (coreLoadExecutor-4009-thread-1) [    ] o.a.s.c.SolrResourceLoader JNDI not configured for solr (NoInitialContextEx)
   [junit4]   2> 1686632 INFO  (coreLoadExecutor-4009-thread-1) [    ] o.a.s.c.SolrResourceLoader solr home defaulted to 'solr/' (could not find system property or JNDI)
   [junit4]   2> 1686636 INFO  (TEST-TestReplicationHandler.doTestStressReplication-seed#[B0A0DB0EFD174CC8]) [    ] o.a.s.s.SolrDispatchFilter user.dir=/x1/jenkins/jenkins-slave/workspace/Lucene-Solr-NightlyTests-5.5/solr/build/solr-core/test/J2
   [junit4]   2> 1686636 INFO  (TEST-TestReplicationHandler.doTestStressReplication-seed#[B0A0DB0EFD174CC8]) [    ] o.a.s.s.SolrDispatchFilter SolrDispatchFilter.init() done
   [junit4]   2> 1686642 INFO  (coreLoadExecutor-4009-thread-1) [    ] o.a.s.c.SolrConfig current version of requestparams : -1
   [junit4]   2> 1686669 INFO  (coreLoadExecutor-4009-thread-1) [    ] o.a.s.c.SolrConfig Using Lucene MatchVersion: 5.5.0
   [junit4]   2> 1686739 INFO  (coreLoadExecutor-4009-thread-1) [    ] o.a.s.c.SolrConfig Loaded SolrConfig: solrconfig.xml
   [junit4]   2> 1686744 INFO  (coreLoadExecutor-4009-thread-1) [    ] o.a.s.s.IndexSchema [collection1] Schema name=test
   [junit4]   2> 1686770 INFO  (coreLoadExecutor-4009-thread-1) [    ] o.a.s.s.IndexSchema unique key field: id
   [junit4]   2> 1686772 INFO  (coreLoadExecutor-4009-thread-1) [    ] o.a.s.c.ConfigSetProperties Did not find ConfigSet properties, assuming default properties: Can't find resource 'configsetprops.json' in classpath or '/x1/jenkins/jenkins-slave/workspace/Lucene-Solr-NightlyTests-5.5/solr/build/solr-core/test/J2/temp/solr.handler.TestReplicationHandler_B0A0DB0EFD174CC8-001/solr-instance-001/collection1'
   [junit4]   2> 1686773 INFO  (coreLoadExecutor-4009-thread-1) [    ] o.a.s.c.CoreContainer Creating SolrCore 'collection1' using configuration from instancedir /x1/jenkins/jenkins-slave/workspace/Lucene-Solr-NightlyTests-5.5/solr/build/solr-core/test/J2/temp/solr.handler.TestReplicationHandler_B0A0DB0EFD174CC8-001/solr-instance-001/./collection1
   [junit4]   2> 1686773 INFO  (coreLoadExecutor-4009-thread-1) [    x:collection1] o.a.s.c.SolrCore org.apache.solr.core.MockDirectoryFactory
   [junit4]   2> 1686773 INFO  (coreLoadExecutor-4009-thread-1) [    x:collection1] o.a.s.c.SolrCore [[collection1] ] Opening new SolrCore at [/x1/jenkins/jenkins-slave/workspace/Lucene-Solr-NightlyTests-5.5/solr/build/solr-core/test/J2/temp/solr.handler.TestReplicationHandler_B0A0DB0EFD174CC8-001/solr-instance-001/collection1], dataDir=[/x1/jenkins/jenkins-slave/workspace/Lucene-Solr-NightlyTests-5.5/solr/build/solr-core/test/J2/temp/solr.handler.TestReplicationHandler_B0A0DB0EFD174CC8-001/solr-instance-001/./collection1/data/]
   [junit4]   2> 1686773 INFO  (coreLoadExecutor-4009-thread-1) [    x:collection1] o.a.s.c.SolrCore JMX monitoring not detected for core: collection1
   [junit4]   2> 1686774 INFO  (coreLoadExecutor-4009-thread-1) [    x:collection1] o.a.s.c.CachingDirectoryFactory return new directory for /x1/jenkins/jenkins-slave/workspace/Lucene-Solr-NightlyTests-5.5/solr/build/solr-core/test/J2/temp/solr.handler.TestReplicationHandler_B0A0DB0EFD174CC8-001/solr-instance-001/./collection1/data
   [junit4]   2> 1686782 INFO  (coreLoadExecutor-4009-thread-1) [    x:collection1] o.a.s.c.SolrCore New index directory detected: old=null new=/x1/jenkins/jenkins-slave/workspace/Lucene-Solr-NightlyTests-5.5/solr/build/solr-core/test/J2/temp/solr.handler.TestReplicationHandler_B0A0DB0EFD174CC8-001/solr-instance-001/./collection1/data/index/
   [junit4]   2> 1686782 WARN  (coreLoadExecutor-4009-thread-1) [    x:collection1] o.a.s.c.SolrCore [collection1] Solr index directory '/x1/jenkins/jenkins-slave/workspace/Lucene-Solr-NightlyTests-5.5/solr/build/solr-core/test/J2/temp/solr.handler.TestReplicationHandler_B0A0DB0EFD174CC8-001/solr-instance-001/./collection1/data/index' doesn't exist. Creating new index...
   [junit4]   2> 1686782 INFO  (coreLoadExecutor-4009-thread-1) [    x:collection1] o.a.s.c.CachingDirectoryFactory return new directory for /x1/jenkins/jenkins-slave/workspace/Lucene-Solr-NightlyTests-5.5/solr/build/solr-core/test/J2/temp/solr.handler.TestReplicationHandler_B0A0DB0EFD174CC8-001/solr-instance-001/./collection1/data/index
   [junit4]   2> 1686782 INFO  (coreLoadExecutor-4009-thread-1) [    x:collection1] o.a.s.u.RandomMergePolicy RandomMergePolicy wrapping class org.apache.lucene.index.MockRandomMergePolicy: org.apache.lucene.index.MockRandomMergePolicy@75436950
   [junit4]   2> 1686783 INFO  (coreLoadExecutor-4009-thread-1) [    x:collection1] o.a.s.c.SolrDeletionPolicy SolrDeletionPolicy.onCommit: commits: num=1
   [junit4]   2> 	commit{dir=MockDirectoryWrapper(NRTCachingDirectory(RAMDirectory@1cb73f55 lockFactory=org.apache.lucene.store.SingleInstanceLockFactory@429ef42d; maxCacheMB=0.3095703125 maxMergeSizeMB=0.875)),segFN=segments_1,generation=1}
   [junit4]   2> 1686783 INFO  (coreLoadExecutor-4009-thread-1) [    x:collection1] o.a.s.c.SolrDeletionPolicy newest commit generation = 1
   [junit4]   2> 1686791 INFO  (coreLoadExecutor-4009-thread-1) [    x:collection1] o.a.s.c.SolrCore no updateRequestProcessorChain defined as default, creating implicit default
   [junit4]   2> 1686794 INFO  (OldIndexDirectoryCleanupThreadForCore-collection1) [    x:collection1] o.a.s.c.SolrCore Looking for old index directories to cleanup for core collection1 in /x1/jenkins/jenkins-slave/workspace/Lucene-Solr-NightlyTests-5.5/solr/build/solr-core/test/J2/temp/solr.handler.TestReplicationHandler_B0A0DB0EFD174CC8-001/solr-instance-001/./collection1/data/
   [junit4]   2> 1686795 INFO  (coreLoadExecutor-4009-thread-1) [    x:collection1] o.a.s.h.l.XMLLoader xsltCacheLifetimeSeconds=60
   [junit4]   2> 1686796 INFO  (coreLoadExecutor-4009-thread-1) [    x:collection1] o.a.s.h.l.XMLLoader xsltCacheLifetimeSeconds=60
   [junit4]   2> 1686798 INFO  (coreLoadExecutor-4009-thread-1) [    x:collection1] o.a.s.h.l.XMLLoader xsltCacheLifetimeSeconds=60
   [junit4]   2> 1686799 INFO  (coreLoadExecutor-4009-thread-1) [    x:collection1] o.a.s.h.l.XMLLoader xsltCacheLifetimeSeconds=60
   [junit4]   2> 1686801 INFO  (coreLoadExecutor-4009-thread-1) [    x:collection1] o.a.s.c.PluginBag requestHandler : 'lazy' created with startup=lazy 
   [junit4]   2> 1686801 INFO  (coreLoadExecutor-4009-thread-1) [    x:collection1] o.a.s.c.RequestHandlers Registered paths: /admin/system,/admin/plugins,/update/json/docs,/admin/properties,/admin/threads,/admin/mbeans,/config,lazy,/update/json,defaults,/update,/get,/replication,standard,/admin/file,/admin/ping,/admin/segments,/schema,/admin/logging,/admin/luke,/update/csv
   [junit4]   2> 1686803 INFO  (coreLoadExecutor-4009-thread-1) [    x:collection1] o.a.s.c.SolrCore Using default statsCache cache: org.apache.solr.search.stats.LocalStatsCache
   [junit4]   2> 1686814 INFO  (coreLoadExecutor-4009-thread-1) [    x:collection1] o.a.s.u.CommitTracker Hard AutoCommit: disabled
   [junit4]   2> 1686814 INFO  (coreLoadExecutor-4009-thread-1) [    x:collection1] o.a.s.u.CommitTracker Soft AutoCommit: disabled
   [junit4]   2> 1686814 INFO  (coreLoadExecutor-4009-thread-1) [    x:collection1] o.a.s.u.RandomMergePolicy RandomMergePolicy wrapping class org.apache.lucene.index.TieredMergePolicy: [TieredMergePolicy: maxMergeAtOnce=18, maxMergeAtOnceExplicit=29, maxMergedSegmentMB=12.5380859375, floorSegmentMB=0.8994140625, forceMergeDeletesPctAllowed=15.018109783544224, segmentsPerTier=40.0, maxCFSSegmentSizeMB=8.796093022207999E12, noCFSRatio=0.3012127962735466
   [junit4]   2> 1686815 INFO  (coreLoadExecutor-4009-thread-1) [    x:collection1] o.a.s.c.SolrDeletionPolicy SolrDeletionPolicy.onInit: commits: num=1
   [junit4]   2> 	commit{dir=MockDirectoryWrapper(NRTCachingDirectory(RAMDirectory@1cb73f55 lockFactory=org.apache.lucene.store.SingleInstanceLockFactory@429ef42d; maxCacheMB=0.3095703125 maxMergeSizeMB=0.875)),segFN=segments_1,generation=1}
   [junit4]   2> 1686815 INFO  (coreLoadExecutor-4009-thread-1) [    x:collection1] o.a.s.c.SolrDeletionPolicy newest commit generation = 1
   [junit4]   2> 1686815 INFO  (coreLoadExecutor-4009-thread-1) [    x:collection1] o.a.s.s.SolrIndexSearcher Opening Searcher@d32f188[collection1] main
   [junit4]   2> 1686815 INFO  (coreLoadExecutor-4009-thread-1) [    x:collection1] o.a.s.r.ManagedResourceStorage File-based storage initialized to use dir: /x1/jenkins/jenkins-slave/workspace/Lucene-Solr-NightlyTests-5.5/solr/build/solr-core/test/J2/temp/solr.handler.TestReplicationHandler_B0A0DB0EFD174CC8-001/solr-instance-001/collection1/conf
   [junit4]   2> 1686815 INFO  (coreLoadExecutor-4009-thread-1) [    x:collection1] o.a.s.r.RestManager Initializing RestManager with initArgs: {storageDir=/x1/jenkins/jenkins-slave/workspace/Lucene-Solr-NightlyTests-5.5/solr/build/solr-core/test/J2/temp/solr.handler.TestReplicationHandler_B0A0DB0EFD174CC8-001/solr-instance-001/collection1/conf}
   [junit4]   2> 1686815 INFO  (coreLoadExecutor-4009-thread-1) [    x:collection1] o.a.s.r.ManagedResourceStorage Reading _rest_managed.json using file:dir=/x1/jenkins/jenkins-slave/workspace/Lucene-Solr-NightlyTests-5.5/solr/build/solr-core/test/J2/temp/solr.handler.TestReplicationHandler_B0A0DB0EFD174CC8-001/solr-instance-001/collection1/conf
   [junit4]   2> 1686816 INFO  (coreLoadExecutor-4009-thread-1) [    x:collection1] o.a.s.r.RestManager Initializing 0 registered ManagedResources
   [junit4]   2> 1686816 INFO  (coreLoadExecutor-4009-thread-1) [    x:collection1] o.a.s.h.ReplicationHandler Replication enabled for following config files: schema.xml,xslt/dummy.xsl
   [junit4]   2> 1686816 INFO  (coreLoadExecutor-4009-thread-1) [    x:collection1] o.a.s.h.ReplicationHandler Commits will be reserved for  10000
   [junit4]   2> 1686816 INFO  (searcherExecutor-4010-thread-1-processing-x:collection1) [    x:collection1] o.a.s.c.SolrCore [collection1] Registered new searcher Searcher@d32f188[collection1] main{ExitableDirectoryReader(UninvertingDirectoryReader())}
   [junit4]   2> 1686816 INFO  (coreLoadExecutor-4009-thread-1) [    x:collection1] o.a.s.c.CoreContainer registering core: collection1
   [junit4]   2> 1687138 INFO  (TEST-TestReplicationHandler.doTestStressReplication-seed#[B0A0DB0EFD174CC8]) [    ] o.a.s.SolrTestCaseJ4 Writing core.properties file to /x1/jenkins/jenkins-slave/workspace/Lucene-Solr-NightlyTests-5.5/solr/build/solr-core/test/J2/temp/solr.handler.TestReplicationHandler_B0A0DB0EFD174CC8-001/solr-instance-002/collection1
   [junit4]   2> 1687146 INFO  (TEST-TestReplicationHandler.doTestStressReplication-seed#[B0A0DB0EFD174CC8]) [    ] o.e.j.s.Server jetty-9.2.13.v20150730
   [junit4]   2> 1687254 INFO  (TEST-TestReplicationHandler.doTestStressReplication-seed#[B0A0DB0EFD174CC8]) [    ] o.e.j.s.h.ContextHandler Started o.e.j.s.ServletContextHandler@496fddd2{/solr,null,AVAILABLE}
   [junit4]   2> 1687254 INFO  (TEST-TestReplicationHandler.doTestStressReplication-seed#[B0A0DB0EFD174CC8]) [    ] o.e.j.s.ServerConnector Started ServerConnector@4f4c2ba8{HTTP/1.1}{127.0.0.1:48148}
   [junit4]   2> 1687255 INFO  (TEST-TestReplicationHandler.doTestStressReplication-seed#[B0A0DB0EFD174CC8]) [    ] o.e.j.s.Server Started @1690011ms
   [junit4]   2> 1687255 INFO  (TEST-TestReplicationHandler.doTestStressReplication-seed#[B0A0DB0EFD174CC8]) [    ] o.a.s.c.s.e.JettySolrRunner Jetty properties: {solr.data.dir=/x1/jenkins/jenkins-slave/workspace/Lucene-Solr-NightlyTests-5.5/solr/build/solr-core/test/J2/temp/solr.handler.TestReplicationHandler_B0A0DB0EFD174CC8-001/solr-instance-002/collection1/data, hostContext=/solr, hostPort=48148}
   [junit4]   2> 1687255 INFO  (TEST-TestReplicationHandler.doTestStressReplication-seed#[B0A0DB0EFD174CC8]) [    ] o.a.s.s.SolrDispatchFilter SolrDispatchFilter.init(): sun.misc.Launcher$AppClassLoader@3827de24
   [junit4]   2> 1687255 INFO  (TEST-TestReplicationHandler.doTestStressReplication-seed#[B0A0DB0EFD174CC8]) [    ] o.a.s.c.SolrResourceLoader new SolrResourceLoader for directory: '/x1/jenkins/jenkins-slave/workspace/Lucene-Solr-NightlyTests-5.5/solr/build/solr-core/test/J2/temp/solr.handler.TestReplicationHandler_B0A0DB0EFD174CC8-001/solr-instance-002'
   [junit4]   2> 1687255 INFO  (TEST-TestReplicationHandler.doTestStressReplication-seed#[B0A0DB0EFD174CC8]) [    ] o.a.s.c.SolrResourceLoader JNDI not configured for solr (NoInitialContextEx)
   [junit4]   2> 1687255 INFO  (TEST-TestReplicationHandler.doTestStressReplication-seed#[B0A0DB0EFD174CC8]) [    ] o.a.s.c.SolrResourceLoader solr home defaulted to 'solr/' (could not find system property or JNDI)
   [junit4]   2> 1687256 INFO  (TEST-TestReplicationHandler.doTestStressReplication-seed#[B0A0DB0EFD174CC8]) [    ] o.a.s.c.SolrXmlConfig Loading container configuration from /x1/jenkins/jenkins-slave/workspace/Lucene-Solr-NightlyTests-5.5/solr/build/solr-core/test/J2/temp/solr.handler.TestReplicationHandler_B0A0DB0EFD174CC8-001/solr-instance-002/solr.xml
   [junit4]   2> 1687271 INFO  (TEST-TestReplicationHandler.doTestStressReplication-seed#[B0A0DB0EFD174CC8]) [    ] o.a.s.c.CorePropertiesLocator Config-defined core root directory: /x1/jenkins/jenkins-slave/workspace/Lucene-Solr-NightlyTests-5.5/solr/build/solr-core/test/J2/temp/solr.handler.TestReplicationHandler_B0A0DB0EFD174CC8-001/solr-instance-002/.
   [junit4]   2> 1687271 INFO  (TEST-TestReplicationHandler.doTestStressReplication-seed#[B0A0DB0EFD174CC8]) [    ] o.a.s.c.CoreContainer New CoreContainer 943002666
   [junit4]   2> 1687271 INFO  (TEST-TestReplicationHandler.doTestStressReplication-seed#[B0A0DB0EFD174CC8]) [    ] o.a.s.c.CoreContainer Loading cores into CoreContainer [instanceDir=/x1/jenkins/jenkins-slave/workspace/Lucene-Solr-NightlyTests-5.5/solr/build/solr-core/test/J2/temp/solr.handler.TestReplicationHandler_B0A0DB0EFD174CC8-001/solr-instance-002]
   [junit4]   2> 1687271 WARN  (TEST-TestReplicationHandler.doTestStressReplication-seed#[B0A0DB0EFD174CC8]) [    ] o.a.s.c.CoreContainer Couldn't add files from /x1/jenkins/jenkins-slave/workspace/Lucene-Solr-NightlyTests-5.5/solr/build/solr-core/test/J2/temp/solr.handler.TestReplicationHandler_B0A0DB0EFD174CC8-001/solr-instance-002/lib to classpath: /x1/jenkins/jenkins-slave/workspace/Lucene-Solr-NightlyTests-5.5/solr/build/solr-core/test/J2/temp/solr.handler.TestReplicationHandler_B0A0DB0EFD174CC8-001/solr-instance-002/lib
   [junit4]   2> 1687282 INFO  (TEST-TestReplicationHandler.doTestStressReplication-seed#[B0A0DB0EFD174CC8]) [    ] o.a.s.h.c.HttpShardHandlerFactory created with socketTimeout : 90000,urlScheme : ,connTimeout : 15000,maxConnectionsPerHost : 20,maxConnections : 10000,corePoolSize : 0,maximumPoolSize : 2147483647,maxThreadIdleTime : 5,sizeOfQueue : -1,fairnessPolicy : false,useRetries : false,
   [junit4]   2> 1687283 INFO  (TEST-TestReplicationHandler.doTestStressReplication-seed#[B0A0DB0EFD174CC8]) [    ] o.a.s.u.UpdateShardHandler Creating UpdateShardHandler HTTP client with params: socketTimeout=340000&connTimeout=45000&retry=true
   [junit4]   2> 1687284 INFO  (TEST-TestReplicationHandler.doTestStressReplication-seed#[B0A0DB0EFD174CC8]) [    ] o.a.s.l.LogWatcher SLF4J impl is org.slf4j.impl.Log4jLoggerFactory
   [junit4]   2> 1687284 INFO  (TEST-TestReplicationHandler.doTestStressReplication-seed#[B0A0DB0EFD174CC8]) [    ] o.a.s.l.LogWatcher Registering Log Listener [Log4j (org.slf4j.impl.Log4jLoggerFactory)]
   [junit4]   2> 1687284 INFO  (TEST-TestReplicationHandler.doTestStressReplication-seed#[B0A0DB0EFD174CC8]) [    ] o.a.s.c.CoreContainer Security conf doesn't exist. Skipping setup for authorization module.
   [junit4]   2> 1687284 INFO  (TEST-TestReplicationHandler.doTestStressReplication-seed#[B0A0DB0EFD174CC8]) [    ] o.a.s.c.CoreContainer No authentication plugin used.
   [junit4]   2> 1687285 INFO  (TEST-TestReplicationHandler.doTestStressReplication-seed#[B0A0DB0EFD174CC8]) [    ] o.a.s.c.CorePropertiesLocator Looking for core definitions underneath /x1/jenkins/jenkins-slave/workspace/Lucene-Solr-NightlyTests-5.5/solr/build/solr-core/test/J2/temp/solr.handler.TestReplicationHandler_B0A0DB0EFD174CC8-001/solr-instance-002/.
   [junit4]   2> 1687290 INFO  (TEST-TestReplicationHandler.doTestStressReplication-seed#[B0A0DB0EFD174CC8]) [    ] o.a.s.c.CoreDescriptor Created CoreDescriptor: {loadOnStartup=true, configSetProperties=configsetprops.json, transient=false, schema=schema.xml, dataDir=data/, name=collection1, config=solrconfig.xml}
   [junit4]   2> 1687290 INFO  (TEST-TestReplicationHandler.doTestStressReplication-seed#[B0A0DB0EFD174CC8]) [    ] o.a.s.c.CorePropertiesLocator Found core collection1 in /x1/jenkins/jenkins-slave/workspace/Lucene-Solr-NightlyTests-5.5/solr/build/solr-core/test/J2/temp/solr.handler.TestReplicationHandler_B0A0DB0EFD174CC8-001/solr-instance-002/./collection1
   [junit4]   2> 1687290 INFO  (TEST-TestReplicationHandler.doTestStressReplication-seed#[B0A0DB0EFD174CC8]) [    ] o.a.s.c.CorePropertiesLocator Found 1 core definitions
   [junit4]   2> 1687302 INFO  (coreLoadExecutor-4019-thread-1) [    ] o.a.s.c.SolrResourceLoader new SolrResourceLoader for directory: '/x1/jenkins/jenkins-slave/workspace/Lucene-Solr-NightlyTests-5.5/solr/build/solr-core/test/J2/temp/solr.handler.TestReplicationHandler_B0A0DB0EFD174CC8-001/solr-instance-002/collection1'
   [junit4]   2> 1687337 INFO  (coreLoadExecutor-4019-thread-1) [    ] o.a.s.c.SolrResourceLoader JNDI not configured for solr (NoInitialContextEx)
   [junit4]   2> 1687337 INFO  (coreLoadExecutor-4019-thread-1) [    ] o.a.s.c.SolrResourceLoader solr home defaulted to 'solr/' (could not find system property or JNDI)
   [junit4]   2> 1687330 INFO  (TEST-TestReplicationHandler.doTestStressReplication-seed#[B0A0DB0EFD174CC8]) [    ] o.a.s.s.SolrDispatchFilter user.dir=/x1/jenkins/jenkins-slave/workspace/Lucene-Solr-NightlyTests-5.5/solr/build/solr-core/test/J2
   [junit4]   2> 1687337 INFO  (TEST-TestReplicationHandler.doTestStressReplication-seed#[B0A0DB0EFD174CC8]) [    ] o.a.s.s.SolrDispatchFilter SolrDispatchFilter.init() done
   [junit4]   2> 1687349 INFO  (coreLoadExecutor-4019-thread-1) [    ] o.a.s.c.SolrConfig current version of requestparams : -1
   [junit4]   2> 1687369 INFO  (coreLoadExecutor-4019-thread-1) [    ] o.a.s.c.SolrConfig Using Lucene MatchVersion: 5.5.0
   [junit4]   2> 1687429 INFO  (coreLoadExecutor-4019-thread-1) [    ] o.a.s.c.SolrConfig Loaded SolrConfig: solrconfig.xml
   [junit4]   2> 1687434 INFO  (coreLoadExecutor-4019-thread-1) [    ] o.a.s.s.IndexSchema [collection1] Schema name=test
   [junit4]   2> 1687442 INFO  (coreLoadExecutor-4019-thread-1) [    ] o.a.s.s.IndexSchema unique key field: id
   [junit4]   2> 1687444 INFO  (coreLoadExecutor-4019-thread-1) [    ] o.a.s.c.ConfigSetProperties Did not find ConfigSet properties, assuming default properties: Can't find resource 'configsetprops.json' in classpath or '/x1/jenkins/jenkins-slave/workspace/Lucene-Solr-NightlyTests-5.5/solr/build/solr-core/test/J2/temp/solr.handler.TestReplicationHandler_B0A0DB0EFD174CC8-001/solr-instance-002/collection1'
   [junit4]   2> 1687444 INFO  (coreLoadExecutor-4019-thread-1) [    ] o.a.s.c.CoreContainer Creating SolrCore 'collection1' using configuration from instancedir /x1/jenkins/jenkins-slave/workspace/Lucene-Solr-NightlyTests-5.5/solr/build/solr-core/test/J2/temp/solr.handler.TestReplicationHandler_B0A0DB0EFD174CC8-001/solr-instance-002/./collection1
   [junit4]   2> 1687444 INFO  (coreLoadExecutor-4019-thread-1) [    x:collection1] o.a.s.c.SolrCore org.apache.solr.core.MockDirectoryFactory
   [junit4]   2> 1687444 INFO  (coreLoadExecutor-4019-thread-1) [    x:collection1] o.a.s.c.SolrCore [[collection1] ] Opening new SolrCore at [/x1/jenkins/jenkins-slave/workspace/Lucene-Solr-NightlyTests-5.5/solr/build/solr-core/test/J2/temp/solr.handler.TestReplicationHandler_B0A0DB0EFD174CC8-001/solr-instance-002/collection1], dataDir=[/x1/jenkins/jenkins-slave/workspace/Lucene-Solr-NightlyTests-5.5/solr/build/solr-core/test/J2/temp/solr.handler.TestReplicationHandler_B0A0DB0EFD174CC8-001/solr-instance-002/./collection1/data/]
   [junit4]   2> 1687444 INFO  (coreLoadExecutor-4019-thread-1) [    x:collection1] o.a.s.c.SolrCore JMX monitoring not detected for core: collection1
   [junit4]   2> 1687445 INFO  (coreLoadExecutor-4019-thread-1) [    x:collection1] o.a.s.c.CachingDirectoryFactory return new directory for /x1/jenkins/jenkins-slave/workspace/Lucene-Solr-NightlyTests-5.5/solr/build/solr-core/test/J2/temp/solr.handler.TestReplicationHandler_B0A0DB0EFD174CC8-001/solr-instance-002/./collection1/data
   [junit4]   2> 1687445 INFO  (coreLoadExecutor-4019-thread-1) [    x:collection1] o.a.s.c.SolrCore New index directory detected: old=null new=/x1/jenkins/jenkins-slave/workspace/Lucene-Solr-NightlyTests-5.5/solr/build/solr-core/test/J2/temp/solr.handler.TestReplicationHandler_B0A0DB0EFD174CC8-001/solr-instance-002/./collection1/data/index/
   [junit4]   2> 1687445 WARN  (coreLoadExecutor-4019-thread-1) [    x:collection1] o.a.s.c.SolrCore [collection1] Solr index directory '/x1/jenkins/jenkins-slave/workspace/Lucene-Solr-NightlyTests-5.5/solr/build/solr-core/test/J2/temp/solr.handler.TestReplicationHandler_B0A0DB0EFD174CC8-001/solr-instance-002/./collection1/data/index' doesn't exist. Creating new index...
   [junit4]   2> 1687445 INFO  (coreLoadExecutor-4019-thread-1) [    x:collection1] o.a.s.c.CachingDirectoryFactory return new directory for /x1/jenkins/jenkins-slave/workspace/Lucene-Solr-NightlyTests-5.5/solr/build/solr-core/test/J2/temp/solr.handler.TestReplicationHandler_B0A0DB0EFD174CC8-001/solr-instance-002/./collection1/data/index
   [junit4]   2> 1687445 INFO  (coreLoadExecutor-4019-thread-1) [    x:collection1] o.a.s.u.RandomMergePolicy RandomMergePolicy wrapping class org.apache.lucene.index.MockRandomMergePolicy: org.apache.lucene.index.MockRandomMergePolicy@65dbe7b8
   [junit4]   2> 1687446 INFO  (coreLoadExecutor-4019-thread-1) [    x:collection1] o.a.s.c.SolrDeletionPolicy SolrDeletionPolicy.onCommit: commits: num=1
   [junit4]   2> 	commit{dir=MockDirectoryWrapper(NRTCachingDirectory(RAMDirectory@484a1546 lockFactory=org.apache.lucene.store.SingleInstanceLockFactory@77bacbbd; maxCacheMB=0.3095703125 maxMergeSizeMB=0.875)),segFN=segments_1,generation=1}
   [junit4]   2> 1687446 INFO  (coreLoadExecutor-4019-thread-1) [    x:collection1] o.a.s.c.SolrDeletionPolicy newest commit generation = 1
   [junit4]   2> 1687447 INFO  (OldIndexDirectoryCleanupThreadForCore-collection1) [    x:collection1] o.a.s.c.SolrCore Looking for old index directories to cleanup for core collection1 in /x1/jenkins/jenkins-slave/workspace/Lucene-Solr-NightlyTests-5.5/solr/build/solr-core/test/J2/temp/solr.handler.TestReplicationHandler_B0A0DB0EFD174CC8-001/solr-instance-002/./collection1/data/
   [junit4]   2> 1687448 INFO  (coreLoadExecutor-4019-thread-1) [    x:collection1] o.a.s.c.SolrCore no updateRequestProcessorChain defined as default, creating implicit default
   [junit4]   2> 1687450 INFO  (coreLoadExecutor-4019-thread-1) [    x:collection1] o.a.s.h.l.XMLLoader xsltCacheLifetimeSeconds=60
   [junit4]   2> 1687451 INFO  (coreLoadExecutor-4019-thread-1) [    x:collection1] o.a.s.h.l.XMLLoader xsltCacheLifetimeSeconds=60
   [junit4]   2> 1687452 INFO  (coreLoadExecutor-4019-thread-1) [    x:collection1] o.a.s.h.l.XMLLoader xsltCacheLifetimeSeconds=60
   [junit4]   2> 1687454 INFO  (coreLoadExecutor-4019-thread-1) [    x:collection1] o.a.s.h.l.XMLLoader xsltCacheLifetimeSeconds=60
   [junit4]   2> 1687456 INFO  (coreLoadExecutor-4019-thread-1) [    x:collection1] o.a.s.c.PluginBag requestHandler : 'lazy' created with startup=lazy 
   [junit4]   2> 1687456 INFO  (coreLoadExecutor-4019-thread-1) [    x:collection1] o.a.s.c.RequestHandlers Registered paths: /admin/system,/admin/plugins,/update/json/docs,/admin/properties,/admin/threads,/admin/mbeans,/config,lazy,/update/json,defaults,/update,/get,/replication,standard,/admin/file,/admin/ping,/admin/segments,/schema,/admin/logging,/admin/luke,/update/csv
   [junit4]   2> 1687457 INFO  (coreLoadExecutor-4019-thread-1) [    x:collection1] o.a.s.c.SolrCore Using default statsCache cache: org.apache.solr.search.stats.LocalStatsCache
   [junit4]   2> 1687457 INFO  (coreLoadExecutor-4019-thread-1) [    x:collection1] o.a.s.u.CommitTracker Hard AutoCommit: disabled
   [junit4]   2> 1687457 INFO  (coreLoadExecutor-4019-thread-1) [    x:collection1] o.a.s.u.CommitTracker Soft AutoCommit: disabled
   [junit4]   2> 1687458 INFO  (coreLoadExecutor-4019-thread-1) [    x:collection1] o.a.s.u.RandomMergePolicy RandomMergePolicy wrapping class org.apache.lucene.index.TieredMergePolicy: [TieredMergePolicy: maxMergeAtOnce=18, maxMergeAtOnceExplicit=29, maxMergedSegmentMB=12.5380859375, floorSegmentMB=0.8994140625, forceMergeDeletesPctAllowed=15.018109783544224, segmentsPerTier=40.0, maxCFSSegmentSizeMB=8.796093022207999E12, noCFSRatio=0.3012127962735466
   [junit4]   2> 1687458 INFO  (coreLoadExecutor-4019-thread-1) [    x:collection1] o.a.s.c.SolrDeletionPolicy SolrDeletionPolicy.onInit: commits: num=1
   [junit4]   2> 	commit{dir=MockDirectoryWrapper(NRTCachingDirectory(RAMDirectory@484a1546 lockFactory=org.apache.lucene.store.SingleInstanceLockFactory@77bacbbd; maxCacheMB=0.3095703125 maxMergeSizeMB=0.875)),segFN=segments_1,generation=1}
   [junit4]   2> 1687458 INFO  (coreLoadExecutor-4019-thread-1) [    x:collection1] o.a.s.c.SolrDeletionPolicy newest commit generation = 1
   [junit4]   2> 1687458 INFO  (coreLoadExecutor-4019-thread-1) [    x:collection1] o.a.s.s.SolrIndexSearcher Opening Searcher@3a8391[collection1] main
   [junit4]   2> 1687459 INFO  (coreLoadExecutor-4019-thread-1) [    x:collection1] o.a.s.r.ManagedResourceStorage File-based storage initialized to use dir: /x1/jenkins/jenkins-slave/workspace/Lucene-Solr-NightlyTests-5.5/solr/build/solr-core/test/J2/temp/solr.handler.TestReplicationHandler_B0A0DB0EFD174CC8-001/solr-instance-002/collection1/conf
   [junit4]   2> 1687459 INFO  (coreLoadExecutor-4019-thread-1) [    x:collection1] o.a.s.r.RestManager Initializing RestManager with initArgs: {storageDir=/x1/jenkins/jenkins-slave/workspace/Lucene-Solr-NightlyTests-5.5/solr/build/solr-core/test/J2/temp/solr.handler.TestReplicationHandler_B0A0DB0EFD174CC8-001/solr-instance-002/collection1/conf}
   [junit4]   2> 1687459 INFO  (coreLoadExecutor-4019-thread-1) [    x:collection1] o.a.s.r.ManagedResourceStorage Reading _rest_managed.json using file:dir=/x1/jenkins/jenkins-slave/workspace/Lucene-Solr-NightlyTests-5.5/solr/build/solr-core/test/J2/temp/solr.handler.TestReplicationHandler_B0A0DB0EFD174CC8-001/solr-instance-002/collection1/conf
   [junit4]   2> 1687459 INFO  (coreLoadExecutor-4019-thread-1) [    x:collection1] o.a.s.r.RestManager Initializing 0 registered ManagedResources
   [junit4]   2> 1687462 INFO  (coreLoadExecutor-4019-thread-1) [    x:collection1] o.a.s.h.ReplicationHandler Poll scheduled at an interval of 1000ms
   [junit4]   2> 1687462 INFO  (searcherExecutor-4020-thread-1-processing-x:collection1) [    x:collection1] o.a.s.c.SolrCore [collection1] Registered new searcher Searcher@3a8391[collection1] main{ExitableDirectoryReader(UninvertingDirectoryReader())}
   [junit4]   2> 1687462 INFO  (coreLoadExecutor-4019-thread-1) [    x:collection1] o.a.s.c.CoreContainer registering core: collection1
   [junit4]   2> 1687850 INFO  (TEST-TestReplicationHandler.doTestStressReplication-seed#[B0A0DB0EFD174CC8]) [    ] o.e.j.s.ServerConnector Stopped ServerConnector@4f4c2ba8{HTTP/1.1}{127.0.0.1:0}
   [junit4]   2> 1687850 INFO  (TEST-TestReplicationHandler.doTestStressReplication-seed#[B0A0DB0EFD174CC8]) [    ] o.a.s.c.CoreContainer Shutting down CoreContainer instance=943002666
   [junit4]   2> 1687882 INFO  (coreCloseExecutor-4025-thread-1) [    x:collection1] o.a.s.c.SolrCore [collection1]  CLOSING SolrCore org.apache.solr.core.SolrCore@2bc287e8
   [junit4]   2> 1687882 INFO  (coreCloseExecutor-4025-thread-1) [    x:collection1] o.a.s.u.DirectUpdateHandler2 closing DirectUpdateHandler2{commits=0,autocommits=0,soft autocommits=0,optimizes=0,rollbacks=0,expungeDeletes=0,docsPending=0,adds=0,deletesById=0,deletesByQuery=0,errors=0,cumulative_adds=0,cumulative_deletesById=0,cumulative_deletesByQuery=0,cumulative_errors=0}
   [junit4]   2> 1687883 INFO  (coreCloseExecutor-4025-thread-1) [    x:collection1] o.a.s.u.SolrCoreState Closing SolrCoreState
   [junit4]   2> 1687883 INFO  (coreCloseExecutor-4025-thread-1) [    x:collection1] o.a.s.u.DefaultSolrCoreState SolrCoreState ref count has reached 0 - closing IndexWriter
   [junit4]   2> 1687883 INFO  (coreCloseExecutor-4025-thread-1) [    x:collection1] o.a.s.u.DefaultSolrCoreState closing IndexWriter with IndexWriterCloser
   [junit4]   2> 1687894 INFO  (coreCloseExecutor-4025-thread-1) [    x:collection1] o.a.s.c.SolrCore [collection1] Closing main searcher on request.
   [junit4]   2> 1687894 INFO  (coreCloseExecutor-4025-thread-1) [    x:collection1] o.a.s.c.CachingDirectoryFactory Closing MockDirectoryFactory - 2 directories currently being tracked
   [junit4]   2> 1687894 INFO  (coreCloseExecutor-4025-thread-1) [    x:collection1] o.a.s.c.CachingDirectoryFactory looking to close /x1/jenkins/jenkins-slave/workspace/Lucene-Solr-NightlyTests-5.5/solr/build/solr-core/test/J2/temp/solr.handler.TestReplicationHandler_B0A0DB0EFD174CC8-001/solr-instance-002/./collection1/data [CachedDir<<refCount=0;path=/x1/jenkins/jenkins-slave/workspace/Lucene-Solr-NightlyTests-5.5/solr/build/solr-core/test/J2/temp/solr.handler.TestReplicationHandler_B0A0DB0EFD174CC8-001/solr-instance-002/./collection1/data;done=false>>]
   [junit4]   2> 1687895 INFO  (coreCloseExecutor-4025-thread-1) [    x:collection1] o.a.s.c.CachingDirectoryFactory Closing directory: /x1/jenkins/jenkins-slave/workspace/Lucene-Solr-NightlyTests-5.5/solr/build/solr-core/test/J2/temp/solr.handler.TestReplicationHandler_B0A0DB0EFD174CC8-001/solr-instance-002/./collection1/data
   [junit4]   2> 1687895 INFO  (coreCloseExecutor-4025-thread-1) [    x:collection1] o.a.s.c.CachingDirectoryFactory looking to close /x1/jenkins/jenkins-slave/workspace/Lucene-Solr-NightlyTests-5.5/solr/build/solr-core/test/J2/temp/solr.handler.TestReplicationHandler_B0A0DB0EFD174CC8-001/solr-instance-002/./collection1/data/index [CachedDir<<refCount=0;path=/x1/jenkins/jenkins-slave/workspace/Lucene-Solr-NightlyTests-5.5/solr/build/solr-core/test/J2/temp/solr.handler.TestReplicationHandler_B0A0DB0EFD174CC8-001/solr-instance-002/./collection1/data/index;done=false>>]
   [junit4]   2> 1687895 INFO  (coreCloseExecutor-4025-thread-1) [    x:collection1] o.a.s.c.CachingDirectoryFactory Closing directory: /x1/jenkins/jenkins-slave/workspace/Lucene-Solr-NightlyTests-5.5/solr/build/solr-core/test/J2/temp/solr.handler.TestReplicationHandler_B0A0DB0EFD174CC8-001/solr-instance-002/./collection1/data/index
   [junit4]   2> 1687896 INFO  (TEST-TestReplicationHandler.doTestStressReplication-seed#[B0A0DB0EFD174CC8]) [    ] o.e.j.s.h.ContextHandler Stopped o.e.j.s.ServletContextHandler@496fddd2{/solr,null,UNAVAILABLE}
   [junit4]   2> 1687906 INFO  (TEST-TestReplicationHandler.doTestStressReplication-seed#[B0A0DB0EFD174CC8]) [    ] o.e.j.s.Server jetty-9.2.13.v20150730
   [junit4]   2> 1687970 INFO  (TEST-TestReplicationHandler.doTestStressReplication-seed#[B0A0DB0EFD174CC8]) [    ] o.e.j.s.h.ContextHandler Started o.e.j.s.ServletContextHandler@4d0d3439{/solr,null,AVAILABLE}
   [junit4]   2> 1687971 INFO  (TEST-TestReplicationHandler.doTestStressReplication-seed#[B0A0DB0EFD174CC8]) [    ] o.e.j.s.ServerConnector Started ServerConnector@490bafbe{HTTP/1.1}{127.0.0.1:39334}
   [junit4]   2> 1687971 INFO  (TEST-TestReplicationHandler.doTestStressReplication-seed#[B0A0DB0EFD174CC8]) [    ] o.e.j.s.Server Started @1690727ms
   [junit4]   2> 1687971 INFO  (TEST-TestReplicationHandler.doTestStressReplication-seed#[B0A0DB0EFD174CC8]) [    ] o.a.s.c.s.e.JettySolrRunner Jetty properties: {hostPort=39334, solr.data.dir=/x1/jenkins/jenkins-slave/workspace/Lucene-Solr-NightlyTests-5.5/solr/build/solr-core/test/J2/temp/solr.handler.TestReplicationHandler_B0A0DB0EFD174CC8-001/solr-instance-002/collection1/data, hostContext=/solr}
   [junit4]   2> 1687971 INFO  (TEST-TestReplicationHandler.doTestStressReplication-seed#[B0A0DB0EFD174CC8]) [    ] o.a.s.s.SolrDispatchFilter SolrDispatchFilter.init(): sun.misc.Launcher$AppClassLoader@3827de24
   [junit4]   2> 1687971 INFO  (TEST-TestReplicationHandler.doTestStressReplication-seed#[B0A0DB0EFD174CC8]) [    ] o.a.s.c.SolrResourceLoader new SolrResourceLoader for directory: '/x1/jenkins/jenkins-slave/workspace/Lucene-Solr-NightlyTests-5.5/solr/build/solr-core/test/J2/temp/solr.handler.TestReplicationHandler_B0A0DB0EFD174CC8-001/solr-instance-002'
   [junit4]   2> 1687971 INFO  (TEST-TestReplicationHandler.doTestStressReplication-seed#[B0A0DB0EFD174CC8]) [    ] o.a.s.c.SolrResourceLoader JNDI not configured for solr (NoInitialContextEx)
   [junit4]   2> 1687971 INFO  (TEST-TestReplicationHandler.doTestStressReplication-seed#[B0A0DB0EFD174CC8]) [    ] o.a.s.c.SolrResourceLoader solr home defaulted to 'solr/' (could not find system property or JNDI)
   [junit4]   2> 1687972 INFO  (TEST-TestReplicationHandler.doTestStressReplication-seed#[B0A0DB0EFD174CC8]) [    ] o.a.s.c.SolrXmlConfig Loading container configuration from /x1/jenkins/jenkins-slave/workspace/Lucene-Solr-NightlyTests-5.5/solr/build/solr-core/test/J2/temp/solr.handler.TestReplicationHandler_B0A0DB0EFD174CC8-001/solr-instance-002/solr.xml
   [junit4]   2> 1687986 INFO  (TEST-TestReplicationHandler.doTestStressReplication-seed#[B0A0DB0EFD174CC8]) [    ] o.a.s.c.CorePropertiesLocator Config-defined core root directory: /x1/jenkins/jenkins-slave/workspace/Lucene-Solr-NightlyTests-5.5/solr/build/solr-core/test/J2/temp/solr.handler.TestReplicationHandler_B0A0DB0EFD174CC8-001/solr-instance-002/.
   [junit4]   2> 1687986 INFO  (TEST-TestReplicationHandler.doTestStressReplication-seed#[B0A0DB0EFD174CC8]) [    ] o.a.s.c.CoreContainer New CoreContainer 91767429
   [junit4]   2> 1687986 INFO  (TEST-TestReplicationHandler.doTestStressReplication-seed#[B0A0DB0EFD174CC8]) [    ] o.a.s.c.CoreContainer Loading cores into CoreContainer [instanceDir=/x1/jenkins/jenkins-slave/workspace/Lucene-Solr-NightlyTests-5.5/solr/build/solr-core/test/J2/temp/solr.handler.TestReplicationHandler_B0A0DB0EFD174CC8-001/solr-instance-002]
   [junit4]   2> 1687986 WARN  (TEST-TestReplicationHandler.doTestStressReplication-seed#[B0A0DB0EFD174CC8]) [    ] o.a.s.c.CoreContainer Couldn't add files from /x1/jenkins/jenkins-slave/workspace/Lucene-Solr-NightlyTests-5.5/solr/build/solr-core/test/J2/temp/solr.handler.TestReplicationHandler_B0A0DB0EFD174CC8-001/solr-instance-002/lib to classpath: /x1/jenkins/jenkins-slave/workspace/Lucene-Solr-NightlyTests-5.5/solr/build/solr-core/test/J2/temp/solr.handler.TestReplicationHandler_B0A0DB0EFD174CC8-001/solr-instance-002/lib
   [junit4]   2> 1687987 INFO  (TEST-TestReplicationHandler.doTestStressReplication-seed#[B0A0DB0EFD174CC8]) [    ] o.a.s.h.c.HttpShardHandlerFactory created with socketTimeout : 90000,urlScheme : ,connTimeout : 15000,maxConnectionsPerHost : 20,maxConnections : 10000,corePoolSize : 0,maximumPoolSize : 2147483647,maxThreadIdleTime : 5,sizeOfQueue : -1,fairnessPolicy : false,useRetries : false,
   [junit4]   2> 1687988 INFO  (TEST-TestReplicationHandler.doTestStressReplication-seed#[B0A0DB0EFD174CC8]) [    ] o.a.s.u.UpdateShardHandler Creating UpdateShardHandler HTTP client with params: socketTimeout=340000&connTimeout=45000&retry=true
   [junit4]   2> 1687988 INFO  (TEST-TestReplicationHandler.doTestStressReplication-seed#[B0A0DB0EFD174CC8]) [    ] o.a.s.l.LogWatcher SLF4J impl is org.slf4j.impl.Log4jLoggerFactory
   [junit4]   2> 1687988 INFO  (TEST-TestReplicationHandler.doTestStressReplication-seed#[B0A0DB0EFD174CC8]) [    ] o.a.s.l.LogWatcher Registering Log Listener [Log4j (org.slf4j.impl.Log4jLoggerFactory)]
   [junit4]   2> 1687988 INFO  (TEST-TestReplicationHandler.doTestStressReplication-seed#[B0A0DB0EFD174CC8]) [    ] o.a.s.c.CoreContainer Security conf doesn't exist. Skipping setup for authorization module.
   [junit4]   2> 1687988 INFO  (TEST-TestReplicationHandler.doTestStressReplication-seed#[B0A0DB0EFD174CC8]) [    ] o.a.s.c.CoreContainer No authentication plugin used.
   [junit4]   2> 1687989 INFO  (TEST-TestReplicationHandler.doTestStressReplication-seed#[B0A0DB0EFD174CC8]) [    ] o.a.s.c.CorePropertiesLocator Looking for core definitions underneath /x1/jenkins/jenkins-slave/workspace/Lucene-Solr-NightlyTests-5.5/solr/build/solr-core/test/J2/temp/solr.handler.TestReplicationHandler_B0A0DB0EFD174CC8-001/solr-instance-002/.
   [junit4]   2> 1687990 INFO  (TEST-TestReplicationHandler.doTestStressReplication-seed#[B0A0DB0EFD174CC8]) [    ] o.a.s.c.CoreDescriptor Created CoreDescriptor: {name=collection1, configSetProperties=configsetprops.json, schema=schema.xml, loadOnStartup=true, config=solrconfig.xml, transient=false, dataDir=data/}
   [junit4]   2> 1687990 INFO  (TEST-TestReplicationHandler.doTestStressReplication-seed#[B0A0DB0EFD174CC8]) [    ] o.a.s.c.CorePropertiesLocator Found core collection1 in /x1/jenkins/jenkins-slave/workspace/Lucene-Solr-NightlyTests-5.5/solr/build/solr-core/test/J2/temp/solr.handler.TestReplicationHandler_B0A0DB0EFD174CC8-001/solr-instance-002/./collection1
   [junit4]   2> 1687990 INFO  (TEST-TestReplicationHandler.doTestStressReplication-seed#[B0A0DB0EFD174CC8]) [    ] o.a.s.c.CorePropertiesLocator Found 1 core definitions
   [junit4]   2> 1687991 INFO  (coreLoadExecutor-4031-thread-1) [    ] o.a.s.c.SolrResourceLoader new SolrResourceLoader for directory: '/x1/jenkins/jenkins-slave/workspace/Lucene-Solr-NightlyTests-5.5/solr/build/solr-core/test/J2/temp/solr.handler.TestReplicationHandler_B0A0DB0EFD174CC8-001/solr-instance-002/collection1'
   [junit4]   2> 1687991 INFO  (TEST-TestReplicationHandler.doTestStressReplication-seed#[B0A0DB0EFD174CC8]) [    ] o.a.s.s.SolrDispatchFilter user.dir=/x1/jenkins/jenkins-slave/workspace/Lucene-Solr-NightlyTests-5.5/solr/build/solr-core/test/J2
   [junit4]   2> 1687998 INFO  (TEST-TestReplicationHandler.doTestStressReplication-seed#[B0A0DB0EFD174CC8]) [    ] o.a.s.s.SolrDispatchFilter SolrDispatchFilter.init() done
   [junit4]   2> 1687998 INFO  (coreLoadExecutor-4031-thread-1) [    ] o.a.s.c.SolrResourceLoader JNDI not configured for solr (NoInitialContextEx)
   [junit4]   2> 1687998 INFO  (coreLoadExecutor-4031-thread-1) [    ] o.a.s.c.SolrResourceLoader solr home defaulted to 'solr/' (could not find system property or JNDI)
   [junit4]   2> 1688007 INFO  (coreLoadExecutor-4031-thread-1) [    ] o.a.s.c.SolrConfig current version of requestparams : -1
   [junit4]   2> 1688020 INFO  (coreLoadExecutor-4031-thread-1) [    ] o.a.s.c.SolrConfig Using Lucene MatchVersion: 5.5.0
   [junit4]   2> 1688047 INFO  (coreLoadExecutor-4031-thread-1) [    ] o.a.s.c.SolrConfig Loaded SolrConfig: solrconfig.xml
   [junit4]   2> 1688052 INFO  (coreLoadExecutor-4031-thread-1) [    ] o.a.s.s.IndexSchema [collection1] Schema name=test
   [junit4]   2> 1688060 INFO  (coreLoadExecutor-4031-thread-1) [    ] o.a.s.s.IndexSchema unique key field: id
   [junit4]   2> 1688062 INFO  (coreLoadExecutor-4031-thread-1) [    ] o.a.s.c.ConfigSetProperties Did not find ConfigSet properties, assuming default properties: Can't find resource 'configsetprops.json' in classpath or '/x1/jenkins/jenkins-slave/workspace/Lucene-Solr-NightlyTests-5.5/solr/build/solr-core/test/J2/temp/solr.handler.TestReplicationHandler_B0A0DB0EFD174CC8-001/solr-instance-002/collection1'
   [junit4]   2> 1688062 INFO  (coreLoadExecutor-4031-thread-1) [    ] o.a.s.c.CoreContainer Creating SolrCore 'collection1' using configuration from instancedir /x1/jenkins/jenkins-slave/workspace/Lucene-Solr-NightlyTests-5.5/solr/build/solr-core/test/J2/temp/solr.handler.TestReplicationHandler_B0A0DB0EFD174CC8-001/solr-instance-002/./collection1
   [junit4]   2> 1688062 INFO  (coreLoadExecutor-4031-thread-1) [    x:collection1] o.a.s.c.SolrCore solr.NRTCachingDirectoryFactory
   [junit4]   2> 1688062 INFO  (coreLoadExecutor-4031-thread-1) [    x:collection1] o.a.s.c.SolrCore [[collection1] ] Opening new SolrCore at [/x1/jenkins/jenkins-slave/workspace/Lucene-Solr-NightlyTests-5.5/solr/build/solr-core/test/J2/temp/solr.handler.TestReplicationHandler_B0A0DB0EFD174CC8-001/solr-instance-002/collection1], dataDir=[/x1/jenkins/jenkins-slave/workspace/Lucene-Solr-NightlyTests-5.5/solr/build/solr-core/test/J2/temp/solr.handler.TestReplicationHandler_B0A0DB0EFD174CC8-001/solr-instance-002/./collection1/data/]
   [junit4]   2> 1688062 INFO  (coreLoadExecutor-4031-thread-1) [    x:collection1] o.a.s.c.SolrCore JMX monitoring not detected for core: collection1
   [junit4]   2> 1688063 INFO  (coreLoadExecutor-4031-thread-1) [    x:collection1] o.a.s.c.CachingDirectoryFactory return new directory for /x1/jenkins/jenkins-slave/workspace/Lucene-Solr-NightlyTests-5.5/solr/build/solr-core/test/J2/temp/solr.handler.TestReplicationHandler_B0A0DB0EFD174CC8-001/solr-instance-002/collection1/data
   [junit4]   2> 1688063 INFO  (coreLoadExecutor-4031-thread-1) [    x:collection1] o.a.s.c.SolrCore New index directory detected: old=null new=/x1/jenkins/jenkins-slave/workspace/Lucene-Solr-NightlyTests-5.5/solr/build/solr-core/test/J2/temp/solr.handler.TestReplicationHandler_B0A0DB0EFD174CC8-001/solr-instance-002/./collection1/data/index/
   [junit4]   2> 1688063 WARN  (coreLoadExecutor-4031-thread-1) [    x:collection1] o.a.s.c.SolrCore [collection1] Solr index directory '/x1/jenkins/jenkins-slave/workspace/Lucene-Solr-NightlyTests-5.5/solr/build/solr-core/test/J2/temp/solr.handler.TestReplicationHandler_B0A0DB0EFD174CC8-001/solr-instance-002/./collection1/data/index' doesn't exist. Creating new index...
   [junit4]   2> 1688064 INFO  (coreLoadExecutor-4031-thread-1) [    x:collection1] o.a.s.c.CachingDirectoryFactory return new directory for /x1/jenkins/jenkins-slave/workspace/Lucene-Solr-NightlyTests-5.5/solr/build/solr-core/test/J2/temp/solr.handler.TestReplicationHandler_B0A0DB0EFD174CC8-001/solr-instance-002/collection1/data/index
   [junit4]   2> 1688064 INFO  (coreLoadExecutor-4031-thread-1) [    x:collection1] o.a.s.u.RandomMergePolicy RandomMergePolicy wrapping class org.apache.lucene.index.LogDocMergePolicy: [LogDocMergePolicy: minMergeSize=1000, mergeFactor=14, maxMergeSize=9223372036854775807, maxMergeSizeForForcedMerge=9223372036854775807, calibrateSizeByDeletes=true, maxMergeDocs=2147483647, maxCFSSegmentSizeMB=8.796093022207999E12, noCFSRatio=0.7497311033045947]
   [junit4]   2> 1688079 INFO  (coreLoadExecutor-4031-thread-1) [    x:collection1] o.a.s.c.SolrDeletionPolicy SolrDeletionPolicy.onCommit: commits: num=1
   [junit4]   2> 	commit{dir=NRTCachingDirectory(MMapDirectory@/x1/jenkins/jenkins-slave/workspace/Lucene-Solr-NightlyTests-5.5/solr/build/solr-core/test/J2/temp/solr.handler.TestReplicationHandler_B0A0DB0EFD174CC8-001/solr-instance-002/collection1/data/index lockFactory=org.apache.lucene.store.SingleInstanceLockFactory@7c065ded; maxCacheMB=48.0 maxMergeSizeMB=4.0),segFN=segments_1,generation=1}
   [junit4]   2> 1688079 INFO  (coreLoadExecutor-4031-thread-1) [    x:collection1] o.a.s.c.SolrDeletionPolicy newest commit generation = 1
   [junit4]   2> 1688095 INFO  (coreLoadExecutor-4031-thread-1) [    x:collection1] o.a.s.c.SolrCore no updateRequestProcessorChain defined as default, creating implicit default
   [junit4]   2> 1688099 INFO  (coreLoadExecutor-4031-thread-1) [    x:collection1] o.a.s.h.l.XMLLoader xsltCacheLifetimeSeconds=60
   [junit4]   2> 1688100 INFO  (coreLoadExecutor-4031-thread-1) [    x:collection1] o.a.s.h.l.XMLLoader xsltCacheLifetimeSeconds=60
   [junit4]   2> 1688101 INFO  (coreLoadExecutor-4031-thread-1) [    x:collection1] o.a.s.h.l.XMLLoader xsltCacheLifetimeSeconds=60
   [junit4]   2> 1688102 INFO  (coreLoadExecutor-4031-thread-1) [    x:collection1] o.a.s.h.l.XMLLoader xsltCacheLifetimeSeconds=60
   [junit4]   2> 1688104 INFO  (coreLoadExecutor-4031-thread-1) [    x:collection1] o.a.s.c.PluginBag requestHandler : 'lazy' created with startup=lazy 
   [junit4]   2> 1688104 INFO  (coreLoadExecutor-4031-thread-1) [    x:collection1] o.a.s.c.RequestHandlers Registered paths: /admin/system,/admin/plugins,/update/json/docs,/admin/properties,/admin/threads,/admin/mbeans,/config,lazy,/update/json,defaults,/update,/get,/replication,standard,/admin/file,/admin/ping,/admin/segments,/schema,/admin/logging,/admin/luke,/update/csv
   [junit4]   2> 1688105 INFO  (coreLoadExecutor-4031-thread-1) [    x:collection1] o.a.s.c.SolrCore Using default statsCache cache: org.apache.solr.search.stats.LocalStatsCache
   [junit4]   2> 1688114 INFO  (OldIndexDirectoryCleanupThreadForCore-collection1) [    x:collection1] o.a.s.c.SolrCore Looking for old index directories to cleanup for core collection1 in /x1/jenkins/jenkins-slave/workspace/Lucene-Solr-NightlyTests-5.5/solr/build/solr-core/test/J2/temp/solr.handler.TestReplicationHandler_B0A0DB0EFD174CC8-001/solr-instance-002/./collection1/data/
   [junit4]   2> 1688124 INFO  (coreLoadExecutor-4031-thread-1) [    x:collection1] o.a.s.u.CommitTracker Hard AutoCommit: disabled
   [junit4]   2> 1688124 INFO  (coreLoadExecutor-4031-thread-1) [    x:collection1] o.a.s.u.CommitTracker Soft AutoCommit: disabled
   [junit4]   2> 1688124 INFO  (coreLoadExecutor-4031-thread-1) [    x:collection1] o.a.s.u.RandomMergePolicy RandomMergePolicy wrapping class org.apache.lucene.index.TieredMergePolicy: [TieredMergePolicy: maxMergeAtOnce=14, maxMergeAtOnceExplicit=50, maxMergedSegmentMB=46.703125, floorSegmentMB=1.89453125, forceMergeDeletesPctAllowed=3.7616427728369253, segmentsPerTier=2.0, maxCFSSegmentSizeMB=8.796093022207999E12, noCFSRatio=0.8200250382754288
   [junit4]   2> 1688125 INFO  (coreLoadExecutor-4031-thread-1) [    x:collection1] o.a.s.c.SolrDeletionPolicy SolrDeletionPolicy.onInit: commits: num=1
   [junit4]   2> 	commit{dir=NRTCachingDirectory(MMapDirectory@/x1/jenkins/jenkins-slave/workspace/Lucene-Solr-NightlyTests-5.5/solr/build/solr-core/test/J2/temp/solr.handler.TestReplicationHandler_B0A0DB0EFD174CC8-001/solr-instance-002/collection1/data/index lockFactory=org.apache.lucene.store.SingleInstanceLockFactory@7c065ded; maxCacheMB=48.0 maxMergeSizeMB=4.0),segFN=segments_1,generation=1}
   [junit4]   2> 1688125 INFO  (coreLoadExecutor-4031-thread-1) [    x:collection1] o.a.s.c.SolrDeletionPolicy newest commit generation = 1
   [junit4]   2> 1688125 INFO  (coreLoadExecutor-4031-thread-1) [    x:collection1] o.a.s.s.SolrIndexSearcher Opening Searcher@277e224[collection1] main
   [junit4]   2> 1688126 INFO  (coreLoadExecutor-4031-thread-1) [    x:collection1] o.a.s.r.ManagedResourceStorage File-based storage initialized to use dir: /x1/jenkins/jenkins-slave/workspace/Lucene-Solr-NightlyTests-5.5/solr/build/solr-core/test/J2/temp/solr.handler.TestReplicationHandler_B0A0DB0EFD174CC8-001/solr-instance-002/collection1/conf
   [junit4]   2> 1688126 INFO  (coreLoadExecutor-4031-thread-1) [    x:collection1] o.a.s.r.RestManager Initializing RestManager with initArgs: {storageDir=/x1/jenkins/jenkins-slave/workspace/Lucene-Solr-NightlyTests-5.5/solr/build/solr-core/test/J2/temp/solr.handler.TestReplicationHandler_B0A0DB0EFD174CC8-001/solr-instance-002/collection1/conf}
   [junit4]   2> 1688126 INFO  (coreLoadExecutor-4031-thread-1) [    x:collection1] o.a.s.r.ManagedResourceStorage Reading _rest_managed.json using file:dir=/x1/jenkins/jenkins-slave/workspace/Lucene-Solr-NightlyTests-5.5/solr/build/solr-core/test/J2/temp/solr.handler.TestReplicationHandler_B0A0DB0EFD174CC8-001/solr-instance-002/collection1/conf
   [junit4]   2> 1688126 INFO  (coreLoadExecutor-4031-thread-1) [    x:collection1] o.a.s.r.RestManager Initializing 0 registered ManagedResources
   [junit4]   2> 1688126 INFO  (coreLoadExecutor-4031-thread-1) [    x:collection1] o.a.s.h.ReplicationHandler Commits will be reserved for  10000
   [junit4]   2> 1688126 INFO  (searcherExecutor-4032-thread-1-processing-x:collection1) [    x:collection1] o.a.s.c.SolrCore [collection1] Registered new searcher Searcher@277e224[collection1] main{ExitableDirectoryReader(UninvertingDirectoryReader())}
   [junit4]   2> 1688126 INFO  (coreLoadExecutor-4031-thread-1) [    x:collection1] o.a.s.c.CoreContainer registering core: collection1
   [junit4]   2> 1688501 INFO  (TEST-TestReplicationHandler.doTestStressReplication-seed#[B0A0DB0EFD174CC8]) [    ] o.e.j.s.ServerConnector Stopped ServerConnector@2073b7e3{HTTP/1.1}{127.0.0.1:0}
   [junit4]   2> 1688501 INFO  (TEST-TestReplicationHandler.doTestStressReplication-seed#[B0A0DB0EFD174CC8]) [    ] o.a.s.c.CoreContainer Shutting down CoreContainer instance=1812678688
   [junit4]   2> 1688515 INFO  (coreCloseExecutor-4036-thread-1) [    x:collection1] o.a.s.c.SolrCore [collection1]  CLOSING SolrCore org.apache.solr.core.SolrCore@611aa678
   [junit4]   2> 1688516 INFO  (coreCloseExecutor-4036-thread-1) [    x:collection1] o.a.s.u.DirectUpdateHandler2 closing DirectUpdateHandler2{commits=0,autocommits=0,soft autocommits=0,optimizes=0,rollbacks=0,expungeDeletes=0,docsPending=0,adds=0,deletesById=0,deletesByQuery=0,errors=0,cumulative_adds=0,cumulative_deletesById=0,cumulative_deletesByQuery=0,cumulative_errors=0}
   [junit4]   2> 1688518 INFO  (coreCloseExecutor-4036-thread-1) [    x:collection1] o.a.s.u.SolrCoreState Closing SolrCoreState
   [junit4]   2> 1688518 INFO  (coreCloseExecutor-4036-thread-1) [    x:collection1] o.a.s.u.DefaultSolrCoreState SolrCoreState ref count has reached 0 - closing IndexWriter
   [junit4]   2> 1688518 INFO  (coreCloseExecutor-4036-thread-1) [    x:collection1] o.a.s.u.DefaultSolrCoreState closing IndexWriter with IndexWriterCloser
   [junit4]   2> 1688520 INFO  (coreCloseExecutor-4036-thread-1) [    x:collection1] o.a.s.c.SolrCore [collection1] Closing main searcher on request.
   [junit4]   2> 1688520 INFO  (coreCloseExecutor-4036-thread-1) [    x:collection1] o.a.s.c.CachingDirectoryFactory Closing MockDirectoryFactory - 2 directories currently being tracked
   [junit4]   2> 1688520 INFO  (coreCloseExecutor-4036-thread-1) [    x:collection1] o.a.s.c.CachingDirectoryFactory looking to close /x1/jenkins/jenkins-slave/workspace/Lucene-Solr-NightlyTests-5.5/solr/build/solr-core/test/J2/temp/solr.handler.TestReplicationHandler_B0A0DB0EFD174CC8-001/solr-instance-001/./collection1/data/index [CachedDir<<refCount=0;path=/x1/jenkins/jenkins-slave/workspace/Lucene-Solr-NightlyTests-5.5/solr/build/solr-core/test/J2/temp/solr.handler.TestReplicationHandler_B0A0DB0EFD174CC8-001/solr-instance-001/./collection1/data/index;done=false>>]
   [junit4]   2> 1688520 INFO  (coreCloseExecutor-4036-thread-1) [    x:collection1] o.a.s.c.CachingDirectoryFactory Closing directory: /x1/jenkins/jenkins-slave/workspace/Lucene-Solr-NightlyTests-5.5/solr/build/solr-core/test/J2/temp/solr.handler.TestReplicationHandler_B0A0DB0EFD174CC8-001/solr-instance-001/./collection1/data/index
   [junit4]   2> 1688525 INFO  (coreCloseExecutor-4036-thread-1) [    x:collection1] o.a.s.c.CachingDirectoryFactory looking to close /x1/jenkins/jenkins-slave/workspace/Lucene-Solr-NightlyTests-5.5/solr/build/solr-core/test/J2/temp/solr.handler.TestReplicationHandler_B0A0DB0EFD174CC8-001/solr-instance-001/./collection1/data [CachedDir<<refCount=0;path=/x1/jenkins/jenkins-slave/workspace/Lucene-Solr-NightlyTests-5.5/solr/build/solr-core/test/J2/temp/solr.handler.TestReplicationHandler_B0A0DB0EFD174CC8-001/solr-instance-001/./collection1/data;done=false>>]
   [junit4]   2> 1688526 INFO  (coreCloseExecutor-4036-thread-1) [    x:collection1] o.a.s.c.CachingDirectoryFactory Closing directory: /x1/jenkins/jenkins-slave/workspace/Lucene-Solr-NightlyTests-5.5/solr/build/solr-core/test/J2/temp/solr.handler.TestReplicationHandler_B0A0DB0EFD174CC8-001/solr-instance-001/./collection1/data
   [junit4]   2> 1688526 INFO  (TEST-TestReplicationHandler.doTestStressReplication-seed#[B0A0DB0EFD174CC8]) [    ] o.e.j.s.h.ContextHandler Stopped o.e.j.s.ServletContextHandler@68401ab{/solr,null,UNAVAILABLE}
   [junit4]   2> 1688528 INFO  (TEST-TestReplicationHandler.doTestStressReplication-seed#[B0A0DB0EFD174CC8]) [    ] o.e.j.s.Server jetty-9.2.13.v20150730
   [junit4]   2> 1688530 INFO  (TEST-TestReplicationHandler.doTestStressReplication-seed#[B0A0DB0EFD174CC8]) [    ] o.e.j.s.h.ContextHandler Started o.e.j.s.ServletContextHandler@d396f22{/solr,null,AVAILABLE}
   [junit4]   2> 1688531 INFO  (TEST-TestReplicationHandler.doTestStressReplication-seed#[B0A0DB0EFD174CC8]) [    ] o.e.j.s.ServerConnector Started ServerConnector@7e68a302{HTTP/1.1}{127.0.0.1:49233}
   [junit4]   2> 1688531 INFO  (TEST-TestReplicationHandler.doTestStressReplication-seed#[B0A0DB0EFD174CC8]) [    ] o.e.j.s.Server Started @1691287ms
   [junit4]   2> 1688531 INFO  (TEST-TestReplicationHandler.doTestStressReplication-seed#[B0A0DB0EFD174CC8]) [    ] o.a.s.c.s.e.JettySolrRunner Jetty properties: {solr.data.dir=/x1/jenkins/jenkins-slave/workspace/Lucene-Solr-NightlyTests-5.5/solr/build/solr-core/test/J2/temp/solr.handler.TestReplicationHandler_B0A0DB0EFD174CC8-001/solr-instance-001/collection1/data, hostContext=/solr, hostPort=49233}
   [junit4]   2> 1688531 INFO  (TEST-TestReplicationHandler.doTestStressReplication-seed#[B0A0DB0EFD174CC8]) [    ] o.a.s.s.SolrDispatchFilter SolrDispatchFilter.init(): sun.misc.Launcher$AppClassLoader@3827de24
   [junit4]   2> 1688531 INFO  (TEST-TestReplicationHandler.doTestStressReplication-seed#[B0A0DB0EFD174CC8]) [    ] o.a.s.c.SolrResourceLoader new SolrResourceLoader for directory: '/x1/jenkins/jenkins-slave/workspace/Lucene-Solr-NightlyTests-5.5/solr/build/solr-core/test/J2/temp/solr.handler.TestReplicationHandler_B0A0DB0EFD174CC8-001/solr-instance-001'
   [junit4]   2> 1688531 INFO  (TEST-TestReplicationHandler.doTestStressReplication-seed#[B0A0DB0EFD174CC8]) [    ] o.a.s.c.SolrResourceLoader JNDI not configured for solr (NoInitialContextEx)
   [junit4]   2> 1688532 INFO  (TEST-TestReplicationHandler.doTestStressReplication-seed#[B0A0DB0EFD174CC8]) [    ] o.a.s.c.SolrResourceLoader solr home defaulted to 'solr/' (could not find system property or JNDI)
   [junit4]   2> 1688532 INFO  (TEST-TestReplicationHandler.doTestStressReplication-seed#[B0A0DB0EFD174CC8]) [    ] o.a.s.c.SolrXmlConfig Loading container configuration from /x1/jenkins/jenkins-slave/workspace/Lucene-Solr-NightlyTests-5.5/solr/build/solr-core/test/J2/temp/solr.handler.TestReplicationHandler_B0A0DB0EFD174CC8-001/solr-instance-001/solr.xml
   [junit4]   2> 1688549 INFO  (TEST-TestReplicationHandler.doTestStressReplication-seed#[B0A0DB0EFD174CC8]) [    ] o.a.s.c.CorePropertiesLocator Config-defined core root directory: /x1/jenkins/jenkins-slave/workspace/Lucene-Solr-NightlyTests-5.5/solr/build/solr-core/test/J2/temp/solr.handler.TestReplicationHandler_B0A0DB0EFD174CC8-001/solr-instance-001/.
   [junit4]   2> 1688549 INFO  (TEST-TestReplicationHandler.doTestStressReplication-seed#[B0A0DB0EFD174CC8]) [    ] o.a.s.c.CoreContainer New CoreContainer 1903417965
   [junit4]   2> 1688550 INFO  (TEST-TestReplicationHandler.doTestStressReplication-seed#[B0A0DB0EFD174CC8]) [    ] o.a.s.c.CoreContainer Loading cores into CoreContainer [instanceDir=/x1/jenkins/jenkins-slave/workspace/Lucene-Solr-NightlyTests-5.5/solr/build/solr-core/test/J2/temp/solr.handler.TestReplicationHandler_B0A0DB0EFD174CC8-001/solr-instance-001]
   [junit4]   2> 1688550 WARN  (TEST-TestReplicationHandler.doTestStressReplication-seed#[B0A0DB0EFD174CC8]) [    ] o.a.s.c.CoreContainer Couldn't add files from /x1/jenkins/jenkins-slave/workspace/Lucene-Solr-NightlyTests-5.5/solr/build/solr-core/test/J2/temp/solr.handler.TestReplicationHandler_B0A0DB0EFD174CC8-001/solr-instance-001/lib to classpath: /x1/jenkins/jenkins-slave/workspace/Lucene-Solr-NightlyTests-5.5/solr/build/solr-core/test/J2/temp/solr.handler.TestReplicationHandler_B0A0DB0EFD174CC8-001/solr-instance-001/lib
   [junit4]   2> 1688551 INFO  (TEST-TestReplicationHandler.doTestStressReplication-seed#[B0A0DB0EFD174CC8]) [    ] o.a.s.h.c.HttpShardHandlerFactory created with socketTimeout : 90000,urlScheme : ,connTimeout : 15000,maxConnectionsPerHost : 20,maxConnections : 10000,corePoolSize : 0,maximumPoolSize : 2147483647,maxThreadIdleTime : 5,sizeOfQueue : -1,fairnessPolicy : false,useRetries : false,
   [junit4]   2> 1688551 INFO  (TEST-TestReplicationHandler.doTestStressReplication-seed#[B0A0DB0EFD174CC8]) [    ] o.a.s.u.UpdateShardHandler Creating UpdateShardHandler HTTP client with params: socketTimeout=340000&connTimeout=45000&retry=true
   [junit4]   2> 1688552 INFO  (TEST-TestReplicationHandler.doTestStressReplication-seed#[B0A0DB0EFD174CC8]) [    ] o.a.s.l.LogWatcher SLF4J impl is org.slf4j.impl.Log4jLoggerFactory
   [junit4]   2> 1688552 INFO  (TEST-TestReplicationHandler.doTestStressReplication-seed#[B0A0DB0EFD174CC8]) [    ] o.a.s.l.LogWatcher Registering Log Listener [Log4j (org.slf4j.impl.Log4jLoggerFactory)]
   [junit4]   2> 1688552 INFO  (TEST-TestReplicationHandler.doTestStressReplication-seed#[B0A0DB0EFD174CC8]) [    ] o.a.s.c.CoreContainer Security conf doesn't exist. Skipping setup for authorization module.
   [junit4]   2> 1688552 INFO  (TEST-TestReplicationHandler.doTestStressReplication-seed#[B0A0DB0EFD174CC8]) [    ] o.a.s.c.CoreContainer No authentication plugin used.
   [junit4]   2> 1688553 INFO  (TEST-TestReplicationHandler.doTestStressReplication-seed#[B0A0DB0EFD174CC8]) [    ] o.a.s.c.CorePropertiesLocator Looking for core definitions underneath /x1/jenkins/jenkins-slave/workspace/Lucene-Solr-NightlyTests-5.5/solr/build/solr-core/test/J2/temp/solr.handler.TestReplicationHandler_B0A0DB0EFD174CC8-001/solr-instance-001/.
   [junit4]   2> 1688554 INFO  (TEST-TestReplicationHandler.doTestStressReplication-seed#[B0A0DB0EFD174CC8]) [    ] o.a.s.c.CoreDescriptor Created CoreDescriptor: {transient=false, configSetProperties=configsetprops.json, config=solrconfig.xml, loadOnStartup=true, dataDir=data/, name=collection1, schema=schema.xml}
   [junit4]   2> 1688554 INFO  (TEST-TestReplicationHandler.doTestStressReplication-seed#[B0A0DB0EFD174CC8]) [    ] o.a.s.c.CorePropertiesLocator Found core collection1 in /x1/jenkins/jenkins-slave/workspace/Lucene-Solr-NightlyTests-5.5/solr/build/solr-core/test/J2/temp/solr.handler.TestReplicationHandler_B0A0DB0EFD174CC8-001/solr-instance-001/./collection1
   [junit4]   2> 1688554 INFO  (TEST-TestReplicationHandler.doTestStressReplication-seed#[B0A0DB0EFD174CC8]) [    ] o.a.s.c.CorePropertiesLocator Found 1 core definitions
   [junit4]   2> 1688555 INFO  (coreLoadExecutor-4042-thread-1) [    ] o.a.s.c.SolrResourceLoader new SolrResourceLoader for directory: '/x1/jenkins/jenkins-slave/workspace/Lucene-Solr-NightlyTests-5.5/solr/build/solr-core/test/J2/temp/solr.handler.TestReplicationHandler_B0A0DB0EFD174CC8-001/solr-instance-001/collection1'
   [junit4]   2> 1688556 INFO  (coreLoadExecutor-4042-thread-1) [    ] o.a.s.c.SolrResourceLoader JNDI not configured for solr (NoInitialContextEx)
   [junit4]   2> 1688556 INFO  (TEST-TestReplicationHandler.doTestStressReplication-seed#[B0A0DB0EFD174CC8]) [    ] o.a.s.s.SolrDispatchFilter user.dir=/x1/jenkins/jenkins-slave/workspace/Lucene-Solr-NightlyTests-5.5/solr/build/solr-core/test/J2
   [junit4]   2> 1688556 INFO  (coreLoadExecutor-4042-thread-1) [    ] o.a.s.c.SolrResourceLoader solr home defaulted to 'solr/' (could not find system property or JNDI)
   [junit4]   2> 1688556 INFO  (TEST-TestReplicationHandler.doTestStressReplication-seed#[B0A0DB0EFD174CC8]) [    ] o.a.s.s.SolrDispatchFilter SolrDispatchFilter.init() done
   [junit4]   2> 1688564 INFO  (coreLoadExecutor-4042-thread-1) [    ] o.a.s.c.SolrConfig current version of requestparams : -1
   [junit4]   2> 1688578 INFO  (coreLoadExecutor-4042-thread-1) [    ] o.a.s.c.SolrConfig Using Lucene MatchVersion: 5.5.0
   [junit4]   2> 1688607 INFO  (coreLoadExecutor-4042-thread-1) [    ] o.a.s.c.SolrConfig Loaded SolrConfig: solrconfig.xml
   [junit4]   2> 1688612 INFO  (coreLoadExecutor-4042-thread-1) [    ] o.a.s.s.IndexSchema [collection1] Schema name=test
   [junit4]   2> 1688620 INFO  (coreLoadExecutor-4042-thread-1) [    ] o.a.s.s.IndexSchema unique key field: id
   [junit4]   2> 1688621 INFO  (coreLoadExecutor-4042-thread-1) [    ] o.a.s.c.ConfigSetProperties Did not find ConfigSet properties, assuming default properties: Can't find resource 'configsetprops.json' in classpath or '/x1/jenkins/jenkins-slave/workspace/Lucene-Solr-NightlyTests-5.5/solr/build/solr-core/test/J2/temp/solr.handler.TestReplicationHandler_B0A0DB0EFD174CC8-001/solr-instance-001/collection1'
   [junit4]   2> 1688622 INFO  (coreLoadExecutor-4042-thread-1) [    ] o.a.s.c.CoreContainer Creating SolrCore 'collection1' using configuration from instancedir /x1/jenkins/jenkins-slave/workspace/Lucene-Solr-NightlyTests-5.5/solr/build/solr-core/test/J2/temp/solr.handler.TestReplicationHandler_B0A0DB0EFD174CC8-001/solr-instance-001/./collection1
   [junit4]   2> 1688622 INFO  (coreLoadExecutor-4042-thread-1) [    x:collection1] o.a.s.c.SolrCore solr.NRTCachingDirectoryFactory
   [junit4]   2> 1688622 INFO  (coreLoadExecutor-4042-thread-1) [    x:collection1] o.a.s.c.SolrCore [[collection1] ] Opening new SolrCore at [/x1/jenkins/jenkins-slave/workspace/Lucene-Solr-NightlyTests-5.5/solr/build/solr-core/test/J2/temp/solr.handler.TestReplicationHandler_B0A0DB0EFD174CC8-001/solr-instance-001/collection1], dataDir=[/x1/jenkins/jenkins-slave/workspace/Lucene-Solr-NightlyTests-5.5/solr/build/solr-core/test/J2/temp/solr.handler.TestReplicationHandler_B0A0DB0EFD174CC8-001/solr-instance-001/./collection1/data/]
   [junit4]   2> 1688622 INFO  (coreLoadExecutor-4042-thread-1) [    x:collection1] o.a.s.c.SolrCore JMX monitoring not detected for core: collection1
   [junit4]   2> 1688622 INFO  (coreLoadExecutor-4042-thread-1) [    x:collection1] o.a.s.c.CachingDirectoryFactory return new directory for /x1/jenkins/jenkins-slave/workspace/Lucene-Solr-NightlyTests-5.5/solr/build/solr-core/test/J2/temp/solr.handler.TestReplicationHandler_B0A0DB0EFD174CC8-001/solr-instance-001/collection1/data
   [junit4]   2> 1688623 INFO  (coreLoadExecutor-4042-thread-1) [    x:collection1] o.a.s.c.SolrCore New index directory detected: old=null new=/x1/jenkins/jenkins-slave/workspace/Lucene-Solr-NightlyTests-5.5/solr/build/solr-core/test/J2/temp/solr.handler.TestReplicationHandler_B0A0DB0EFD174CC8-001/solr-instance-001/./collection1/data/index/
   [junit4]   2> 1688623 WARN  (coreLoadExecutor-4042-thread-1) [    x:collection1] o.a.s.c.SolrCore [collection1] Solr index directory '/x1/jenkins/jenkins-slave/workspace/Lucene-Solr-NightlyTests-5.5/solr/build/solr-core/test/J2/temp/solr.handler.TestReplicationHandler_B0A0DB0EFD174CC8-001/solr-instance-001/./collection1/data/index' doesn't exist. Creating new index...
   [junit4]   2> 1688623 INFO  (coreLoadExecutor-4042-thread-1) [    x:collection1] o.a.s.c.CachingDirectoryFactory return new directory for /x1/jenkins/jenkins-slave/workspace/Lucene-Solr-NightlyTests-5.5/solr/build/solr-core/test/J2/temp/solr.handler.TestReplicationHandler_B0A0DB0EFD174CC8-001/solr-instance-001/collection1/data/index
   [junit4]   2> 1688624 INFO  (coreLoadExecutor-4042-thread-1) [    x:collection1] o.a.s.u.RandomMergePolicy RandomMergePolicy wrapping class org.apache.lucene.index.LogDocMergePolicy: [LogDocMergePolicy: minMergeSize=1000, mergeFactor=14, maxMergeSize=9223372036854775807, maxMergeSizeForForcedMerge=9223372036854775807, calibrateSizeByDeletes=true, maxMergeDocs=2147483647, maxCFSSegmentSizeMB=8.796093022207999E12, noCFSRatio=0.7497311033045947]
   [junit4]   2> 1688638 INFO  (coreLoadExecutor-4042-thread-1) [    x:collection1] o.a.s.c.SolrDeletionPolicy SolrDeletionPolicy.onCommit: commits: num=1
   [junit4]   2> 	commit{dir=NRTCachingDirectory(MMapDirectory@/x1/jenkins/jenkins-slave/workspace/Lucene-Solr-NightlyTests-5.5/solr/build/solr-core/test/J2/temp/solr.handler.TestReplicationHandler_B0A0DB0EFD174CC8-001/solr-instance-001/collection1/data/index lockFactory=org.apache.lucene.store.SingleInstanceLockFactory@2da3e924; maxCacheMB=48.0 maxMergeSizeMB=4.0),segFN=segments_1,generation=1}
   [junit4]   2> 1688638 INFO  (coreLoadExecutor-4042-thread-1) [    x:collection1] o.a.s.c.SolrDeletionPolicy newest commit generation = 1
   [junit4]   2> 1688654 INFO  (OldIndexDirectoryCleanupThreadForCore-collection1) [    x:collection1] o.a.s.c.SolrCore Looking for old index directories to cleanup for core collection1 in /x1/jenkins/jenkins-slave/workspace/Lucene-Solr-NightlyTests-5.5/solr/build/solr-core/test/J2/temp/solr.handler.TestReplicationHandler_B0A0DB0EFD174CC8-001/solr-instance-001/./collection1/data/
   [junit4]   2> 1688655 INFO  (coreLoadExecutor-4042-thread-1) [    x:collection1] o.a.s.c.SolrCore no updateRequestProcessorChain defined as default, creating implicit default
   [junit4]   2> 1688657 INFO  (coreLoadExecutor-4042-thread-1) [    x:collection1] o.a.s.h.l.XMLLoader xsltCacheLifetimeSeconds=60
   [junit4]   2> 1688659 INFO  (coreLoadExecutor-4042-thread-1) [    x:collection1] o.a.s.h.l.XMLLoader xsltCacheLifetimeSeconds=60
   [junit4]   2> 1688660 INFO  (coreLoadExecutor-4042-thread-1) [    x:collection1] o.a.s.h.l.XMLLoader xsltCacheLifetimeSeconds=60
   [junit4]   2> 1688661 INFO  (coreLoadExecutor-4042-thread-1) [    x:collection1] o.a.s.h.l.XMLLoader xsltCacheLifetimeSeconds=60
   [junit4]   2> 1688663 INFO  (coreLoadExecutor-4042-thread-1) [    x:collection1] o.a.s.c.PluginBag requestHandler : 'lazy' created with startup=lazy 
   [junit4]   2> 1688663 INFO  (coreLoadExecutor-4042-thread-1) [    x:collection1] o.a.s.c.RequestHandlers Registered paths: /admin/system,/admin/plugins,/update/json/docs,/admin/properties,/admin/threads,/admin/mbeans,/config,lazy,/update/json,defaults,/update,/get,/replication,standard,/admin/file,/admin/ping,/admin/segments,/schema,/admin/logging,/admin/luke,/update/csv
   [junit4]   2> 1688664 INFO  (coreLoadExecutor-4042-thread-1) [    x:collection1] o.a.s.c.SolrCore Using default statsCache cache: org.apache.solr.search.stats.LocalStatsCache
   [junit4]   2> 1688674 INFO  (coreLoadExecutor-4042-thread-1) [    x:collection1] o.a.s.u.CommitTracker Hard AutoCommit: disabled
   [junit4]   2> 1688674 INFO  (coreLoadExecutor-4042-thread-1) [    x:collection1] o.a.s.u.CommitTracker Soft AutoCommit: disabled
   [junit4]   2> 1688674 INFO  (coreLoadExecutor-4042-thread-1) [    x:collection1] o.a.s.u.RandomMergePolicy RandomMergePolicy wrapping class org.apache.lucene.index.TieredMergePolicy: [TieredMergePolicy: maxMergeAtOnce=14, maxMergeAtOnceExplicit=50, maxMergedSegmentMB=46.703125, floorSegmentMB=1.89453125, forceMergeDeletesPctAllowed=3.7616427728369253, segmentsPerTier=2.0, maxCFSSegmentSizeMB=8.796093022207999E12, noCFSRatio=0.8200250382754288
   [junit4]   2> 1688675 INFO  (coreLoadExecutor-4042-thread-1) [    x:collection1] o.a.s.c.SolrDeletionPolicy SolrDeletionPolicy.onInit: commits: num=1
   [junit4]   2> 	commit{dir=NRTCachingDirectory(MMapDirectory@/x1/jenkins/jenkins-slave/workspace/Lucene-Solr-NightlyTests-5.5/solr/build/solr-core/test/J2/temp/solr.handler.TestReplicationHandler_B0A0DB0EFD174CC8-001/solr-instance-001/collection1/data/index lockFactory=org.apache.lucene.store.SingleInstanceLockFactory@2da3e924; maxCacheMB=48.0 maxMergeSizeMB=4.0),segFN=segments_1,generation=1}
   [junit4]   2> 1688675 INFO  (coreLoadExecutor-4042-thread-1) [    x:collection1] o.a.s.c.SolrDeletionPolicy newest commit generation = 1
   [junit4]   2> 1688675 INFO  (coreLoadExecutor-4042-thread-1) [    x:collection1] o.a.s.s.SolrIndexSearcher Opening Searcher@3714a4b2[collection1] main
   [junit4]   2> 1688676 INFO  (coreLoadExecutor-4042-thread-1) [    x:collection1] o.a.s.r.ManagedResourceStorage File-based storage initialized to use dir: /x1/jenkins/jenkins-slave/workspace/Lucene-Solr-NightlyTests-5.5/solr/build/solr-core/test/J2/temp/solr.handler.TestReplicationHandler_B0A0DB0EFD174CC8-001/solr-instance-001/collection1/conf
   [junit4]   2> 1688676 INFO  (coreLoadExecutor-4042-thread-1) [    x:collection1] o.a.s.r.RestManager Initializing RestManager with initArgs: {storageDir=/x1/jenkins/jenkins-slave/workspace/Lucene-Solr-NightlyTests-5.5/solr/build/solr-core/test/J2/temp/solr.handler.TestReplicationHandler_B0A0DB0EFD174CC8-001/solr-instance-001/collection1/conf}
   [junit4]   2> 1688676 INFO  (coreLoadExecutor-4042-thread-1) [    x:collection1] o.a.s.r.ManagedResourceStorage Reading _rest_managed.json using file:dir=/x1/jenkins/jenkins-slave/workspace/Lucene-Solr-NightlyTests-5.5/solr/build/solr-core/test/J2/temp/solr.handler.TestReplicationHandler_B0A0DB0EFD174CC8-001/solr-instance-001/collection1/conf
   [junit4]   2> 1688676 INFO  (coreLoadExecutor-4042-thread-1) [    x:collection1] o.a.s.r.RestManager Initializing 0 registered ManagedResources
   [junit4]   2> 1688676 INFO  (coreLoadExecutor-4042-thread-1) [    x:collection1] o.a.s.h.ReplicationHandler Replication enabled for following config files: schema.xml
   [junit4]   2> 1688676 INFO  (coreLoadExecutor-4042-thread-1) [    x:collection1] o.a.s.h.ReplicationHandler Commits will be reserved for  10000
   [junit4]   2> 1688676 INFO  (searcherExecutor-4043-thread-1-processing-x:collection1) [    x:collection1] o.a.s.c.SolrCore [collection1] Registered new searcher Searcher@3714a4b2[collection1] main{ExitableDirectoryReader(UninvertingDirectoryReader())}
   [junit4]   2> 1688676 INFO  (coreLoadExecutor-4042-thread-1) [    x:collection1] o.a.s.c.CoreContainer registering core: collection1
   [junit4]   2> 1689074 INFO  (qtp2038299005-20112) [    x:collection1] o.a.s.u.DirectUpdateHandler2 [collection1] REMOVING ALL DOCUMENTS FROM INDEX
   [junit4]   2> 1689074 INFO  (qtp2038299005-20112) [    x:collection1] o.a.s.u.p.LogUpdateProcessorFactory [collection1]  webapp=/solr path=/update params={version=2&wt=javabin}{deleteByQuery=*:*} 0 0
   [junit4]   2> 1689076 INFO  (qtp585802593-20092) [    x:collection1] o.a.s.u.DirectUpdateHandler2 [collection1] REMOVING ALL DOCUMENTS FROM INDEX
   [junit4]   2> 1689077 INFO  (qtp585802593-20092) [    x:collection1] o.a.s.u.p.LogUpdateProcessorFactory [collection1]  webapp=/solr path=/update params={version=2&wt=javabin}{deleteByQuery=*:*} 0 0
   [junit4]   2> 1689078 INFO  (qtp585802593-20094) [    x:collection1] o.a.s.u.DirectUpdateHandler2 start commit{,optimize=false,openSearcher=true,waitSearcher=true,expungeDeletes=false,softCommit=false,prepareCommit=false}
   [junit4]   2> 1689083 INFO  (qtp585802593-20094) [    x:collection1] o.a.s.c.SolrDeletionPolicy SolrDeletionPolicy.onCommit: commits: num=2
   [junit4]   2> 	commit{dir=NRTCachingDirectory(MMapDirectory@/x1/jenkins/jenkins-slave/workspace/Lucene-Solr-NightlyTests-5.5/solr/build/solr-core/test/J2/temp/solr.handler.TestReplicationHandler_B0A0DB0EFD174CC8-001/solr-instance-002/collection1/data/index lockFactory=org.apache.lucene.store.SingleInstanceLockFactory@7c065ded; maxCacheMB=48.0 maxMergeSizeMB=4.0),segFN=segments_1,generation=1}
   [junit4]   2> 	commit{dir=NRTCachingDirectory(MMapDirectory@/x1/jenkins/jenkins-slave/workspace/Lucene-Solr-NightlyTests-5.5/solr/build/solr-core/test/J2/temp/solr.handler.TestReplicationHandler_B0A0DB0EFD174CC8-001/solr-instance-002/collection1/data/index lockFactory=org.apache.lucene.store.SingleInstanceLockFactory@7c065ded; maxCacheMB=48.0 maxMergeSizeMB=4.0),segFN=segments_2,generation=2}
   [junit4]   2> 1689083 INFO  (qtp585802593-20094) [    x:collection1] o.a.s.c.SolrDeletionPolicy newest commit generation = 2
   [junit4]   2> 1689084 INFO  (qtp585802593-20094) [    x:collection1] o.a.s.s.SolrIndexSearcher Opening Searcher@7aaa933f[collection1] main
   [junit4]   2> 1689084 INFO  (qtp585802593-20094) [    x:collection1] o.a.s.u.DirectUpdateHandler2 end_commit_flush
   [junit4]   2> 1689085 INFO  (searcherExecutor-4032-thread-1-processing-x:collection1) [    x:collection1] o.a.s.c.SolrCore [collection1] Registered new searcher Searcher@7aaa933f[collection1] main{ExitableDirectoryReader(UninvertingDirectoryReader())}
   [junit4]   2> 1689085 INFO  (qtp585802593-20094) [    x:collection1] o.a.s.u.p.LogUpdateProcessorFactory [collection1]  webapp=/solr path=/update params={softCommit=false&version=2&waitSearcher=true&wt=javabin&commit=true}{commit=} 0 6
   [junit4]   2> 1689088 INFO  (qtp2038299005-20113) [    x:collection1] o.a.s.u.p.LogUpdateProcessorFactory [collection1]  webapp=/solr path=/update params={version=2&wt=javabin}{add=[0]} 0 1
   [junit4]   2> 1689090 INFO  (qtp2038299005-20114) [    x:collection1] o.a.s.u.p.LogUpdateProcessorFactory [collection1]  webapp=/solr path=/update params={version=2&wt=javabin}{add=[1]} 0 0
   [junit4]   2> 1689092 INFO  (qtp2038299005-20115) [    x:collection1] o.a.s.u.p.LogUpdateProcessorFactory [collection1]  webapp=/solr path=/update params={version=2&wt=javabin}{add=[2]} 0 0
   [junit4]   2> 1689094 INFO  (qtp2038299005-20116) [    x:collection1] o.a.s.u.p.LogUpdateProcessorFactory [collection1]  webapp=/solr path=/update params={version=2&wt=javabin}{add=[3]} 0 0
   [junit4]   2> 1689095 INFO  (qtp2038299005-20112) [    x:collection1] o.a.s.u.p.LogUpdateProcessorFactory [collection1]  webapp=/solr path=/update params={version=2&wt=javabin}{add=[4]} 0 0
   [junit4]   2> 1689097 INFO  (qtp2038299005-20113) [    x:collection1] o.a.s.u.p.LogUpdateProcessorFactory [collection1]  webapp=/solr path=/update params={version=2&wt=javabin}{add=[5]} 0 0
   [junit4]   2> 1689099 INFO  (qtp2038299005-20114) [    x:collection1] o.a.s.u.p.LogUpdateProcessorFactory [collection1]  webapp=/solr path=/update params={version=2&wt=javabin}{add=[6]} 0 0
   [junit4]   2> 1689101 INFO  (qtp2038299005-20115) [    x:collection1] o.a.s.u.p.LogUpdateProcessorFactory [collection1]  webapp=/solr path=/update params={version=2&wt=javabin}{add=[7]} 0 0
   [junit4]   2> 1689103 INFO  (qtp2038299005-20116) [    x:collection1] o.a.s.u.p.LogUpdateProcessorFactory [collection1]  webapp=/solr path=/update params={versi

[...truncated too long message...]

tlyTests-5.5/solr/core/test-lib/apacheds-interceptors-authn-2.0.0-M15.jar:/x1/jenkins/jenkins-slave/workspace/Lucene-Solr-NightlyTests-5.5/solr/core/test-lib/apacheds-interceptors-authz-2.0.0-M15.jar:/x1/jenkins/jenkins-slave/workspace/Lucene-Solr-NightlyTests-5.5/solr/core/test-lib/apacheds-interceptors-changelog-2.0.0-M15.jar:/x1/jenkins/jenkins-slave/workspace/Lucene-Solr-NightlyTests-5.5/solr/core/test-lib/apacheds-interceptors-collective-2.0.0-M15.jar:/x1/jenkins/jenkins-slave/workspace/Lucene-Solr-NightlyTests-5.5/solr/core/test-lib/apacheds-interceptors-event-2.0.0-M15.jar:/x1/jenkins/jenkins-slave/workspace/Lucene-Solr-NightlyTests-5.5/solr/core/test-lib/apacheds-interceptors-exception-2.0.0-M15.jar:/x1/jenkins/jenkins-slave/workspace/Lucene-Solr-NightlyTests-5.5/solr/core/test-lib/apacheds-interceptors-journal-2.0.0-M15.jar:/x1/jenkins/jenkins-slave/workspace/Lucene-Solr-NightlyTests-5.5/solr/core/test-lib/apacheds-interceptors-normalization-2.0.0-M15.jar:/x1/jenkins/jenkins-slave/workspace/Lucene-Solr-NightlyTests-5.5/solr/core/test-lib/apacheds-interceptors-operational-2.0.0-M15.jar:/x1/jenkins/jenkins-slave/workspace/Lucene-Solr-NightlyTests-5.5/solr/core/test-lib/apacheds-interceptors-referral-2.0.0-M15.jar:/x1/jenkins/jenkins-slave/workspace/Lucene-Solr-NightlyTests-5.5/solr/core/test-lib/apacheds-interceptors-schema-2.0.0-M15.jar:/x1/jenkins/jenkins-slave/workspace/Lucene-Solr-NightlyTests-5.5/solr/core/test-lib/apacheds-interceptors-subtree-2.0.0-M15.jar:/x1/jenkins/jenkins-slave/workspace/Lucene-Solr-NightlyTests-5.5/solr/core/test-lib/apacheds-interceptors-trigger-2.0.0-M15.jar:/x1/jenkins/jenkins-slave/workspace/Lucene-Solr-NightlyTests-5.5/solr/core/test-lib/apacheds-jdbm-partition-2.0.0-M15.jar:/x1/jenkins/jenkins-slave/workspace/Lucene-Solr-NightlyTests-5.5/solr/core/test-lib/apacheds-jdbm1-2.0.0-M2.jar:/x1/jenkins/jenkins-slave/workspace/Lucene-Solr-NightlyTests-5.5/solr/core/test-lib/apacheds-kerberos-codec-2.0.0-M15.jar:/x1/jenkins/jenkins-slave/workspace/Lucene-Solr-NightlyTests-5.5/solr/core/test-lib/apacheds-ldif-partition-2.0.0-M15.jar:/x1/jenkins/jenkins-slave/workspace/Lucene-Solr-NightlyTests-5.5/solr/core/test-lib/apacheds-mavibot-partition-2.0.0-M15.jar:/x1/jenkins/jenkins-slave/workspace/Lucene-Solr-NightlyTests-5.5/solr/core/test-lib/apacheds-protocol-kerberos-2.0.0-M15.jar:/x1/jenkins/jenkins-slave/workspace/Lucene-Solr-NightlyTests-5.5/solr/core/test-lib/apacheds-protocol-ldap-2.0.0-M15.jar:/x1/jenkins/jenkins-slave/workspace/Lucene-Solr-NightlyTests-5.5/solr/core/test-lib/apacheds-protocol-shared-2.0.0-M15.jar:/x1/jenkins/jenkins-slave/workspace/Lucene-Solr-NightlyTests-5.5/solr/core/test-lib/apacheds-xdbm-partition-2.0.0-M15.jar:/x1/jenkins/jenkins-slave/workspace/Lucene-Solr-NightlyTests-5.5/solr/core/test-lib/api-all-1.0.0-M20.jar:/x1/jenkins/jenkins-slave/workspace/Lucene-Solr-NightlyTests-5.5/solr/core/test-lib/bcprov-jdk15-1.45.jar:/x1/jenkins/jenkins-slave/workspace/Lucene-Solr-NightlyTests-5.5/solr/core/test-lib/cglib-nodep-2.2.jar:/x1/jenkins/jenkins-slave/workspace/Lucene-Solr-NightlyTests-5.5/solr/core/test-lib/commons-collections-3.2.2.jar:/x1/jenkins/jenkins-slave/workspace/Lucene-Solr-NightlyTests-5.5/solr/core/test-lib/commons-math3-3.4.1.jar:/x1/jenkins/jenkins-slave/workspace/Lucene-Solr-NightlyTests-5.5/solr/core/test-lib/easymock-3.0.jar:/x1/jenkins/jenkins-slave/workspace/Lucene-Solr-NightlyTests-5.5/solr/core/test-lib/ehcache-core-2.4.4.jar:/x1/jenkins/jenkins-slave/workspace/Lucene-Solr-NightlyTests-5.5/solr/core/test-lib/hadoop-common-2.6.0-tests.jar:/x1/jenkins/jenkins-slave/workspace/Lucene-Solr-NightlyTests-5.5/solr/core/test-lib/hadoop-hdfs-2.6.0-tests.jar:/x1/jenkins/jenkins-slave/workspace/Lucene-Solr-NightlyTests-5.5/solr/core/test-lib/hadoop-minikdc-2.6.0.jar:/x1/jenkins/jenkins-slave/workspace/Lucene-Solr-NightlyTests-5.5/solr/core/test-lib/jackson-annotations-2.5.4.jar:/x1/jenkins/jenkins-slave/workspace/Lucene-Solr-NightlyTests-5.5/solr/core/test-lib/jackson-databind-2.5.4.jar:/x1/jenkins/jenkins-slave/workspace/Lucene-Solr-NightlyTests-5.5/solr/core/test-lib/jersey-core-1.9.jar:/x1/jenkins/jenkins-slave/workspace/Lucene-Solr-NightlyTests-5.5/solr/core/test-lib/jersey-server-1.9.jar:/x1/jenkins/jenkins-slave/workspace/Lucene-Solr-NightlyTests-5.5/solr/core/test-lib/jetty-6.1.26.jar:/x1/jenkins/jenkins-slave/workspace/Lucene-Solr-NightlyTests-5.5/solr/core/test-lib/jetty-util-6.1.26.jar:/x1/jenkins/jenkins-slave/workspace/Lucene-Solr-NightlyTests-5.5/solr/core/test-lib/mina-core-2.0.0-M5.jar:/x1/jenkins/jenkins-slave/workspace/Lucene-Solr-NightlyTests-5.5/solr/core/test-lib/objenesis-1.2.jar:/x1/jenkins/jenkins-slave/workspace/Lucene-Solr-NightlyTests-5.5/lucene/build/analysis/icu/lucene-analyzers-icu-5.5.0-SNAPSHOT.jar:/x1/jenkins/jenkins-slave/workspace/Lucene-Solr-NightlyTests-5.5/solr/build/contrib/solr-analysis-extras/classes/java:/x1/jenkins/jenkins-slave/workspace/Lucene-Solr-NightlyTests-5.5/lucene/build/queryparser/classes/test:/x1/jenkins/jenkins-slave/workspace/Lucene-Solr-NightlyTests-5.5/solr/contrib/analysis-extras/lib/icu4j-54.1.jar:/home/jenkins/jenkins-slave/tools/hudson.tasks.Ant_AntInstallation/ant-1.8.2/lib/ant-launcher.jar:/x1/jenkins/.ant/lib/ivy-2.3.0.jar:/home/jenkins/jenkins-slave/tools/hudson.tasks.Ant_AntInstallation/ant-1.8.2/lib/ant-antlr.jar:/home/jenkins/jenkins-slave/tools/hudson.tasks.Ant_AntInstallation/ant-1.8.2/lib/ant-apache-regexp.jar:/home/jenkins/jenkins-slave/tools/hudson.tasks.Ant_AntInstallation/ant-1.8.2/lib/ant-apache-resolver.jar:/home/jenkins/jenkins-slave/tools/hudson.tasks.Ant_AntInstallation/ant-1.8.2/lib/ant-commons-net.jar:/home/jenkins/jenkins-slave/tools/hudson.tasks.Ant_AntInstallation/ant-1.8.2/lib/ant-jmf.jar:/home/jenkins/jenkins-slave/tools/hudson.tasks.Ant_AntInstallation/ant-1.8.2/lib/ant-apache-oro.jar:/home/jenkins/jenkins-slave/tools/hudson.tasks.Ant_AntInstallation/ant-1.8.2/lib/ant-apache-xalan2.jar:/home/jenkins/jenkins-slave/tools/hudson.tasks.Ant_AntInstallation/ant-1.8.2/lib/ant-commons-logging.jar:/home/jenkins/jenkins-slave/tools/hudson.tasks.Ant_AntInstallation/ant-1.8.2/lib/ant-jsch.jar:/home/jenkins/jenkins-slave/tools/hudson.tasks.Ant_AntInstallation/ant-1.8.2/lib/ant-junit4.jar:/home/jenkins/jenkins-slave/tools/hudson.tasks.Ant_AntInstallation/ant-1.8.2/lib/ant-javamail.jar:/home/jenkins/jenkins-slave/tools/hudson.tasks.Ant_AntInstallation/ant-1.8.2/lib/ant-jai.jar:/home/jenkins/jenkins-slave/tools/hudson.tasks.Ant_AntInstallation/ant-1.8.2/lib/ant-jdepend.jar:/home/jenkins/jenkins-slave/tools/hudson.tasks.Ant_AntInstallation/ant-1.8.2/lib/ant-junit.jar:/home/jenkins/jenkins-slave/tools/hudson.tasks.Ant_AntInstallation/ant-1.8.2/lib/ant-apache-bsf.jar:/home/jenkins/jenkins-slave/tools/hudson.tasks.Ant_AntInstallation/ant-1.8.2/lib/ant-swing.jar:/home/jenkins/jenkins-slave/tools/hudson.tasks.Ant_AntInstallation/ant-1.8.2/lib/ant.jar:/home/jenkins/jenkins-slave/tools/hudson.tasks.Ant_AntInstallation/ant-1.8.2/lib/ant-netrexx.jar:/home/jenkins/jenkins-slave/tools/hudson.tasks.Ant_AntInstallation/ant-1.8.2/lib/ant-apache-bcel.jar:/home/jenkins/jenkins-slave/tools/hudson.tasks.Ant_AntInstallation/ant-1.8.2/lib/ant-testutil.jar:/home/jenkins/jenkins-slave/tools/hudson.tasks.Ant_AntInstallation/ant-1.8.2/lib/ant-apache-log4j.jar:/x1/jenkins/jenkins-slave/tools/hudson.model.JDK/latest1.7/lib/tools.jar:/x1/jenkins/.ivy2/cache/com.carrotsearch.randomizedtesting/junit4-ant/jars/junit4-ant-2.3.2.jar com.carrotsearch.ant.tasks.junit4.slave.SlaveMainSafe -eventsfile /x1/jenkins/jenkins-slave/workspace/Lucene-Solr-NightlyTests-5.5/solr/build/solr-core/test/temp/junit4-J1-20160215_023359_779.events @/x1/jenkins/jenkins-slave/workspace/Lucene-Solr-NightlyTests-5.5/solr/build/solr-core/test/temp/junit4-J1-20160215_023359_779.suites -stdin
   [junit4] ERROR: JVM J1 ended with an exception: Quit event not received from the forked process? This may indicate JVM crash or runner bugs.
   [junit4] 	at com.carrotsearch.ant.tasks.junit4.JUnit4.executeSlave(JUnit4.java:1501)
   [junit4] 	at com.carrotsearch.ant.tasks.junit4.JUnit4.access$000(JUnit4.java:121)
   [junit4] 	at com.carrotsearch.ant.tasks.junit4.JUnit4$2.call(JUnit4.java:955)
   [junit4] 	at com.carrotsearch.ant.tasks.junit4.JUnit4$2.call(JUnit4.java:952)
   [junit4] 	at java.util.concurrent.FutureTask.run(FutureTask.java:262)
   [junit4] 	at java.util.concurrent.ThreadPoolExecutor.runWorker(ThreadPoolExecutor.java:1145)
   [junit4] 	at java.util.concurrent.ThreadPoolExecutor$Worker.run(ThreadPoolExecutor.java:615)
   [junit4] 	at java.lang.Thread.run(Thread.java:745)

BUILD FAILED
/x1/jenkins/jenkins-slave/workspace/Lucene-Solr-NightlyTests-5.5/build.xml:757: The following error occurred while executing this line:
/x1/jenkins/jenkins-slave/workspace/Lucene-Solr-NightlyTests-5.5/build.xml:694: The following error occurred while executing this line:
/x1/jenkins/jenkins-slave/workspace/Lucene-Solr-NightlyTests-5.5/build.xml:59: The following error occurred while executing this line:
/x1/jenkins/jenkins-slave/workspace/Lucene-Solr-NightlyTests-5.5/solr/build.xml:233: The following error occurred while executing this line:
/x1/jenkins/jenkins-slave/workspace/Lucene-Solr-NightlyTests-5.5/solr/common-build.xml:534: The following error occurred while executing this line:
/x1/jenkins/jenkins-slave/workspace/Lucene-Solr-NightlyTests-5.5/lucene/common-build.xml:1477: The following error occurred while executing this line:
/x1/jenkins/jenkins-slave/workspace/Lucene-Solr-NightlyTests-5.5/lucene/common-build.xml:1033: At least one slave process threw an exception, first: Quit event not received from the forked process? This may indicate JVM crash or runner bugs.

Total time: 261 minutes 43 seconds
Build step 'Invoke Ant' marked build as failure
Archiving artifacts
No prior successful build to compare, so performing full copy of artifacts
Recording test results
Email was triggered for: Failure - Any
Sending email for trigger: Failure - Any



Mime
View raw message