lucene-dev mailing list archives

Site index · List index
Message view « Date » · « Thread »
Top « Date » · « Thread »
From Policeman Jenkins Server <jenk...@thetaphi.de>
Subject [JENKINS] Lucene-Solr-5.x-Linux (64bit/jdk1.8.0_72) - Build # 15424 - Failure!
Date Mon, 01 Feb 2016 07:58:49 GMT
Build: http://jenkins.thetaphi.de/job/Lucene-Solr-5.x-Linux/15424/
Java: 64bit/jdk1.8.0_72 -XX:+UseCompressedOops -XX:+UseParallelGC

1 tests failed.
FAILED:  org.apache.solr.cloud.CustomCollectionTest.test

Error Message:
Error from server at http://127.0.0.1:59702/k_g/ht/implicitcoll0: non ok status: 500, message:Server Error

Stack Trace:
org.apache.solr.client.solrj.impl.HttpSolrClient$RemoteSolrException: Error from server at http://127.0.0.1:59702/k_g/ht/implicitcoll0: non ok status: 500, message:Server Error
	at __randomizedtesting.SeedInfo.seed([27A9A88727022EB5:AFFD975D89FE434D]:0)
	at org.apache.solr.client.solrj.impl.HttpSolrClient.executeMethod(HttpSolrClient.java:511)
	at org.apache.solr.client.solrj.impl.HttpSolrClient.request(HttpSolrClient.java:240)
	at org.apache.solr.client.solrj.impl.HttpSolrClient.request(HttpSolrClient.java:229)
	at org.apache.solr.client.solrj.SolrRequest.process(SolrRequest.java:150)
	at org.apache.solr.client.solrj.SolrClient.query(SolrClient.java:943)
	at org.apache.solr.client.solrj.SolrClient.query(SolrClient.java:958)
	at org.apache.solr.cloud.AbstractFullDistribZkTestBase.waitForNon403or404or503(AbstractFullDistribZkTestBase.java:1753)
	at org.apache.solr.cloud.CustomCollectionTest.testCustomCollectionsAPI(CustomCollectionTest.java:173)
	at org.apache.solr.cloud.CustomCollectionTest.test(CustomCollectionTest.java:100)
	at sun.reflect.NativeMethodAccessorImpl.invoke0(Native Method)
	at sun.reflect.NativeMethodAccessorImpl.invoke(NativeMethodAccessorImpl.java:62)
	at sun.reflect.DelegatingMethodAccessorImpl.invoke(DelegatingMethodAccessorImpl.java:43)
	at java.lang.reflect.Method.invoke(Method.java:498)
	at com.carrotsearch.randomizedtesting.RandomizedRunner.invoke(RandomizedRunner.java:1764)
	at com.carrotsearch.randomizedtesting.RandomizedRunner$8.evaluate(RandomizedRunner.java:871)
	at com.carrotsearch.randomizedtesting.RandomizedRunner$9.evaluate(RandomizedRunner.java:907)
	at com.carrotsearch.randomizedtesting.RandomizedRunner$10.evaluate(RandomizedRunner.java:921)
	at org.apache.solr.BaseDistributedSearchTestCase$ShardsRepeatRule$ShardsFixedStatement.callStatement(BaseDistributedSearchTestCase.java:965)
	at org.apache.solr.BaseDistributedSearchTestCase$ShardsRepeatRule$ShardsStatement.evaluate(BaseDistributedSearchTestCase.java:940)
	at com.carrotsearch.randomizedtesting.rules.SystemPropertiesRestoreRule$1.evaluate(SystemPropertiesRestoreRule.java:57)
	at org.apache.lucene.util.TestRuleSetupTeardownChained$1.evaluate(TestRuleSetupTeardownChained.java:50)
	at org.apache.lucene.util.AbstractBeforeAfterRule$1.evaluate(AbstractBeforeAfterRule.java:46)
	at org.apache.lucene.util.TestRuleThreadAndTestName$1.evaluate(TestRuleThreadAndTestName.java:49)
	at org.apache.lucene.util.TestRuleIgnoreAfterMaxFailures$1.evaluate(TestRuleIgnoreAfterMaxFailures.java:65)
	at org.apache.lucene.util.TestRuleMarkFailure$1.evaluate(TestRuleMarkFailure.java:48)
	at com.carrotsearch.randomizedtesting.rules.StatementAdapter.evaluate(StatementAdapter.java:36)
	at com.carrotsearch.randomizedtesting.ThreadLeakControl$StatementRunner.run(ThreadLeakControl.java:367)
	at com.carrotsearch.randomizedtesting.ThreadLeakControl.forkTimeoutingTask(ThreadLeakControl.java:809)
	at com.carrotsearch.randomizedtesting.ThreadLeakControl$3.evaluate(ThreadLeakControl.java:460)
	at com.carrotsearch.randomizedtesting.RandomizedRunner.runSingleTest(RandomizedRunner.java:880)
	at com.carrotsearch.randomizedtesting.RandomizedRunner$5.evaluate(RandomizedRunner.java:781)
	at com.carrotsearch.randomizedtesting.RandomizedRunner$6.evaluate(RandomizedRunner.java:816)
	at com.carrotsearch.randomizedtesting.RandomizedRunner$7.evaluate(RandomizedRunner.java:827)
	at com.carrotsearch.randomizedtesting.rules.StatementAdapter.evaluate(StatementAdapter.java:36)
	at com.carrotsearch.randomizedtesting.rules.SystemPropertiesRestoreRule$1.evaluate(SystemPropertiesRestoreRule.java:57)
	at org.apache.lucene.util.AbstractBeforeAfterRule$1.evaluate(AbstractBeforeAfterRule.java:46)
	at com.carrotsearch.randomizedtesting.rules.StatementAdapter.evaluate(StatementAdapter.java:36)
	at org.apache.lucene.util.TestRuleStoreClassName$1.evaluate(TestRuleStoreClassName.java:42)
	at com.carrotsearch.randomizedtesting.rules.NoShadowingOrOverridesOnMethodsRule$1.evaluate(NoShadowingOrOverridesOnMethodsRule.java:40)
	at com.carrotsearch.randomizedtesting.rules.NoShadowingOrOverridesOnMethodsRule$1.evaluate(NoShadowingOrOverridesOnMethodsRule.java:40)
	at com.carrotsearch.randomizedtesting.rules.StatementAdapter.evaluate(StatementAdapter.java:36)
	at com.carrotsearch.randomizedtesting.rules.StatementAdapter.evaluate(StatementAdapter.java:36)
	at com.carrotsearch.randomizedtesting.rules.StatementAdapter.evaluate(StatementAdapter.java:36)
	at org.apache.lucene.util.TestRuleAssertionsRequired$1.evaluate(TestRuleAssertionsRequired.java:54)
	at org.apache.lucene.util.TestRuleMarkFailure$1.evaluate(TestRuleMarkFailure.java:48)
	at org.apache.lucene.util.TestRuleIgnoreAfterMaxFailures$1.evaluate(TestRuleIgnoreAfterMaxFailures.java:65)
	at org.apache.lucene.util.TestRuleIgnoreTestSuites$1.evaluate(TestRuleIgnoreTestSuites.java:55)
	at com.carrotsearch.randomizedtesting.rules.StatementAdapter.evaluate(StatementAdapter.java:36)
	at com.carrotsearch.randomizedtesting.ThreadLeakControl$StatementRunner.run(ThreadLeakControl.java:367)
	at java.lang.Thread.run(Thread.java:745)




Build Log:
[...truncated 11873 lines...]
   [junit4] Suite: org.apache.solr.cloud.CustomCollectionTest
   [junit4]   2> Creating dataDir: /home/jenkins/workspace/Lucene-Solr-5.x-Linux/solr/build/solr-core/test/J2/temp/solr.cloud.CustomCollectionTest_27A9A88727022EB5-001/init-core-data-001
   [junit4]   2> 1260663 INFO  (SUITE-CustomCollectionTest-seed#[27A9A88727022EB5]-worker) [    ] o.a.s.BaseDistributedSearchTestCase Setting hostContext system property: /k_g/ht
   [junit4]   2> 1260665 INFO  (TEST-CustomCollectionTest.test-seed#[27A9A88727022EB5]) [    ] o.a.s.c.ZkTestServer STARTING ZK TEST SERVER
   [junit4]   2> 1260666 INFO  (Thread-3840) [    ] o.a.s.c.ZkTestServer client port:0.0.0.0/0.0.0.0:0
   [junit4]   2> 1260666 INFO  (Thread-3840) [    ] o.a.s.c.ZkTestServer Starting server
   [junit4]   2> 1260766 INFO  (TEST-CustomCollectionTest.test-seed#[27A9A88727022EB5]) [    ] o.a.s.c.ZkTestServer start zk server on port:52089
   [junit4]   2> 1260766 INFO  (TEST-CustomCollectionTest.test-seed#[27A9A88727022EB5]) [    ] o.a.s.c.c.SolrZkClient Using default ZkCredentialsProvider
   [junit4]   2> 1260766 INFO  (TEST-CustomCollectionTest.test-seed#[27A9A88727022EB5]) [    ] o.a.s.c.c.ConnectionManager Waiting for client to connect to ZooKeeper
   [junit4]   2> 1260768 INFO  (zkCallback-1342-thread-1) [    ] o.a.s.c.c.ConnectionManager Watcher org.apache.solr.common.cloud.ConnectionManager@32164c6c name:ZooKeeperConnection Watcher:127.0.0.1:52089 got event WatchedEvent state:SyncConnected type:None path:null path:null type:None
   [junit4]   2> 1260768 INFO  (TEST-CustomCollectionTest.test-seed#[27A9A88727022EB5]) [    ] o.a.s.c.c.ConnectionManager Client is connected to ZooKeeper
   [junit4]   2> 1260768 INFO  (TEST-CustomCollectionTest.test-seed#[27A9A88727022EB5]) [    ] o.a.s.c.c.SolrZkClient Using default ZkACLProvider
   [junit4]   2> 1260768 INFO  (TEST-CustomCollectionTest.test-seed#[27A9A88727022EB5]) [    ] o.a.s.c.c.SolrZkClient makePath: /solr
   [junit4]   2> 1260769 INFO  (TEST-CustomCollectionTest.test-seed#[27A9A88727022EB5]) [    ] o.a.s.c.c.SolrZkClient Using default ZkCredentialsProvider
   [junit4]   2> 1260769 INFO  (TEST-CustomCollectionTest.test-seed#[27A9A88727022EB5]) [    ] o.a.s.c.c.ConnectionManager Waiting for client to connect to ZooKeeper
   [junit4]   2> 1260770 INFO  (zkCallback-1343-thread-1) [    ] o.a.s.c.c.ConnectionManager Watcher org.apache.solr.common.cloud.ConnectionManager@6a9699ec name:ZooKeeperConnection Watcher:127.0.0.1:52089/solr got event WatchedEvent state:SyncConnected type:None path:null path:null type:None
   [junit4]   2> 1260770 INFO  (TEST-CustomCollectionTest.test-seed#[27A9A88727022EB5]) [    ] o.a.s.c.c.ConnectionManager Client is connected to ZooKeeper
   [junit4]   2> 1260770 INFO  (TEST-CustomCollectionTest.test-seed#[27A9A88727022EB5]) [    ] o.a.s.c.c.SolrZkClient Using default ZkACLProvider
   [junit4]   2> 1260770 INFO  (TEST-CustomCollectionTest.test-seed#[27A9A88727022EB5]) [    ] o.a.s.c.c.SolrZkClient makePath: /collections/collection1
   [junit4]   2> 1260770 INFO  (TEST-CustomCollectionTest.test-seed#[27A9A88727022EB5]) [    ] o.a.s.c.c.SolrZkClient makePath: /collections/collection1/shards
   [junit4]   2> 1260771 INFO  (TEST-CustomCollectionTest.test-seed#[27A9A88727022EB5]) [    ] o.a.s.c.c.SolrZkClient makePath: /collections/control_collection
   [junit4]   2> 1260771 INFO  (TEST-CustomCollectionTest.test-seed#[27A9A88727022EB5]) [    ] o.a.s.c.c.SolrZkClient makePath: /collections/control_collection/shards
   [junit4]   2> 1260772 INFO  (TEST-CustomCollectionTest.test-seed#[27A9A88727022EB5]) [    ] o.a.s.c.AbstractZkTestCase put /home/jenkins/workspace/Lucene-Solr-5.x-Linux/solr/core/src/test-files/solr/collection1/conf/solrconfig-tlog.xml to /configs/conf1/solrconfig.xml
   [junit4]   2> 1260772 INFO  (TEST-CustomCollectionTest.test-seed#[27A9A88727022EB5]) [    ] o.a.s.c.c.SolrZkClient makePath: /configs/conf1/solrconfig.xml
   [junit4]   2> 1260773 INFO  (TEST-CustomCollectionTest.test-seed#[27A9A88727022EB5]) [    ] o.a.s.c.AbstractZkTestCase put /home/jenkins/workspace/Lucene-Solr-5.x-Linux/solr/core/src/test-files/solr/collection1/conf/schema.xml to /configs/conf1/schema.xml
   [junit4]   2> 1260773 INFO  (TEST-CustomCollectionTest.test-seed#[27A9A88727022EB5]) [    ] o.a.s.c.c.SolrZkClient makePath: /configs/conf1/schema.xml
   [junit4]   2> 1260774 INFO  (TEST-CustomCollectionTest.test-seed#[27A9A88727022EB5]) [    ] o.a.s.c.AbstractZkTestCase put /home/jenkins/workspace/Lucene-Solr-5.x-Linux/solr/core/src/test-files/solr/collection1/conf/solrconfig.snippet.randomindexconfig.xml to /configs/conf1/solrconfig.snippet.randomindexconfig.xml
   [junit4]   2> 1260774 INFO  (TEST-CustomCollectionTest.test-seed#[27A9A88727022EB5]) [    ] o.a.s.c.c.SolrZkClient makePath: /configs/conf1/solrconfig.snippet.randomindexconfig.xml
   [junit4]   2> 1260774 INFO  (TEST-CustomCollectionTest.test-seed#[27A9A88727022EB5]) [    ] o.a.s.c.AbstractZkTestCase put /home/jenkins/workspace/Lucene-Solr-5.x-Linux/solr/core/src/test-files/solr/collection1/conf/stopwords.txt to /configs/conf1/stopwords.txt
   [junit4]   2> 1260774 INFO  (TEST-CustomCollectionTest.test-seed#[27A9A88727022EB5]) [    ] o.a.s.c.c.SolrZkClient makePath: /configs/conf1/stopwords.txt
   [junit4]   2> 1260775 INFO  (TEST-CustomCollectionTest.test-seed#[27A9A88727022EB5]) [    ] o.a.s.c.AbstractZkTestCase put /home/jenkins/workspace/Lucene-Solr-5.x-Linux/solr/core/src/test-files/solr/collection1/conf/protwords.txt to /configs/conf1/protwords.txt
   [junit4]   2> 1260775 INFO  (TEST-CustomCollectionTest.test-seed#[27A9A88727022EB5]) [    ] o.a.s.c.c.SolrZkClient makePath: /configs/conf1/protwords.txt
   [junit4]   2> 1260775 INFO  (TEST-CustomCollectionTest.test-seed#[27A9A88727022EB5]) [    ] o.a.s.c.AbstractZkTestCase put /home/jenkins/workspace/Lucene-Solr-5.x-Linux/solr/core/src/test-files/solr/collection1/conf/currency.xml to /configs/conf1/currency.xml
   [junit4]   2> 1260775 INFO  (TEST-CustomCollectionTest.test-seed#[27A9A88727022EB5]) [    ] o.a.s.c.c.SolrZkClient makePath: /configs/conf1/currency.xml
   [junit4]   2> 1260776 INFO  (TEST-CustomCollectionTest.test-seed#[27A9A88727022EB5]) [    ] o.a.s.c.AbstractZkTestCase put /home/jenkins/workspace/Lucene-Solr-5.x-Linux/solr/core/src/test-files/solr/collection1/conf/enumsConfig.xml to /configs/conf1/enumsConfig.xml
   [junit4]   2> 1260776 INFO  (TEST-CustomCollectionTest.test-seed#[27A9A88727022EB5]) [    ] o.a.s.c.c.SolrZkClient makePath: /configs/conf1/enumsConfig.xml
   [junit4]   2> 1260776 INFO  (TEST-CustomCollectionTest.test-seed#[27A9A88727022EB5]) [    ] o.a.s.c.AbstractZkTestCase put /home/jenkins/workspace/Lucene-Solr-5.x-Linux/solr/core/src/test-files/solr/collection1/conf/open-exchange-rates.json to /configs/conf1/open-exchange-rates.json
   [junit4]   2> 1260776 INFO  (TEST-CustomCollectionTest.test-seed#[27A9A88727022EB5]) [    ] o.a.s.c.c.SolrZkClient makePath: /configs/conf1/open-exchange-rates.json
   [junit4]   2> 1260777 INFO  (TEST-CustomCollectionTest.test-seed#[27A9A88727022EB5]) [    ] o.a.s.c.AbstractZkTestCase put /home/jenkins/workspace/Lucene-Solr-5.x-Linux/solr/core/src/test-files/solr/collection1/conf/mapping-ISOLatin1Accent.txt to /configs/conf1/mapping-ISOLatin1Accent.txt
   [junit4]   2> 1260777 INFO  (TEST-CustomCollectionTest.test-seed#[27A9A88727022EB5]) [    ] o.a.s.c.c.SolrZkClient makePath: /configs/conf1/mapping-ISOLatin1Accent.txt
   [junit4]   2> 1260778 INFO  (TEST-CustomCollectionTest.test-seed#[27A9A88727022EB5]) [    ] o.a.s.c.AbstractZkTestCase put /home/jenkins/workspace/Lucene-Solr-5.x-Linux/solr/core/src/test-files/solr/collection1/conf/old_synonyms.txt to /configs/conf1/old_synonyms.txt
   [junit4]   2> 1260778 INFO  (TEST-CustomCollectionTest.test-seed#[27A9A88727022EB5]) [    ] o.a.s.c.c.SolrZkClient makePath: /configs/conf1/old_synonyms.txt
   [junit4]   2> 1260778 INFO  (TEST-CustomCollectionTest.test-seed#[27A9A88727022EB5]) [    ] o.a.s.c.AbstractZkTestCase put /home/jenkins/workspace/Lucene-Solr-5.x-Linux/solr/core/src/test-files/solr/collection1/conf/synonyms.txt to /configs/conf1/synonyms.txt
   [junit4]   2> 1260778 INFO  (TEST-CustomCollectionTest.test-seed#[27A9A88727022EB5]) [    ] o.a.s.c.c.SolrZkClient makePath: /configs/conf1/synonyms.txt
   [junit4]   2> 1260826 INFO  (TEST-CustomCollectionTest.test-seed#[27A9A88727022EB5]) [    ] o.a.s.SolrTestCaseJ4 Writing core.properties file to /home/jenkins/workspace/Lucene-Solr-5.x-Linux/solr/build/solr-core/test/J2/temp/solr.cloud.CustomCollectionTest_27A9A88727022EB5-001/control-001/cores/collection1
   [junit4]   2> 1260827 INFO  (TEST-CustomCollectionTest.test-seed#[27A9A88727022EB5]) [    ] o.e.j.s.Server jetty-9.2.13.v20150730
   [junit4]   2> 1260828 INFO  (TEST-CustomCollectionTest.test-seed#[27A9A88727022EB5]) [    ] o.e.j.s.h.ContextHandler Started o.e.j.s.ServletContextHandler@5b2f5d47{/k_g/ht,null,AVAILABLE}
   [junit4]   2> 1260830 INFO  (TEST-CustomCollectionTest.test-seed#[27A9A88727022EB5]) [    ] o.e.j.s.ServerConnector Started ServerConnector@30a92dd7{HTTP/1.1}{127.0.0.1:47555}
   [junit4]   2> 1260830 INFO  (TEST-CustomCollectionTest.test-seed#[27A9A88727022EB5]) [    ] o.e.j.s.Server Started @1262580ms
   [junit4]   2> 1260830 INFO  (TEST-CustomCollectionTest.test-seed#[27A9A88727022EB5]) [    ] o.a.s.c.s.e.JettySolrRunner Jetty properties: {solr.data.dir=/home/jenkins/workspace/Lucene-Solr-5.x-Linux/solr/build/solr-core/test/J2/temp/solr.cloud.CustomCollectionTest_27A9A88727022EB5-001/tempDir-001/control/data, hostContext=/k_g/ht, hostPort=47555, coreRootDirectory=/home/jenkins/workspace/Lucene-Solr-5.x-Linux/solr/build/solr-core/test/J2/temp/solr.cloud.CustomCollectionTest_27A9A88727022EB5-001/control-001/cores}
   [junit4]   2> 1260831 INFO  (TEST-CustomCollectionTest.test-seed#[27A9A88727022EB5]) [    ] o.a.s.s.SolrDispatchFilter SolrDispatchFilter.init(): sun.misc.Launcher$AppClassLoader@73d16e93
   [junit4]   2> 1260831 INFO  (TEST-CustomCollectionTest.test-seed#[27A9A88727022EB5]) [    ] o.a.s.c.SolrResourceLoader new SolrResourceLoader for directory: '/home/jenkins/workspace/Lucene-Solr-5.x-Linux/solr/build/solr-core/test/J2/temp/solr.cloud.CustomCollectionTest_27A9A88727022EB5-001/control-001'
   [junit4]   2> 1260831 INFO  (TEST-CustomCollectionTest.test-seed#[27A9A88727022EB5]) [    ] o.a.s.c.SolrResourceLoader JNDI not configured for solr (NoInitialContextEx)
   [junit4]   2> 1260831 INFO  (TEST-CustomCollectionTest.test-seed#[27A9A88727022EB5]) [    ] o.a.s.c.SolrResourceLoader solr home defaulted to 'solr/' (could not find system property or JNDI)
   [junit4]   2> 1260831 INFO  (TEST-CustomCollectionTest.test-seed#[27A9A88727022EB5]) [    ] o.a.s.c.c.SolrZkClient Using default ZkCredentialsProvider
   [junit4]   2> 1260831 INFO  (TEST-CustomCollectionTest.test-seed#[27A9A88727022EB5]) [    ] o.a.s.c.c.ConnectionManager Waiting for client to connect to ZooKeeper
   [junit4]   2> 1260832 INFO  (zkCallback-1344-thread-1) [    ] o.a.s.c.c.ConnectionManager Watcher org.apache.solr.common.cloud.ConnectionManager@2091e0c5 name:ZooKeeperConnection Watcher:127.0.0.1:52089/solr got event WatchedEvent state:SyncConnected type:None path:null path:null type:None
   [junit4]   2> 1260832 INFO  (TEST-CustomCollectionTest.test-seed#[27A9A88727022EB5]) [    ] o.a.s.c.c.ConnectionManager Client is connected to ZooKeeper
   [junit4]   2> 1260832 INFO  (TEST-CustomCollectionTest.test-seed#[27A9A88727022EB5]) [    ] o.a.s.c.c.SolrZkClient Using default ZkACLProvider
   [junit4]   2> 1260832 INFO  (TEST-CustomCollectionTest.test-seed#[27A9A88727022EB5]) [    ] o.a.s.s.SolrDispatchFilter Loading solr.xml from SolrHome (not found in ZooKeeper)
   [junit4]   2> 1260832 INFO  (TEST-CustomCollectionTest.test-seed#[27A9A88727022EB5]) [    ] o.a.s.c.SolrXmlConfig Loading container configuration from /home/jenkins/workspace/Lucene-Solr-5.x-Linux/solr/build/solr-core/test/J2/temp/solr.cloud.CustomCollectionTest_27A9A88727022EB5-001/control-001/solr.xml
   [junit4]   2> 1260837 INFO  (TEST-CustomCollectionTest.test-seed#[27A9A88727022EB5]) [    ] o.a.s.c.CorePropertiesLocator Config-defined core root directory: /home/jenkins/workspace/Lucene-Solr-5.x-Linux/solr/build/solr-core/test/J2/temp/solr.cloud.CustomCollectionTest_27A9A88727022EB5-001/control-001/cores
   [junit4]   2> 1260837 INFO  (TEST-CustomCollectionTest.test-seed#[27A9A88727022EB5]) [    ] o.a.s.c.CoreContainer New CoreContainer 899743984
   [junit4]   2> 1260837 INFO  (TEST-CustomCollectionTest.test-seed#[27A9A88727022EB5]) [    ] o.a.s.c.CoreContainer Loading cores into CoreContainer [instanceDir=/home/jenkins/workspace/Lucene-Solr-5.x-Linux/solr/build/solr-core/test/J2/temp/solr.cloud.CustomCollectionTest_27A9A88727022EB5-001/control-001]
   [junit4]   2> 1260837 WARN  (TEST-CustomCollectionTest.test-seed#[27A9A88727022EB5]) [    ] o.a.s.c.CoreContainer Couldn't add files from /home/jenkins/workspace/Lucene-Solr-5.x-Linux/solr/build/solr-core/test/J2/temp/solr.cloud.CustomCollectionTest_27A9A88727022EB5-001/control-001/lib to classpath: /home/jenkins/workspace/Lucene-Solr-5.x-Linux/solr/build/solr-core/test/J2/temp/solr.cloud.CustomCollectionTest_27A9A88727022EB5-001/control-001/lib
   [junit4]   2> 1260837 INFO  (TEST-CustomCollectionTest.test-seed#[27A9A88727022EB5]) [    ] o.a.s.h.c.HttpShardHandlerFactory created with socketTimeout : 90000,urlScheme : ,connTimeout : 15000,maxConnectionsPerHost : 20,maxConnections : 10000,corePoolSize : 0,maximumPoolSize : 2147483647,maxThreadIdleTime : 5,sizeOfQueue : -1,fairnessPolicy : false,useRetries : false,
   [junit4]   2> 1260838 INFO  (TEST-CustomCollectionTest.test-seed#[27A9A88727022EB5]) [    ] o.a.s.u.UpdateShardHandler Creating UpdateShardHandler HTTP client with params: socketTimeout=340000&connTimeout=45000&retry=true
   [junit4]   2> 1260839 INFO  (TEST-CustomCollectionTest.test-seed#[27A9A88727022EB5]) [    ] o.a.s.l.LogWatcher SLF4J impl is org.slf4j.impl.Log4jLoggerFactory
   [junit4]   2> 1260839 INFO  (TEST-CustomCollectionTest.test-seed#[27A9A88727022EB5]) [    ] o.a.s.l.LogWatcher Registering Log Listener [Log4j (org.slf4j.impl.Log4jLoggerFactory)]
   [junit4]   2> 1260839 INFO  (TEST-CustomCollectionTest.test-seed#[27A9A88727022EB5]) [    ] o.a.s.c.ZkContainer Zookeeper client=127.0.0.1:52089/solr
   [junit4]   2> 1260839 INFO  (TEST-CustomCollectionTest.test-seed#[27A9A88727022EB5]) [    ] o.a.s.c.ZkController zkHost includes chroot
   [junit4]   2> 1260839 INFO  (TEST-CustomCollectionTest.test-seed#[27A9A88727022EB5]) [    ] o.a.s.c.c.SolrZkClient Using default ZkCredentialsProvider
   [junit4]   2> 1260839 INFO  (TEST-CustomCollectionTest.test-seed#[27A9A88727022EB5]) [    ] o.a.s.c.c.ConnectionManager Waiting for client to connect to ZooKeeper
   [junit4]   2> 1260840 INFO  (zkCallback-1347-thread-1) [    ] o.a.s.c.c.ConnectionManager Watcher org.apache.solr.common.cloud.ConnectionManager@467d2c53 name:ZooKeeperConnection Watcher:127.0.0.1:52089 got event WatchedEvent state:SyncConnected type:None path:null path:null type:None
   [junit4]   2> 1260840 INFO  (TEST-CustomCollectionTest.test-seed#[27A9A88727022EB5]) [    ] o.a.s.c.c.ConnectionManager Client is connected to ZooKeeper
   [junit4]   2> 1260840 INFO  (TEST-CustomCollectionTest.test-seed#[27A9A88727022EB5]) [    ] o.a.s.c.c.SolrZkClient Using default ZkACLProvider
   [junit4]   2> 1260841 INFO  (TEST-CustomCollectionTest.test-seed#[27A9A88727022EB5]) [n:127.0.0.1:47555_k_g%2Fht    ] o.a.s.c.c.ConnectionManager Waiting for client to connect to ZooKeeper
   [junit4]   2> 1260841 INFO  (zkCallback-1348-thread-1-processing-n:127.0.0.1:47555_k_g%2Fht) [n:127.0.0.1:47555_k_g%2Fht    ] o.a.s.c.c.ConnectionManager Watcher org.apache.solr.common.cloud.ConnectionManager@7bebb8e name:ZooKeeperConnection Watcher:127.0.0.1:52089/solr got event WatchedEvent state:SyncConnected type:None path:null path:null type:None
   [junit4]   2> 1260841 INFO  (TEST-CustomCollectionTest.test-seed#[27A9A88727022EB5]) [n:127.0.0.1:47555_k_g%2Fht    ] o.a.s.c.c.ConnectionManager Client is connected to ZooKeeper
   [junit4]   2> 1260842 INFO  (TEST-CustomCollectionTest.test-seed#[27A9A88727022EB5]) [n:127.0.0.1:47555_k_g%2Fht    ] o.a.s.c.c.SolrZkClient makePath: /overseer/queue
   [junit4]   2> 1260843 INFO  (TEST-CustomCollectionTest.test-seed#[27A9A88727022EB5]) [n:127.0.0.1:47555_k_g%2Fht    ] o.a.s.c.c.SolrZkClient makePath: /overseer/collection-queue-work
   [junit4]   2> 1260843 INFO  (TEST-CustomCollectionTest.test-seed#[27A9A88727022EB5]) [n:127.0.0.1:47555_k_g%2Fht    ] o.a.s.c.c.SolrZkClient makePath: /overseer/collection-map-running
   [junit4]   2> 1260844 INFO  (TEST-CustomCollectionTest.test-seed#[27A9A88727022EB5]) [n:127.0.0.1:47555_k_g%2Fht    ] o.a.s.c.c.SolrZkClient makePath: /overseer/collection-map-completed
   [junit4]   2> 1260845 INFO  (TEST-CustomCollectionTest.test-seed#[27A9A88727022EB5]) [n:127.0.0.1:47555_k_g%2Fht    ] o.a.s.c.c.SolrZkClient makePath: /overseer/collection-map-failure
   [junit4]   2> 1260846 INFO  (TEST-CustomCollectionTest.test-seed#[27A9A88727022EB5]) [n:127.0.0.1:47555_k_g%2Fht    ] o.a.s.c.c.SolrZkClient makePath: /live_nodes
   [junit4]   2> 1260846 INFO  (TEST-CustomCollectionTest.test-seed#[27A9A88727022EB5]) [n:127.0.0.1:47555_k_g%2Fht    ] o.a.s.c.c.SolrZkClient makePath: /aliases.json
   [junit4]   2> 1260847 INFO  (TEST-CustomCollectionTest.test-seed#[27A9A88727022EB5]) [n:127.0.0.1:47555_k_g%2Fht    ] o.a.s.c.c.SolrZkClient makePath: /clusterstate.json
   [junit4]   2> 1260847 INFO  (TEST-CustomCollectionTest.test-seed#[27A9A88727022EB5]) [n:127.0.0.1:47555_k_g%2Fht    ] o.a.s.c.c.SolrZkClient makePath: /security.json
   [junit4]   2> 1260848 INFO  (TEST-CustomCollectionTest.test-seed#[27A9A88727022EB5]) [n:127.0.0.1:47555_k_g%2Fht    ] o.a.s.c.ZkController Register node as live in ZooKeeper:/live_nodes/127.0.0.1:47555_k_g%2Fht
   [junit4]   2> 1260848 INFO  (TEST-CustomCollectionTest.test-seed#[27A9A88727022EB5]) [n:127.0.0.1:47555_k_g%2Fht    ] o.a.s.c.c.SolrZkClient makePath: /live_nodes/127.0.0.1:47555_k_g%2Fht
   [junit4]   2> 1260849 INFO  (TEST-CustomCollectionTest.test-seed#[27A9A88727022EB5]) [n:127.0.0.1:47555_k_g%2Fht    ] o.a.s.c.c.SolrZkClient makePath: /overseer_elect
   [junit4]   2> 1260849 INFO  (TEST-CustomCollectionTest.test-seed#[27A9A88727022EB5]) [n:127.0.0.1:47555_k_g%2Fht    ] o.a.s.c.c.SolrZkClient makePath: /overseer_elect/election
   [junit4]   2> 1260849 INFO  (TEST-CustomCollectionTest.test-seed#[27A9A88727022EB5]) [n:127.0.0.1:47555_k_g%2Fht    ] o.a.s.c.Overseer Overseer (id=null) closing
   [junit4]   2> 1260850 INFO  (TEST-CustomCollectionTest.test-seed#[27A9A88727022EB5]) [n:127.0.0.1:47555_k_g%2Fht    ] o.a.s.c.LeaderElector Joined leadership election with path: /overseer_elect/election/95309864579170308-127.0.0.1:47555_k_g%2Fht-n_0000000000
   [junit4]   2> 1260850 INFO  (TEST-CustomCollectionTest.test-seed#[27A9A88727022EB5]) [n:127.0.0.1:47555_k_g%2Fht    ] o.a.s.c.OverseerElectionContext I am going to be the leader 127.0.0.1:47555_k_g%2Fht
   [junit4]   2> 1260850 INFO  (TEST-CustomCollectionTest.test-seed#[27A9A88727022EB5]) [n:127.0.0.1:47555_k_g%2Fht    ] o.a.s.c.c.SolrZkClient makePath: /overseer_elect/leader
   [junit4]   2> 1260850 INFO  (TEST-CustomCollectionTest.test-seed#[27A9A88727022EB5]) [n:127.0.0.1:47555_k_g%2Fht    ] o.a.s.c.Overseer Overseer (id=95309864579170308-127.0.0.1:47555_k_g%2Fht-n_0000000000) starting
   [junit4]   2> 1260851 INFO  (TEST-CustomCollectionTest.test-seed#[27A9A88727022EB5]) [n:127.0.0.1:47555_k_g%2Fht    ] o.a.s.c.c.SolrZkClient makePath: /overseer/queue-work
   [junit4]   2> 1260853 INFO  (TEST-CustomCollectionTest.test-seed#[27A9A88727022EB5]) [n:127.0.0.1:47555_k_g%2Fht    ] o.a.s.c.OverseerAutoReplicaFailoverThread Starting OverseerAutoReplicaFailoverThread autoReplicaFailoverWorkLoopDelay=10000 autoReplicaFailoverWaitAfterExpiration=10000 autoReplicaFailoverBadNodeExpiration=60000
   [junit4]   2> 1260853 INFO  (OverseerCollectionConfigSetProcessor-95309864579170308-127.0.0.1:47555_k_g%2Fht-n_0000000000) [n:127.0.0.1:47555_k_g%2Fht    ] o.a.s.c.OverseerTaskProcessor Process current queue of overseer operations
   [junit4]   2> 1260853 INFO  (TEST-CustomCollectionTest.test-seed#[27A9A88727022EB5]) [n:127.0.0.1:47555_k_g%2Fht    ] o.a.s.c.c.ZkStateReader Updating cluster state from ZooKeeper... 
   [junit4]   2> 1260854 INFO  (OverseerStateUpdate-95309864579170308-127.0.0.1:47555_k_g%2Fht-n_0000000000) [n:127.0.0.1:47555_k_g%2Fht    ] o.a.s.c.Overseer Starting to work on the main queue
   [junit4]   2> 1260871 INFO  (TEST-CustomCollectionTest.test-seed#[27A9A88727022EB5]) [n:127.0.0.1:47555_k_g%2Fht    ] o.a.s.c.CoreContainer Security conf doesn't exist. Skipping setup for authorization module.
   [junit4]   2> 1260871 INFO  (TEST-CustomCollectionTest.test-seed#[27A9A88727022EB5]) [n:127.0.0.1:47555_k_g%2Fht    ] o.a.s.c.CoreContainer No authentication plugin used.
   [junit4]   2> 1260871 INFO  (TEST-CustomCollectionTest.test-seed#[27A9A88727022EB5]) [n:127.0.0.1:47555_k_g%2Fht    ] o.a.s.c.CorePropertiesLocator Looking for core definitions underneath /home/jenkins/workspace/Lucene-Solr-5.x-Linux/solr/build/solr-core/test/J2/temp/solr.cloud.CustomCollectionTest_27A9A88727022EB5-001/control-001/cores
   [junit4]   2> 1260872 INFO  (TEST-CustomCollectionTest.test-seed#[27A9A88727022EB5]) [n:127.0.0.1:47555_k_g%2Fht    ] o.a.s.c.CoreDescriptor Created CoreDescriptor: {name=collection1, config=solrconfig.xml, transient=false, schema=schema.xml, loadOnStartup=true, configSetProperties=configsetprops.json, collection=control_collection, coreNodeName=, dataDir=data/, shard=}
   [junit4]   2> 1260872 INFO  (TEST-CustomCollectionTest.test-seed#[27A9A88727022EB5]) [n:127.0.0.1:47555_k_g%2Fht    ] o.a.s.c.CorePropertiesLocator Found core collection1 in /home/jenkins/workspace/Lucene-Solr-5.x-Linux/solr/build/solr-core/test/J2/temp/solr.cloud.CustomCollectionTest_27A9A88727022EB5-001/control-001/cores/collection1
   [junit4]   2> 1260872 INFO  (TEST-CustomCollectionTest.test-seed#[27A9A88727022EB5]) [n:127.0.0.1:47555_k_g%2Fht    ] o.a.s.c.CorePropertiesLocator Found 1 core definitions
   [junit4]   2> 1260872 INFO  (TEST-CustomCollectionTest.test-seed#[27A9A88727022EB5]) [n:127.0.0.1:47555_k_g%2Fht    ] o.a.s.s.SolrDispatchFilter user.dir=/home/jenkins/workspace/Lucene-Solr-5.x-Linux/solr/build/solr-core/test/J2
   [junit4]   2> 1260872 INFO  (TEST-CustomCollectionTest.test-seed#[27A9A88727022EB5]) [n:127.0.0.1:47555_k_g%2Fht    ] o.a.s.s.SolrDispatchFilter SolrDispatchFilter.init() done
   [junit4]   2> 1260872 INFO  (coreLoadExecutor-4183-thread-1-processing-n:127.0.0.1:47555_k_g%2Fht) [n:127.0.0.1:47555_k_g%2Fht c:control_collection   x:collection1] o.a.s.c.ZkController publishing state=down
   [junit4]   2> 1260873 INFO  (coreLoadExecutor-4183-thread-1-processing-n:127.0.0.1:47555_k_g%2Fht) [n:127.0.0.1:47555_k_g%2Fht c:control_collection   x:collection1] o.a.s.c.ZkController numShards not found on descriptor - reading it from system property
   [junit4]   2> 1260873 INFO  (OverseerStateUpdate-95309864579170308-127.0.0.1:47555_k_g%2Fht-n_0000000000) [n:127.0.0.1:47555_k_g%2Fht    ] o.a.s.c.Overseer processMessage: queueSize: 1, message = {
   [junit4]   2>   "core":"collection1",
   [junit4]   2>   "roles":null,
   [junit4]   2>   "base_url":"http://127.0.0.1:47555/k_g/ht",
   [junit4]   2>   "node_name":"127.0.0.1:47555_k_g%2Fht",
   [junit4]   2>   "numShards":"1",
   [junit4]   2>   "state":"down",
   [junit4]   2>   "shard":null,
   [junit4]   2>   "collection":"control_collection",
   [junit4]   2>   "operation":"state"} current state version: 0
   [junit4]   2> 1260873 INFO  (coreLoadExecutor-4183-thread-1-processing-n:127.0.0.1:47555_k_g%2Fht) [n:127.0.0.1:47555_k_g%2Fht c:control_collection   x:collection1] o.a.s.c.ZkController look for our core node name
   [junit4]   2> 1260873 INFO  (OverseerStateUpdate-95309864579170308-127.0.0.1:47555_k_g%2Fht-n_0000000000) [n:127.0.0.1:47555_k_g%2Fht    ] o.a.s.c.o.ReplicaMutator Update state numShards=1 message={
   [junit4]   2>   "core":"collection1",
   [junit4]   2>   "roles":null,
   [junit4]   2>   "base_url":"http://127.0.0.1:47555/k_g/ht",
   [junit4]   2>   "node_name":"127.0.0.1:47555_k_g%2Fht",
   [junit4]   2>   "numShards":"1",
   [junit4]   2>   "state":"down",
   [junit4]   2>   "shard":null,
   [junit4]   2>   "collection":"control_collection",
   [junit4]   2>   "operation":"state"}
   [junit4]   2> 1260874 INFO  (OverseerStateUpdate-95309864579170308-127.0.0.1:47555_k_g%2Fht-n_0000000000) [n:127.0.0.1:47555_k_g%2Fht    ] o.a.s.c.o.ClusterStateMutator building a new cName: control_collection
   [junit4]   2> 1260874 INFO  (OverseerStateUpdate-95309864579170308-127.0.0.1:47555_k_g%2Fht-n_0000000000) [n:127.0.0.1:47555_k_g%2Fht    ] o.a.s.c.o.ReplicaMutator Assigning new node to shard shard=shard1
   [junit4]   2> 1260874 INFO  (zkCallback-1348-thread-1-processing-n:127.0.0.1:47555_k_g%2Fht) [n:127.0.0.1:47555_k_g%2Fht    ] o.a.s.c.c.ZkStateReader A cluster state change: [WatchedEvent state:SyncConnected type:NodeDataChanged path:/clusterstate.json], has occurred - updating... (live nodes size: [1])
   [junit4]   2> 1261874 INFO  (coreLoadExecutor-4183-thread-1-processing-n:127.0.0.1:47555_k_g%2Fht) [n:127.0.0.1:47555_k_g%2Fht c:control_collection   x:collection1] o.a.s.c.ZkController waiting to find shard id in clusterstate for collection1
   [junit4]   2> 1261874 INFO  (coreLoadExecutor-4183-thread-1-processing-n:127.0.0.1:47555_k_g%2Fht) [n:127.0.0.1:47555_k_g%2Fht c:control_collection   x:collection1] o.a.s.c.ZkController Check for collection zkNode:control_collection
   [junit4]   2> 1261874 INFO  (coreLoadExecutor-4183-thread-1-processing-n:127.0.0.1:47555_k_g%2Fht) [n:127.0.0.1:47555_k_g%2Fht c:control_collection   x:collection1] o.a.s.c.ZkController Collection zkNode exists
   [junit4]   2> 1261874 INFO  (coreLoadExecutor-4183-thread-1-processing-n:127.0.0.1:47555_k_g%2Fht) [n:127.0.0.1:47555_k_g%2Fht c:control_collection   x:collection1] o.a.s.c.c.ZkStateReader Load collection config from: [/collections/control_collection]
   [junit4]   2> 1261874 INFO  (coreLoadExecutor-4183-thread-1-processing-n:127.0.0.1:47555_k_g%2Fht) [n:127.0.0.1:47555_k_g%2Fht c:control_collection   x:collection1] o.a.s.c.c.ZkStateReader path=[/collections/control_collection] [configName]=[conf1] specified config exists in ZooKeeper
   [junit4]   2> 1261874 INFO  (coreLoadExecutor-4183-thread-1-processing-n:127.0.0.1:47555_k_g%2Fht) [n:127.0.0.1:47555_k_g%2Fht c:control_collection   x:collection1] o.a.s.c.SolrResourceLoader new SolrResourceLoader for directory: '/home/jenkins/workspace/Lucene-Solr-5.x-Linux/solr/build/solr-core/test/J2/temp/solr.cloud.CustomCollectionTest_27A9A88727022EB5-001/control-001/cores/collection1'
   [junit4]   2> 1261874 INFO  (coreLoadExecutor-4183-thread-1-processing-n:127.0.0.1:47555_k_g%2Fht) [n:127.0.0.1:47555_k_g%2Fht c:control_collection   x:collection1] o.a.s.c.SolrResourceLoader JNDI not configured for solr (NoInitialContextEx)
   [junit4]   2> 1261874 INFO  (coreLoadExecutor-4183-thread-1-processing-n:127.0.0.1:47555_k_g%2Fht) [n:127.0.0.1:47555_k_g%2Fht c:control_collection   x:collection1] o.a.s.c.SolrResourceLoader solr home defaulted to 'solr/' (could not find system property or JNDI)
   [junit4]   2> 1261875 INFO  (coreLoadExecutor-4183-thread-1-processing-n:127.0.0.1:47555_k_g%2Fht) [n:127.0.0.1:47555_k_g%2Fht c:control_collection   x:collection1] o.a.s.c.Config loaded config solrconfig.xml with version 0 
   [junit4]   2> 1261878 INFO  (coreLoadExecutor-4183-thread-1-processing-n:127.0.0.1:47555_k_g%2Fht) [n:127.0.0.1:47555_k_g%2Fht c:control_collection   x:collection1] o.a.s.c.SolrConfig current version of requestparams : -1
   [junit4]   2> 1261880 INFO  (coreLoadExecutor-4183-thread-1-processing-n:127.0.0.1:47555_k_g%2Fht) [n:127.0.0.1:47555_k_g%2Fht c:control_collection   x:collection1] o.a.s.c.SolrConfig Using Lucene MatchVersion: 5.5.0
   [junit4]   2> 1261892 INFO  (coreLoadExecutor-4183-thread-1-processing-n:127.0.0.1:47555_k_g%2Fht) [n:127.0.0.1:47555_k_g%2Fht c:control_collection   x:collection1] o.a.s.c.SolrConfig Loaded SolrConfig: solrconfig.xml
   [junit4]   2> 1261895 INFO  (coreLoadExecutor-4183-thread-1-processing-n:127.0.0.1:47555_k_g%2Fht) [n:127.0.0.1:47555_k_g%2Fht c:control_collection   x:collection1] o.a.s.s.IndexSchema [collection1] Schema name=test
   [junit4]   2> 1261940 INFO  (coreLoadExecutor-4183-thread-1-processing-n:127.0.0.1:47555_k_g%2Fht) [n:127.0.0.1:47555_k_g%2Fht c:control_collection   x:collection1] o.a.s.s.OpenExchangeRatesOrgProvider Initialized with rates=open-exchange-rates.json, refreshInterval=1440.
   [junit4]   2> 1261943 INFO  (coreLoadExecutor-4183-thread-1-processing-n:127.0.0.1:47555_k_g%2Fht) [n:127.0.0.1:47555_k_g%2Fht c:control_collection   x:collection1] o.a.s.s.IndexSchema default search field in schema is text
   [junit4]   2> 1261944 INFO  (coreLoadExecutor-4183-thread-1-processing-n:127.0.0.1:47555_k_g%2Fht) [n:127.0.0.1:47555_k_g%2Fht c:control_collection   x:collection1] o.a.s.s.IndexSchema unique key field: id
   [junit4]   2> 1261947 INFO  (coreLoadExecutor-4183-thread-1-processing-n:127.0.0.1:47555_k_g%2Fht) [n:127.0.0.1:47555_k_g%2Fht c:control_collection   x:collection1] o.a.s.s.FileExchangeRateProvider Reloading exchange rates from file currency.xml
   [junit4]   2> 1261948 INFO  (coreLoadExecutor-4183-thread-1-processing-n:127.0.0.1:47555_k_g%2Fht) [n:127.0.0.1:47555_k_g%2Fht c:control_collection   x:collection1] o.a.s.s.FileExchangeRateProvider Reloading exchange rates from file currency.xml
   [junit4]   2> 1261949 INFO  (coreLoadExecutor-4183-thread-1-processing-n:127.0.0.1:47555_k_g%2Fht) [n:127.0.0.1:47555_k_g%2Fht c:control_collection   x:collection1] o.a.s.s.OpenExchangeRatesOrgProvider Reloading exchange rates from open-exchange-rates.json
   [junit4]   2> 1261949 INFO  (coreLoadExecutor-4183-thread-1-processing-n:127.0.0.1:47555_k_g%2Fht) [n:127.0.0.1:47555_k_g%2Fht c:control_collection   x:collection1] o.a.s.s.OpenExchangeRatesOrgProvider Reloading exchange rates from open-exchange-rates.json
   [junit4]   2> 1261950 INFO  (coreLoadExecutor-4183-thread-1-processing-n:127.0.0.1:47555_k_g%2Fht) [n:127.0.0.1:47555_k_g%2Fht c:control_collection   x:collection1] o.a.s.c.ConfigSetProperties Did not find ConfigSet properties, assuming default properties: Can't find resource 'configsetprops.json' in classpath or '/configs/conf1', cwd=/home/jenkins/workspace/Lucene-Solr-5.x-Linux/solr/build/solr-core/test/J2
   [junit4]   2> 1261950 INFO  (coreLoadExecutor-4183-thread-1-processing-n:127.0.0.1:47555_k_g%2Fht) [n:127.0.0.1:47555_k_g%2Fht c:control_collection   x:collection1] o.a.s.c.CoreContainer Creating SolrCore 'collection1' using configuration from collection control_collection
   [junit4]   2> 1261950 INFO  (coreLoadExecutor-4183-thread-1-processing-n:127.0.0.1:47555_k_g%2Fht) [n:127.0.0.1:47555_k_g%2Fht c:control_collection s:shard1 r:core_node1 x:collection1] o.a.s.c.SolrCore org.apache.solr.core.MockDirectoryFactory
   [junit4]   2> 1261950 INFO  (coreLoadExecutor-4183-thread-1-processing-n:127.0.0.1:47555_k_g%2Fht) [n:127.0.0.1:47555_k_g%2Fht c:control_collection s:shard1 r:core_node1 x:collection1] o.a.s.c.SolrCore [[collection1] ] Opening new SolrCore at [/home/jenkins/workspace/Lucene-Solr-5.x-Linux/solr/build/solr-core/test/J2/temp/solr.cloud.CustomCollectionTest_27A9A88727022EB5-001/control-001/cores/collection1], dataDir=[/home/jenkins/workspace/Lucene-Solr-5.x-Linux/solr/build/solr-core/test/J2/temp/solr.cloud.CustomCollectionTest_27A9A88727022EB5-001/control-001/cores/collection1/data/]
   [junit4]   2> 1261950 INFO  (coreLoadExecutor-4183-thread-1-processing-n:127.0.0.1:47555_k_g%2Fht) [n:127.0.0.1:47555_k_g%2Fht c:control_collection s:shard1 r:core_node1 x:collection1] o.a.s.c.JmxMonitoredMap JMX monitoring is enabled. Adding Solr mbeans to JMX Server: com.sun.jmx.mbeanserver.JmxMBeanServer@5ad69328
   [junit4]   2> 1261951 INFO  (coreLoadExecutor-4183-thread-1-processing-n:127.0.0.1:47555_k_g%2Fht) [n:127.0.0.1:47555_k_g%2Fht c:control_collection s:shard1 r:core_node1 x:collection1] o.a.s.c.CachingDirectoryFactory return new directory for /home/jenkins/workspace/Lucene-Solr-5.x-Linux/solr/build/solr-core/test/J2/temp/solr.cloud.CustomCollectionTest_27A9A88727022EB5-001/control-001/cores/collection1/data
   [junit4]   2> 1261951 INFO  (coreLoadExecutor-4183-thread-1-processing-n:127.0.0.1:47555_k_g%2Fht) [n:127.0.0.1:47555_k_g%2Fht c:control_collection s:shard1 r:core_node1 x:collection1] o.a.s.c.SolrCore New index directory detected: old=null new=/home/jenkins/workspace/Lucene-Solr-5.x-Linux/solr/build/solr-core/test/J2/temp/solr.cloud.CustomCollectionTest_27A9A88727022EB5-001/control-001/cores/collection1/data/index/
   [junit4]   2> 1261951 WARN  (coreLoadExecutor-4183-thread-1-processing-n:127.0.0.1:47555_k_g%2Fht) [n:127.0.0.1:47555_k_g%2Fht c:control_collection s:shard1 r:core_node1 x:collection1] o.a.s.c.SolrCore [collection1] Solr index directory '/home/jenkins/workspace/Lucene-Solr-5.x-Linux/solr/build/solr-core/test/J2/temp/solr.cloud.CustomCollectionTest_27A9A88727022EB5-001/control-001/cores/collection1/data/index' doesn't exist. Creating new index...
   [junit4]   2> 1261951 INFO  (coreLoadExecutor-4183-thread-1-processing-n:127.0.0.1:47555_k_g%2Fht) [n:127.0.0.1:47555_k_g%2Fht c:control_collection s:shard1 r:core_node1 x:collection1] o.a.s.c.CachingDirectoryFactory return new directory for /home/jenkins/workspace/Lucene-Solr-5.x-Linux/solr/build/solr-core/test/J2/temp/solr.cloud.CustomCollectionTest_27A9A88727022EB5-001/control-001/cores/collection1/data/index
   [junit4]   2> 1261951 INFO  (coreLoadExecutor-4183-thread-1-processing-n:127.0.0.1:47555_k_g%2Fht) [n:127.0.0.1:47555_k_g%2Fht c:control_collection s:shard1 r:core_node1 x:collection1] o.a.s.u.RandomMergePolicy RandomMergePolicy wrapping class org.apache.lucene.index.TieredMergePolicy: [TieredMergePolicy: maxMergeAtOnce=13, maxMergeAtOnceExplicit=18, maxMergedSegmentMB=70.5126953125, floorSegmentMB=1.154296875, forceMergeDeletesPctAllowed=1.849036928595994, segmentsPerTier=47.0, maxCFSSegmentSizeMB=8.796093022207999E12, noCFSRatio=0.22238863716551815
   [junit4]   2> 1261952 INFO  (coreLoadExecutor-4183-thread-1-processing-n:127.0.0.1:47555_k_g%2Fht) [n:127.0.0.1:47555_k_g%2Fht c:control_collection s:shard1 r:core_node1 x:collection1] o.a.s.c.SolrDeletionPolicy SolrDeletionPolicy.onCommit: commits: num=1
   [junit4]   2> 	commit{dir=MockDirectoryWrapper(RAMDirectory@66ef7ffe lockFactory=org.apache.lucene.store.SingleInstanceLockFactory@265b5340),segFN=segments_1,generation=1}
   [junit4]   2> 1261952 INFO  (coreLoadExecutor-4183-thread-1-processing-n:127.0.0.1:47555_k_g%2Fht) [n:127.0.0.1:47555_k_g%2Fht c:control_collection s:shard1 r:core_node1 x:collection1] o.a.s.c.SolrDeletionPolicy newest commit generation = 1
   [junit4]   2> 1261952 INFO  (OldIndexDirectoryCleanupThreadForCore-collection1) [n:127.0.0.1:47555_k_g%2Fht c:control_collection s:shard1 r:core_node1 x:collection1] o.a.s.c.SolrCore Looking for old index directories to cleanup for core collection1 in /home/jenkins/workspace/Lucene-Solr-5.x-Linux/solr/build/solr-core/test/J2/temp/solr.cloud.CustomCollectionTest_27A9A88727022EB5-001/control-001/cores/collection1/data/
   [junit4]   2> 1261952 WARN  (OldIndexDirectoryCleanupThreadForCore-collection1) [n:127.0.0.1:47555_k_g%2Fht c:control_collection s:shard1 r:core_node1 x:collection1] o.a.s.c.DirectoryFactory /home/jenkins/workspace/Lucene-Solr-5.x-Linux/solr/build/solr-core/test/J2/temp/solr.cloud.CustomCollectionTest_27A9A88727022EB5-001/control-001/cores/collection1/data/ does not point to a valid data directory; skipping clean-up of old index directories.
   [junit4]   2> 1261953 INFO  (coreLoadExecutor-4183-thread-1-processing-n:127.0.0.1:47555_k_g%2Fht) [n:127.0.0.1:47555_k_g%2Fht c:control_collection s:shard1 r:core_node1 x:collection1] o.a.s.u.p.UpdateRequestProcessorChain creating updateRequestProcessorChain "nodistrib"
   [junit4]   2> 1261954 INFO  (coreLoadExecutor-4183-thread-1-processing-n:127.0.0.1:47555_k_g%2Fht) [n:127.0.0.1:47555_k_g%2Fht c:control_collection s:shard1 r:core_node1 x:collection1] o.a.s.u.p.UpdateRequestProcessorChain creating updateRequestProcessorChain "dedupe"
   [junit4]   2> 1261954 INFO  (coreLoadExecutor-4183-thread-1-processing-n:127.0.0.1:47555_k_g%2Fht) [n:127.0.0.1:47555_k_g%2Fht c:control_collection s:shard1 r:core_node1 x:collection1] o.a.s.u.p.UpdateRequestProcessorChain inserting DistributedUpdateProcessorFactory into updateRequestProcessorChain "dedupe"
   [junit4]   2> 1261954 INFO  (coreLoadExecutor-4183-thread-1-processing-n:127.0.0.1:47555_k_g%2Fht) [n:127.0.0.1:47555_k_g%2Fht c:control_collection s:shard1 r:core_node1 x:collection1] o.a.s.u.p.UpdateRequestProcessorChain creating updateRequestProcessorChain "stored_sig"
   [junit4]   2> 1261954 INFO  (coreLoadExecutor-4183-thread-1-processing-n:127.0.0.1:47555_k_g%2Fht) [n:127.0.0.1:47555_k_g%2Fht c:control_collection s:shard1 r:core_node1 x:collection1] o.a.s.u.p.UpdateRequestProcessorChain inserting DistributedUpdateProcessorFactory into updateRequestProcessorChain "stored_sig"
   [junit4]   2> 1261954 INFO  (coreLoadExecutor-4183-thread-1-processing-n:127.0.0.1:47555_k_g%2Fht) [n:127.0.0.1:47555_k_g%2Fht c:control_collection s:shard1 r:core_node1 x:collection1] o.a.s.u.p.UpdateRequestProcessorChain creating updateRequestProcessorChain "distrib-dup-test-chain-explicit"
   [junit4]   2> 1261954 INFO  (coreLoadExecutor-4183-thread-1-processing-n:127.0.0.1:47555_k_g%2Fht) [n:127.0.0.1:47555_k_g%2Fht c:control_collection s:shard1 r:core_node1 x:collection1] o.a.s.u.p.UpdateRequestProcessorChain creating updateRequestProcessorChain "distrib-dup-test-chain-implicit"
   [junit4]   2> 1261954 INFO  (coreLoadExecutor-4183-thread-1-processing-n:127.0.0.1:47555_k_g%2Fht) [n:127.0.0.1:47555_k_g%2Fht c:control_collection s:shard1 r:core_node1 x:collection1] o.a.s.u.p.UpdateRequestProcessorChain inserting DistributedUpdateProcessorFactory into updateRequestProcessorChain "distrib-dup-test-chain-implicit"
   [junit4]   2> 1261954 INFO  (coreLoadExecutor-4183-thread-1-processing-n:127.0.0.1:47555_k_g%2Fht) [n:127.0.0.1:47555_k_g%2Fht c:control_collection s:shard1 r:core_node1 x:collection1] o.a.s.c.SolrCore no updateRequestProcessorChain defined as default, creating implicit default
   [junit4]   2> 1261954 WARN  (coreLoadExecutor-4183-thread-1-processing-n:127.0.0.1:47555_k_g%2Fht) [n:127.0.0.1:47555_k_g%2Fht c:control_collection s:shard1 r:core_node1 x:collection1] o.a.s.c.RequestHandlers INVALID paramSet a in requestHandler {type = requestHandler,name = /dump,class = DumpRequestHandler,args = {defaults={a=A,b=B}}}
   [junit4]   2> 1261955 INFO  (coreLoadExecutor-4183-thread-1-processing-n:127.0.0.1:47555_k_g%2Fht) [n:127.0.0.1:47555_k_g%2Fht c:control_collection s:shard1 r:core_node1 x:collection1] o.a.s.h.l.XMLLoader xsltCacheLifetimeSeconds=60
   [junit4]   2> 1261955 INFO  (coreLoadExecutor-4183-thread-1-processing-n:127.0.0.1:47555_k_g%2Fht) [n:127.0.0.1:47555_k_g%2Fht c:control_collection s:shard1 r:core_node1 x:collection1] o.a.s.h.l.XMLLoader xsltCacheLifetimeSeconds=60
   [junit4]   2> 1261956 INFO  (coreLoadExecutor-4183-thread-1-processing-n:127.0.0.1:47555_k_g%2Fht) [n:127.0.0.1:47555_k_g%2Fht c:control_collection s:shard1 r:core_node1 x:collection1] o.a.s.h.l.XMLLoader xsltCacheLifetimeSeconds=60
   [junit4]   2> 1261956 INFO  (coreLoadExecutor-4183-thread-1-processing-n:127.0.0.1:47555_k_g%2Fht) [n:127.0.0.1:47555_k_g%2Fht c:control_collection s:shard1 r:core_node1 x:collection1] o.a.s.h.l.XMLLoader xsltCacheLifetimeSeconds=60
   [junit4]   2> 1261958 INFO  (coreLoadExecutor-4183-thread-1-processing-n:127.0.0.1:47555_k_g%2Fht) [n:127.0.0.1:47555_k_g%2Fht c:control_collection s:shard1 r:core_node1 x:collection1] o.a.s.c.RequestHandlers Registered paths: /admin/mbeans,standard,/dump,/update/csv,/update/json/docs,/admin/luke,/admin/segments,/get,/admin/system,/replication,/admin/properties,/config,/schema,/admin/plugins,/admin/logging,/update/json,/admin/threads,/admin/ping,/update,/admin/file
   [junit4]   2> 1261958 INFO  (coreLoadExecutor-4183-thread-1-processing-n:127.0.0.1:47555_k_g%2Fht) [n:127.0.0.1:47555_k_g%2Fht c:control_collection s:shard1 r:core_node1 x:collection1] o.a.s.c.SolrCore Using default statsCache cache: org.apache.solr.search.stats.LocalStatsCache
   [junit4]   2> 1261958 INFO  (coreLoadExecutor-4183-thread-1-processing-n:127.0.0.1:47555_k_g%2Fht) [n:127.0.0.1:47555_k_g%2Fht c:control_collection s:shard1 r:core_node1 x:collection1] o.a.s.u.UpdateHandler Using UpdateLog implementation: org.apache.solr.update.UpdateLog
   [junit4]   2> 1261958 INFO  (coreLoadExecutor-4183-thread-1-processing-n:127.0.0.1:47555_k_g%2Fht) [n:127.0.0.1:47555_k_g%2Fht c:control_collection s:shard1 r:core_node1 x:collection1] o.a.s.u.UpdateLog Initializing UpdateLog: dataDir= defaultSyncLevel=FLUSH numRecordsToKeep=100 maxNumLogsToKeep=10 numVersionBuckets=65536
   [junit4]   2> 1261959 INFO  (coreLoadExecutor-4183-thread-1-processing-n:127.0.0.1:47555_k_g%2Fht) [n:127.0.0.1:47555_k_g%2Fht c:control_collection s:shard1 r:core_node1 x:collection1] o.a.s.u.CommitTracker Hard AutoCommit: disabled
   [junit4]   2> 1261959 INFO  (coreLoadExecutor-4183-thread-1-processing-n:127.0.0.1:47555_k_g%2Fht) [n:127.0.0.1:47555_k_g%2Fht c:control_collection s:shard1 r:core_node1 x:collection1] o.a.s.u.CommitTracker Soft AutoCommit: disabled
   [junit4]   2> 1261959 INFO  (coreLoadExecutor-4183-thread-1-processing-n:127.0.0.1:47555_k_g%2Fht) [n:127.0.0.1:47555_k_g%2Fht c:control_collection s:shard1 r:core_node1 x:collection1] o.a.s.u.RandomMergePolicy RandomMergePolicy wrapping class org.apache.lucene.index.LogDocMergePolicy: [LogDocMergePolicy: minMergeSize=1000, mergeFactor=24, maxMergeSize=9223372036854775807, maxMergeSizeForForcedMerge=9223372036854775807, calibrateSizeByDeletes=false, maxMergeDocs=2147483647, maxCFSSegmentSizeMB=8.796093022207999E12, noCFSRatio=0.0]
   [junit4]   2> 1261959 INFO  (coreLoadExecutor-4183-thread-1-processing-n:127.0.0.1:47555_k_g%2Fht) [n:127.0.0.1:47555_k_g%2Fht c:control_collection s:shard1 r:core_node1 x:collection1] o.a.s.c.SolrDeletionPolicy SolrDeletionPolicy.onInit: commits: num=1
   [junit4]   2> 	commit{dir=MockDirectoryWrapper(RAMDirectory@66ef7ffe lockFactory=org.apache.lucene.store.SingleInstanceLockFactory@265b5340),segFN=segments_1,generation=1}
   [junit4]   2> 1261959 INFO  (coreLoadExecutor-4183-thread-1-processing-n:127.0.0.1:47555_k_g%2Fht) [n:127.0.0.1:47555_k_g%2Fht c:control_collection s:shard1 r:core_node1 x:collection1] o.a.s.c.SolrDeletionPolicy newest commit generation = 1
   [junit4]   2> 1261959 INFO  (coreLoadExecutor-4183-thread-1-processing-n:127.0.0.1:47555_k_g%2Fht) [n:127.0.0.1:47555_k_g%2Fht c:control_collection s:shard1 r:core_node1 x:collection1] o.a.s.s.SolrIndexSearcher Opening Searcher@7d9dfc15[collection1] main
   [junit4]   2> 1261959 INFO  (coreLoadExecutor-4183-thread-1-processing-n:127.0.0.1:47555_k_g%2Fht) [n:127.0.0.1:47555_k_g%2Fht c:control_collection s:shard1 r:core_node1 x:collection1] o.a.s.c.c.ZkStateReader Load collection config from: [/collections/control_collection]
   [junit4]   2> 1261959 INFO  (coreLoadExecutor-4183-thread-1-processing-n:127.0.0.1:47555_k_g%2Fht) [n:127.0.0.1:47555_k_g%2Fht c:control_collection s:shard1 r:core_node1 x:collection1] o.a.s.c.c.ZkStateReader path=[/collections/control_collection] [configName]=[conf1] specified config exists in ZooKeeper
   [junit4]   2> 1261959 INFO  (coreLoadExecutor-4183-thread-1-processing-n:127.0.0.1:47555_k_g%2Fht) [n:127.0.0.1:47555_k_g%2Fht c:control_collection s:shard1 r:core_node1 x:collection1] o.a.s.r.ManagedResourceStorage Setting up ZooKeeper-based storage for the RestManager with znodeBase: /configs/conf1
   [junit4]   2> 1261960 INFO  (coreLoadExecutor-4183-thread-1-processing-n:127.0.0.1:47555_k_g%2Fht) [n:127.0.0.1:47555_k_g%2Fht c:control_collection s:shard1 r:core_node1 x:collection1] o.a.s.r.ManagedResourceStorage Configured ZooKeeperStorageIO with znodeBase: /configs/conf1
   [junit4]   2> 1261960 INFO  (coreLoadExecutor-4183-thread-1-processing-n:127.0.0.1:47555_k_g%2Fht) [n:127.0.0.1:47555_k_g%2Fht c:control_collection s:shard1 r:core_node1 x:collection1] o.a.s.r.RestManager Initializing RestManager with initArgs: {}
   [junit4]   2> 1261960 INFO  (coreLoadExecutor-4183-thread-1-processing-n:127.0.0.1:47555_k_g%2Fht) [n:127.0.0.1:47555_k_g%2Fht c:control_collection s:shard1 r:core_node1 x:collection1] o.a.s.r.ManagedResourceStorage Reading _rest_managed.json using ZooKeeperStorageIO:path=/configs/conf1
   [junit4]   2> 1261960 INFO  (coreLoadExecutor-4183-thread-1-processing-n:127.0.0.1:47555_k_g%2Fht) [n:127.0.0.1:47555_k_g%2Fht c:control_collection s:shard1 r:core_node1 x:collection1] o.a.s.r.ManagedResourceStorage No data found for znode /configs/conf1/_rest_managed.json
   [junit4]   2> 1261960 INFO  (coreLoadExecutor-4183-thread-1-processing-n:127.0.0.1:47555_k_g%2Fht) [n:127.0.0.1:47555_k_g%2Fht c:control_collection s:shard1 r:core_node1 x:collection1] o.a.s.r.ManagedResourceStorage Loaded null at path _rest_managed.json using ZooKeeperStorageIO:path=/configs/conf1
   [junit4]   2> 1261960 INFO  (coreLoadExecutor-4183-thread-1-processing-n:127.0.0.1:47555_k_g%2Fht) [n:127.0.0.1:47555_k_g%2Fht c:control_collection s:shard1 r:core_node1 x:collection1] o.a.s.r.RestManager Initializing 0 registered ManagedResources
   [junit4]   2> 1261960 INFO  (coreLoadExecutor-4183-thread-1-processing-n:127.0.0.1:47555_k_g%2Fht) [n:127.0.0.1:47555_k_g%2Fht c:control_collection s:shard1 r:core_node1 x:collection1] o.a.s.h.ReplicationHandler Commits will be reserved for  10000
   [junit4]   2> 1261960 INFO  (searcherExecutor-4184-thread-1-processing-n:127.0.0.1:47555_k_g%2Fht x:collection1 s:shard1 c:control_collection r:core_node1) [n:127.0.0.1:47555_k_g%2Fht c:control_collection s:shard1 r:core_node1 x:collection1] o.a.s.c.SolrCore [collection1] Registered new searcher Searcher@7d9dfc15[collection1] main{ExitableDirectoryReader(UninvertingDirectoryReader())}
   [junit4]   2> 1261960 INFO  (coreLoadExecutor-4183-thread-1-processing-n:127.0.0.1:47555_k_g%2Fht) [n:127.0.0.1:47555_k_g%2Fht c:control_collection s:shard1 r:core_node1 x:collection1] o.a.s.u.UpdateLog Looking up max value of version field to seed version buckets
   [junit4]   2> 1261961 INFO  (coreLoadExecutor-4183-thread-1-processing-n:127.0.0.1:47555_k_g%2Fht) [n:127.0.0.1:47555_k_g%2Fht c:control_collection s:shard1 r:core_node1 x:collection1] o.a.s.u.VersionInfo Refreshing highest value of _version_ for 65536 version buckets from index
   [junit4]   2> 1261961 INFO  (coreLoadExecutor-4183-thread-1-processing-n:127.0.0.1:47555_k_g%2Fht) [n:127.0.0.1:47555_k_g%2Fht c:control_collection s:shard1 r:core_node1 x:collection1] o.a.s.u.VersionInfo No terms found for _version_, cannot seed version bucket highest value from index
   [junit4]   2> 1261961 INFO  (coreLoadExecutor-4183-thread-1-processing-n:127.0.0.1:47555_k_g%2Fht) [n:127.0.0.1:47555_k_g%2Fht c:control_collection s:shard1 r:core_node1 x:collection1] o.a.s.u.UpdateLog Could not find max version in index or recent updates, using new clock 1524957834623582208
   [junit4]   2> 1261962 INFO  (coreLoadExecutor-4183-thread-1-processing-n:127.0.0.1:47555_k_g%2Fht) [n:127.0.0.1:47555_k_g%2Fht c:control_collection s:shard1 r:core_node1 x:collection1] o.a.s.u.UpdateLog Took 1.0ms to seed version buckets with highest version 1524957834623582208
   [junit4]   2> 1261962 INFO  (coreLoadExecutor-4183-thread-1-processing-n:127.0.0.1:47555_k_g%2Fht) [n:127.0.0.1:47555_k_g%2Fht c:control_collection s:shard1 r:core_node1 x:collection1] o.a.s.c.ZkController watch zkdir /configs/conf1
   [junit4]   2> 1261962 INFO  (coreLoadExecutor-4183-thread-1-processing-n:127.0.0.1:47555_k_g%2Fht) [n:127.0.0.1:47555_k_g%2Fht c:control_collection s:shard1 r:core_node1 x:collection1] o.a.s.c.CoreContainer registering core: collection1
   [junit4]   2> 1261963 INFO  (coreZkRegister-4177-thread-1-processing-n:127.0.0.1:47555_k_g%2Fht x:collection1 s:shard1 c:control_collection r:core_node1) [n:127.0.0.1:47555_k_g%2Fht c:control_collection s:shard1 r:core_node1 x:collection1] o.a.s.c.ZkController Register replica - core:collection1 address:http://127.0.0.1:47555/k_g/ht collection:control_collection shard:shard1
   [junit4]   2> 1261963 INFO  (coreZkRegister-4177-thread-1-processing-n:127.0.0.1:47555_k_g%2Fht x:collection1 s:shard1 c:control_collection r:core_node1) [n:127.0.0.1:47555_k_g%2Fht c:control_collection s:shard1 r:core_node1 x:collection1] o.a.s.c.c.SolrZkClient makePath: /collections/control_collection/leader_elect/shard1/election
   [junit4]   2> 1261964 INFO  (coreZkRegister-4177-thread-1-processing-n:127.0.0.1:47555_k_g%2Fht x:collection1 s:shard1 c:control_collection r:core_node1) [n:127.0.0.1:47555_k_g%2Fht c:control_collection s:shard1 r:core_node1 x:collection1] o.a.s.c.LeaderElector Joined leadership election with path: /collections/control_collection/leader_elect/shard1/election/95309864579170308-core_node1-n_0000000000
   [junit4]   2> 1261964 INFO  (coreZkRegister-4177-thread-1-processing-n:127.0.0.1:47555_k_g%2Fht x:collection1 s:shard1 c:control_collection r:core_node1) [n:127.0.0.1:47555_k_g%2Fht c:control_collection s:shard1 r:core_node1 x:collection1] o.a.s.c.ShardLeaderElectionContext Running the leader process for shard=shard1 and weAreReplacement=false and leaderVoteWait=180000
   [junit4]   2> 1261964 INFO  (coreZkRegister-4177-thread-1-processing-n:127.0.0.1:47555_k_g%2Fht x:collection1 s:shard1 c:control_collection r:core_node1) [n:127.0.0.1:47555_k_g%2Fht c:control_collection s:shard1 r:core_node1 x:collection1] o.a.s.c.ShardLeaderElectionContext Enough replicas found to continue.
   [junit4]   2> 1261964 INFO  (coreZkRegister-4177-thread-1-processing-n:127.0.0.1:47555_k_g%2Fht x:collection1 s:shard1 c:control_collection r:core_node1) [n:127.0.0.1:47555_k_g%2Fht c:control_collection s:shard1 r:core_node1 x:collection1] o.a.s.c.ShardLeaderElectionContext I may be the new leader - try and sync
   [junit4]   2> 1261965 INFO  (coreZkRegister-4177-thread-1-processing-n:127.0.0.1:47555_k_g%2Fht x:collection1 s:shard1 c:control_collection r:core_node1) [n:127.0.0.1:47555_k_g%2Fht c:control_collection s:shard1 r:core_node1 x:collection1] o.a.s.c.SyncStrategy Sync replicas to http://127.0.0.1:47555/k_g/ht/collection1/
   [junit4]   2> 1261965 INFO  (OverseerStateUpdate-95309864579170308-127.0.0.1:47555_k_g%2Fht-n_0000000000) [n:127.0.0.1:47555_k_g%2Fht    ] o.a.s.c.Overseer processMessage: queueSize: 1, message = {
   [junit4]   2>   "operation":"leader",
   [junit4]   2>   "shard":"shard1",
   [junit4]   2>   "collection":"control_collection"} current state version: 1
   [junit4]   2> 1261965 INFO  (coreZkRegister-4177-thread-1-processing-n:127.0.0.1:47555_k_g%2Fht x:collection1 s:shard1 c:control_collection r:core_node1) [n:127.0.0.1:47555_k_g%2Fht c:control_collection s:shard1 r:core_node1 x:collection1] o.a.s.c.SyncStrategy Sync Success - now sync replicas to me
   [junit4]   2> 1261965 INFO  (coreZkRegister-4177-thread-1-processing-n:127.0.0.1:47555_k_g%2Fht x:collection1 s:shard1 c:control_collection r:core_node1) [n:127.0.0.1:47555_k_g%2Fht c:control_collection s:shard1 r:core_node1 x:collection1] o.a.s.c.SyncStrategy http://127.0.0.1:47555/k_g/ht/collection1/ has no replicas
   [junit4]   2> 1261965 INFO  (coreZkRegister-4177-thread-1-processing-n:127.0.0.1:47555_k_g%2Fht x:collection1 s:shard1 c:control_collection r:core_node1) [n:127.0.0.1:47555_k_g%2Fht c:control_collection s:shard1 r:core_node1 x:collection1] o.a.s.c.c.SolrZkClient makePath: /collections/control_collection/leaders/shard1
   [junit4]   2> 1261966 INFO  (coreZkRegister-4177-thread-1-processing-n:127.0.0.1:47555_k_g%2Fht x:collection1 s:shard1 c:control_collection r:core_node1) [n:127.0.0.1:47555_k_g%2Fht c:control_collection s:shard1 r:core_node1 x:collection1] o.a.s.c.ShardLeaderElectionContextBase Creating leader registration node
   [junit4]   2> 1261966 INFO  (coreZkRegister-4177-thread-1-processing-n:127.0.0.1:47555_k_g%2Fht x:collection1 s:shard1 c:control_collection r:core_node1) [n:127.0.0.1:47555_k_g%2Fht c:control_collection s:shard1 r:core_node1 x:collection1] o.a.s.c.ShardLeaderElectionContext I am the new leader: http://127.0.0.1:47555/k_g/ht/collection1/ shard1
   [junit4]   2> 1261966 INFO  (OverseerStateUpdate-95309864579170308-127.0.0.1:47555_k_g%2Fht-n_0000000000) [n:127.0.0.1:47555_k_g%2Fht    ] o.a.s.c.Overseer processMessage: queueSize: 1, message = {
   [junit4]   2>   "operation":"leader",
   [junit4]   2>   "shard":"shard1",
   [junit4]   2>   "collection":"control_collection",
   [junit4]   2>   "base_url":"http://127.0.0.1:47555/k_g/ht",
   [junit4]   2>   "core":"collection1",
   [junit4]   2>   "state":"active"} current state version: 1
   [junit4]   2> 1262067 INFO  (zkCallback-1348-thread-1-processing-n:127.0.0.1:47555_k_g%2Fht) [n:127.0.0.1:47555_k_g%2Fht    ] o.a.s.c.c.ZkStateReader A cluster state change: [WatchedEvent state:SyncConnected type:NodeDataChanged path:/clusterstate.json], has occurred - updating... (live nodes size: [1])
   [junit4]   2> 1262117 INFO  (coreZkRegister-4177-thread-1-processing-n:127.0.0.1:47555_k_g%2Fht x:collection1 s:shard1 c:control_collection r:core_node1) [n:127.0.0.1:47555_k_g%2Fht c:control_collection s:shard1 r:core_node1 x:collection1] o.a.s.c.ZkController We are http://127.0.0.1:47555/k_g/ht/collection1/ and leader is http://127.0.0.1:47555/k_g/ht/collection1/
   [junit4]   2> 1262117 INFO  (coreZkRegister-4177-thread-1-processing-n:127.0.0.1:47555_k_g%2Fht x:collection1 s:shard1 c:control_collection r:core_node1) [n:127.0.0.1:47555_k_g%2Fht c:control_collection s:shard1 r:core_node1 x:collection1] o.a.s.c.ZkController No LogReplay needed for core=collection1 baseURL=http://127.0.0.1:47555/k_g/ht
   [junit4]   2> 1262117 INFO  (coreZkRegister-4177-thread-1-processing-n:127.0.0.1:47555_k_g%2Fht x:collection1 s:shard1 c:control_collection r:core_node1) [n:127.0.0.1:47555_k_g%2Fht c:control_collection s:shard1 r:core_node1 x:collection1] o.a.s.c.ZkController I am the leader, no recovery necessary
   [junit4]   2> 1262117 INFO  (coreZkRegister-4177-thread-1-processing-n:127.0.0.1:47555_k_g%2Fht x:collection1 s:shard1 c:control_collection r:core_node1) [n:127.0.0.1:47555_k_g%2Fht c:control_collection s:shard1 r:core_node1 x:collection1] o.a.s.c.ZkController publishing state=active
   [junit4]   2> 1262117 INFO  (coreZkRegister-4177-thread-1-processing-n:127.0.0.1:47555_k_g%2Fht x:collection1 s:shard1 c:control_collection r:core_node1) [n:127.0.0.1:47555_k_g%2Fht c:control_collection s:shard1 r:core_node1 x:collection1] o.a.s.c.ZkController numShards not found on descriptor - reading it from system property
   [junit4]   2> 1262118 INFO  (OverseerStateUpdate-95309864579170308-127.0.0.1:47555_k_g%2Fht-n_0000000000) [n:127.0.0.1:47555_k_g%2Fht    ] o.a.s.c.Overseer processMessage: queueSize: 1, message = {
   [junit4]   2>   "core":"collection1",
   [junit4]   2>   "core_node_name":"core_node1",
   [junit4]   2>   "roles":null,
   [junit4]   2>   "base_url":"http://127.0.0.1:47555/k_g/ht",
   [junit4]   2>   "node_name":"127.0.0.1:47555_k_g%2Fht",
   [junit4]   2>   "numShards":"1",
   [junit4]   2>   "state":"active",
   [junit4]   2>   "shard":"shard1",
   [junit4]   2>   "collection":"control_collection",
   [junit4]   2>   "operation":"state"} current state version: 2
   [junit4]   2> 1262118 INFO  (OverseerStateUpdate-95309864579170308-127.0.0.1:47555_k_g%2Fht-n_0000000000) [n:127.0.0.1:47555_k_g%2Fht    ] o.a.s.c.o.ReplicaMutator Update state numShards=1 message={
   [junit4]   2>   "core":"collection1",
   [junit4]   2>   "core_node_name":"core_node1",
   [junit4]   2>   "roles":null,
   [junit4]   2>   "base_url":"http://127.0.0.1:47555/k_g/ht",
   [junit4]   2>   "node_name":"127.0.0.1:47555_k_g%2Fht",
   [junit4]   2>   "numShards":"1",
   [junit4]   2>   "state":"active",
   [junit4]   2>   "shard":"shard1",
   [junit4]   2>   "collection":"control_collection",
   [junit4]   2>   "operation":"state"}
   [junit4]   2> 1262219 INFO  (zkCallback-1348-thread-1-processing-n:127.0.0.1:47555_k_g%2Fht) [n:127.0.0.1:47555_k_g%2Fht    ] o.a.s.c.c.ZkStateReader A cluster state change: [WatchedEvent state:SyncConnected type:NodeDataChanged path:/clusterstate.json], has occurred - updating... (live nodes size: [1])
   [junit4]   2> 1262373 INFO  (TEST-CustomCollectionTest.test-seed#[27A9A88727022EB5]) [    ] o.a.s.c.c.SolrZkClient Using default ZkCredentialsProvider
   [junit4]   2> 1262374 INFO  (TEST-CustomCollectionTest.test-seed#[27A9A88727022EB5]) [    ] o.a.s.c.c.ConnectionManager Waiting for client to connect to ZooKeeper
   [junit4]   2> 1262374 INFO  (zkCallback-1350-thread-1) [    ] o.a.s.c.c.ConnectionManager Watcher org.apache.solr.common.cloud.ConnectionManager@6b93916 name:ZooKeeperConnection Watcher:127.0.0.1:52089/solr got event WatchedEvent state:SyncConnected type:None path:null path:null type:None
   [junit4]   2> 1262374 INFO  (TEST-CustomCollectionTest.test-seed#[27A9A88727022EB5]) [    ] o.a.s.c.c.ConnectionManager Client is connected to ZooKeeper
   [junit4]   2> 1262375 INFO  (TEST-CustomCollectionTest.test-seed#[27A9A88727022EB5]) [    ] o.a.s.c.c.SolrZkClient Using default ZkACLProvider
   [junit4]   2> 1262375 INFO  (TEST-CustomCollectionTest.test-seed#[27A9A88727022EB5]) [    ] o.a.s.c.c.ZkStateReader Updating cluster state from ZooKeeper... 
   [junit4]   2> 1262375 INFO  (TEST-CustomCollectionTest.test-seed#[27A9A88727022EB5]) [    ] o.a.s.c.ChaosMonkey monkey: init - expire sessions:false cause connection loss:false
   [junit4]   2> 1262426 INFO  (TEST-CustomCollectionTest.test-seed#[27A9A88727022EB5]) [    ] o.a.s.SolrTestCaseJ4 Writing core.properties file to /home/jenkins/workspace/Lucene-Solr-5.x-Linux/solr/build/solr-core/test/J2/temp/solr.cloud.CustomCollectionTest_27A9A88727022EB5-001/shard-1-001/cores/collection1
   [junit4]   2> 1262427 INFO  (TEST-CustomCollectionTest.test-seed#[27A9A88727022EB5]) [    ] o.a.s.c.AbstractFullDistribZkTestBase create jetty 1 in directory /home/jenkins/workspace/Lucene-Solr-5.x-Linux/solr/build/solr-core/test/J2/temp/solr.cloud.CustomCollectionTest_27A9A88727022EB5-001/shard-1-001
   [junit4]   2> 1262427 INFO  (TEST-CustomCollectionTest.test-seed#[27A9A88727022EB5]) [    ] o.e.j.s.Server jetty-9.2.13.v20150730
   [junit4]   2> 1262428 INFO  (TEST-CustomCollectionTest.test-seed#[27A9A88727022EB5]) [    ] o.e.j.s.h.ContextHandler Started o.e.j.s.ServletContextHandler@1bdbe0cd{/k_g/ht,null,AVAILABLE}
   [junit4]   2> 1262428 INFO  (TEST-CustomCollectionTest.test-seed#[27A9A88727022EB5]) [    ] o.e.j.s.ServerConnector Started ServerConnector@9d1fd7e{HTTP/1.1}{127.0.0.1:59702}
   [junit4]   2> 1262428 INFO  (TEST-CustomCollectionTest.test-seed#[27A9A88727022EB5]) [    ] o.e.j.s.Server Started @1264178ms
   [junit4]   2> 1262428 INFO  (TEST-CustomCollectionTest.test-seed#[27A9A88727022EB5]) [    ] o.a.s.c.s.e.JettySolrRunner Jetty properties: {solr.data.dir=/home/jenkins/workspace/Lucene-Solr-5.x-Linux/solr/build/solr-core/test/J2/temp/solr.cloud.CustomCollectionTest_27A9A88727022EB5-001/tempDir-001/jetty1, solrconfig=solrconfig.xml, hostContext=/k_g/ht, hostPort=59702, coreRootDirectory=/home/jenkins/workspace/Lucene-Solr-5.x-Linux/solr/build/solr-core/test/J2/temp/solr.cloud.CustomCollectionTest_27A9A88727022EB5-001/shard-1-001/cores}
   [junit4]   2> 1262428 INFO  (TEST-CustomCollectionTest.test-seed#[27A9A88727022EB5]) [    ] o.a.s.s.SolrDispatchFilter SolrDispatchFilter.init(): sun.misc.Launcher$AppClassLoader@73d16e93
   [junit4]   2> 1262429 INFO  (TEST-CustomCollectionTest.test-seed#[27A9A88727022EB5]) [    ] o.a.s.c.SolrResourceLoader new SolrResourceLoader for directory: '/home/jenkins/workspace/Lucene-Solr-5.x-Linux/solr/build/solr-core/test/J2/temp/solr.cloud.CustomCollectionTest_27A9A88727022EB5-001/shard-1-001'
   [junit4]   2> 1262429 INFO  (TEST-CustomCollectionTest.test-seed#[27A9A88727022EB5]) [    ] o.a.s.c.SolrResourceLoader JNDI not configured for solr (NoInitialContextEx)
   [junit4]   2> 1262429 INFO  (TEST-CustomCollectionTest.test-seed#[27A9A88727022EB5]) [    ] o.a.s.c.SolrResourceLoader solr home defaulted to 'solr/' (could not find system property or JNDI)
   [junit4]   2> 1262429 INFO  (TEST-CustomCollectionTest.test-seed#[27A9A88727022EB5]) [    ] o.a.s.c.c.SolrZkClient Using default ZkCredentialsProvider
   [junit4]   2> 1262429 INFO  (TEST-CustomCollectionTest.test-seed#[27A9A88727022EB5]) [    ] o.a.s.c.c.ConnectionManager Waiting for client to connect to ZooKeeper
   [junit4]   2> 1262430 INFO  (zkCallback-1351-thread-1) [    ] o.a.s.c.c.ConnectionManager Watcher org.apache.solr.common.cloud.ConnectionManager@5d52c56a name:ZooKeeperConnection Watcher:127.0.0.1:52089/solr got event WatchedEvent state:SyncConnected type:None path:null path:null type:None
   [junit4]   2> 1262430 INFO  (TEST-CustomCollectionTest.test-seed#[27A9A88727022EB5]) [    ] o.a.s.c.c.ConnectionManager Client is connected to ZooKeeper
   [junit4]   2> 1262430 INFO  (TEST-CustomCollectionTest.test-seed#[27A9A88727022EB5]) [    ] o.a.s.c.c.SolrZkClient Using default ZkACLProvider
   [junit4]   2> 1262430 INFO  (TEST-CustomCollectionTest.test-seed#[27A9A88727022EB5]) [    ] o.a.s.s.SolrDispatchFilter Loading solr.xml from SolrHome (not found in ZooKeeper)
   [junit4]   2> 1262430 INFO  (TEST-CustomCollectionTest.test-seed#[27A9A88727022EB5]) [    ] o.a.s.c.SolrXmlConfig Loading container configuration from /home/jenkins/workspace/Lucene-Solr-5.x-Linux/solr/build/solr-core/test/J2/temp/solr.cloud.CustomCollectionTest_27A9A88727022EB5-001/shard-1-001/solr.xml
   [junit4]   2> 1262433 INFO  (TEST-CustomCollectionTest.test-seed#[27A9A88727022EB5]) [    ] o.a.s.c.CorePropertiesLocator Config-defined core root directory: /home/jenkins/workspace/Lucene-Solr-5.x-Linux/solr/build/solr-core/test/J2/temp/solr.cloud.CustomCollectionTest_27A9A88727022EB5-001/shard-1-001/cores
   [junit4]   2> 1262433 INFO  (TEST-CustomCollectionTest.test-seed#[27A9A88727022EB5]) [    ] o.a.s.c.CoreContainer New CoreContainer 936550736
   [junit4]   2> 1262433 INFO  (TEST-CustomCollectionTest.test-seed#[27A9A88727022EB5]) [    ] o.a.s.c.CoreContainer Loading cores into CoreContainer [instanceDir=/home/jenkins/workspace/Lucene-Solr-5.x-Linux/solr/build/solr-core/test/J2/temp/solr.cloud.CustomCollectionTest_27A9A88727022EB5-001/shard-1-001]
   [junit4]   2> 1262433 WARN  (TEST-CustomCollectionTest.test-seed#[27A9A88727022EB5]) [    ] o.a.s.c.CoreContainer Couldn't add files from /home/jenkins/workspace/Lucene-Solr-5.x-Linux/solr/build/solr-core/test/J2/temp/solr.cloud.CustomCollectionTest_27A9A88727022EB5-001/shard-1-001/lib to classpath: /home/jenkins/workspace/Lucene-Solr-5.x-Linux/solr/build/solr-core/test/J2/temp/solr.cloud.CustomCollectionTest_27A9A88727022EB5-001/shard-1-001/lib
   [junit4]   2> 1262434 INFO  (TEST-CustomCollectionTest.test-seed#[27A9A88727022EB5]) [    ] o.a.s.h.c.HttpShardHandlerFactory created with socketTimeout : 90000,urlScheme : ,connTimeout : 15000,maxConnectionsPerHost : 20,maxConnections : 10000,corePoolSize : 0,maximumPoolSize : 2147483647,maxThreadIdleTime : 5,sizeOfQueue : -1,fairnessPolicy : false,useRetries : false,
   [junit4]   2> 1262434 INFO  (TEST-CustomCollectionTest.test-seed#[27A9A88727022EB5]) [    ] o.a.s.u.UpdateShardHandler Creating UpdateShardHandler HTTP client with params: socketTimeout=340000&connTimeout=45000&retry=true
   [junit4]   2> 1262434 INFO  (TEST-CustomCollectionTest.test-seed#[27A9A88727022EB5]) [    ] o.a.s.l.LogWatcher SLF4J impl is org.slf4j.impl.Log4jLoggerFactory
   [junit4]   2> 1262434 INFO  (TEST-CustomCollectionTest.test-seed#[27A9A88727022EB5]) [    ] o.a.s.l.LogWatcher Registering Log Listener [Log4j (org.slf4j.impl.Log4jLoggerFactory)]
   [junit4]   2> 1262434 INFO  (TEST-CustomCollectionTest.test-seed#[27A9A88727022EB5]) [    ] o.a.s.c.ZkContainer Zookeeper client=127.0.0.1:52089/solr
   [junit4]   2> 1262435 INFO  (TEST-CustomCollectionTest.test-seed#[27A9A88727022EB5]) [    ] o.a.s.c.ZkController zkHost includes chroot
   [junit4]   2> 1262435 INFO  (TEST-CustomCollectionTest.test-seed#[27A9A88727022EB5]) [    ] o.a.s.c.c.SolrZkClient Using default ZkCredentialsProvider
   [junit4]   2> 1262435 INFO  (TEST-CustomCollectionTest.test-seed#[27A9A88727022EB5]) [    ] o.a.s.c.c.ConnectionManager Waiting for client to connect to ZooKeeper
   [junit4]   2> 1262435 INFO  (zkCallback-1354-thread-1) [    ] o.a.s.c.c.ConnectionManager Watcher org.apache.solr.common.cloud.ConnectionManager@2254fffe name:ZooKeeperConnection Watcher:127.0.0.1:52089 got event WatchedEvent state:SyncConnected type:None path:null path:null type:None
   [junit4]   2> 1262435 INFO  (TEST-CustomCollectionTest.test-seed#[27A9A88727022EB5]) [    ] o.a.s.c.c.ConnectionManager Client is connected to ZooKeeper
   [junit4]   2> 1262436 INFO  (TEST-CustomCollectionTest.test-seed#[27A9A88727022EB5]) [    ] o.a.s.c.c.SolrZkClient Using default ZkACLProvider
   [junit4]   2> 1262436 INFO  (TEST-CustomCollectionTest.test-seed#[27A9A88727022EB5]) [n:127.0.0.1:59702_k_g%2Fht    ] o.a.s.c.c.ConnectionManager Waiting for client to connect to ZooKeeper
   [junit4]   2> 1262437 INFO  (zkCallback-1355-thread-1-processing-n:127.0.0.1:59702_k_g%2Fht) [n:127.0.0.1:59702_k_g%2Fht    ] o.a.s.c.c.ConnectionManager Watcher org.apache.solr.common.cloud.ConnectionManager@34e3ef38 name:ZooKeeperConnection Watcher:127.0.0.1:52089/solr got event WatchedEvent state:SyncConnected type:None path:null path:null type:None
   [junit4]   2> 1262437 INFO  (TEST-CustomCollectionTest.test-seed#[27A9A88727022EB5]) [n:127.0.0.1:59702_k_g%2Fht    ] o.a.s.c.c.ConnectionManager Client is connected to ZooKeeper
   [junit4]   2> 1262438 INFO  (TEST-CustomCollectionTest.test-seed#[27A9A88727022EB5]) [n:127.0.0.1:59702_k_g%2Fht    ] o.a.s.c.c.ZkStateReader Updating cluster state from ZooKeeper... 
   [junit4]   2> 1263440 INFO  (TEST-CustomCollectionTest.test-seed#[27A9A88727022EB5]) [n:127.0.0.1:59702_k_g%2Fht    ] o.a.s.c.ZkController Register node as live in ZooKeeper:/live_nodes/127.0.0.1:59702_k_g%2Fht
   [junit4]   2> 1263440 INFO  (TEST-CustomCollectionTest.test-seed#[27A9A88727022EB5]) [n:127.0.0.1:59702_k_g%2Fht    ] o.a.s.c.c.SolrZkClient makePath: /live_nodes/127.0.0.1:59702_k_g%2Fht
   [junit4]   2> 1263441 INFO  (zkCallback-1350-thread-1) [    ] o.a.s.c.c.ZkStateReader A live node change: [WatchedEvent state:SyncConnected type:NodeChildrenChanged path:/live_nodes], has occurred - updating... (live nodes size: [1])
   [junit4]   2> 1263441 INFO  (zkCallback-1355-thread-1-processing-n:127.0.0.1:59702_k_g%2Fht) [n:127.0.0.1:59702_k_g%2Fht    ] o.a.s.c.c.ZkStateReader A live node change: [WatchedEvent state:SyncConnected type:NodeChildrenChanged path:/live_nodes], has occurred - updating... (live nodes size: [1])
   [junit4]   2> 1263441 INFO  (zkCallback-1348-thread-1-processing-n:127.0.0.1:47555_k_g%2Fht) [n:127.0.0.1:47555_k_g%2Fht    ] o.a.s.c.c.ZkStateReader A live node change: [WatchedEvent state:SyncConnected type:NodeChildrenChanged path:/live_nodes], has occurred - updating... (live nodes size: [1])
   [junit4]   2> 1263441 INFO  (TEST-CustomCollectionTest.test-seed#[27A9A88727022EB5]) [n:127.0.0.1:59702_k_g%2Fht    ] o.a.s.c.Overseer Overseer (id=null) closing
   [junit4]   2> 1263442 INFO  (TEST-CustomCollectionTest.test-seed#[27A9A88727022EB5]) [n:127.0.0.1:59702_k_g%2Fht    ] o.a.s.c.LeaderElector Joined leadership election with path: /overseer_elect/election/95309864579170312-127.0.0.1:59702_k_g%2Fht-n_0000000001
   [junit4]   2> 1263442 INFO  (TEST-CustomCollectionTest.test-seed#[27A9A88727022EB5]) [n:127.0.0.1:59702_k_g%2Fht    ] o.a.s.c.LeaderElector Watching path /overseer_elect/election/95309864579170308-127.0.0.1:47555_k_g%2Fht-n_0000000000 to know if I could be the leader
   [junit4]   2> 1263456 INFO  (TEST-CustomCollectionTest.test-seed#[27A9A88727022EB5]) [n:127.0.0.1:59702_k_g%2Fht    ] o.a.s.c.CoreContainer Security conf doesn't exist. Skipping setup for authorization module.
   [junit4]   2> 1263456 INFO  (TEST-CustomCollectionTest.test-seed#[27A9A88727022EB5]) [n:127.0.0.1:59702_k_g%2Fht    ] o.a.s.c.CoreContainer No authentication plugin used.
   [junit4]   2> 1263457 INFO  (TEST-CustomCollectionTest.test-seed#[27A9A88727022EB5]) [n:127.0.0.1:59702_k_g%2Fht    ] o.a.s.c.CorePropertiesLocator Looking for core definitions underneath /home/jenkins/workspace/Lucene-Solr-5.x-Linux/solr/build/solr-core/test/J2/temp/solr.cloud.CustomCollectionTest_27A9A88727022EB5-001/shard-1-001/cores
   [junit4]   2> 1263457 INFO  (TEST-CustomCollectionTest.test-seed#[27A9A88727022EB5]) [n:127.0.0.1:59702_k_g%2Fht    ] o.a.s.c.CoreDescriptor Created CoreDescriptor: {name=collection1, config=solrconfig.xml, transient=false, schema=schema.xml, loadOnStartup=true, configSetProperties=configsetprops.json, collection=collection1, coreNodeName=, dataDir=data/, shard=}
   [junit4]   2> 1263457 INFO  (TEST-CustomCollectionTest.test-seed#[27A9A88727022EB5]) [n:127.0.0.1:59702_k_g%2Fht    ] o.a.s.c.CorePropertiesLocator Found core collection1 in /home/jenkins/workspace/Lucene-Solr-5.x-Linux/solr/build/solr-core/test/J2/temp/solr.cloud.CustomCollectionTest_27A9A88727022EB5-001/shard-1-001/cores/collection1
   [junit4]   2> 1263457 INFO  (TEST-CustomCollectionTest.test-seed#[27A9A88727022EB5]) [n:127.0.0.1:59702_k_g%2Fht    ] o.a.s.c.CorePropertiesLocator Found 1 core definitions
   [junit4]   2> 1263460 INFO  (TEST-CustomCollectionTest.test-seed#[27A9A88727022EB5]) [n:127.0.0.1:59702_k_g%2Fht    ] o.a.s.s.SolrDispatchFilter user.dir=/home/jenkins/workspace/Lucene-Solr-5.x-Linux/solr/build/solr-core/test/J2
   [junit4]   2> 1263460 INFO  (TEST-CustomCollectionTest.test-seed#[27A9A88727022EB5]) [n:127.0.0.1:59702_k_g%2Fht    ] o.a.s.s.SolrDispatchFilter SolrDispatchFilter.init() done
   [junit4]   2> 1263460 INFO  (coreLoadExecutor-4194-thread-1-processing-n:127.0.0.1:59702_k_g%2Fht) [n:127.0.0.1:59702_k_g%2Fht c:collection1   x:collection1] o.a.s.c.ZkController publishing state=down
   [junit4]   2> 1263460 INFO  (coreLoadExecutor-4194-thread-1-processing-n:127.0.0.1:59702_k_g%2Fht) [n:127.0.0.1:59702_k_g%2Fht c:collection1   x:collection1] o.a.s.c.ZkController numShards not found on descriptor - reading it from system property
   [junit4]   2> 1263461 INFO  (coreLoadExecutor-4194-thread-1-processing-n:127.0.0.1:59702_k_g%2Fht) [n:127.0.0.1:59702_k_g%2Fht c:collection1   x:collection1] o.a.s.c.ZkController look for our core node name
   [junit4]   2> 1263461 INFO  (OverseerStateUpdate-95309864579170308-127.0.0.1:47555_k_g%2Fht-n_0000000000) [n:127.0.0.1:47555_k_g%2Fht    ] o.a.s.c.Overseer processMessage: queueSize: 1, message = {
   [junit4]   2>   "core":"collection1",
   [junit4]   2>   "roles":null,
   [junit4]   2>   "base_url":"http://127.0.0.1:59702/k_g/ht",
   [junit4]   2>   "node_name":"127.0.0.1:59702_k_g%2Fht",
   [junit4]   2>   "numShards":"2",
   [junit4]   2>   "state":"down",
   [junit4]   2>   "shard":null,
   [junit4]   2>   "collection":"collection1",
   [junit4]   2>   "operation":"state"} current state version: 3
   [junit4]   2> 1263461 INFO  (OverseerStateUpdate-95309864579170308-127.0.0.1:47555_k_g%2Fht-n_0000000000) [n:127.0.0.1:47555_k_g%2Fht    ] o.a.s.c.o.ReplicaMutator Update state numShards=2 message={
   [junit4]   2>   "core":"collection1",
   [junit4]   2>   "roles":null,
   [junit4]   2>   "base_url":"http://127.0.0.1:59702/k_g/ht",
   [junit4]   2>   "node_name":"127.0.0.1:59702_k_g%2Fht",
   [junit4]   2>   "numShards":"2",
   [junit4]   2>   "state":"down",
   [junit4]   2>   "shard":null,
   [junit4]   2>   "collection":"collection1",
   [junit4]   2>   "operation":"state"}
   [junit4]   2> 1263461 INFO  (OverseerStateUpdate-95309864579170308-127.0.0.1:47555_k_g%2Fht-n_0000000000) [n:127.0.0.1:47555_k_g%2Fht    ] o.a.s.c.o.ClusterStateMutator building a new cName: collection1
   [junit4]   2> 1263461 INFO  (OverseerStateUpdate-95309864579170308-127.0.0.1:47555_k_g%2Fht-n_0000000000) [n:127.0.0.1:47555_k_g%2Fht    ] o.a.s.c.o.ReplicaMutator Assigning new node to shard shard=shard2
   [junit4]   2> 1263562 INFO  (zkCallback-1350-thread-1) [    ] o.a.s.c.c.ZkStateReader A cluster state change: [WatchedEvent state:SyncConnected type:NodeDataChanged path:/clusterstate.json], has occurred - updating... (live nodes size: [2])
   [junit4]   2> 1263562 INFO  (zkCallback-1355-thread-1-processing-n:127.0.0.1:59702_k_g%2Fht) [n:127.0.0.1:59702_k_g%2Fht    ] o.a.s.c.c.ZkStateReader A cluster state change: [WatchedEvent state:SyncConnected type:NodeDataChanged path:/clusterstate.json], has occurred - updating... (live nodes size: [2])
   [junit4]   2> 1263562 INFO  (zkCallback-1348-thread-1-processing-n:127.0.0.1:47555_k_g%2Fht) [n:127.0.0.1:47555_k_g%2Fht    ] o.a.s.c.c.ZkStateReader A cluster state change: [WatchedEvent state:SyncConnected type:NodeDataChanged path:/clusterstate.json], has occurred - updating... (live nodes size: [2])
   [junit4]   2> 1264461 INFO  (coreLoadExecutor-4194-thread-1-processing-n:127.0.0.1:59702_k_g%2Fht) [n:127.0.0.1:59702_k_g%2Fht c:collection1   x:collection1] o.a.s.c.ZkController waiting to find shard id in clusterstate for collection1
   [junit4]   2> 1264461 INFO  (coreLoadExecutor-4194-thread-1-processing-n:127.0.0.1:59702_k_g%2Fht) [n:127.0.0.1:59702_k_g%2Fht c:collection1   x:collection1] o.a.s.c.ZkController Check for collection zkNode:collection1
   [junit4]   2> 1264462 INFO  (coreLoadExecutor-4194-thread-1-processing-n:127.0.0.1:59702_k_g%2Fht) [n:127.0.0.1:59702_k_g%2Fht c:collection1   x:collection1] o.a.s.c.ZkController Collection zkNode exists
   [junit4]   2> 1264462 INFO  (coreLoadExecutor-4194-thread-1-processing-n:127.0.0.1:59702_k_g%2Fht) [n:127.0.0.1:59702_k_g%2Fht c:collection1   x:collection1] o.a.s.c.c.ZkStateReader Load collection config from: [/collections/collection1]
   [junit4]   2> 1264462 INFO  (coreLoadExecutor-4194-thread-1-processing-n:127.0.0.1:59702_k_g%2Fht) [n:127.0.0.1:59702_k_g%2Fht c:collection1   x:collection1] o.a.s.c.c.ZkStateReader path=[/collections/collection1] [configName]=[conf1] specified config exists in ZooKeeper
   [junit4]   2> 1264462 INFO  (coreLoadExecutor-4194-thread-1-processing-n:127.0.0.1:59702_k_g%2Fht) [n:127.0.0.1:59702_k_g%2Fht c:collection1   x:collection1] o.a.s.c.SolrResourceLoader new SolrResourceLoader for directory: '/home/jenkins/workspace/Lucene-Solr-5.x-Linux/solr/build/solr-core/test/J2/temp/solr.cloud.CustomCollectionTest_27A9A88727022EB5-001/shard-1-001/cores/collection1'
   [junit4]   2> 1264462 INFO  (coreLoadExecutor-4194-thread-1-processing-n:127.0.0.1:59702_k_g%2Fht) [n:127.0.0.1:59702_k_g%2Fht c:collection1   x:collection1] o.a.s.c.SolrResourceLoader JNDI not configured for solr (NoInitialContextEx)
   [junit4]   2> 1264462 INFO  (coreLoadExecutor-4194-thread-1-processing-n:127.0.0.1:59702_k_g%2Fht) [n:127.0.0.1:59702_k_g%2Fht c:collection1   x:collection1] o.a.s.c.SolrResourceLoader solr home defaulted to 'solr/' (could not find system property or JNDI)
   [junit4]   2> 1264463 INFO  (coreLoadExecutor-4194-thread-1-processing-n:127.0.0.1:59702_k_g%2Fht) [n:127.0.0.1:59702_k_g%2Fht c:collection1   x:collection1] o.a.s.c.Config loaded config solrconfig.xml with version 0 
   [junit4]   2> 1264466 INFO  (coreLoadExecutor-4194-thread-1-processing-n:127.0.0.1:59702_k_g%2Fht) [n:127.0.0.1:59702_k_g%2Fht c:collection1   x:collection1] o.a.s.c.SolrConfig current version of requestparams : -1
   [junit4]   2> 1264468 INFO  (coreLoadExecutor-4194-thread-1-processing-n:127.0.0.1:59702_k_g%2Fht) [n:127.0.0.1:59702_k_g%2Fht c:collection1   x:collection1] o.a.s.c.SolrConfig Using Lucene MatchVersion: 5.5.0
   [junit4]   2> 1264474 INFO  (coreLoadExecutor-4194-thread-1-processing-n:127.0.0.1:59702_k_g%2Fht) [n:127.0.0.1:59702_k_g%2Fht c:collection1   x:collection1] o.a.s.c.SolrConfig Loaded SolrConfig: solrconfig.xml
   [junit4]   2> 1264477 INFO  (coreLoadExecutor-4194-thread-1-processing-n:127.0.0.1:59702_k_g%2Fht) [n:127.0.0.1:59702_k_g%2Fht c:collection1   x:collection1] o.a.s.s.IndexSchema [collection1] Schema name=test
   [junit4]   2> 1264528 INFO  (coreLoadExecutor-4194-thread-1-processing-n:127.0.0.1:59702_k_g%2Fht) [n:127.0.0.1:59702_k_g%2Fht c:collection1   x:collection1] o.a.s.s.OpenExchangeRatesOrgProvider Initialized with rates=open-exchange-rates.json, refreshInterval=1440.
   [junit4]   2> 1264531 INFO  (coreLoadExecutor-4194-thread-1-processing-n:127.0.0.1:59702_k_g%2Fht) [n:127.0.0.1:59702_k_g%2Fht c:collection1   x:collection1] o.a.s.s.IndexSchema default search field in schema is text
   [junit4]   2> 1264532 INFO  (coreLoadExecutor-4194-thread-1-processing-n:127.0.0.1:59702_k_g%2Fht) [n:127.0.0.1:59702_k_g%2Fht c:collection1   x:collection1] o.a.s.s.IndexSchema unique key field: id
   [junit4]   2> 1264535 INFO  (coreLoadExecutor-4194-thread-1-processing-n:127.0.0.1:59702_k_g%2Fht) [n:127.0.0.1:59702_k_g%2Fht c:collection1   x:collection1] o.a.s.s.FileExchangeRateProvider Reloading exchange rates from file currency.xml
   [junit4]   2> 1264536 INFO  (coreLoadExecutor-4194-thread-1-processing-n:127.0.0.1:59702_k_g%2Fht) [n:127.0.0.1:59702_k_g%2Fht c:collection1   x:collection1] o.a.s.s.FileExchangeRateProvider Reloading exchange rates from file currency.xml
   [junit4]   2> 1264536 INFO  (coreLoadExecutor-4194-thread-1-processing-n:127.0.0.1:59702_k_g%2Fht) [n:127.0.0.1:59702_k_g%2Fht c:collection1   x:collection1] o.a.s.s.OpenExchangeRatesOrgProvider Reloading exchange rates from open-exchange-rates.json
   [junit4]   2> 1264537 INFO  (coreLoadExecutor-4194-thread-1-processing-n:127.0.0.1:59702_k_g%2Fht) [n:127.0.0.1:59702_k_g%2Fht c:collection1   x:collection1] o.a.s.s.OpenExchangeRatesOrgProvider Reloading exchange rates from open-exchange-rates.json
   [junit4]   2> 1264537 INFO  (coreLoadExecutor-4194-thread-1-processing-n:127.0.0.1:59702_k_g%2Fht) [n:127.0.0.1:59702_k_g%2Fht c:collection1   x:collection1] o.a.s.c.ConfigSetProperties Did not find ConfigSet properties, assuming default properties: Can't find resource 'configsetprops.json' in classpath or '/configs/conf1', cwd=/home/jenkins/workspace/Lucene-Solr-5.x-Linux/solr/build/solr-core/test/J2
   [junit4]   2> 1264537 INFO  (coreLoadExecutor-4194-thread-1-processing-n:127.0.0.1:59702_k_g%2Fht) [n:127.0.0.1:59702_k_g%2Fht c:collection1   x:collection1] o.a.s.c.CoreContainer Creating SolrCore 'collection1' using configuration from collection collection1
   [junit4]   2> 1264538 INFO  (coreLoadExecutor-4194-thread-1-processing-n:127.0.0.1:59702_k_g%2Fht) [n:127.0.0.1:59702_k_g%2Fht c:collection1 s:shard2 r:core_node1 x:collection1] o.a.s.c.SolrCore org.apache.solr.core.MockDirectoryFactory
   [junit4]   2> 1264538 INFO  (coreLoadExecutor-4194-thread-1-processing-n:127.0.0.1:59702_k_g%2Fht) [n:127.0.0.1:59702_k_g%2Fht c:collection1 s:shard2 r:core_node1 x:collection1] o.a.s.c.SolrCore [[collection1] ] Opening new SolrCore at [/home/jenkins/workspace/Lucene-Solr-5.x-Linux/solr/build/solr-core/test/J2/temp/solr.cloud.CustomCollectionTest_27A9A88727022EB5-001/shard-1-001/cores/collection1], dataDir=[/home/jenkins/workspace/Lucene-Solr-5.x-Linux/solr/build/solr-core/test/J2/temp/solr.cloud.CustomCollectionTest_27A9A88727022EB5-001/shard-1-001/cores/collection1/data/]
   [junit4]   2> 1264538 INFO  (coreLoadExecutor-4194-thread-1-processing-n:127.0.0.1:59702_k_g%2Fht) [n:127.0.0.1:59702_k_g%2Fht c:collection1 s:shard2 r:core_node1 x:collection1] o.a.s.c.JmxMonitoredMap JMX monitoring is enabled. Adding Solr mbeans to JMX Server: com.sun.jmx.mbeanserver.JmxMBeanServer@5ad69328
   [junit4]   2> 1264538 INFO  (coreLoadExecutor-4194-thread-1-processing-n:127.0.0.1:59702_k_g%2Fht) [n:127.0.0.1:59702_k_g%2Fht c:collection1 s:shard2 r:core_node1 x:collection1] o.a.s.c.CachingDirectoryFactory return new directory for /home/jenkins/workspace/Lucene-Solr-5.x-Linux/solr/build/solr-core/test/J2/temp/solr.cloud.CustomCollectionTest_27A9A88727022EB5-001/shard-1-001/cores/collection1/data
   [junit4]   2> 1264538 INFO  (coreLoadExecutor-4194-thread-1-processing-n:127.0.0.1:59702_k_g%2Fht) [n:127.0.0.1:59702_k_g%2Fht c:collection1 s:shard2 r:core_node1 x:collection1] o.a.s.c.SolrCore New index directory detected: old=null new=/home/jenkins/workspace/Lucene-Solr-5.x-Linux/solr/build/solr-core/test/J2/temp/solr.cloud.CustomCollectionTest_27A9A88727022EB5-001/shard-1-001/cores/collection1/data/index/
   [junit4]   2> 1264538 WARN  (coreLoadExecutor-4194-thread-1-processing-n:127.0.0.1:59702_k_g%2Fht) [n:127.0.0.1:59702_k_g%2Fht c:collection1 s:shard2 r:core_node1 x:collection1] o.a.s.c.SolrCore [collection1] Solr index directory '/home/jenkins/workspace/Lucene-Solr-5.x-Linux/solr/build/solr-core/test/J2/temp/solr.cloud.CustomCollectionTest_27A9A88727022EB5-001/shard-1-001/cores/collection1/data/index' doesn't exist. Creating new index...
   [junit4]   2> 1264538 INFO  (coreLoadExecutor-4194-thread-1-processing-n:127.0.0.1:59702_k_g%2Fht) [n:127.0.0.1:59702_k_g%2Fht c:collection1 s:shard2 r:core_node1 x:collection1] o.a.s.c.CachingDirectoryFactory return new directory for /home/jenkins/workspace/Lucene-Solr-5.x-Linux/solr/build/solr-core/test/J2/temp/solr.cloud.CustomCollectionTest_27A9A88727022EB5-001/shard-1-001/cores/collection1/data/index
   [junit4]   2> 1264538 INFO  (coreLoadExecutor-4194-thread-1-processing-n:127.0.0.1:59702_k_g%2Fht) [n:127.0.0.1:59702_k_g%2Fht c:collection1 s:shard2 r:core_node1 x:collection1] o.a.s.u.RandomMergePolicy RandomMergePolicy wrapping class org.apache.lucene.index.TieredMergePolicy: [TieredMergePolicy: maxMergeAtOnce=13, maxMergeAtOnceExplicit=18, maxMergedSegmentMB=70.5126953125, floorSegmentMB=1.154296875, forceMergeDeletesPctAllowed=1.849036928595994, segmentsPerTier=47.0, maxCFSSegmentSizeMB=8.796093022207999E12, noCFSRatio=0.22238863716551815
   [junit4]   2> 1264539 INFO  (coreLoadExecutor-4194-thread-1-processing-n:127.0.0.1:59702_k_g%2Fht) [n:127.0.0.1:59702_k_g%2Fht c:collection1 s:shard2 r:core_node1 x:collection1] o.a.s.c.SolrDeletionPolicy SolrDeletionPolicy.onCommit: commits: num=1
   [junit4]   2> 	commit{dir=MockDirectoryWrapper(RAMDirectory@198043b9 lockFactory=org.apache.lucene.store.SingleInstanceLockFactory@7862b5cd),segFN=segments_1,generation=1}
   [junit4]   2> 1264539 INFO  (coreLoadExecutor-4194-thread-1-processing-n:127.0.0.1:59702_k_g%2Fht) [n:127.0.0.1:59702_k_g%2Fht c:collection1 s:shard2 r:core_node1 x:collection1] o.a.s.c.SolrDeletionPolicy newest commit generation = 1
   [junit4]   2> 1264539 INFO  (OldIndexDirectoryCleanupThreadForCore-collection1) [n:127.0.0.1:59702_k_g%2Fht c:collection1 s:shard2 r:core_node1 x:collection1] o.a.s.c.SolrCore Looking for old index directories to cleanup for core collection1 in /home/jenkins/workspace/Lucene-Solr-5.x-Linux/solr/build/solr-core/test/J2/temp/solr.cloud.CustomCollectionTest_27A9A88727022EB5-001/shard-1-001/cores/collection1/data/
   [junit4]   2> 1264539 WARN  (OldIndexDirectoryCleanupThreadForCore-collection1) [n:127.0.0.1:59702_k_g%2Fht c:collection1 s:shard2 r:core_node1 x:collection1] o.a.s.c.DirectoryFactory /home/jenkins/workspace/Lucene-Solr-5.x-Linux/solr/build/solr-core/test/J2/temp/solr.cloud.CustomCollectionTest_27A9A88727022EB5-001/shard-1-001/cores/collection1/data/ does not point to a valid data directory; skipping clean-up of old index directories.
   [junit4]   2> 1264541 INFO  (coreLoadExecutor-4194-thread-1-processing-n:127.0.0.1:59702_k_g%2Fht) [n:127.0.0.1:59702_k_g%2Fht c:collection1 s:shard2 r:core_node1 x:collection1] o.a.s.u.p.UpdateRequestProcessorChain creating updateRequestProcessorChain "nodistrib"
   [junit4]   2> 1264541 INFO  (coreLoadExecutor-4194-thread-1-processing-n:127.0.0.1:59702_k_g%2Fht) [n:127.0.0.1:59702_k_g%2Fht c:collection1 s:shard2 r:core_node1 x:collection1] o.a.s.u.p.UpdateRequestProcessorChain creating updateRequestProcessorChain "dedupe"
   [junit4]   2> 1264541 INFO  (coreLoadExecutor-4194-thread-1-processing-n:127.0.0.

[...truncated too long message...]

ExpiredException: KeeperErrorCode = Session expired for /overseer
   [junit4]   2> 	at org.apache.zookeeper.KeeperException.create(KeeperException.java:127)
   [junit4]   2> 	at org.apache.zookeeper.KeeperException.create(KeeperException.java:51)
   [junit4]   2> 	at org.apache.zookeeper.ZooKeeper.create(ZooKeeper.java:783)
   [junit4]   2> 	at org.apache.solr.common.cloud.SolrZkClient$9.execute(SolrZkClient.java:381)
   [junit4]   2> 	at org.apache.solr.common.cloud.SolrZkClient$9.execute(SolrZkClient.java:378)
   [junit4]   2> 	at org.apache.solr.common.cloud.ZkCmdExecutor.retryOperation(ZkCmdExecutor.java:61)
   [junit4]   2> 	at org.apache.solr.common.cloud.SolrZkClient.create(SolrZkClient.java:378)
   [junit4]   2> 	at org.apache.solr.cloud.Overseer.createOverseerNode(Overseer.java:949)
   [junit4]   2> 	... 26 more
   [junit4]   2> 1291530 INFO  (TEST-CustomCollectionTest.test-seed#[27A9A88727022EB5]) [    ] o.e.j.s.ServerConnector Stopped ServerConnector@37c83250{HTTP/1.1}{127.0.0.1:0}
   [junit4]   2> 1291530 INFO  (TEST-CustomCollectionTest.test-seed#[27A9A88727022EB5]) [    ] o.e.j.s.h.ContextHandler Stopped o.e.j.s.ServletContextHandler@2df3821{/k_g/ht,null,UNAVAILABLE}
   [junit4]   2> 1291532 INFO  (TEST-CustomCollectionTest.test-seed#[27A9A88727022EB5]) [n:127.0.0.1:44108_k_g%2Fht c:implicitcoll0 s:b r:core_node11 x:implicitcoll0_b_replica5] o.a.s.c.ZkTestServer connecting to 127.0.0.1:52089 52089
   [junit4]   2> 1291564 INFO  (Thread-3840) [    ] o.a.s.c.ZkTestServer connecting to 127.0.0.1:52089 52089
   [junit4]   2> 1291566 WARN  (Thread-3840) [    ] o.a.s.c.ZkTestServer Watch limit violations: 
   [junit4]   2> Maximum concurrent create/delete watches above limit:
   [junit4]   2> 
   [junit4]   2> 	8	/solr/aliases.json
   [junit4]   2> 	5	/solr/security.json
   [junit4]   2> 	5	/solr/configs/conf1
   [junit4]   2> 
   [junit4]   2> Maximum concurrent data watches above limit:
   [junit4]   2> 
   [junit4]   2> 	8	/solr/clusterstate.json
   [junit4]   2> 	2	/solr/collections/implicitcoll0/leader_elect/a/election/95309864579170321-core_node2-n_0000000001
   [junit4]   2> 	2	/solr/collections/implicitcoll0/leader_elect/b/election/95309864579170318-core_node3-n_0000000003
   [junit4]   2> 	2	/solr/collections/implicitcoll0/leader_elect/b/election/95309864579170315-core_node14-n_0000000000
   [junit4]   2> 	2	/solr/collections/implicitcoll0/leader_elect/c/election/95309864579170315-core_node12-n_0000000003
   [junit4]   2> 
   [junit4]   2> Maximum concurrent children watches above limit:
   [junit4]   2> 
   [junit4]   2> 	8	/solr/live_nodes
   [junit4]   2> 	8	/solr/collections
   [junit4]   2> 	5	/solr/overseer/queue
   [junit4]   2> 	5	/solr/overseer/collection-queue-work
   [junit4]   2> 	3	/solr/overseer/queue-work
   [junit4]   2> 
   [junit4]   2> NOTE: reproduce with: ant test  -Dtestcase=CustomCollectionTest -Dtests.method=test -Dtests.seed=27A9A88727022EB5 -Dtests.multiplier=3 -Dtests.slow=true -Dtests.locale=en-IE -Dtests.timezone=Arctic/Longyearbyen -Dtests.asserts=true -Dtests.file.encoding=US-ASCII
   [junit4] ERROR   30.9s J2 | CustomCollectionTest.test <<<
   [junit4]    > Throwable #1: org.apache.solr.client.solrj.impl.HttpSolrClient$RemoteSolrException: Error from server at http://127.0.0.1:59702/k_g/ht/implicitcoll0: non ok status: 500, message:Server Error
   [junit4]    > 	at __randomizedtesting.SeedInfo.seed([27A9A88727022EB5:AFFD975D89FE434D]:0)
   [junit4]    > 	at org.apache.solr.client.solrj.impl.HttpSolrClient.executeMethod(HttpSolrClient.java:511)
   [junit4]    > 	at org.apache.solr.client.solrj.impl.HttpSolrClient.request(HttpSolrClient.java:240)
   [junit4]    > 	at org.apache.solr.client.solrj.impl.HttpSolrClient.request(HttpSolrClient.java:229)
   [junit4]    > 	at org.apache.solr.client.solrj.SolrRequest.process(SolrRequest.java:150)
   [junit4]    > 	at org.apache.solr.client.solrj.SolrClient.query(SolrClient.java:943)
   [junit4]    > 	at org.apache.solr.client.solrj.SolrClient.query(SolrClient.java:958)
   [junit4]    > 	at org.apache.solr.cloud.AbstractFullDistribZkTestBase.waitForNon403or404or503(AbstractFullDistribZkTestBase.java:1753)
   [junit4]    > 	at org.apache.solr.cloud.CustomCollectionTest.testCustomCollectionsAPI(CustomCollectionTest.java:173)
   [junit4]    > 	at org.apache.solr.cloud.CustomCollectionTest.test(CustomCollectionTest.java:100)
   [junit4]    > 	at org.apache.solr.BaseDistributedSearchTestCase$ShardsRepeatRule$ShardsFixedStatement.callStatement(BaseDistributedSearchTestCase.java:965)
   [junit4]    > 	at org.apache.solr.BaseDistributedSearchTestCase$ShardsRepeatRule$ShardsStatement.evaluate(BaseDistributedSearchTestCase.java:940)
   [junit4]    > 	at java.lang.Thread.run(Thread.java:745)
   [junit4]   2> 1291568 INFO  (SUITE-CustomCollectionTest-seed#[27A9A88727022EB5]-worker) [n:127.0.0.1:44108_k_g%2Fht c:implicitcoll0 s:b r:core_node11 x:implicitcoll0_b_replica5] o.a.s.SolrTestCaseJ4 ###deleteCore
   [junit4]   2> NOTE: leaving temporary files on disk at: /home/jenkins/workspace/Lucene-Solr-5.x-Linux/solr/build/solr-core/test/J2/temp/solr.cloud.CustomCollectionTest_27A9A88727022EB5-001
   [junit4]   2> Feb 01, 2016 7:52:30 AM com.carrotsearch.randomizedtesting.ThreadLeakControl checkThreadLeaks
   [junit4]   2> WARNING: Will linger awaiting termination of 1 leaked thread(s).
   [junit4]   2> NOTE: test params are: codec=CheapBastard, sim=DefaultSimilarity, locale=en-IE, timezone=Arctic/Longyearbyen
   [junit4]   2> NOTE: Linux 3.19.0-47-generic amd64/Oracle Corporation 1.8.0_72 (64-bit)/cpus=12,threads=1,free=225348832,total=501743616
   [junit4]   2> NOTE: All tests run in this JVM: [AnalysisErrorHandlingTest, TestTolerantSearch, TestDistributedStatsComponentCardinality, StatelessScriptUpdateProcessorFactoryTest, AssignTest, DistributedQueryComponentOptimizationTest, TestSolrIndexConfig, CircularListTest, TestExtendedDismaxParser, TestJmxMonitoredMap, QueryParsingTest, TestConfigSetsAPIExclusivity, PKIAuthenticationIntegrationTest, RulesTest, SharedFSAutoReplicaFailoverUtilsTest, HdfsRecoverLeaseTest, CheckHdfsIndexTest, TestRandomForceMergePolicy, TestRequestForwarding, DistributedFacetPivotLargeTest, TestFieldResource, SolrTestCaseJ4Test, TestStressRecovery, DirectUpdateHandlerOptimizeTest, SuggesterTSTTest, SampleTest, DistributedFacetPivotSmallTest, TestJettySolrRunner, TestCSVResponseWriter, TestCollationFieldDocValues, LeaderElectionTest, SearchHandlerTest, BitVectorTest, FieldAnalysisRequestHandlerTest, SimpleMLTQParserTest, TestPostingsSolrHighlighter, TestManagedResourceStorage, PluginInfoTest, CollectionsAPIAsyncDistributedZkTest, TestStressReorder, HLLSerializationTest, TestSmileRequest, HdfsWriteToMultipleCollectionsTest, TestManagedStopFilterFactory, TestStressUserVersions, TestClassNameShortening, TestRemoveLastDynamicCopyField, DistanceUnitsTest, HttpPartitionTest, TestZkChroot, BinaryUpdateRequestHandlerTest, TestSchemaSimilarityResource, BadIndexSchemaTest, TestMiniSolrCloudClusterBase, BlockCacheTest, DistribCursorPagingTest, TestSearchPerf, TestCloudManagedSchema, TestSweetSpotSimilarityFactory, CurrencyFieldXmlFileTest, DistributedQueueTest, TestRecovery, TestLeaderElectionZkExpiry, SaslZkACLProviderTest, TestJsonFacets, UpdateParamsTest, TestIntervalFaceting, TestExactStatsCache, TestSolrCloudWithKerberosAlt, TestReload, ChangedSchemaMergeTest, PreAnalyzedUpdateProcessorTest, DebugComponentTest, CoreAdminHandlerTest, BlockJoinFacetRandomTest, TestNonDefinedSimilarityFactory, TestJmxIntegration, TestDistributedMissingSort, SolrCoreCheckLockOnStartupTest, TestFastWriter, RecoveryZkTest, TestUseDocValuesAsStored, TestCollationField, TestInfoStreamLogging, SpatialHeatmapFacetsTest, TestSolrQueryParser, ConjunctionSolrSpellCheckerTest, TestInitQParser, TestDistribDocBasedVersion, TestConfigSets, RankQueryTest, DirectSolrConnectionTest, ChaosMonkeySafeLeaderTest, BasicDistributedZk2Test, CollectionsAPIDistributedZkTest, ZkSolrClientTest, ZkCLITest, AutoCommitTest, TestStressVersions, DistributedTermsComponentTest, SimpleFacetsTest, TestGroupingSearch, SolrCmdDistributorTest, DirectUpdateHandlerTest, SoftAutoCommitTest, FieldMutatingUpdateProcessorTest, QueryEqualityTest, SolrInfoMBeanTest, TestQueryUtils, StandardRequestHandlerTest, TestReversedWildcardFilterFactory, PrimitiveFieldTypeTest, TermsComponentTest, RequestHandlersTest, TestIndexingPerformance, FastVectorHighlighterTest, UpdateRequestProcessorFactoryTest, TestPartialUpdateDeduplication, CSVRequestHandlerTest, TestLFUCache, AliasIntegrationTest, CollectionReloadTest, ConcurrentDeleteAndCreateCollectionTest, ConnectionManagerTest, CustomCollectionTest]
   [junit4] Completed [432/566 (1!)] on J2 in 31.92s, 1 test, 1 error <<< FAILURES!

[...truncated 441 lines...]
BUILD FAILED
/home/jenkins/workspace/Lucene-Solr-5.x-Linux/build.xml:750: The following error occurred while executing this line:
/home/jenkins/workspace/Lucene-Solr-5.x-Linux/build.xml:694: The following error occurred while executing this line:
/home/jenkins/workspace/Lucene-Solr-5.x-Linux/build.xml:59: The following error occurred while executing this line:
/home/jenkins/workspace/Lucene-Solr-5.x-Linux/solr/build.xml:233: The following error occurred while executing this line:
/home/jenkins/workspace/Lucene-Solr-5.x-Linux/solr/common-build.xml:534: The following error occurred while executing this line:
/home/jenkins/workspace/Lucene-Solr-5.x-Linux/lucene/common-build.xml:1477: The following error occurred while executing this line:
/home/jenkins/workspace/Lucene-Solr-5.x-Linux/lucene/common-build.xml:1033: There were test failures: 566 suites (7 ignored), 2268 tests, 1 error, 83 ignored (39 assumptions) [seed: 27A9A88727022EB5]

Total time: 48 minutes 42 seconds
Build step 'Invoke Ant' marked build as failure
Archiving artifacts
[WARNINGS] Skipping publisher since build result is FAILURE
Recording test results
Email was triggered for: Failure - Any
Sending email for trigger: Failure - Any



Mime
View raw message