lucene-dev mailing list archives

Site index · List index
Message view « Date » · « Thread »
Top « Date » · « Thread »
From Apache Jenkins Server <jenk...@builds.apache.org>
Subject [JENKINS] Lucene-Solr-Tests-trunk-Java8 - Build # 840 - Still Failing
Date Wed, 17 Feb 2016 22:41:42 GMT
Build: https://builds.apache.org/job/Lucene-Solr-Tests-trunk-Java8/840/

2 tests failed.
FAILED:  org.apache.solr.search.TestIndexSearcher.testReopen

Error Message:
expected:<_0(6.0.0):C2> but was:<_3(6.0.0):c6>

Stack Trace:
java.lang.AssertionError: expected:<_0(6.0.0):C2> but was:<_3(6.0.0):c6>
	at __randomizedtesting.SeedInfo.seed([D182CE444F24E904:FDCA1F523C186627]:0)
	at org.junit.Assert.fail(Assert.java:93)
	at org.junit.Assert.failNotEquals(Assert.java:647)
	at org.junit.Assert.assertEquals(Assert.java:128)
	at org.junit.Assert.assertEquals(Assert.java:147)
	at org.apache.solr.search.TestIndexSearcher.testReopen(TestIndexSearcher.java:121)
	at sun.reflect.NativeMethodAccessorImpl.invoke0(Native Method)
	at sun.reflect.NativeMethodAccessorImpl.invoke(NativeMethodAccessorImpl.java:62)
	at sun.reflect.DelegatingMethodAccessorImpl.invoke(DelegatingMethodAccessorImpl.java:43)
	at java.lang.reflect.Method.invoke(Method.java:497)
	at com.carrotsearch.randomizedtesting.RandomizedRunner.invoke(RandomizedRunner.java:1764)
	at com.carrotsearch.randomizedtesting.RandomizedRunner$8.evaluate(RandomizedRunner.java:871)
	at com.carrotsearch.randomizedtesting.RandomizedRunner$9.evaluate(RandomizedRunner.java:907)
	at com.carrotsearch.randomizedtesting.RandomizedRunner$10.evaluate(RandomizedRunner.java:921)
	at com.carrotsearch.randomizedtesting.rules.SystemPropertiesRestoreRule$1.evaluate(SystemPropertiesRestoreRule.java:57)
	at org.apache.lucene.util.TestRuleSetupTeardownChained$1.evaluate(TestRuleSetupTeardownChained.java:49)
	at org.apache.lucene.util.AbstractBeforeAfterRule$1.evaluate(AbstractBeforeAfterRule.java:45)
	at org.apache.lucene.util.TestRuleThreadAndTestName$1.evaluate(TestRuleThreadAndTestName.java:48)
	at org.apache.lucene.util.TestRuleIgnoreAfterMaxFailures$1.evaluate(TestRuleIgnoreAfterMaxFailures.java:64)
	at org.apache.lucene.util.TestRuleMarkFailure$1.evaluate(TestRuleMarkFailure.java:47)
	at com.carrotsearch.randomizedtesting.rules.StatementAdapter.evaluate(StatementAdapter.java:36)
	at com.carrotsearch.randomizedtesting.ThreadLeakControl$StatementRunner.run(ThreadLeakControl.java:367)
	at com.carrotsearch.randomizedtesting.ThreadLeakControl.forkTimeoutingTask(ThreadLeakControl.java:809)
	at com.carrotsearch.randomizedtesting.ThreadLeakControl$3.evaluate(ThreadLeakControl.java:460)
	at com.carrotsearch.randomizedtesting.RandomizedRunner.runSingleTest(RandomizedRunner.java:880)
	at com.carrotsearch.randomizedtesting.RandomizedRunner$5.evaluate(RandomizedRunner.java:781)
	at com.carrotsearch.randomizedtesting.RandomizedRunner$6.evaluate(RandomizedRunner.java:816)
	at com.carrotsearch.randomizedtesting.RandomizedRunner$7.evaluate(RandomizedRunner.java:827)
	at com.carrotsearch.randomizedtesting.rules.StatementAdapter.evaluate(StatementAdapter.java:36)
	at com.carrotsearch.randomizedtesting.rules.SystemPropertiesRestoreRule$1.evaluate(SystemPropertiesRestoreRule.java:57)
	at org.apache.lucene.util.AbstractBeforeAfterRule$1.evaluate(AbstractBeforeAfterRule.java:45)
	at com.carrotsearch.randomizedtesting.rules.StatementAdapter.evaluate(StatementAdapter.java:36)
	at org.apache.lucene.util.TestRuleStoreClassName$1.evaluate(TestRuleStoreClassName.java:41)
	at com.carrotsearch.randomizedtesting.rules.NoShadowingOrOverridesOnMethodsRule$1.evaluate(NoShadowingOrOverridesOnMethodsRule.java:40)
	at com.carrotsearch.randomizedtesting.rules.NoShadowingOrOverridesOnMethodsRule$1.evaluate(NoShadowingOrOverridesOnMethodsRule.java:40)
	at com.carrotsearch.randomizedtesting.rules.StatementAdapter.evaluate(StatementAdapter.java:36)
	at com.carrotsearch.randomizedtesting.rules.StatementAdapter.evaluate(StatementAdapter.java:36)
	at com.carrotsearch.randomizedtesting.rules.StatementAdapter.evaluate(StatementAdapter.java:36)
	at org.apache.lucene.util.TestRuleAssertionsRequired$1.evaluate(TestRuleAssertionsRequired.java:53)
	at org.apache.lucene.util.TestRuleMarkFailure$1.evaluate(TestRuleMarkFailure.java:47)
	at org.apache.lucene.util.TestRuleIgnoreAfterMaxFailures$1.evaluate(TestRuleIgnoreAfterMaxFailures.java:64)
	at org.apache.lucene.util.TestRuleIgnoreTestSuites$1.evaluate(TestRuleIgnoreTestSuites.java:54)
	at com.carrotsearch.randomizedtesting.rules.StatementAdapter.evaluate(StatementAdapter.java:36)
	at com.carrotsearch.randomizedtesting.ThreadLeakControl$StatementRunner.run(ThreadLeakControl.java:367)
	at java.lang.Thread.run(Thread.java:745)


FAILED:  org.apache.solr.util.TestSolrCLIRunExample.testInteractiveSolrCloudExample

Error Message:
Could not find a healthy node to handle the request.

Stack Trace:
org.apache.solr.common.SolrException: Could not find a healthy node to handle the request.
	at __randomizedtesting.SeedInfo.seed([D182CE444F24E904:AF32E8E78512C62]:0)
	at org.apache.solr.client.solrj.impl.CloudSolrClient.sendRequest(CloudSolrClient.java:1084)
	at org.apache.solr.client.solrj.impl.CloudSolrClient.requestWithRetryOnStaleState(CloudSolrClient.java:870)
	at org.apache.solr.client.solrj.impl.CloudSolrClient.requestWithRetryOnStaleState(CloudSolrClient.java:953)
	at org.apache.solr.client.solrj.impl.CloudSolrClient.requestWithRetryOnStaleState(CloudSolrClient.java:953)
	at org.apache.solr.client.solrj.impl.CloudSolrClient.requestWithRetryOnStaleState(CloudSolrClient.java:953)
	at org.apache.solr.client.solrj.impl.CloudSolrClient.requestWithRetryOnStaleState(CloudSolrClient.java:953)
	at org.apache.solr.client.solrj.impl.CloudSolrClient.requestWithRetryOnStaleState(CloudSolrClient.java:953)
	at org.apache.solr.client.solrj.impl.CloudSolrClient.request(CloudSolrClient.java:806)
	at org.apache.solr.client.solrj.SolrRequest.process(SolrRequest.java:149)
	at org.apache.solr.client.solrj.SolrClient.commit(SolrClient.java:484)
	at org.apache.solr.client.solrj.SolrClient.commit(SolrClient.java:463)
	at org.apache.solr.util.TestSolrCLIRunExample.testInteractiveSolrCloudExample(TestSolrCLIRunExample.java:446)
	at sun.reflect.NativeMethodAccessorImpl.invoke0(Native Method)
	at sun.reflect.NativeMethodAccessorImpl.invoke(NativeMethodAccessorImpl.java:62)
	at sun.reflect.DelegatingMethodAccessorImpl.invoke(DelegatingMethodAccessorImpl.java:43)
	at java.lang.reflect.Method.invoke(Method.java:497)
	at com.carrotsearch.randomizedtesting.RandomizedRunner.invoke(RandomizedRunner.java:1764)
	at com.carrotsearch.randomizedtesting.RandomizedRunner$8.evaluate(RandomizedRunner.java:871)
	at com.carrotsearch.randomizedtesting.RandomizedRunner$9.evaluate(RandomizedRunner.java:907)
	at com.carrotsearch.randomizedtesting.RandomizedRunner$10.evaluate(RandomizedRunner.java:921)
	at com.carrotsearch.randomizedtesting.rules.SystemPropertiesRestoreRule$1.evaluate(SystemPropertiesRestoreRule.java:57)
	at org.apache.lucene.util.TestRuleSetupTeardownChained$1.evaluate(TestRuleSetupTeardownChained.java:49)
	at org.apache.lucene.util.AbstractBeforeAfterRule$1.evaluate(AbstractBeforeAfterRule.java:45)
	at org.apache.lucene.util.TestRuleThreadAndTestName$1.evaluate(TestRuleThreadAndTestName.java:48)
	at org.apache.lucene.util.TestRuleIgnoreAfterMaxFailures$1.evaluate(TestRuleIgnoreAfterMaxFailures.java:64)
	at org.apache.lucene.util.TestRuleMarkFailure$1.evaluate(TestRuleMarkFailure.java:47)
	at com.carrotsearch.randomizedtesting.rules.StatementAdapter.evaluate(StatementAdapter.java:36)
	at com.carrotsearch.randomizedtesting.ThreadLeakControl$StatementRunner.run(ThreadLeakControl.java:367)
	at com.carrotsearch.randomizedtesting.ThreadLeakControl.forkTimeoutingTask(ThreadLeakControl.java:809)
	at com.carrotsearch.randomizedtesting.ThreadLeakControl$3.evaluate(ThreadLeakControl.java:460)
	at com.carrotsearch.randomizedtesting.RandomizedRunner.runSingleTest(RandomizedRunner.java:880)
	at com.carrotsearch.randomizedtesting.RandomizedRunner$5.evaluate(RandomizedRunner.java:781)
	at com.carrotsearch.randomizedtesting.RandomizedRunner$6.evaluate(RandomizedRunner.java:816)
	at com.carrotsearch.randomizedtesting.RandomizedRunner$7.evaluate(RandomizedRunner.java:827)
	at com.carrotsearch.randomizedtesting.rules.StatementAdapter.evaluate(StatementAdapter.java:36)
	at com.carrotsearch.randomizedtesting.rules.SystemPropertiesRestoreRule$1.evaluate(SystemPropertiesRestoreRule.java:57)
	at org.apache.lucene.util.AbstractBeforeAfterRule$1.evaluate(AbstractBeforeAfterRule.java:45)
	at com.carrotsearch.randomizedtesting.rules.StatementAdapter.evaluate(StatementAdapter.java:36)
	at org.apache.lucene.util.TestRuleStoreClassName$1.evaluate(TestRuleStoreClassName.java:41)
	at com.carrotsearch.randomizedtesting.rules.NoShadowingOrOverridesOnMethodsRule$1.evaluate(NoShadowingOrOverridesOnMethodsRule.java:40)
	at com.carrotsearch.randomizedtesting.rules.NoShadowingOrOverridesOnMethodsRule$1.evaluate(NoShadowingOrOverridesOnMethodsRule.java:40)
	at com.carrotsearch.randomizedtesting.rules.StatementAdapter.evaluate(StatementAdapter.java:36)
	at com.carrotsearch.randomizedtesting.rules.StatementAdapter.evaluate(StatementAdapter.java:36)
	at com.carrotsearch.randomizedtesting.rules.StatementAdapter.evaluate(StatementAdapter.java:36)
	at org.apache.lucene.util.TestRuleAssertionsRequired$1.evaluate(TestRuleAssertionsRequired.java:53)
	at org.apache.lucene.util.TestRuleMarkFailure$1.evaluate(TestRuleMarkFailure.java:47)
	at org.apache.lucene.util.TestRuleIgnoreAfterMaxFailures$1.evaluate(TestRuleIgnoreAfterMaxFailures.java:64)
	at org.apache.lucene.util.TestRuleIgnoreTestSuites$1.evaluate(TestRuleIgnoreTestSuites.java:54)
	at com.carrotsearch.randomizedtesting.rules.StatementAdapter.evaluate(StatementAdapter.java:36)
	at com.carrotsearch.randomizedtesting.ThreadLeakControl$StatementRunner.run(ThreadLeakControl.java:367)
	at java.lang.Thread.run(Thread.java:745)




Build Log:
[...truncated 10492 lines...]
   [junit4] Suite: org.apache.solr.util.TestSolrCLIRunExample
   [junit4]   2> Creating dataDir: /x1/jenkins/jenkins-slave/workspace/Lucene-Solr-Tests-trunk-Java8/solr/build/solr-core/test/J2/temp/solr.util.TestSolrCLIRunExample_D182CE444F24E904-001/init-core-data-001
   [junit4]   2> 70996 INFO  (TEST-TestSolrCLIRunExample.testInteractiveSolrCloudExample-seed#[D182CE444F24E904]) [    ] o.a.s.SolrTestCaseJ4 ###Starting testInteractiveSolrCloudExample
   [junit4]   2> 71065 INFO  (TEST-TestSolrCLIRunExample.testInteractiveSolrCloudExample-seed#[D182CE444F24E904]) [    ] o.a.s.c.ZkTestServer STARTING ZK TEST SERVER
   [junit4]   2> 71065 INFO  (Thread-192) [    ] o.a.s.c.ZkTestServer client port:0.0.0.0/0.0.0.0:0
   [junit4]   2> 71065 INFO  (Thread-192) [    ] o.a.s.c.ZkTestServer Starting server
   [junit4]   2> 71165 INFO  (TEST-TestSolrCLIRunExample.testInteractiveSolrCloudExample-seed#[D182CE444F24E904]) [    ] o.a.s.c.ZkTestServer start zk server on port:51339
   [junit4]   2> 71165 INFO  (TEST-TestSolrCLIRunExample.testInteractiveSolrCloudExample-seed#[D182CE444F24E904]) [    ] o.a.s.c.c.SolrZkClient Using default ZkCredentialsProvider
   [junit4]   2> 71168 INFO  (TEST-TestSolrCLIRunExample.testInteractiveSolrCloudExample-seed#[D182CE444F24E904]) [    ] o.a.s.c.c.ConnectionManager Waiting for client to connect to ZooKeeper
   [junit4]   2> 71172 INFO  (zkCallback-77-thread-1) [    ] o.a.s.c.c.ConnectionManager Watcher org.apache.solr.common.cloud.ConnectionManager@134be2df name:ZooKeeperConnection Watcher:127.0.0.1:51339 got event WatchedEvent state:SyncConnected type:None path:null path:null type:None
   [junit4]   2> 71172 INFO  (TEST-TestSolrCLIRunExample.testInteractiveSolrCloudExample-seed#[D182CE444F24E904]) [    ] o.a.s.c.c.ConnectionManager Client is connected to ZooKeeper
   [junit4]   2> 71172 INFO  (TEST-TestSolrCLIRunExample.testInteractiveSolrCloudExample-seed#[D182CE444F24E904]) [    ] o.a.s.c.c.SolrZkClient Using default ZkACLProvider
   [junit4]   2> 71172 INFO  (TEST-TestSolrCLIRunExample.testInteractiveSolrCloudExample-seed#[D182CE444F24E904]) [    ] o.a.s.c.c.SolrZkClient makePath: /solr/solr.xml
   [junit4]   2> 71184 INFO  (jetty-launcher-76-thread-1) [    ] o.e.j.s.Server jetty-9.3.6.v20151106
   [junit4]   2> 71205 INFO  (jetty-launcher-76-thread-1) [    ] o.e.j.s.h.ContextHandler Started o.e.j.s.ServletContextHandler@24ef7f55{/solr,null,AVAILABLE}
   [junit4]   2> 71206 INFO  (jetty-launcher-76-thread-1) [    ] o.e.j.s.ServerConnector Started ServerConnector@7b0a7fec{HTTP/1.1,[http/1.1]}{127.0.0.1:45220}
   [junit4]   2> 71206 INFO  (jetty-launcher-76-thread-1) [    ] o.e.j.s.Server Started @74542ms
   [junit4]   2> 71206 INFO  (jetty-launcher-76-thread-1) [    ] o.a.s.c.s.e.JettySolrRunner Jetty properties: {hostContext=/solr, hostPort=45220}
   [junit4]   2> 71209 INFO  (jetty-launcher-76-thread-1) [    ] o.a.s.s.SolrDispatchFilter SolrDispatchFilter.init(): sun.misc.Launcher$AppClassLoader@4e0e2f2a
   [junit4]   2> 71210 INFO  (jetty-launcher-76-thread-1) [    ] o.a.s.c.SolrResourceLoader new SolrResourceLoader for directory: '/x1/jenkins/jenkins-slave/workspace/Lucene-Solr-Tests-trunk-Java8/solr/build/solr-core/test/J2/temp/solr.util.TestSolrCLIRunExample_D182CE444F24E904-001/tempDir-002/node1'
   [junit4]   2> 71210 INFO  (jetty-launcher-76-thread-1) [    ] o.a.s.c.SolrResourceLoader JNDI not configured for solr (NoInitialContextEx)
   [junit4]   2> 71210 INFO  (jetty-launcher-76-thread-1) [    ] o.a.s.c.SolrResourceLoader solr home defaulted to 'solr/' (could not find system property or JNDI)
   [junit4]   2> 71211 INFO  (jetty-launcher-76-thread-1) [    ] o.a.s.c.c.SolrZkClient Using default ZkCredentialsProvider
   [junit4]   2> 71228 INFO  (jetty-launcher-76-thread-1) [    ] o.a.s.c.c.ConnectionManager Waiting for client to connect to ZooKeeper
   [junit4]   2> 71242 INFO  (zkCallback-78-thread-1) [    ] o.a.s.c.c.ConnectionManager Watcher org.apache.solr.common.cloud.ConnectionManager@1529ca92 name:ZooKeeperConnection Watcher:127.0.0.1:51339/solr got event WatchedEvent state:SyncConnected type:None path:null path:null type:None
   [junit4]   2> 71242 INFO  (jetty-launcher-76-thread-1) [    ] o.a.s.c.c.ConnectionManager Client is connected to ZooKeeper
   [junit4]   2> 71243 INFO  (jetty-launcher-76-thread-1) [    ] o.a.s.c.c.SolrZkClient Using default ZkACLProvider
   [junit4]   2> 71243 INFO  (jetty-launcher-76-thread-1) [    ] o.a.s.s.SolrDispatchFilter solr.xml found in ZooKeeper. Loading...
   [junit4]   2> 71251 INFO  (jetty-launcher-76-thread-1) [    ] o.a.s.c.CorePropertiesLocator Config-defined core root directory: /x1/jenkins/jenkins-slave/workspace/Lucene-Solr-Tests-trunk-Java8/solr/build/solr-core/test/J2/temp/solr.util.TestSolrCLIRunExample_D182CE444F24E904-001/tempDir-002/node1
   [junit4]   2> 71252 INFO  (jetty-launcher-76-thread-1) [    ] o.a.s.c.CoreContainer New CoreContainer 468755752
   [junit4]   2> 71252 INFO  (jetty-launcher-76-thread-1) [    ] o.a.s.c.CoreContainer Loading cores into CoreContainer [instanceDir=/x1/jenkins/jenkins-slave/workspace/Lucene-Solr-Tests-trunk-Java8/solr/build/solr-core/test/J2/temp/solr.util.TestSolrCLIRunExample_D182CE444F24E904-001/tempDir-002/node1]
   [junit4]   2> 71252 WARN  (jetty-launcher-76-thread-1) [    ] o.a.s.c.CoreContainer Couldn't add files from /x1/jenkins/jenkins-slave/workspace/Lucene-Solr-Tests-trunk-Java8/solr/build/solr-core/test/J2/temp/solr.util.TestSolrCLIRunExample_D182CE444F24E904-001/tempDir-002/node1/lib to classpath: /x1/jenkins/jenkins-slave/workspace/Lucene-Solr-Tests-trunk-Java8/solr/build/solr-core/test/J2/temp/solr.util.TestSolrCLIRunExample_D182CE444F24E904-001/tempDir-002/node1/lib
   [junit4]   2> 71252 INFO  (jetty-launcher-76-thread-1) [    ] o.a.s.h.c.HttpShardHandlerFactory created with socketTimeout : 600000,connTimeout : 60000,maxConnectionsPerHost : 20,maxConnections : 10000,corePoolSize : 0,maximumPoolSize : 2147483647,maxThreadIdleTime : 5,sizeOfQueue : -1,fairnessPolicy : false,useRetries : false,
   [junit4]   2> 71254 INFO  (jetty-launcher-76-thread-1) [    ] o.a.s.u.UpdateShardHandler Creating UpdateShardHandler HTTP client with params: socketTimeout=600000&connTimeout=60000&retry=true
   [junit4]   2> 71254 INFO  (jetty-launcher-76-thread-1) [    ] o.a.s.l.LogWatcher SLF4J impl is org.slf4j.impl.Log4jLoggerFactory
   [junit4]   2> 71254 INFO  (jetty-launcher-76-thread-1) [    ] o.a.s.l.LogWatcher Registering Log Listener [Log4j (org.slf4j.impl.Log4jLoggerFactory)]
   [junit4]   2> 71254 INFO  (jetty-launcher-76-thread-1) [    ] o.a.s.c.ZkContainer Zookeeper client=127.0.0.1:51339/solr
   [junit4]   2> 71256 INFO  (jetty-launcher-76-thread-1) [    ] o.a.s.c.ZkController zkHost includes chroot
   [junit4]   2> 71256 INFO  (jetty-launcher-76-thread-1) [    ] o.a.s.c.c.SolrZkClient Using default ZkCredentialsProvider
   [junit4]   2> 71257 INFO  (jetty-launcher-76-thread-1) [    ] o.a.s.c.c.ConnectionManager Waiting for client to connect to ZooKeeper
   [junit4]   2> 71263 INFO  (zkCallback-81-thread-1) [    ] o.a.s.c.c.ConnectionManager Watcher org.apache.solr.common.cloud.ConnectionManager@680ef8c7 name:ZooKeeperConnection Watcher:127.0.0.1:51339 got event WatchedEvent state:SyncConnected type:None path:null path:null type:None
   [junit4]   2> 71264 INFO  (jetty-launcher-76-thread-1) [    ] o.a.s.c.c.ConnectionManager Client is connected to ZooKeeper
   [junit4]   2> 71264 INFO  (jetty-launcher-76-thread-1) [    ] o.a.s.c.c.SolrZkClient Using default ZkACLProvider
   [junit4]   2> 71271 INFO  (jetty-launcher-76-thread-1) [n:localhost:45220_solr    ] o.a.s.c.c.ConnectionManager Waiting for client to connect to ZooKeeper
   [junit4]   2> 71278 INFO  (zkCallback-82-thread-1-processing-n:localhost:45220_solr) [n:localhost:45220_solr    ] o.a.s.c.c.ConnectionManager Watcher org.apache.solr.common.cloud.ConnectionManager@6e3bc89d name:ZooKeeperConnection Watcher:127.0.0.1:51339/solr got event WatchedEvent state:SyncConnected type:None path:null path:null type:None
   [junit4]   2> 71278 INFO  (jetty-launcher-76-thread-1) [n:localhost:45220_solr    ] o.a.s.c.c.ConnectionManager Client is connected to ZooKeeper
   [junit4]   2> 71280 INFO  (jetty-launcher-76-thread-1) [n:localhost:45220_solr    ] o.a.s.c.c.SolrZkClient makePath: /overseer/queue
   [junit4]   2> 71284 INFO  (jetty-launcher-76-thread-1) [n:localhost:45220_solr    ] o.a.s.c.c.SolrZkClient makePath: /overseer/collection-queue-work
   [junit4]   2> 71289 INFO  (jetty-launcher-76-thread-1) [n:localhost:45220_solr    ] o.a.s.c.c.SolrZkClient makePath: /overseer/collection-map-running
   [junit4]   2> 71294 INFO  (jetty-launcher-76-thread-1) [n:localhost:45220_solr    ] o.a.s.c.c.SolrZkClient makePath: /overseer/collection-map-completed
   [junit4]   2> 71295 INFO  (jetty-launcher-76-thread-1) [n:localhost:45220_solr    ] o.a.s.c.c.SolrZkClient makePath: /overseer/collection-map-failure
   [junit4]   2> 71298 INFO  (jetty-launcher-76-thread-1) [n:localhost:45220_solr    ] o.a.s.c.c.SolrZkClient makePath: /live_nodes
   [junit4]   2> 71299 INFO  (jetty-launcher-76-thread-1) [n:localhost:45220_solr    ] o.a.s.c.c.SolrZkClient makePath: /collections
   [junit4]   2> 71300 INFO  (jetty-launcher-76-thread-1) [n:localhost:45220_solr    ] o.a.s.c.c.SolrZkClient makePath: /aliases.json
   [junit4]   2> 71301 INFO  (jetty-launcher-76-thread-1) [n:localhost:45220_solr    ] o.a.s.c.c.SolrZkClient makePath: /clusterstate.json
   [junit4]   2> 71302 INFO  (jetty-launcher-76-thread-1) [n:localhost:45220_solr    ] o.a.s.c.c.SolrZkClient makePath: /security.json
   [junit4]   2> 71303 INFO  (jetty-launcher-76-thread-1) [n:localhost:45220_solr    ] o.a.s.c.ZkController Register node as live in ZooKeeper:/live_nodes/localhost:45220_solr
   [junit4]   2> 71303 INFO  (jetty-launcher-76-thread-1) [n:localhost:45220_solr    ] o.a.s.c.c.SolrZkClient makePath: /live_nodes/localhost:45220_solr
   [junit4]   2> 71308 INFO  (jetty-launcher-76-thread-1) [n:localhost:45220_solr    ] o.a.s.c.c.SolrZkClient makePath: /overseer_elect
   [junit4]   2> 71309 INFO  (jetty-launcher-76-thread-1) [n:localhost:45220_solr    ] o.a.s.c.c.SolrZkClient makePath: /overseer_elect/election
   [junit4]   2> 71310 INFO  (jetty-launcher-76-thread-1) [n:localhost:45220_solr    ] o.a.s.c.Overseer Overseer (id=null) closing
   [junit4]   2> 71315 INFO  (jetty-launcher-76-thread-1) [n:localhost:45220_solr    ] o.a.s.c.LeaderElector Joined leadership election with path: /overseer_elect/election/95403819636228099-localhost:45220_solr-n_0000000000
   [junit4]   2> 71316 INFO  (jetty-launcher-76-thread-1) [n:localhost:45220_solr    ] o.a.s.c.OverseerElectionContext I am going to be the leader localhost:45220_solr
   [junit4]   2> 71316 INFO  (jetty-launcher-76-thread-1) [n:localhost:45220_solr    ] o.a.s.c.c.SolrZkClient makePath: /overseer_elect/leader
   [junit4]   2> 71317 INFO  (jetty-launcher-76-thread-1) [n:localhost:45220_solr    ] o.a.s.c.Overseer Overseer (id=95403819636228099-localhost:45220_solr-n_0000000000) starting
   [junit4]   2> 71318 INFO  (jetty-launcher-76-thread-1) [n:localhost:45220_solr    ] o.a.s.c.c.SolrZkClient makePath: /overseer/queue-work
   [junit4]   2> 71324 INFO  (jetty-launcher-76-thread-1) [n:localhost:45220_solr    ] o.a.s.c.OverseerAutoReplicaFailoverThread Starting OverseerAutoReplicaFailoverThread autoReplicaFailoverWorkLoopDelay=10000 autoReplicaFailoverWaitAfterExpiration=30000 autoReplicaFailoverBadNodeExpiration=60000
   [junit4]   2> 71330 INFO  (OverseerStateUpdate-95403819636228099-localhost:45220_solr-n_0000000000) [n:localhost:45220_solr    ] o.a.s.c.Overseer Starting to work on the main queue
   [junit4]   2> 71331 INFO  (OverseerStateUpdate-95403819636228099-localhost:45220_solr-n_0000000000) [n:localhost:45220_solr    ] o.a.s.c.c.ZkStateReader Updating cluster state from ZooKeeper... 
   [junit4]   2> 71331 INFO  (OverseerCollectionConfigSetProcessor-95403819636228099-localhost:45220_solr-n_0000000000) [n:localhost:45220_solr    ] o.a.s.c.OverseerTaskProcessor Process current queue of overseer operations
   [junit4]   2> 71346 INFO  (jetty-launcher-76-thread-1) [n:localhost:45220_solr    ] o.a.s.c.c.ZkStateReader Updating cluster state from ZooKeeper... 
   [junit4]   2> 71404 INFO  (jetty-launcher-76-thread-1) [n:localhost:45220_solr    ] o.a.s.c.CoreContainer Security conf doesn't exist. Skipping setup for authorization module.
   [junit4]   2> 71404 INFO  (jetty-launcher-76-thread-1) [n:localhost:45220_solr    ] o.a.s.c.CoreContainer No authentication plugin used.
   [junit4]   2> 71407 INFO  (jetty-launcher-76-thread-1) [n:localhost:45220_solr    ] o.a.s.c.CorePropertiesLocator Looking for core definitions underneath /x1/jenkins/jenkins-slave/workspace/Lucene-Solr-Tests-trunk-Java8/solr/build/solr-core/test/J2/temp/solr.util.TestSolrCLIRunExample_D182CE444F24E904-001/tempDir-002/node1
   [junit4]   2> 71408 INFO  (jetty-launcher-76-thread-1) [n:localhost:45220_solr    ] o.a.s.c.CorePropertiesLocator Found 0 core definitions
   [junit4]   2> 71415 INFO  (jetty-launcher-76-thread-1) [n:localhost:45220_solr    ] o.a.s.s.SolrDispatchFilter user.dir=/x1/jenkins/jenkins-slave/workspace/Lucene-Solr-Tests-trunk-Java8/solr/build/solr-core/test/J2
   [junit4]   2> 71415 INFO  (jetty-launcher-76-thread-1) [n:localhost:45220_solr    ] o.a.s.s.SolrDispatchFilter SolrDispatchFilter.init() done
   [junit4]   2> 71416 INFO  (TEST-TestSolrCLIRunExample.testInteractiveSolrCloudExample-seed#[D182CE444F24E904]) [    ] o.a.s.c.c.SolrZkClient Using default ZkCredentialsProvider
   [junit4]   2> 71420 INFO  (TEST-TestSolrCLIRunExample.testInteractiveSolrCloudExample-seed#[D182CE444F24E904]) [    ] o.a.s.c.c.ConnectionManager Waiting for client to connect to ZooKeeper
   [junit4]   2> 71428 INFO  (zkCallback-83-thread-1) [    ] o.a.s.c.c.ConnectionManager Watcher org.apache.solr.common.cloud.ConnectionManager@51170126 name:ZooKeeperConnection Watcher:127.0.0.1:51339 got event WatchedEvent state:SyncConnected type:None path:null path:null type:None
   [junit4]   2> 71428 INFO  (TEST-TestSolrCLIRunExample.testInteractiveSolrCloudExample-seed#[D182CE444F24E904]) [    ] o.a.s.c.c.ConnectionManager Client is connected to ZooKeeper
   [junit4]   2> 71429 INFO  (TEST-TestSolrCLIRunExample.testInteractiveSolrCloudExample-seed#[D182CE444F24E904]) [    ] o.a.s.c.c.SolrZkClient Using default ZkACLProvider
   [junit4]   2> 71481 INFO  (qtp1414128015-591) [n:localhost:45220_solr    ] o.a.s.s.HttpSolrCall [admin] webapp=null path=/admin/info/system params={wt=json} status=0 QTime=27
   [junit4]   2> 71520 INFO  (qtp1414128015-592) [n:localhost:45220_solr    ] o.a.s.h.a.CollectionsHandler Invoked Collection Action :clusterstatus with params action=CLUSTERSTATUS&wt=json and sendToOCPQueue=true
   [junit4]   2> 71525 INFO  (qtp1414128015-592) [n:localhost:45220_solr    ] o.a.s.s.HttpSolrCall [admin] webapp=null path=/admin/collections params={action=CLUSTERSTATUS&wt=json} status=0 QTime=29
   [junit4]   2> 71526 INFO  (TEST-TestSolrCLIRunExample.testInteractiveSolrCloudExample-seed#[D182CE444F24E904]) [    ] o.a.s.c.c.SolrZkClient Using default ZkCredentialsProvider
   [junit4]   2> 71526 INFO  (TEST-TestSolrCLIRunExample.testInteractiveSolrCloudExample-seed#[D182CE444F24E904]) [    ] o.a.s.c.c.ConnectionManager Waiting for client to connect to ZooKeeper
   [junit4]   2> 71528 INFO  (zkCallback-86-thread-1) [    ] o.a.s.c.c.ConnectionManager Watcher org.apache.solr.common.cloud.ConnectionManager@2d5977d8 name:ZooKeeperConnection Watcher:127.0.0.1:51339/solr got event WatchedEvent state:SyncConnected type:None path:null path:null type:None
   [junit4]   2> 71528 INFO  (TEST-TestSolrCLIRunExample.testInteractiveSolrCloudExample-seed#[D182CE444F24E904]) [    ] o.a.s.c.c.ConnectionManager Client is connected to ZooKeeper
   [junit4]   2> 71529 INFO  (TEST-TestSolrCLIRunExample.testInteractiveSolrCloudExample-seed#[D182CE444F24E904]) [    ] o.a.s.c.c.SolrZkClient Using default ZkACLProvider
   [junit4]   2> 71529 INFO  (TEST-TestSolrCLIRunExample.testInteractiveSolrCloudExample-seed#[D182CE444F24E904]) [    ] o.a.s.c.c.ZkStateReader Updating cluster state from ZooKeeper... 
   [junit4]   2> 71539 INFO  (qtp1414128015-595) [n:localhost:45220_solr    ] o.a.s.h.a.CollectionsHandler Invoked Collection Action :list with params action=list&wt=json and sendToOCPQueue=true
   [junit4]   2> 71539 INFO  (qtp1414128015-595) [n:localhost:45220_solr    ] o.a.s.s.HttpSolrCall [admin] webapp=null path=/admin/collections params={action=list&wt=json} status=0 QTime=0
   [junit4]   2> 71553 INFO  (qtp1414128015-594) [n:localhost:45220_solr    ] o.a.s.s.HttpSolrCall [admin] webapp=null path=/admin/info/system params={wt=json} status=0 QTime=9
   [junit4]   2> 71575 INFO  (qtp1414128015-589) [n:localhost:45220_solr    ] o.a.s.h.a.CollectionsHandler Invoked Collection Action :clusterstatus with params action=CLUSTERSTATUS&wt=json and sendToOCPQueue=true
   [junit4]   2> 71577 INFO  (qtp1414128015-589) [n:localhost:45220_solr    ] o.a.s.s.HttpSolrCall [admin] webapp=null path=/admin/collections params={action=CLUSTERSTATUS&wt=json} status=0 QTime=2
   [junit4]   2> 71578 INFO  (TEST-TestSolrCLIRunExample.testInteractiveSolrCloudExample-seed#[D182CE444F24E904]) [    ] o.a.s.c.c.SolrZkClient Using default ZkCredentialsProvider
   [junit4]   2> 71578 INFO  (TEST-TestSolrCLIRunExample.testInteractiveSolrCloudExample-seed#[D182CE444F24E904]) [    ] o.a.s.c.c.ConnectionManager Waiting for client to connect to ZooKeeper
   [junit4]   2> 71583 INFO  (zkCallback-88-thread-1) [    ] o.a.s.c.c.ConnectionManager Watcher org.apache.solr.common.cloud.ConnectionManager@620abdee name:ZooKeeperConnection Watcher:127.0.0.1:51339/solr got event WatchedEvent state:SyncConnected type:None path:null path:null type:None
   [junit4]   2> 71584 INFO  (TEST-TestSolrCLIRunExample.testInteractiveSolrCloudExample-seed#[D182CE444F24E904]) [    ] o.a.s.c.c.ConnectionManager Client is connected to ZooKeeper
   [junit4]   2> 71584 INFO  (TEST-TestSolrCLIRunExample.testInteractiveSolrCloudExample-seed#[D182CE444F24E904]) [    ] o.a.s.c.c.SolrZkClient Using default ZkACLProvider
   [junit4]   2> 71584 INFO  (TEST-TestSolrCLIRunExample.testInteractiveSolrCloudExample-seed#[D182CE444F24E904]) [    ] o.a.s.c.c.ZkStateReader Updating cluster state from ZooKeeper... 
   [junit4]   2> 71590 INFO  (TEST-TestSolrCLIRunExample.testInteractiveSolrCloudExample-seed#[D182CE444F24E904]) [    ] o.a.s.c.c.SolrZkClient makePath: /configs/testCloudExamplePrompt/managed-schema
   [junit4]   2> 71594 INFO  (TEST-TestSolrCLIRunExample.testInteractiveSolrCloudExample-seed#[D182CE444F24E904]) [    ] o.a.s.c.c.SolrZkClient makePath: /configs/testCloudExamplePrompt/elevate.xml
   [junit4]   2> 71596 INFO  (TEST-TestSolrCLIRunExample.testInteractiveSolrCloudExample-seed#[D182CE444F24E904]) [    ] o.a.s.c.c.SolrZkClient makePath: /configs/testCloudExamplePrompt/synonyms.txt
   [junit4]   2> 71602 INFO  (TEST-TestSolrCLIRunExample.testInteractiveSolrCloudExample-seed#[D182CE444F24E904]) [    ] o.a.s.c.c.SolrZkClient makePath: /configs/testCloudExamplePrompt/lang/stopwords_en.txt
   [junit4]   2> 71605 INFO  (TEST-TestSolrCLIRunExample.testInteractiveSolrCloudExample-seed#[D182CE444F24E904]) [    ] o.a.s.c.c.SolrZkClient makePath: /configs/testCloudExamplePrompt/lang/stopwords_ro.txt
   [junit4]   2> 71608 INFO  (TEST-TestSolrCLIRunExample.testInteractiveSolrCloudExample-seed#[D182CE444F24E904]) [    ] o.a.s.c.c.SolrZkClient makePath: /configs/testCloudExamplePrompt/lang/stopwords_ca.txt
   [junit4]   2> 71611 INFO  (TEST-TestSolrCLIRunExample.testInteractiveSolrCloudExample-seed#[D182CE444F24E904]) [    ] o.a.s.c.c.SolrZkClient makePath: /configs/testCloudExamplePrompt/lang/stopwords_bg.txt
   [junit4]   2> 71613 INFO  (TEST-TestSolrCLIRunExample.testInteractiveSolrCloudExample-seed#[D182CE444F24E904]) [    ] o.a.s.c.c.SolrZkClient makePath: /configs/testCloudExamplePrompt/lang/stopwords_es.txt
   [junit4]   2> 71616 INFO  (TEST-TestSolrCLIRunExample.testInteractiveSolrCloudExample-seed#[D182CE444F24E904]) [    ] o.a.s.c.c.SolrZkClient makePath: /configs/testCloudExamplePrompt/lang/stopwords_ja.txt
   [junit4]   2> 71619 INFO  (TEST-TestSolrCLIRunExample.testInteractiveSolrCloudExample-seed#[D182CE444F24E904]) [    ] o.a.s.c.c.SolrZkClient makePath: /configs/testCloudExamplePrompt/lang/stopwords_gl.txt
   [junit4]   2> 71622 INFO  (TEST-TestSolrCLIRunExample.testInteractiveSolrCloudExample-seed#[D182CE444F24E904]) [    ] o.a.s.c.c.SolrZkClient makePath: /configs/testCloudExamplePrompt/lang/stopwords_lv.txt
   [junit4]   2> 71624 INFO  (TEST-TestSolrCLIRunExample.testInteractiveSolrCloudExample-seed#[D182CE444F24E904]) [    ] o.a.s.c.c.SolrZkClient makePath: /configs/testCloudExamplePrompt/lang/contractions_ca.txt
   [junit4]   2> 71627 INFO  (TEST-TestSolrCLIRunExample.testInteractiveSolrCloudExample-seed#[D182CE444F24E904]) [    ] o.a.s.c.c.SolrZkClient makePath: /configs/testCloudExamplePrompt/lang/stopwords_id.txt
   [junit4]   2> 71632 INFO  (TEST-TestSolrCLIRunExample.testInteractiveSolrCloudExample-seed#[D182CE444F24E904]) [    ] o.a.s.c.c.SolrZkClient makePath: /configs/testCloudExamplePrompt/lang/stopwords_hi.txt
   [junit4]   2> 71635 INFO  (TEST-TestSolrCLIRunExample.testInteractiveSolrCloudExample-seed#[D182CE444F24E904]) [    ] o.a.s.c.c.SolrZkClient makePath: /configs/testCloudExamplePrompt/lang/stopwords_de.txt
   [junit4]   2> 71638 INFO  (TEST-TestSolrCLIRunExample.testInteractiveSolrCloudExample-seed#[D182CE444F24E904]) [    ] o.a.s.c.c.SolrZkClient makePath: /configs/testCloudExamplePrompt/lang/stopwords_cz.txt
   [junit4]   2> 71641 INFO  (TEST-TestSolrCLIRunExample.testInteractiveSolrCloudExample-seed#[D182CE444F24E904]) [    ] o.a.s.c.c.SolrZkClient makePath: /configs/testCloudExamplePrompt/lang/contractions_fr.txt
   [junit4]   2> 71643 INFO  (TEST-TestSolrCLIRunExample.testInteractiveSolrCloudExample-seed#[D182CE444F24E904]) [    ] o.a.s.c.c.SolrZkClient makePath: /configs/testCloudExamplePrompt/lang/stopwords_fa.txt
   [junit4]   2> 71648 INFO  (TEST-TestSolrCLIRunExample.testInteractiveSolrCloudExample-seed#[D182CE444F24E904]) [    ] o.a.s.c.c.SolrZkClient makePath: /configs/testCloudExamplePrompt/lang/stopwords_eu.txt
   [junit4]   2> 71651 INFO  (TEST-TestSolrCLIRunExample.testInteractiveSolrCloudExample-seed#[D182CE444F24E904]) [    ] o.a.s.c.c.SolrZkClient makePath: /configs/testCloudExamplePrompt/lang/stopwords_ga.txt
   [junit4]   2> 71657 INFO  (TEST-TestSolrCLIRunExample.testInteractiveSolrCloudExample-seed#[D182CE444F24E904]) [    ] o.a.s.c.c.SolrZkClient makePath: /configs/testCloudExamplePrompt/lang/contractions_it.txt
   [junit4]   2> 71660 INFO  (TEST-TestSolrCLIRunExample.testInteractiveSolrCloudExample-seed#[D182CE444F24E904]) [    ] o.a.s.c.c.SolrZkClient makePath: /configs/testCloudExamplePrompt/lang/stopwords_ar.txt
   [junit4]   2> 71664 INFO  (TEST-TestSolrCLIRunExample.testInteractiveSolrCloudExample-seed#[D182CE444F24E904]) [    ] o.a.s.c.c.SolrZkClient makePath: /configs/testCloudExamplePrompt/lang/stopwords_ru.txt
   [junit4]   2> 71669 INFO  (TEST-TestSolrCLIRunExample.testInteractiveSolrCloudExample-seed#[D182CE444F24E904]) [    ] o.a.s.c.c.SolrZkClient makePath: /configs/testCloudExamplePrompt/lang/stopwords_tr.txt
   [junit4]   2> 71672 INFO  (TEST-TestSolrCLIRunExample.testInteractiveSolrCloudExample-seed#[D182CE444F24E904]) [    ] o.a.s.c.c.SolrZkClient makePath: /configs/testCloudExamplePrompt/lang/stoptags_ja.txt
   [junit4]   2> 71676 INFO  (TEST-TestSolrCLIRunExample.testInteractiveSolrCloudExample-seed#[D182CE444F24E904]) [    ] o.a.s.c.c.SolrZkClient makePath: /configs/testCloudExamplePrompt/lang/stopwords_fi.txt
   [junit4]   2> 71679 INFO  (TEST-TestSolrCLIRunExample.testInteractiveSolrCloudExample-seed#[D182CE444F24E904]) [    ] o.a.s.c.c.SolrZkClient makePath: /configs/testCloudExamplePrompt/lang/stopwords_nl.txt
   [junit4]   2> 71682 INFO  (TEST-TestSolrCLIRunExample.testInteractiveSolrCloudExample-seed#[D182CE444F24E904]) [    ] o.a.s.c.c.SolrZkClient makePath: /configs/testCloudExamplePrompt/lang/hyphenations_ga.txt
   [junit4]   2> 71687 INFO  (TEST-TestSolrCLIRunExample.testInteractiveSolrCloudExample-seed#[D182CE444F24E904]) [    ] o.a.s.c.c.SolrZkClient makePath: /configs/testCloudExamplePrompt/lang/stopwords_hu.txt
   [junit4]   2> 71689 INFO  (TEST-TestSolrCLIRunExample.testInteractiveSolrCloudExample-seed#[D182CE444F24E904]) [    ] o.a.s.c.c.SolrZkClient makePath: /configs/testCloudExamplePrompt/lang/stopwords_el.txt
   [junit4]   2> 71692 INFO  (TEST-TestSolrCLIRunExample.testInteractiveSolrCloudExample-seed#[D182CE444F24E904]) [    ] o.a.s.c.c.SolrZkClient makePath: /configs/testCloudExamplePrompt/lang/stemdict_nl.txt
   [junit4]   2> 71696 INFO  (TEST-TestSolrCLIRunExample.testInteractiveSolrCloudExample-seed#[D182CE444F24E904]) [    ] o.a.s.c.c.SolrZkClient makePath: /configs/testCloudExamplePrompt/lang/contractions_ga.txt
   [junit4]   2> 71698 INFO  (TEST-TestSolrCLIRunExample.testInteractiveSolrCloudExample-seed#[D182CE444F24E904]) [    ] o.a.s.c.c.SolrZkClient makePath: /configs/testCloudExamplePrompt/lang/stopwords_no.txt
   [junit4]   2> 71702 INFO  (TEST-TestSolrCLIRunExample.testInteractiveSolrCloudExample-seed#[D182CE444F24E904]) [    ] o.a.s.c.c.SolrZkClient makePath: /configs/testCloudExamplePrompt/lang/stopwords_pt.txt
   [junit4]   2> 71705 INFO  (TEST-TestSolrCLIRunExample.testInteractiveSolrCloudExample-seed#[D182CE444F24E904]) [    ] o.a.s.c.c.SolrZkClient makePath: /configs/testCloudExamplePrompt/lang/stopwords_da.txt
   [junit4]   2> 71718 INFO  (TEST-TestSolrCLIRunExample.testInteractiveSolrCloudExample-seed#[D182CE444F24E904]) [    ] o.a.s.c.c.SolrZkClient makePath: /configs/testCloudExamplePrompt/lang/stopwords_sv.txt
   [junit4]   2> 71724 INFO  (TEST-TestSolrCLIRunExample.testInteractiveSolrCloudExample-seed#[D182CE444F24E904]) [    ] o.a.s.c.c.SolrZkClient makePath: /configs/testCloudExamplePrompt/lang/userdict_ja.txt
   [junit4]   2> 71728 INFO  (TEST-TestSolrCLIRunExample.testInteractiveSolrCloudExample-seed#[D182CE444F24E904]) [    ] o.a.s.c.c.SolrZkClient makePath: /configs/testCloudExamplePrompt/lang/stopwords_th.txt
   [junit4]   2> 71742 INFO  (TEST-TestSolrCLIRunExample.testInteractiveSolrCloudExample-seed#[D182CE444F24E904]) [    ] o.a.s.c.c.SolrZkClient makePath: /configs/testCloudExamplePrompt/lang/stopwords_hy.txt
   [junit4]   2> 71744 INFO  (TEST-TestSolrCLIRunExample.testInteractiveSolrCloudExample-seed#[D182CE444F24E904]) [    ] o.a.s.c.c.SolrZkClient makePath: /configs/testCloudExamplePrompt/lang/stopwords_fr.txt
   [junit4]   2> 71747 INFO  (TEST-TestSolrCLIRunExample.testInteractiveSolrCloudExample-seed#[D182CE444F24E904]) [    ] o.a.s.c.c.SolrZkClient makePath: /configs/testCloudExamplePrompt/lang/stopwords_it.txt
   [junit4]   2> 71750 INFO  (TEST-TestSolrCLIRunExample.testInteractiveSolrCloudExample-seed#[D182CE444F24E904]) [    ] o.a.s.c.c.SolrZkClient makePath: /configs/testCloudExamplePrompt/currency.xml
   [junit4]   2> 71753 INFO  (TEST-TestSolrCLIRunExample.testInteractiveSolrCloudExample-seed#[D182CE444F24E904]) [    ] o.a.s.c.c.SolrZkClient makePath: /configs/testCloudExamplePrompt/stopwords.txt
   [junit4]   2> 71756 INFO  (TEST-TestSolrCLIRunExample.testInteractiveSolrCloudExample-seed#[D182CE444F24E904]) [    ] o.a.s.c.c.SolrZkClient makePath: /configs/testCloudExamplePrompt/params.json
   [junit4]   2> 71761 INFO  (TEST-TestSolrCLIRunExample.testInteractiveSolrCloudExample-seed#[D182CE444F24E904]) [    ] o.a.s.c.c.SolrZkClient makePath: /configs/testCloudExamplePrompt/solrconfig.xml
   [junit4]   2> 71764 INFO  (TEST-TestSolrCLIRunExample.testInteractiveSolrCloudExample-seed#[D182CE444F24E904]) [    ] o.a.s.c.c.SolrZkClient makePath: /configs/testCloudExamplePrompt/protwords.txt
   [junit4]   2> 71768 INFO  (qtp1414128015-591) [n:localhost:45220_solr    ] o.a.s.h.a.CollectionsHandler Invoked Collection Action :list with params action=list&wt=json and sendToOCPQueue=true
   [junit4]   2> 71769 INFO  (qtp1414128015-591) [n:localhost:45220_solr    ] o.a.s.s.HttpSolrCall [admin] webapp=null path=/admin/collections params={action=list&wt=json} status=0 QTime=0
   [junit4]   2> 71771 INFO  (qtp1414128015-588) [n:localhost:45220_solr    ] o.a.s.h.a.CollectionsHandler Invoked Collection Action :create with params replicationFactor=2&maxShardsPerNode=4&collection.configName=testCloudExamplePrompt&name=testCloudExamplePrompt&action=CREATE&numShards=2&wt=json and sendToOCPQueue=true
   [junit4]   2> 71784 INFO  (OverseerCollectionConfigSetProcessor-95403819636228099-localhost:45220_solr-n_0000000000) [n:localhost:45220_solr    ] o.a.s.c.OverseerTaskProcessor Overseer Collection Message Handler: Get the message id:/overseer/collection-queue-work/qn-0000000000 message:{
   [junit4]   2>   "name":"testCloudExamplePrompt",
   [junit4]   2>   "fromApi":"true",
   [junit4]   2>   "replicationFactor":"2",
   [junit4]   2>   "collection.configName":"testCloudExamplePrompt",
   [junit4]   2>   "numShards":"2",
   [junit4]   2>   "maxShardsPerNode":"4",
   [junit4]   2>   "stateFormat":"2",
   [junit4]   2>   "operation":"create"}
   [junit4]   2> 71795 INFO  (OverseerThreadFactory-238-thread-1-processing-n:localhost:45220_solr) [n:localhost:45220_solr    ] o.a.s.c.OverseerCollectionMessageHandler OverseerCollectionMessageHandler.processMessage : create , {
   [junit4]   2>   "name":"testCloudExamplePrompt",
   [junit4]   2>   "fromApi":"true",
   [junit4]   2>   "replicationFactor":"2",
   [junit4]   2>   "collection.configName":"testCloudExamplePrompt",
   [junit4]   2>   "numShards":"2",
   [junit4]   2>   "maxShardsPerNode":"4",
   [junit4]   2>   "stateFormat":"2",
   [junit4]   2>   "operation":"create"}
   [junit4]   2> 71799 INFO  (OverseerThreadFactory-238-thread-1-processing-n:localhost:45220_solr) [n:localhost:45220_solr    ] o.a.s.c.OverseerCollectionMessageHandler Create collection testCloudExamplePrompt
   [junit4]   2> 71800 WARN  (OverseerThreadFactory-238-thread-1-processing-n:localhost:45220_solr) [n:localhost:45220_solr    ] o.a.s.c.OverseerCollectionMessageHandler Specified replicationFactor of 2 on collection testCloudExamplePrompt is higher than or equal to the number of Solr instances currently live or live and part of your createNodeSet(1). It's unusual to run two replica of the same slice on the same Solr-instance.
   [junit4]   2> 71803 INFO  (OverseerThreadFactory-238-thread-1-processing-n:localhost:45220_solr) [n:localhost:45220_solr    ] o.a.s.c.OverseerCollectionMessageHandler creating collections conf node /collections/testCloudExamplePrompt 
   [junit4]   2> 71803 INFO  (OverseerThreadFactory-238-thread-1-processing-n:localhost:45220_solr) [n:localhost:45220_solr    ] o.a.s.c.c.SolrZkClient makePath: /collections/testCloudExamplePrompt
   [junit4]   2> 71805 INFO  (zkCallback-82-thread-1-processing-n:localhost:45220_solr) [n:localhost:45220_solr    ] o.a.s.c.c.ZkStateReader A collections change: [WatchedEvent state:SyncConnected type:NodeChildrenChanged path:/collections], has occurred - updating...
   [junit4]   2> 71805 INFO  (zkCallback-88-thread-1) [    ] o.a.s.c.c.ZkStateReader A collections change: [WatchedEvent state:SyncConnected type:NodeChildrenChanged path:/collections], has occurred - updating...
   [junit4]   2> 71805 INFO  (zkCallback-82-thread-2-processing-n:localhost:45220_solr) [n:localhost:45220_solr    ] o.a.s.c.c.ZkStateReader A collections change: [WatchedEvent state:SyncConnected type:NodeChildrenChanged path:/collections], has occurred - updating...
   [junit4]   2> 71810 INFO  (OverseerStateUpdate-95403819636228099-localhost:45220_solr-n_0000000000) [n:localhost:45220_solr    ] o.a.s.c.Overseer processMessage: queueSize: 1, message = {
   [junit4]   2>   "name":"testCloudExamplePrompt",
   [junit4]   2>   "fromApi":"true",
   [junit4]   2>   "replicationFactor":"2",
   [junit4]   2>   "collection.configName":"testCloudExamplePrompt",
   [junit4]   2>   "numShards":"2",
   [junit4]   2>   "maxShardsPerNode":"4",
   [junit4]   2>   "stateFormat":"2",
   [junit4]   2>   "operation":"create"} current state version: 0
   [junit4]   2> 71810 INFO  (OverseerStateUpdate-95403819636228099-localhost:45220_solr-n_0000000000) [n:localhost:45220_solr    ] o.a.s.c.o.ClusterStateMutator building a new cName: testCloudExamplePrompt
   [junit4]   2> 71811 INFO  (OverseerStateUpdate-95403819636228099-localhost:45220_solr-n_0000000000) [n:localhost:45220_solr    ] o.a.s.c.o.ZkStateWriter going to create_collection /collections/testCloudExamplePrompt/state.json
   [junit4]   2> 71912 INFO  (OverseerThreadFactory-238-thread-1-processing-n:localhost:45220_solr) [n:localhost:45220_solr    ] o.a.s.c.OverseerCollectionMessageHandler Creating SolrCores for new collection testCloudExamplePrompt, shardNames [shard1, shard2] , replicationFactor : 2
   [junit4]   2> 71912 INFO  (OverseerThreadFactory-238-thread-1-processing-n:localhost:45220_solr) [n:localhost:45220_solr    ] o.a.s.c.OverseerCollectionMessageHandler Creating core testCloudExamplePrompt_shard2_replica2 as part of shard shard2 of collection testCloudExamplePrompt on localhost:45220_solr
   [junit4]   2> 71913 INFO  (OverseerThreadFactory-238-thread-1-processing-n:localhost:45220_solr) [n:localhost:45220_solr    ] o.a.s.c.OverseerCollectionMessageHandler Creating core testCloudExamplePrompt_shard1_replica2 as part of shard shard1 of collection testCloudExamplePrompt on localhost:45220_solr
   [junit4]   2> 71916 INFO  (OverseerThreadFactory-238-thread-1-processing-n:localhost:45220_solr) [n:localhost:45220_solr    ] o.a.s.c.OverseerCollectionMessageHandler Creating core testCloudExamplePrompt_shard1_replica1 as part of shard shard1 of collection testCloudExamplePrompt on localhost:45220_solr
   [junit4]   2> 71918 INFO  (qtp1414128015-594) [n:localhost:45220_solr    ] o.a.s.h.a.CoreAdminOperation core create command qt=/admin/cores&collection.configName=testCloudExamplePrompt&name=testCloudExamplePrompt_shard1_replica2&action=CREATE&numShards=2&collection=testCloudExamplePrompt&shard=shard1&wt=javabin&version=2
   [junit4]   2> 71919 INFO  (qtp1414128015-594) [n:localhost:45220_solr    ] o.a.s.c.CoreDescriptor Created CoreDescriptor: {name=testCloudExamplePrompt_shard1_replica2, collection.configName=testCloudExamplePrompt, config=solrconfig.xml, transient=false, schema=schema.xml, loadOnStartup=true, configSetProperties=configsetprops.json, collection=testCloudExamplePrompt, numShards=2, dataDir=data/, shard=shard1}
   [junit4]   2> 71920 INFO  (qtp1414128015-592) [n:localhost:45220_solr    ] o.a.s.h.a.CoreAdminOperation core create command qt=/admin/cores&collection.configName=testCloudExamplePrompt&name=testCloudExamplePrompt_shard2_replica2&action=CREATE&numShards=2&collection=testCloudExamplePrompt&shard=shard2&wt=javabin&version=2
   [junit4]   2> 71920 INFO  (qtp1414128015-592) [n:localhost:45220_solr    ] o.a.s.c.CoreDescriptor Created CoreDescriptor: {name=testCloudExamplePrompt_shard2_replica2, collection.configName=testCloudExamplePrompt, config=solrconfig.xml, transient=false, schema=schema.xml, loadOnStartup=true, configSetProperties=configsetprops.json, collection=testCloudExamplePrompt, numShards=2, dataDir=data/, shard=shard2}
   [junit4]   2> 71921 INFO  (OverseerThreadFactory-238-thread-1-processing-n:localhost:45220_solr) [n:localhost:45220_solr    ] o.a.s.c.OverseerCollectionMessageHandler Creating core testCloudExamplePrompt_shard2_replica1 as part of shard shard2 of collection testCloudExamplePrompt on localhost:45220_solr
   [junit4]   2> 71923 INFO  (qtp1414128015-593) [n:localhost:45220_solr    ] o.a.s.h.a.CoreAdminOperation core create command qt=/admin/cores&collection.configName=testCloudExamplePrompt&name=testCloudExamplePrompt_shard2_replica1&action=CREATE&numShards=2&collection=testCloudExamplePrompt&shard=shard2&wt=javabin&version=2
   [junit4]   2> 71924 INFO  (qtp1414128015-592) [n:localhost:45220_solr c:testCloudExamplePrompt s:shard2  x:testCloudExamplePrompt_shard2_replica2] o.a.s.c.ZkController publishing state=down
   [junit4]   2> 71924 INFO  (qtp1414128015-594) [n:localhost:45220_solr c:testCloudExamplePrompt s:shard1  x:testCloudExamplePrompt_shard1_replica2] o.a.s.c.ZkController publishing state=down
   [junit4]   2> 71924 INFO  (qtp1414128015-593) [n:localhost:45220_solr    ] o.a.s.c.CoreDescriptor Created CoreDescriptor: {name=testCloudExamplePrompt_shard2_replica1, collection.configName=testCloudExamplePrompt, config=solrconfig.xml, transient=false, schema=schema.xml, loadOnStartup=true, configSetProperties=configsetprops.json, collection=testCloudExamplePrompt, numShards=2, dataDir=data/, shard=shard2}
   [junit4]   2> 71929 INFO  (qtp1414128015-592) [n:localhost:45220_solr c:testCloudExamplePrompt s:shard2  x:testCloudExamplePrompt_shard2_replica2] o.a.s.c.ZkController Registering watch for collection testCloudExamplePrompt
   [junit4]   2> 71929 INFO  (qtp1414128015-592) [n:localhost:45220_solr c:testCloudExamplePrompt s:shard2  x:testCloudExamplePrompt_shard2_replica2] o.a.s.c.c.ZkStateReader addZkWatch [testCloudExamplePrompt]
   [junit4]   2> 71929 INFO  (qtp1414128015-593) [n:localhost:45220_solr c:testCloudExamplePrompt s:shard2  x:testCloudExamplePrompt_shard2_replica1] o.a.s.c.ZkController publishing state=down
   [junit4]   2> 71929 INFO  (qtp1414128015-594) [n:localhost:45220_solr c:testCloudExamplePrompt s:shard1  x:testCloudExamplePrompt_shard1_replica2] o.a.s.c.ZkController Registering watch for collection testCloudExamplePrompt
   [junit4]   2> 71929 INFO  (qtp1414128015-594) [n:localhost:45220_solr c:testCloudExamplePrompt s:shard1  x:testCloudExamplePrompt_shard1_replica2] o.a.s.c.ZkController look for our core node name
   [junit4]   2> 71929 INFO  (OverseerStateUpdate-95403819636228099-localhost:45220_solr-n_0000000000) [n:localhost:45220_solr    ] o.a.s.c.Overseer processMessage: queueSize: 2, message = {
   [junit4]   2>   "core":"testCloudExamplePrompt_shard2_replica2",
   [junit4]   2>   "roles":null,
   [junit4]   2>   "base_url":"http://localhost:45220/solr",
   [junit4]   2>   "node_name":"localhost:45220_solr",
   [junit4]   2>   "numShards":"2",
   [junit4]   2>   "state":"down",
   [junit4]   2>   "shard":"shard2",
   [junit4]   2>   "collection":"testCloudExamplePrompt",
   [junit4]   2>   "operation":"state"} current state version: 0
   [junit4]   2> 71930 INFO  (qtp1414128015-592) [n:localhost:45220_solr c:testCloudExamplePrompt s:shard2  x:testCloudExamplePrompt_shard2_replica2] o.a.s.c.c.ZkStateReader Add data for [testCloudExamplePrompt] ver [0]
   [junit4]   2> 71930 INFO  (qtp1414128015-592) [n:localhost:45220_solr c:testCloudExamplePrompt s:shard2  x:testCloudExamplePrompt_shard2_replica2] o.a.s.c.ZkController look for our core node name
   [junit4]   2> 71930 INFO  (OverseerStateUpdate-95403819636228099-localhost:45220_solr-n_0000000000) [n:localhost:45220_solr    ] o.a.s.c.o.ReplicaMutator Update state numShards=2 message={
   [junit4]   2>   "core":"testCloudExamplePrompt_shard2_replica2",
   [junit4]   2>   "roles":null,
   [junit4]   2>   "base_url":"http://localhost:45220/solr",
   [junit4]   2>   "node_name":"localhost:45220_solr",
   [junit4]   2>   "numShards":"2",
   [junit4]   2>   "state":"down",
   [junit4]   2>   "shard":"shard2",
   [junit4]   2>   "collection":"testCloudExamplePrompt",
   [junit4]   2>   "operation":"state"}
   [junit4]   2> 71931 INFO  (qtp1414128015-593) [n:localhost:45220_solr c:testCloudExamplePrompt s:shard2  x:testCloudExamplePrompt_shard2_replica1] o.a.s.c.ZkController Registering watch for collection testCloudExamplePrompt
   [junit4]   2> 71931 INFO  (qtp1414128015-593) [n:localhost:45220_solr c:testCloudExamplePrompt s:shard2  x:testCloudExamplePrompt_shard2_replica1] o.a.s.c.ZkController look for our core node name
   [junit4]   2> 71932 INFO  (OverseerStateUpdate-95403819636228099-localhost:45220_solr-n_0000000000) [n:localhost:45220_solr    ] o.a.s.c.Overseer processMessage: queueSize: 2, message = {
   [junit4]   2>   "core":"testCloudExamplePrompt_shard1_replica2",
   [junit4]   2>   "roles":null,
   [junit4]   2>   "base_url":"http://localhost:45220/solr",
   [junit4]   2>   "node_name":"localhost:45220_solr",
   [junit4]   2>   "numShards":"2",
   [junit4]   2>   "state":"down",
   [junit4]   2>   "shard":"shard1",
   [junit4]   2>   "collection":"testCloudExamplePrompt",
   [junit4]   2>   "operation":"state"} current state version: 0
   [junit4]   2> 71933 INFO  (OverseerStateUpdate-95403819636228099-localhost:45220_solr-n_0000000000) [n:localhost:45220_solr    ] o.a.s.c.o.ReplicaMutator Update state numShards=2 message={
   [junit4]   2>   "core":"testCloudExamplePrompt_shard1_replica2",
   [junit4]   2>   "roles":null,
   [junit4]   2>   "base_url":"http://localhost:45220/solr",
   [junit4]   2>   "node_name":"localhost:45220_solr",
   [junit4]   2>   "numShards":"2",
   [junit4]   2>   "state":"down",
   [junit4]   2>   "shard":"shard1",
   [junit4]   2>   "collection":"testCloudExamplePrompt",
   [junit4]   2>   "operation":"state"}
   [junit4]   2> 71933 INFO  (qtp1414128015-591) [n:localhost:45220_solr    ] o.a.s.h.a.CoreAdminOperation core create command qt=/admin/cores&collection.configName=testCloudExamplePrompt&name=testCloudExamplePrompt_shard1_replica1&action=CREATE&numShards=2&collection=testCloudExamplePrompt&shard=shard1&wt=javabin&version=2
   [junit4]   2> 71934 INFO  (qtp1414128015-591) [n:localhost:45220_solr    ] o.a.s.c.CoreDescriptor Created CoreDescriptor: {name=testCloudExamplePrompt_shard1_replica1, collection.configName=testCloudExamplePrompt, config=solrconfig.xml, transient=false, schema=schema.xml, loadOnStartup=true, configSetProperties=configsetprops.json, collection=testCloudExamplePrompt, numShards=2, dataDir=data/, shard=shard1}
   [junit4]   2> 71935 INFO  (qtp1414128015-591) [n:localhost:45220_solr c:testCloudExamplePrompt s:shard1  x:testCloudExamplePrompt_shard1_replica1] o.a.s.c.ZkController publishing state=down
   [junit4]   2> 71935 INFO  (OverseerStateUpdate-95403819636228099-localhost:45220_solr-n_0000000000) [n:localhost:45220_solr    ] o.a.s.c.Overseer processMessage: queueSize: 1, message = {
   [junit4]   2>   "core":"testCloudExamplePrompt_shard2_replica1",
   [junit4]   2>   "roles":null,
   [junit4]   2>   "base_url":"http://localhost:45220/solr",
   [junit4]   2>   "node_name":"localhost:45220_solr",
   [junit4]   2>   "numShards":"2",
   [junit4]   2>   "state":"down",
   [junit4]   2>   "shard":"shard2",
   [junit4]   2>   "collection":"testCloudExamplePrompt",
   [junit4]   2>   "operation":"state"} current state version: 0
   [junit4]   2> 71936 INFO  (qtp1414128015-591) [n:localhost:45220_solr c:testCloudExamplePrompt s:shard1  x:testCloudExamplePrompt_shard1_replica1] o.a.s.c.ZkController Registering watch for collection testCloudExamplePrompt
   [junit4]   2> 71936 INFO  (qtp1414128015-591) [n:localhost:45220_solr c:testCloudExamplePrompt s:shard1  x:testCloudExamplePrompt_shard1_replica1] o.a.s.c.ZkController look for our core node name
   [junit4]   2> 71936 INFO  (OverseerStateUpdate-95403819636228099-localhost:45220_solr-n_0000000000) [n:localhost:45220_solr    ] o.a.s.c.o.ReplicaMutator Update state numShards=2 message={
   [junit4]   2>   "core":"testCloudExamplePrompt_shard2_replica1",
   [junit4]   2>   "roles":null,
   [junit4]   2>   "base_url":"http://localhost:45220/solr",
   [junit4]   2>   "node_name":"localhost:45220_solr",
   [junit4]   2>   "numShards":"2",
   [junit4]   2>   "state":"down",
   [junit4]   2>   "shard":"shard2",
   [junit4]   2>   "collection":"testCloudExamplePrompt",
   [junit4]   2>   "operation":"state"}
   [junit4]   2> 71938 INFO  (OverseerStateUpdate-95403819636228099-localhost:45220_solr-n_0000000000) [n:localhost:45220_solr    ] o.a.s.c.Overseer processMessage: queueSize: 1, message = {
   [junit4]   2>   "core":"testCloudExamplePrompt_shard1_replica1",
   [junit4]   2>   "roles":null,
   [junit4]   2>   "base_url":"http://localhost:45220/solr",
   [junit4]   2>   "node_name":"localhost:45220_solr",
   [junit4]   2>   "numShards":"2",
   [junit4]   2>   "state":"down",
   [junit4]   2>   "shard":"shard1",
   [junit4]   2>   "collection":"testCloudExamplePrompt",
   [junit4]   2>   "operation":"state"} current state version: 0
   [junit4]   2> 71938 INFO  (OverseerStateUpdate-95403819636228099-localhost:45220_solr-n_0000000000) [n:localhost:45220_solr    ] o.a.s.c.o.ReplicaMutator Update state numShards=2 message={
   [junit4]   2>   "core":"testCloudExamplePrompt_shard1_replica1",
   [junit4]   2>   "roles":null,
   [junit4]   2>   "base_url":"http://localhost:45220/solr",
   [junit4]   2>   "node_name":"localhost:45220_solr",
   [junit4]   2>   "numShards":"2",
   [junit4]   2>   "state":"down",
   [junit4]   2>   "shard":"shard1",
   [junit4]   2>   "collection":"testCloudExamplePrompt",
   [junit4]   2>   "operation":"state"}
   [junit4]   2> 72041 INFO  (OverseerStateUpdate-95403819636228099-localhost:45220_solr-n_0000000000) [n:localhost:45220_solr    ] o.a.s.c.o.ZkStateWriter going to update_collection /collections/testCloudExamplePrompt/state.json version: 0
   [junit4]   2> 72042 INFO  (zkCallback-82-thread-2-processing-n:localhost:45220_solr) [n:localhost:45220_solr    ] o.a.s.c.c.ZkStateReader A cluster state change: [WatchedEvent state:SyncConnected type:NodeDataChanged path:/collections/testCloudExamplePrompt/state.json] for collection [testCloudExamplePrompt] has occurred - updating... (live nodes size: [1])
   [junit4]   2> 72042 INFO  (zkCallback-82-thread-2-processing-n:localhost:45220_solr) [n:localhost:45220_solr    ] o.a.s.c.c.ZkStateReader Updating data for [testCloudExamplePrompt] from [0] to [1]
   [junit4]   2> 72930 INFO  (qtp1414128015-592) [n:localhost:45220_solr c:testCloudExamplePrompt s:shard2  x:testCloudExamplePrompt_shard2_replica2] o.a.s.c.ZkController waiting to find shard id in clusterstate for testCloudExamplePrompt_shard2_replica2
   [junit4]   2> 72930 INFO  (qtp1414128015-592) [n:localhost:45220_solr c:testCloudExamplePrompt s:shard2  x:testCloudExamplePrompt_shard2_replica2] o.a.s.c.ZkController Check for collection zkNode:testCloudExamplePrompt
   [junit4]   2> 72930 INFO  (qtp1414128015-594) [n:localhost:45220_solr c:testCloudExamplePrompt s:shard1  x:testCloudExamplePrompt_shard1_replica2] o.a.s.c.ZkController waiting to find shard id in clusterstate for testCloudExamplePrompt_shard1_replica2
   [junit4]   2> 72930 INFO  (qtp1414128015-594) [n:localhost:45220_solr c:testCloudExamplePrompt s:shard1  x:testCloudExamplePrompt_shard1_replica2] o.a.s.c.ZkController Check for collection zkNode:testCloudExamplePrompt
   [junit4]   2> 72931 INFO  (qtp1414128015-593) [n:localhost:45220_solr c:testCloudExamplePrompt s:shard2  x:testCloudExamplePrompt_shard2_replica1] o.a.s.c.ZkController waiting to find shard id in clusterstate for testCloudExamplePrompt_shard2_replica1
   [junit4]   2> 72931 INFO  (qtp1414128015-593) [n:localhost:45220_solr c:testCloudExamplePrompt s:shard2  x:testCloudExamplePrompt_shard2_replica1] o.a.s.c.ZkController Check for collection zkNode:testCloudExamplePrompt
   [junit4]   2> 72931 INFO  (qtp1414128015-592) [n:localhost:45220_solr c:testCloudExamplePrompt s:shard2  x:testCloudExamplePrompt_shard2_replica2] o.a.s.c.ZkController Collection zkNode exists
   [junit4]   2> 72931 INFO  (qtp1414128015-592) [n:localhost:45220_solr c:testCloudExamplePrompt s:shard2  x:testCloudExamplePrompt_shard2_replica2] o.a.s.c.c.ZkStateReader Load collection config from: [/collections/testCloudExamplePrompt]
   [junit4]   2> 72931 INFO  (qtp1414128015-593) [n:localhost:45220_solr c:testCloudExamplePrompt s:shard2  x:testCloudExamplePrompt_shard2_replica1] o.a.s.c.ZkController Collection zkNode exists
   [junit4]   2> 72931 INFO  (qtp1414128015-594) [n:localhost:45220_solr c:testCloudExamplePrompt s:shard1  x:testCloudExamplePrompt_shard1_replica2] o.a.s.c.ZkController Collection zkNode exists
   [junit4]   2> 72931 INFO  (qtp1414128015-593) [n:localhost:45220_solr c:testCloudExamplePrompt s:shard2  x:testCloudExamplePrompt_shard2_replica1] o.a.s.c.c.ZkStateReader Load collection config from: [/collections/testCloudExamplePrompt]
   [junit4]   2> 72931 INFO  (qtp1414128015-594) [n:localhost:45220_solr c:testCloudExamplePrompt s:shard1  x:testCloudExamplePrompt_shard1_replica2] o.a.s.c.c.ZkStateReader Load collection config from: [/collections/testCloudExamplePrompt]
   [junit4]   2> 72932 INFO  (qtp1414128015-592) [n:localhost:45220_solr c:testCloudExamplePrompt s:shard2  x:testCloudExamplePrompt_shard2_replica2] o.a.s.c.c.ZkStateReader path=[/collections/testCloudExamplePrompt] [configName]=[testCloudExamplePrompt] specified config exists in ZooKeeper
   [junit4]   2> 72932 INFO  (qtp1414128015-592) [n:localhost:45220_solr c:testCloudExamplePrompt s:shard2  x:testCloudExamplePrompt_shard2_replica2] o.a.s.c.SolrResourceLoader new SolrResourceLoader for directory: '/x1/jenkins/jenkins-slave/workspace/Lucene-Solr-Tests-trunk-Java8/solr/build/solr-core/test/J2/temp/solr.util.TestSolrCLIRunExample_D182CE444F24E904-001/tempDir-002/node1/testCloudExamplePrompt_shard2_replica2'
   [junit4]   2> 72932 INFO  (qtp1414128015-593) [n:localhost:45220_solr c:testCloudExamplePrompt s:shard2  x:testCloudExamplePrompt_shard2_replica1] o.a.s.c.c.ZkStateReader path=[/collections/testCloudExamplePrompt] [configName]=[testCloudExamplePrompt] specified config exists in ZooKeeper
   [junit4]   2> 72932 INFO  (qtp1414128015-593) [n:localhost:45220_solr c:testCloudExamplePrompt s:shard2  x:testCloudExamplePrompt_shard2_replica1] o.a.s.c.SolrResourceLoader new SolrResourceLoader for directory: '/x1/jenkins/jenkins-slave/workspace/Lucene-Solr-Tests-trunk-Java8/solr/build/solr-core/test/J2/temp/solr.util.TestSolrCLIRunExample_D182CE444F24E904-001/tempDir-002/node1/testCloudExamplePrompt_shard2_replica1'
   [junit4]   2> 72932 INFO  (qtp1414128015-592) [n:localhost:45220_solr c:testCloudExamplePrompt s:shard2  x:testCloudExamplePrompt_shard2_replica2] o.a.s.c.SolrResourceLoader JNDI not configured for solr (NoInitialContextEx)
   [junit4]   2> 72933 INFO  (qtp1414128015-592) [n:localhost:45220_solr c:testCloudExamplePrompt s:shard2  x:testCloudExamplePrompt_shard2_replica2] o.a.s.c.SolrResourceLoader solr home defaulted to 'solr/' (could not find system property or JNDI)
   [junit4]   2> 72933 INFO  (qtp1414128015-593) [n:localhost:45220_solr c:testCloudExamplePrompt s:shard2  x:testCloudExamplePrompt_shard2_replica1] o.a.s.c.SolrResourceLoader JNDI not configured for solr (NoInitialContextEx)
   [junit4]   2> 72933 INFO  (qtp1414128015-593) [n:localhost:45220_solr c:testCloudExamplePrompt s:shard2  x:testCloudExamplePrompt_shard2_replica1] o.a.s.c.SolrResourceLoader solr home defaulted to 'solr/' (could not find system property or JNDI)
   [junit4]   2> 72936 INFO  (qtp1414128015-591) [n:localhost:45220_solr c:testCloudExamplePrompt s:shard1  x:testCloudExamplePrompt_shard1_replica1] o.a.s.c.ZkController waiting to find shard id in clusterstate for testCloudExamplePrompt_shard1_replica1
   [junit4]   2> 72936 INFO  (qtp1414128015-591) [n:localhost:45220_solr c:testCloudExamplePrompt s:shard1  x:testCloudExamplePrompt_shard1_replica1] o.a.s.c.ZkController Check for collection zkNode:testCloudExamplePrompt
   [junit4]   2> 72939 INFO  (qtp1414128015-594) [n:localhost:45220_solr c:testCloudExamplePrompt s:shard1  x:testCloudExamplePrompt_shard1_replica2] o.a.s.c.c.ZkStateReader path=[/collections/testCloudExamplePrompt] [configName]=[testCloudExamplePrompt] specified config exists in ZooKeeper
   [junit4]   2> 72939 INFO  (qtp1414128015-594) [n:localhost:45220_solr c:testCloudExamplePrompt s:shard1  x:testCloudExamplePrompt_shard1_replica2] o.a.s.c.SolrResourceLoader new SolrResourceLoader for directory: '/x1/jenkins/jenkins-slave/workspace/Lucene-Solr-Tests-trunk-Java8/solr/build/solr-core/test/J2/temp/solr.util.TestSolrCLIRunExample_D182CE444F24E904-001/tempDir-002/node1/testCloudExamplePrompt_shard1_replica2'
   [junit4]   2> 72939 INFO  (qtp1414128015-594) [n:localhost:45220_solr c:testCloudExamplePrompt s:shard1  x:testCloudExamplePrompt_shard1_replica2] o.a.s.c.SolrResourceLoader JNDI not configured for solr (NoInitialContextEx)
   [junit4]   2> 72939 INFO  (qtp1414128015-594) [n:localhost:45220_solr c:testCloudExamplePrompt s:shard1  x:testCloudExamplePrompt_shard1_replica2] o.a.s.c.SolrResourceLoader solr home defaulted to 'solr/' (could not find system property or JNDI)
   [junit4]   2> 72941 INFO  (qtp1414128015-591) [n:localhost:45220_solr c:testCloudExamplePrompt s:shard1  x:testCloudExamplePrompt_shard1_replica1] o.a.s.c.ZkController Collection zkNode exists
   [junit4]   2> 72941 INFO  (qtp1414128015-591) [n:localhost:45220_solr c:testCloudExamplePrompt s:shard1  x:testCloudExamplePrompt_shard1_replica1] o.a.s.c.c.ZkStateReader Load collection config from: [/collections/testCloudExamplePrompt]
   [junit4]   2> 72943 INFO  (qtp1414128015-593) [n:localhost:45220_solr c:testCloudExamplePrompt s:shard2  x:testCloudExamplePrompt_shard2_replica1] o.a.s.c.Config loaded config solrconfig.xml with version 0 
   [junit4]   2> 72944 INFO  (qtp1414128015-594) [n:localhost:45220_solr c:testCloudExamplePrompt s:shard1  x:testCloudExamplePrompt_shard1_replica2] o.a.s.c.Config loaded config solrconfig.xml with version 0 
   [junit4]   2> 72946 INFO  (qtp1414128015-592) [n:localhost:45220_solr c:testCloudExamplePrompt s:shard2  x:testCloudExamplePrompt_shard2_replica2] o.a.s.c.Config loaded config solrconfig.xml with version 0 
   [junit4]   2> 72947 INFO  (qtp1414128015-591) [n:localhost:45220_solr c:testCloudExamplePrompt s:shard1  x:testCloudExamplePrompt_shard1_replica1] o.a.s.c.c.ZkStateReader path=[/collections/testCloudExamplePrompt] [configName]=[testCloudExamplePrompt] specified config exists in ZooKeeper
   [junit4]   2> 72947 INFO  (qtp1414128015-591) [n:localhost:45220_solr c:testCloudExamplePrompt s:shard1  x:testCloudExamplePrompt_shard1_replica1] o.a.s.c.SolrResourceLoader new SolrResourceLoader for directory: '/x1/jenkins/jenkins-slave/workspace/Lucene-Solr-Tests-trunk-Java8/solr/build/solr-core/test/J2/temp/solr.util.TestSolrCLIRunExample_D182CE444F24E904-001/tempDir-002/node1/testCloudExamplePrompt_shard1_replica1'
   [junit4]   2> 72948 INFO  (qtp1414128015-591) [n:localhost:45220_solr c:testCloudExamplePrompt s:shard1  x:testCloudExamplePrompt_shard1_replica1] o.a.s.c.SolrResourceLoader JNDI not configured for solr (NoInitialContextEx)
   [junit4]   2> 72948 INFO  (qtp1414128015-591) [n:localhost:45220_solr c:testCloudExamplePrompt s:shard1  x:testCloudExamplePrompt_shard1_replica1] o.a.s.c.SolrResourceLoader solr home defaulted to 'solr/' (could not find system property or JNDI)
   [junit4]   2> 72974 INFO  (qtp1414128015-591) [n:localhost:45220_solr c:testCloudExamplePrompt s:shard1  x:testCloudExamplePrompt_shard1_replica1] o.a.s.c.Config loaded config solrconfig.xml with version 0 
   [junit4]   2> 72980 INFO  (qtp1414128015-594) [n:localhost:45220_solr c:testCloudExamplePrompt s:shard1  x:testCloudExamplePrompt_shard1_replica2] o.a.s.c.RequestParams conf resource params.json loaded . version : 0 
   [junit4]   2> 72981 INFO  (qtp1414128015-593) [n:localhost:45220_solr c:testCloudExamplePrompt s:shard2  x:testCloudExamplePrompt_shard2_replica1] o.a.s.c.RequestParams conf resource params.json loaded . version : 0 
   [junit4]   2> 72981 INFO  (qtp1414128015-594) [n:localhost:45220_solr c:testCloudExamplePrompt s:shard1  x:testCloudExamplePrompt_shard1_replica2] o.a.s.c.RequestParams request params refreshed to version 0
   [junit4]   2> 72981 INFO  (qtp1414128015-593) [n:localhost:45220_solr c:testCloudExamplePrompt s:shard2  x:testCloudExamplePrompt_shard2_replica1] o.a.s.c.RequestParams request params refreshed to version 0
   [junit4]   2> 72981 INFO  (qtp1414128015-594) [n:localhost:45220_solr c:testCloudExamplePrompt s:shard1  x:testCloudExamplePrompt_shard1_replica2] o.a.s.c.SolrConfig current version of requestparams : 0
   [junit4]   2> 72981 INFO  (qtp1414128015-593) [n:localhost:45220_solr c:testCloudExamplePrompt s:shard2  x:testCloudExamplePrompt_shard2_replica1] o.a.s.c.SolrConfig current version of requestparams : 0
   [junit4]   2> 72981 INFO  (qtp1414128015-594) [n:localhost:45220_solr c:testCloudExamplePrompt s:shard1  x:testCloudExamplePrompt_shard1_replica2] o.a.s.c.SolrConfig Adding specified lib dirs to ClassLoader
   [junit4]   2> 72981 INFO  (qtp1414128015-593) [n:localhost:45220_solr c:testCloudExamplePrompt s:shard2  x:testCloudExamplePrompt_shard2_replica1] o.a.s.c.SolrConfig Adding specified lib dirs to ClassLoader
   [junit4]   2> 72983 WARN  (qtp1414128015-594) [n:localhost:45220_solr c:testCloudExamplePrompt s:shard1  x:testCloudExamplePrompt_shard1_replica2] o.a.s.c.SolrConfig Couldn't add files from /x1/jenkins/jenkins-slave/workspace/Lucene-Solr-Tests-trunk-Java8/solr/build/solr-core/test/J2/temp/solr.util.TestSolrCLIRunExample_D182CE444F24E904-001/tempDir-002/node1/testCloudExamplePrompt_shard1_replica2/../../../../contrib/extraction/lib filtered by .*\.jar to classpath: /x1/jenkins/jenkins-slave/workspace/Lucene-Solr-Tests-trunk-Java8/solr/build/solr-core/test/J2/temp/solr.util.TestSolrCLIRunExample_D182CE444F24E904-001/tempDir-002/node1/testCloudExamplePrompt_shard1_replica2/../../../../contrib/extraction/lib
   [junit4]   2> 72983 WARN  (qtp1414128015-593) [n:localhost:45220_solr c:testCloudExamplePrompt s:shard2  x:testCloudExamplePrompt_shard2_replica1] o.a.s.c.SolrConfig Couldn't add files from /x1/jenkins/jenkins-slave/workspace/Lucene-Solr-Tests-trunk-Java8/solr/build/solr-core/test/J2/temp/solr.util.TestSolrCLIRunExample_D182CE444F24E904-001/tempDir-002/node1/testCloudExamplePrompt_shard2_replica1/../../../../contrib/extraction/lib filtered by .*\.jar to classpath: /x1/jenkins/jenkins-slave/workspace/Lucene-Solr-Tests-trunk-Java8/solr/build/solr-core/test/J2/temp/solr.util.TestSolrCLIRunExample_D182CE444F24E904-001/tempDir-002/node1/testCloudExamplePrompt_shard2_replica1/../../../../contrib/extraction/lib
   [junit4]   2> 72984 WARN  (qtp1414128015-594) [n:localhost:45220_solr c:testCloudExamplePrompt s:shard1  x:testCloudExamplePrompt_shard1_replica2] o.a.s.c.SolrConfig Couldn't add files from /x1/jenkins/jenkins-slave/workspace/Lucene-Solr-Tests-trunk-Java8/solr/build/solr-core/test/J2/temp/solr.util.TestSolrCLIRunExample_D182CE444F24E904-001/tempDir-002/node1/testCloudExamplePrompt_shard1_replica2/../../../../dist filtered by solr-cell-\d.*\.jar to classpath: /x1/jenkins/jenkins-slave/workspace/Lucene-Solr-Tests-trunk-Java8/solr/build/solr-core/test/J2/temp/solr.util.TestSolrCLIRunExample_D182CE444F24E904-001/tempDir-002/node1/testCloudExamplePrompt_shard1_replica2/../../../../dist
   [junit4]   2> 72984 WARN  (qtp1414128015-593) [n:localhost:45220_solr c:testCloudExamplePrompt s:shard2  x:testCloudExamplePrompt_shard2_replica1] o.a.s.c.SolrConfig Couldn't add files from /x1/jenkins/jenkins-slave/workspace/Lucene-Solr-Tests-trunk-Java8/solr/build/solr-core/test/J2/temp/solr.util.TestSolrCLIRunExample_D182CE444F24E904-001/tempDir-002/node1/testCloudExamplePrompt_shard2_replica1/../../../../dist filtered by solr-cell-\d.*\.jar to classpath: /x1/jenkins/jenkins-slave/workspace/Lucene-Solr-Tests-trunk-Java8/solr/build/solr-core/test/J2/temp/solr.util.TestSolrCLIRunExample_D182CE444F24E904-001/tempDir-002/node1/testCloudExamplePrompt_shard2_replica1/../../../../dist
   [junit4]   2> 72984 WARN  (qtp1414128015-594) [n:localhost:45220_solr c:testCloudExamplePrompt s:shard1  x:testCloudExamplePrompt_shard1_replica2] o.a.s.c.SolrConfig Couldn't add files from /x1/jenkins/jenkins-slave/workspace/Lucene-Solr-Tests-trunk-Java8/solr/build/solr-core/test/J2/temp/solr.util.TestSolrCLIRunExample_D182CE444F24E904-001/tempDir-002/node1/testCloudExamplePrompt_shard1_replica2/../../../../contrib/clustering/lib filtered by .*\.jar to classpath: /x1/jenkins/jenkins-slave/workspace/Lucene-Solr-Tests-trunk-Java8/solr/build/solr-core/test/J2/temp/solr.util.TestSolrCLIRunExample_D182CE444F24E904-001/tempDir-002/node1/testCloudExamplePrompt_shard1_replica2/../../../../contrib/clustering/lib
   [junit4]   2> 72985 WARN  (qtp1414128015-593) [n:localhost:45220_solr c:testCloudExamplePrompt s:shard2  x:testCloudExamplePrompt_shard2_replica1] o.a.s.c.SolrConfig Couldn't add files from /x1/jenkins/jenkins-slave/workspace/Lucene-Solr-Tests-trunk-Java8/solr/build/solr-core/test/J2/temp/solr.util.TestSolrCLIRunExample_D182CE444F24E904-001/tempDir-002/node1/testCloudExamplePrompt_shard2_replica1/../../../../contrib/clustering/lib filtered by .*\.jar to classpath: /x1/jenkins/jenkins-slave/workspace/Lucene-Solr-Tests-trunk-Java8/solr/build/solr-core/test/J2/temp/solr.util.TestSolrCLIRunExample_D182CE444F24E904-001/tempDir-002/node1/testCloudExamplePrompt_shard2_replica1/../../../../contrib/clustering/lib
   [junit4]   2> 72985 WARN  (qtp1414128015-594) [n:localhost:45220_solr c:testCloudExamplePrompt s:shard1  x:testCloudExamplePrompt_shard1_replica2] o.a.s.c.SolrConfig Couldn't add files from /x1/jenkins/jenkins-slave/workspace/Lucene-Solr-Tests-trunk-Java8/solr/build/solr-core/test/J2/temp/solr.util.TestSolrCLIRunExample_D182CE444F24E904-001/tempDir-002/node1/testCloudExamplePrompt_shard1_replica2/../../../../dist filtered by solr-clustering-\d.*\.jar to classpath: /x1/jenkins/jenkins-slave/workspace/Lucene-Solr-Tests-trunk-Java8/solr/build/solr-core/test/J2/temp/solr.util.TestSolrCLIRunExample_D182CE444F24E904-001/tempDir-002/node1/testCloudExamplePrompt_shard1_replica2/../../../../dist
   [junit4]   2> 72985 WARN  (qtp1414128015-593) [n:localhost:45220_solr c:testCloudExamplePrompt s:shard2  x:testCloudExamplePrompt_shard2_replica1] o.a.s.c.SolrConfig Couldn't add files from /x1/jenkins/jenkins-slave/workspace/Lucene-Solr-Tests-trunk-Java8/solr/build/solr-core/test/J2/temp/solr.util.TestSolrCLIRunExample_D182CE444F24E904-001/tempDir-002/node1/testCloudExamplePrompt_shard2_replica1/../../../../dist filtered by solr-clustering-\d.*\.jar to classpath: /x1/jenkins/jenkins-slave/workspace/Lucene-Solr-Tests-trunk-Java8/solr/build/solr-core/test/J2/temp/solr.util.TestSolrCLIRunExample_D182CE444F24E904-001/tempDir-002/node1/testCloudExamplePrompt_shard2_replica1/../../../../dist
   [junit4]   2> 72985 WARN  (qtp1414128015-594) [n:localhost:45220_solr c:testCloudExamplePrompt s:shard1  x:testCloudExamplePrompt_shard1_replica2] o.a.s.c.SolrConfig Couldn't add files from /x1/jenkins/jenkins-slave/workspace/Lucene-Solr-Tests-trunk-Java8/solr/build/solr-core/test/J2/temp/solr.util.TestSolrCLIRunExample_D182CE444F24E904-001/tempDir-002/node1/testCloudExamplePrompt_shard1_replica2/../../../../contrib/langid/lib filtered by .*\.jar to classpath: /x1/jenkins/jenkins-slave/workspace/Lucene-Solr-Tests-trunk-Java8/solr/build/solr-core/test/J2/temp/solr.util.TestSolrCLIRunExample_D182CE444F24E904-001/tempDir-002/node1/testCloudExamplePrompt_shard1_replica2/../../../../contrib/langid/lib
   [junit4]   2> 72985 WARN  (qtp1414128015-593) [n:localhost:45220_solr c:testCloudExamplePrompt s:shard2  x:testCloudExamplePrompt_shard2_replica1] o.a.s.c.SolrConfig Couldn't add files from /x1/jenkins/jenkins-slave/workspace/Lucene-Solr-Tests-trunk-Java8/solr/build/solr-core/test/J2/temp/solr.util.TestSolrCLIRunExample_D182CE444F24E904-001/tempDir-002/node1/testCloudExamplePrompt_shard2_replica1/../../../../contrib/langid/lib filtered by .*\.jar to classpath: /x1/jenkins/jenkins-slave/workspace/Lucene-Solr-Tests-trunk-Java8/solr/build/solr-core/test/J2/temp/solr.util.TestSolrCLIRunExample_D182CE444F24E904-001/tempDir-002/node1/testCloudExamplePrompt_shard2_replica1/../../../../contrib/langid/lib
   [junit4]   2> 72985 WARN  (qtp1414128015-594) [n:localhost:45220_solr c:testCloudExamplePrompt s:shard1  x:testCloudExamplePrompt_shard1_replica2] o.a.s.c.SolrConfig Couldn't add files from /x1/jenkins/jenkins-slave/workspace/Lucene-Solr-Tests-trunk-Java8/solr/build/solr-core/test/J2/temp/solr.util.TestSolrCLIRunExample_D182CE444F24E904-001/tempDir-002/node1/testCloudExamplePrompt_shard1_replica2/../../../../dist filtered by solr-langid-\d.*\.jar to classpath: /x1/jenkins/jenkins-slave/workspace/Lucene-Solr-Tests-trunk-Java8/solr/build/solr-core/test/J2/temp/solr.util.TestSolrCLIRunExample_D182CE444F24E904-001/tempDir-002/node1/testCloudExamplePrompt_shard1_replica2/../../../../dist
   [junit4]   2> 72985 WARN  (qtp1414128015-593) [n:localhost:45220_solr c:testCloudExamplePrompt s:shard2  x:testCloudExamplePrompt_shard2_replica1] o.a.s.c.SolrConfig Couldn't add files from /x1/jenkins/jenkins-slave/workspace/Lucene-Solr-Tests-trunk-Java8/solr/build/solr-core/test/J2/temp/solr.util.TestSolrCLIRunExample_D182CE444F24E904-001/tempDir-002/node1/testCloudExamplePrompt_shard2_replica1/../../../../dist filtered by solr-langid-\d.*\.jar to classpath: /x1/jenkins/jenkins-slave/workspace/Lucene-Solr-Tests-trunk-Java8/solr/build/solr-core/test/J2/temp/solr.util.TestSolrCLIRunExample_D182CE444F24E904-001/tempDir-002/node1/testCloudExamplePrompt_shard2_replica1/../../../../dist
   [junit4]   2> 72986 WARN  (qtp1414128015-594) [n:localhost:45220_solr c:testCloudExamplePrompt s:shard1  x:testCloudExamplePrompt_shard1_replica2] o.a.s.c.SolrConfig Couldn't add files from /x1/jenkins/jenkins-slave/workspace/Lucene-Solr-Tests-trunk-Java8/solr/build/solr-core/test/J2/temp/solr.util.TestSolrCLIRunExample_D182CE444F24E904-001/tempDir-002/node1/testCloudExamplePrompt_shard1_replica2/../../../../contrib/velocity/lib filtered by .*\.jar to classpath: /x1/jenkins/jenkins-slave/workspace/Lucene-Solr-Tests-trunk-Java8/solr/build/solr-core/test/J2/temp/solr.util.TestSolrCLIRunExample_D182CE444F24E904-001/tempDir-002/node1/testCloudExamplePrompt_shard1_replica2/../../../../contrib/velocity/lib
   [junit4]   2> 72986 WARN  (qtp1414128015-593) [n:localhost:45220_solr c:testCloudExamplePrompt s:shard2  x:testCloudExamplePrompt_shard2_replica1] o.a.s.c.SolrConfig Couldn't add files from /x1/jenkins/jenkins-slave/workspace/Lucene-Solr-Tests-trunk-Java8/solr/build/solr-core/test/J2/temp/solr.util.TestSolrCLIRunExample_D182CE444F24E904-001/tempDir-002/node1/testCloudExamplePrompt_shard2_replica1/../../../../contrib/velocity/lib filtered by .*\.jar to classpath: /x1/jenkins/jenkins-slave/workspace/Lucene-Solr-Tests-trunk-Java8/solr/build/solr-core/test/J2/temp/solr.util.TestSolrCLIRunExample_D182CE444F24E904-001/tempDir-002/node1/testCloudExamplePrompt_shard2_replica1/../../../../contrib/velocity/lib
   [junit4]   2> 72986 WARN  (qtp1414128015-594) [n:localhost:45220_solr c:testCloudExamplePrompt s:shard1  x:testCloudExamplePrompt_shard1_replica2] o.a.s.c.SolrConfig Couldn't add files from /x1/jenkins/jenkins-slave/workspace/Lucene-Solr-Tests-trunk-Java8/solr/build/solr-core/test/J2/temp/solr.util.TestSolrCLIRunExample_D182CE444F24E904-001/tempDir-002/node1/testCloudExamplePrompt_shard1_replica2/../../../../dist filtered by solr-velocity-\d.*\.jar to classpath: /x1/jenkins/jenkins-slave/workspace/Lucene-Solr-Tests-trunk-Java8/solr/build/solr-core/test/J2/temp/solr.util.TestSolrCLIRunExample_D182CE444F24E904-001/tempDir-002/node1/testCloudExamplePrompt_shard1_replica2/../../../../dist
   [junit4]   2> 72986 WARN  (qtp1414128015-593) [n:localhost:45220_solr c:testCloudExamplePrompt s:shard2  x:testCloudExamplePrompt_shard2_replica1] o.a.s.c.SolrConfig Couldn't add files from /x1/jenkins/jenkins-slave/workspace/Lucene-Solr-Tests-trunk-Java8/solr/build/solr-core/test/J2/temp/solr.util.TestSolrCLIRunExample_D182CE444F24E904-001/tempDir-002/node1/testCloudExamplePrompt_shard2_replica1/../../../../dist filtered by solr-velocity-\d.*\.jar to classpath: /x1/jenkins/jenkins-slave/workspace/Lucene-Solr-Tests-trunk-Java8/solr/build/solr-core/test/J2/temp/solr.util.TestSolrCLIRunExample_D182CE444F24E904-001/tempDir-002/node1/testCloudExamplePrompt_shard2_replica1/../../../../dist
   [junit4]   2> 72993 WARN  (qtp1414128015-594) [n:localhost:45220_solr c:testCloudExamplePrompt s:shard1  x:testCloudExamplePrompt_shard1_replica2] o.a.s.c.Config Beginning with Solr 5.5, <maxMergeDocs> is deprecated, configure it on the relevant <mergePolicyFactory> instead.
   [junit4]   2> 72993 WARN  (qtp1414128015-593) [n:localhost:45220_solr c:testCloudExamplePrompt s:shard2  x:testCloudExamplePrompt_shard2_replica1] o.a.s.c.Config Beginning with Solr 5.5, <maxMergeDocs> is deprecated, configure it on the relevant <mergePolicyFactory> instead.
   [junit4]   2> 72993 WARN  (qtp1414128015-593) [n:localhost:45220_solr c:testCloudExamplePrompt s:shard2  x:testCloudExamplePrompt_shard2_replica1] o.a.s.c.Config Beginning with Solr 5.5, <mergeFactor> is deprecated, configure it on the relevant <mergePolicyFactory> instead.
   [junit4]   2> 72993 INFO  (qtp1414128015-592) [n:localhost:45220_solr c:testCloudExamplePrompt s:shard2  x:testCloudExamplePrompt_shard2_replica2] o.a.s.c.RequestParams conf resource params.json loaded . version : 0 
   [junit4]   2> 72993 INFO  (qtp1414128015-592) [n:localhost:45220_solr c:testCloudExamplePrompt s:shard2  x:testCloudExamplePrompt_shard2_replica2] o.a.s.c.RequestParams request params refreshed to version 0
   [junit4]   2> 72993 INFO  (qtp1414128015-592) [n:localhost:45220_solr c:testCloudExamplePrompt s:shard2  x:testCloudExamplePrompt_shard2_replica2] o.a.s.c.SolrConfig current version of requestparams : 0
   [junit4]   2> 72994 INFO  (qtp1414128015-592) [n:localhost:45220_solr c:testCloudExamplePrompt s:shard2  x:testCloudExamplePrompt_shard2_replica2] o.a.s.c.SolrConfig Adding specified lib dirs to ClassLoader
   [junit4]   2> 72994 WARN  (qtp1414128015-592) [n:localhost:45220_solr c:testCloudExamplePrompt s:shard2  x:testCloudExamplePrompt_shard2_replica2] o.a.s.c.SolrConfig Couldn't add files from /x1/jenkins/jenkins-slave/workspace/Lucene-Solr-Tests-trunk-Java8/solr/build/solr-core/test/J2/temp/solr.util.TestSolrCLIRunExample_D182CE444F24E904-001/tempDir-002/node1/testCloudExamplePrompt_shard2_replica2/../../../../contrib/extraction/lib filtered by .*\.jar to classpath: /x1/jenkins/jenkins-slave/workspace/Lucene-Solr-Tests-trunk-Java8/solr/build/solr-core/test/J2/temp/solr.util.TestSolrCLIRunExample_D182CE444F24E904-001/tempDir-002/node1/testCloudExamplePrompt_shard2_replica2/../../../../contrib/extraction/lib
   [junit4]   2> 72995 WARN  (qtp1414128015-592) [n:localhost:45220_solr c:testCloudExamplePrompt s:shard2  x:testCloudExamplePrompt_shard2_replica2] o.a.s.c.SolrConfig Couldn't add files from /x1/jenkins/jenkins-slave/workspace/Lucene-Solr-Tests-trunk-Java8/solr/build/solr-core/test/J2/temp/solr.util.TestSolrCLIRunExample_D182CE444F24E904-001/tempDir-002/node1/testCloudExamplePrompt_shard2_replica2/../../../../dist filtered by solr-cell-\d.*\.jar to classpath: /x1/jenkins/jenkins-slave/workspace/Lucene-Solr-Tests-trunk-Java8/solr/build/solr-core/test/J2/temp/solr.util.TestSolrCLIRunExample_D182CE444F24E904-001/tempDir-002/node1/testCloudExamplePrompt_shard2_replica2/../../../../dist
   [junit4]   2> 72995 WARN  (qtp1414128015-592) [n:localhost:45220_solr c:testCloudExamplePrompt s:shard2  x:testCloudExamplePrompt_shard2_replica2] o.a.s.c.SolrConfig Couldn't add files from /x1/jenkins/jenkins-slave/workspace/Lucene-Solr-Tests-trunk-Java8/solr/build/solr-core/test/J2/temp/solr.util.TestSolrCLIRunExample_D182CE444F24E904-001/tempDir-002/node1/testCloudExamplePrompt_shard2_replica2/../../../../contrib/clustering/lib filtered by .*\.jar to classpath: /x1/jenkins/jenkins-slave/workspace/Lucene-Solr-Tests-trunk-Java8/solr/build/solr-core/test/J2/temp/solr.util.TestSolrCLIRunExample_D182CE444F24E904-001/tempDir-002/node1/testCloudExamplePrompt_shard2_replica2/../../../../contrib/clustering/lib
   [junit4]   2> 72995 WARN  (qtp1414128015-592) [n:localhost:45220_solr c:testCloudExamplePrompt s:shard2  x:testCloudExamplePrompt_shard2_replica2] o.a.s.c.SolrConfig Couldn't add files from /x1/jenkins/jenkins-slave/workspace/Lucene-Solr-Tests-trunk-Java8/solr/build/solr-core/test/J2/temp/solr.util.TestSolrCLIRunExample_D182CE444F24E904-001/tempDir-002/node1/testCloudExamplePrompt_shard2_replica2/../../../../dist filtered by solr-clustering-\d.*\.jar to classpath: /x1/jenkins/jenkins-slave/workspace/Lucene-Solr-Tests-trunk-Java8/solr/build/solr-core/test/J2/temp/solr.util.TestSolrCLIRunExample_D182CE444F24E904-001/tempDir-002/node1/testCloudExamplePrompt_shard2_replica2/../../../../dist
   [junit4]   2> 72996 WARN  (qtp1414128015-592) [n:localhost:45220_solr c:testCloudExamplePrompt s:shard2  x:testCloudExamplePrompt_shard2_replica2] o.a.s.c.SolrConfig Couldn't add files from /x1/jenkins/jenkins-slave/workspace/Lucene-Solr-Tests-trunk-Java8/solr/build/solr-core/test/J2/temp/solr.util.TestSolrCLIRunExample_D182CE444F24E904-001/tempDir-002/node1/testCloudExamplePrompt_shard2_replica2/../../../../contrib/langid/lib filtered by .*\.jar to classpath: /x1/jenkins/jenkins-slave/workspace/Lucene-Solr-Tests-trunk-Java8/solr/build/solr-core/test/J2/temp/solr.util.TestSolrCLIRunExample_D182CE444F24E904-001/tempDir-002/node1/testCloudExamplePrompt_shard2_replica2/../../../../contrib/langid/lib
   [junit4]   2> 72996 WARN  (qtp1414128015-592) [n:localhost:45220_solr c:testCloudExamplePrompt s:shard2  x:testCloudExamplePrompt_shard2_replica2] o.a.s.c.SolrConfig Couldn't add files from /x1/jenkins/jenkins-slave/workspace/Lucene-Solr-Tests-trunk-Java8/solr/build/solr-core/test/J2/temp/solr.util.TestSolrCLIRunExample_D182CE444F24E904-001/tempDir-002/node1/testCloudExamplePrompt_shard2_replica2/../../../../dist filtered by solr-langid-\d.*\.jar to classpath: /x1/jenkins/jenkins-slave/workspace/Lucene-Solr-Tests-trunk-Java8/solr/build/solr-core/test/J2/temp/solr.util.TestSolrCLIRunExample_D182CE444F24E904-001/tempDir-002/node1/testCloudExamplePrompt_shard2_replica2/../../../../dist
   [junit4]   2> 72996 WARN  (qtp1414128015-592) [n:localhost:45220_solr c:testCloudExamplePrompt s:shard2  x:testCloudExamplePrompt_shard2_replica2] o.a.s.c.SolrConfig Couldn't add files from /x1/jenkins/jenkins-slave/workspace/Lucene-Solr-Tests-trunk-Java8/solr/build/solr-core/test/J2/temp/solr.util.TestSolrCLIRunExample_D182CE444F24E904-001/tempDir-002/node1/testCloudExamplePrompt_shard2_replica2/../../../../contrib/velocity/lib filtered by .*\.jar to classpath: /x1/jenkins/jenkins-slave/workspace/Lucene-Solr-Tests-trunk-Java8/solr/build/solr-core/test/J2/temp/solr.util.TestSolrCLIRunExample_D182CE444F24E904-001/tempDir-002/node1/testCloudExamplePrompt_shard2_replica2/../../../../contrib/velocity/lib
   [junit4]   2> 72993 WARN  (qtp1414128015-594) [n:localhost:45220_solr c:testCloudExamplePrompt s:shard1  x:testCloudExamplePrompt_shard1_replica2] o.a.s.c.Config Beginning with Solr 5.5, <mergeFactor> is deprecated, configure it on the relevant <mergePolicyFactory> instead.
   [junit4]   2> 72996 WARN  (qtp1414128015-592) [n:localhost:45220_solr c:testCloudExamplePrompt s:shard2  x:testCloudExamplePrompt_shard2_replica2] o.a.s.c.SolrConfig Couldn't add files from /x1/jenkins/jenkins-slave/workspace/Lucene-Solr-Tests-trunk-Java8/solr/build/solr-core/test/J2/temp/solr.util.TestSolrCLIRunExample_D182CE444F24E904-001/tempDir-002/node1/testCloudExamplePrompt_shard2_replica2/../../../../dist filtered by solr-velocity-\d.*\.jar to classpath: /x1/jenkins/jenkins-slave/workspace/Lucene-Solr-Tests-trunk-Java8/solr/build/solr-core/test/J2/temp/solr.util.TestSolrCLIRunExample_D182CE444F24E904-001/tempDir-002/node1/testCloudExamplePrompt_shard2_replica2/../../../../dist
   [junit4]   2> 72998 INFO  (qtp1414128015-594) [n:localhost:45220_solr c:testCloudExamplePrompt s:shard1  x:testCloudExamplePrompt_shard1_replica2] o.a.s.c.SolrConfig Using Lucene MatchVersion: 6.0.0
   [junit4]   2> 73003 WARN  (qtp1414128015-592) [n:localhost:45220_solr c:testCloudExamplePrompt s:shard2  x:testCloudExamplePrompt_shard2_replica2] o.a.s.c.Config Beginning with Solr 5.5, <maxMergeDocs> is deprecated, configure it on the relevant <mergePolicyFactory> instead.
   [junit4]   2> 73003 WARN  (qtp1414128015-592) [n:localhost:45220_solr c:testCloudExamplePrompt s:shard2  x:testCloudExamplePrompt_shard2_replica2] o.a.s.c.Config Beginning with Solr 5.5, <mergeFactor> is deprecated, configure it on the relevant <mergePolicyFactory> instead.
   [junit4]   2> 73005 INFO  (qtp1414128015-593) [n:localhost:45220_solr c:testCloudExamplePrompt s:shard2  x:testCloudExamplePrompt_shard2_replica1] o.a.s.c.SolrConfig Using Lucene MatchVersion: 6.0.0
   [junit4]   2> 73009 INFO  (qtp1414128015-591) [n:localhost:45220_solr c:testCloudExamplePrompt s:shard1  x:testCloudExamplePrompt_shard1_replica1] o.a.s.c.RequestParams conf resource params.json loaded . version : 0 
   [junit4]   2> 73009 INFO  (qtp1414128015-591) [n:localhost:45220_solr c:testCloudExamplePrompt s:shard1  x:testCloudExamplePrompt_shard1_replica1] o.a.s.c.RequestParams request params refreshed to version 0
   [junit4]   2> 73009 INFO  (qtp1414128015-591) [n:localhost:45220_solr c:testCloudExamplePrompt s:shard1  x:testCloudExamplePrompt_shard1_replica1] o.a.s.c.SolrConfig current version of requestparams : 0
   [junit4]   2> 73009 INFO  (qtp1414128015-591) [n:localhost:45220_solr c:testCloudExamplePrompt s:shard1  x:testCloudExamplePrompt_shard1_replica1] o.a.s.c.SolrConfig Adding specified lib dirs to ClassLoader
   [junit4]   2> 73010 WARN  (qtp1414128015-591) [n:localhost:45220_solr c:testCloudExamplePrompt s:shard1  x:testCloudExamplePrompt_shard1_replica1] o.a.s.c.SolrConfig Couldn't add files from /x1/jenkins/jenkins-slave/workspace/Lucene-Solr-Tests-trunk-Java8/solr/build/solr-core/test/J2/temp/solr.util.TestSolrCLIRunExample_D182CE444F24E904-001/tempDir-002/node1/testCloudExamplePrompt_shard1_replica1/../../../../contrib/extraction/lib filtered by .*\.jar to classpath: /x1/jenkins/jenkins-slave/workspace/Lucene-Solr-Tests-trunk-Java8/solr/build/solr-core/test/J2/temp/solr.util.TestSolrCLIRunExample_D182CE444F24E904-001/tempDir-002/node1/testCloudExamplePrompt_shard1_replica1/../../../../contrib/extraction/lib
   [junit4]   2> 73010 WARN  (qtp1414128015-591) [n:localhost:45220_solr c:testCloudExamplePrompt s:shard1  x:testCloudExamplePrompt_shard1_replica1] o.a.s.c.SolrConfig Couldn't add files from /x1/jenkins/jenkins-slave/workspace/Lucene-Solr-Tests-trunk-Java8/solr/build/solr-core/test/J2/temp/solr.util.TestSolrCLIRunExample_D182CE444F24E904-001/tempDir-002/node1/testCloudExamplePrompt_shard1_replica1/../../../../dist filtered by solr-cell-\d.*\.jar to classpath: /x1/jenkins/jenkins-slave/workspace/Lucene-Solr-Tests-trunk-Java8/solr/build/solr-core/test/J2/temp/solr.util.TestSolrCLIRunExample_D182CE444F24E904-001/tempDir-002/node1/testCloudExamplePrompt_shard1_replica1/../../../../dist
   [junit4]   2> 73011 WARN  (qtp1414128015-591) [n:localhost:45220_solr c:testCloudExamplePrompt s:shard1  x:testCloudExamplePrompt_shard1_replica1] o.a.s.c.SolrConfig Couldn't add files from /x1/jenkins/jenkins-slave/workspace/Lucene-Solr-Tests-trunk-Java8/solr/build/solr-core/test/J2/temp/solr.util.TestSolrCLIRunExample_D182CE444F24E904-001/tempDir-002/node1/testCloudExamplePrompt_shard1_replica1/../../../../contrib/clustering/lib filtered by .*\.jar to classpath: /x1/jenkins/jenkins-slave/workspace/Lucene-Solr-Tests-trunk-Java8/solr/build/solr-core/test/J2/temp/solr.util.TestSolrCLIRunExample_D182CE444F24E904-001/tempDir-002/node1/testCloudExamplePrompt_shard1_replica1/../../../../contrib/clustering/lib
   [junit4]   2> 73011 WARN  (qtp1414128015-591) [n:localhost:45220_solr c:testCloudExamplePrompt s:shard1  x:testCloudExamplePrompt_shard1_replica1] o.a.s.c.SolrConfig Couldn't add files from /x1/jenkins/jenkins-slave/workspace/Lucene-Solr-Tests-trunk-Java8/solr/build/solr-core/test/J2/temp/solr.util.TestSolrCLIRunExample_D182CE444F24E904-001/tempDir-002/node1/testCloudExamplePrompt_shard1_replica1/../../../../dist filtered by solr-clustering-\d.*\.jar to classpath: /x1/jenkins/jenkins-slave/workspace/Lucene-Solr-Tests-trunk-Java8/solr/build/solr-core/test/J2/temp/

[...truncated too long message...]

esByQuery=0,errors=0,cumulative_adds=59,cumulative_deletesById=0,cumulative_deletesByQuery=5,cumulative_errors=0,transaction_logs_total_size=1618,transaction_logs_total_number=10}
   [junit4]   2> 1101864 INFO  (coreCloseExecutor-4602-thread-1-processing-x:core1) [    x:collection1] o.a.s.u.SolrCoreState Closing SolrCoreState
   [junit4]   2> 1101864 INFO  (coreCloseExecutor-4602-thread-1-processing-x:core1) [    x:collection1] o.a.s.u.DefaultSolrCoreState SolrCoreState ref count has reached 0 - closing IndexWriter
   [junit4]   2> 1101864 INFO  (coreCloseExecutor-4602-thread-1-processing-x:core1) [    x:collection1] o.a.s.u.DefaultSolrCoreState closing IndexWriter with IndexWriterCloser
   [junit4]   2> 1101866 INFO  (coreCloseExecutor-4602-thread-1-processing-x:core1) [    x:collection1] o.a.s.c.SolrCore [collection1] Closing main searcher on request.
   [junit4]   2> 1101882 INFO  (coreCloseExecutor-4602-thread-1-processing-x:core1) [    x:collection1] o.a.s.c.CachingDirectoryFactory Closing MockDirectoryFactory - 2 directories currently being tracked
   [junit4]   2> 1113996 ERROR (coreCloseExecutor-4602-thread-1-processing-x:core1) [    x:collection1] o.a.s.c.CachingDirectoryFactory Timeout waiting for all directory ref counts to be released - gave up waiting on CachedDir<<refCount=3;path=/x1/jenkins/jenkins-slave/workspace/Lucene-Solr-Tests-trunk-Java8/solr/build/solr-core/test/J0/temp/solr.search.TestIndexSearcher_D182CE444F24E904-001/init-core-data-001/index;done=false>>
   [junit4]   2> 1113997 ERROR (coreCloseExecutor-4602-thread-1-processing-x:core1) [    x:collection1] o.a.s.c.CachingDirectoryFactory Error closing directory:org.apache.solr.common.SolrException: Timeout waiting for all directory ref counts to be released - gave up waiting on CachedDir<<refCount=3;path=/x1/jenkins/jenkins-slave/workspace/Lucene-Solr-Tests-trunk-Java8/solr/build/solr-core/test/J0/temp/solr.search.TestIndexSearcher_D182CE444F24E904-001/init-core-data-001/index;done=false>>
   [junit4]   2> 	at org.apache.solr.core.CachingDirectoryFactory.close(CachingDirectoryFactory.java:187)
   [junit4]   2> 	at org.apache.solr.core.SolrCore.close(SolrCore.java:1275)
   [junit4]   2> 	at org.apache.solr.core.SolrCores$2.call(SolrCores.java:135)
   [junit4]   2> 	at org.apache.solr.core.SolrCores$2.call(SolrCores.java:130)
   [junit4]   2> 	at java.util.concurrent.FutureTask.run(FutureTask.java:266)
   [junit4]   2> 	at org.apache.solr.common.util.ExecutorUtil$MDCAwareThreadPoolExecutor$1.run(ExecutorUtil.java:231)
   [junit4]   2> 	at java.util.concurrent.ThreadPoolExecutor.runWorker(ThreadPoolExecutor.java:1142)
   [junit4]   2> 	at java.util.concurrent.ThreadPoolExecutor$Worker.run(ThreadPoolExecutor.java:617)
   [junit4]   2> 	at java.lang.Thread.run(Thread.java:745)
   [junit4]   2> 
   [junit4]   2> 1113997 INFO  (coreCloseExecutor-4602-thread-1-processing-x:core1) [    x:collection1] o.a.s.c.CachingDirectoryFactory looking to close /x1/jenkins/jenkins-slave/workspace/Lucene-Solr-Tests-trunk-Java8/solr/build/solr-core/test/J0/temp/solr.search.TestIndexSearcher_D182CE444F24E904-001/init-core-data-001 [CachedDir<<refCount=0;path=/x1/jenkins/jenkins-slave/workspace/Lucene-Solr-Tests-trunk-Java8/solr/build/solr-core/test/J0/temp/solr.search.TestIndexSearcher_D182CE444F24E904-001/init-core-data-001;done=false>>]
   [junit4]   2> 1113997 INFO  (coreCloseExecutor-4602-thread-1-processing-x:core1) [    x:collection1] o.a.s.c.CachingDirectoryFactory Closing directory: /x1/jenkins/jenkins-slave/workspace/Lucene-Solr-Tests-trunk-Java8/solr/build/solr-core/test/J0/temp/solr.search.TestIndexSearcher_D182CE444F24E904-001/init-core-data-001
   [junit4]   2> 1113997 ERROR (coreCloseExecutor-4602-thread-1-processing-x:core1) [    x:collection1] o.a.s.c.SolrCore java.lang.AssertionError: 3
   [junit4]   2> 	at org.apache.solr.core.CachingDirectoryFactory.close(CachingDirectoryFactory.java:201)
   [junit4]   2> 	at org.apache.solr.core.SolrCore.close(SolrCore.java:1275)
   [junit4]   2> 	at org.apache.solr.core.SolrCores$2.call(SolrCores.java:135)
   [junit4]   2> 	at org.apache.solr.core.SolrCores$2.call(SolrCores.java:130)
   [junit4]   2> 	at java.util.concurrent.FutureTask.run(FutureTask.java:266)
   [junit4]   2> 	at org.apache.solr.common.util.ExecutorUtil$MDCAwareThreadPoolExecutor$1.run(ExecutorUtil.java:231)
   [junit4]   2> 	at java.util.concurrent.ThreadPoolExecutor.runWorker(ThreadPoolExecutor.java:1142)
   [junit4]   2> 	at java.util.concurrent.ThreadPoolExecutor$Worker.run(ThreadPoolExecutor.java:617)
   [junit4]   2> 	at java.lang.Thread.run(Thread.java:745)
   [junit4]   2> 
   [junit4]   2> 1113997 ERROR (coreCloseExecutor-4602-thread-1-processing-x:core1) [    x:collection1] o.a.s.c.SolrCores Error shutting down core:java.lang.AssertionError: 3
   [junit4]   2> 	at org.apache.solr.core.CachingDirectoryFactory.close(CachingDirectoryFactory.java:201)
   [junit4]   2> 	at org.apache.solr.core.SolrCore.close(SolrCore.java:1275)
   [junit4]   2> 	at org.apache.solr.core.SolrCores$2.call(SolrCores.java:135)
   [junit4]   2> 	at org.apache.solr.core.SolrCores$2.call(SolrCores.java:130)
   [junit4]   2> 	at java.util.concurrent.FutureTask.run(FutureTask.java:266)
   [junit4]   2> 	at org.apache.solr.common.util.ExecutorUtil$MDCAwareThreadPoolExecutor$1.run(ExecutorUtil.java:231)
   [junit4]   2> 	at java.util.concurrent.ThreadPoolExecutor.runWorker(ThreadPoolExecutor.java:1142)
   [junit4]   2> 	at java.util.concurrent.ThreadPoolExecutor$Worker.run(ThreadPoolExecutor.java:617)
   [junit4]   2> 	at java.lang.Thread.run(Thread.java:745)
   [junit4]   2> 
   [junit4]   2> NOTE: leaving temporary files on disk at: /x1/jenkins/jenkins-slave/workspace/Lucene-Solr-Tests-trunk-Java8/solr/build/solr-core/test/J0/temp/solr.search.TestIndexSearcher_D182CE444F24E904-001
   [junit4]   2> NOTE: test params are: codec=CheapBastard, sim=ClassicSimilarity, locale=es-HN, timezone=America/Cayman
   [junit4]   2> NOTE: Linux 3.13.0-52-generic amd64/Oracle Corporation 1.8.0_66 (64-bit)/cpus=4,threads=1,free=230501912,total=533200896
   [junit4]   2> NOTE: All tests run in this JVM: [TestConfigSetProperties, DocumentAnalysisRequestHandlerTest, TestQueryWrapperFilter, AnalysisAfterCoreReloadTest, TestHighlightDedupGrouping, DirectoryFactoryTest, TestRTGBase, TestSolr4Spatial, TestBlendedInfixSuggestions, TestFastOutputStream, TestMinMaxOnMultiValuedField, TestAuthenticationFramework, CoreAdminCreateDiscoverTest, TestScoreJoinQPScore, TestObjectReleaseTracker, TestRequestStatusCollectionAPI, QueryElevationComponentTest, EnumFieldTest, TestBinaryField, TestNRTOpen, SynonymTokenizerTest, TestUseDocValuesAsStored, TestLRUCache, TestConfig, TestPKIAuthenticationPlugin, TestManagedStopFilterFactory, DisMaxRequestHandlerTest, ConfigSetsAPITest, TestLazyCores, TestRealTimeGet, DistributedDebugComponentTest, TestExpandComponent, DistributedVersionInfoTest, SOLR749Test, TestCollectionAPI, TestOmitPositions, TestRangeQuery, TestReRankQParserPlugin, TestRebalanceLeaders, TestSolr4Spatial2, TestCustomSort, TestSolrConfigHandler, RollingRestartTest, TestCollationFieldDocValues, FileBasedSpellCheckerTest, TestCrossCoreJoin, AtomicUpdatesTest, TestValueSourceCache, ResourceLoaderTest, QueryEqualityTest, HdfsRecoverLeaseTest, TestCloudManagedSchema, RankQueryTest, TestFieldResource, BasicAuthIntegrationTest, TestSchemaSimilarityResource, TestIntervalFaceting, TestHdfsUpdateLog, BJQParserTest, IndexSchemaTest, TestSQLHandler, TestIBSimilarityFactory, CdcrVersionReplicationTest, TestManagedResourceStorage, BasicZkTest, TestJoin, DistributedFacetPivotWhiteBoxTest, TestFoldingMultitermQuery, TestRandomDVFaceting, OverriddenZkACLAndCredentialsProvidersTest, ConnectionReuseTest, TestClassNameShortening, PrimUtilsTest, TestAnalyzedSuggestions, TestConfigSetsAPIZkFailure, JavabinLoaderTest, DistributedSuggestComponentTest, TestReplicationHandler, AsyncCallRequestStatusResponseTest, TestExactSharedStatsCache, ZkNodePropsTest, IgnoreCommitOptimizeUpdateProcessorFactoryTest, RemoteQueryErrorTest, LeaderFailoverAfterPartitionTest, TestComponentsName, TestFunctionQuery, TestDownShardTolerantSearch, TestFaceting, ResponseHeaderTest, TestCustomDocTransformer, TestClusterStateMutator, XsltUpdateRequestHandlerTest, TestRemoteStreaming, SolrCoreTest, TestDocSet, ShardRoutingTest, ZkSolrClientTest, AutoCommitTest, TestRecovery, DistributedSpellCheckComponentTest, TermVectorComponentDistributedTest, HardAutoCommitTest, TestGroupingSearch, ConvertedLegacyTest, TestSort, TestBadConfig, TestIndexSearcher]
   [junit4] Completed [328/579 (2!)] on J0 in 14.61s, 5 tests, 1 failure <<< FAILURES!

[...truncated 834 lines...]
BUILD FAILED
/x1/jenkins/jenkins-slave/workspace/Lucene-Solr-Tests-trunk-Java8/build.xml:740: The following error occurred while executing this line:
/x1/jenkins/jenkins-slave/workspace/Lucene-Solr-Tests-trunk-Java8/build.xml:684: The following error occurred while executing this line:
/x1/jenkins/jenkins-slave/workspace/Lucene-Solr-Tests-trunk-Java8/build.xml:59: The following error occurred while executing this line:
/x1/jenkins/jenkins-slave/workspace/Lucene-Solr-Tests-trunk-Java8/solr/build.xml:233: The following error occurred while executing this line:
/x1/jenkins/jenkins-slave/workspace/Lucene-Solr-Tests-trunk-Java8/solr/common-build.xml:524: The following error occurred while executing this line:
/x1/jenkins/jenkins-slave/workspace/Lucene-Solr-Tests-trunk-Java8/lucene/common-build.xml:1457: The following error occurred while executing this line:
/x1/jenkins/jenkins-slave/workspace/Lucene-Solr-Tests-trunk-Java8/lucene/common-build.xml:1014: There were test failures: 579 suites (8 ignored), 2331 tests, 1 error, 1 failure, 88 ignored (72 assumptions) [seed: D182CE444F24E904]

Total time: 59 minutes 26 seconds
Build step 'Invoke Ant' marked build as failure
Archiving artifacts
Recording test results
Email was triggered for: Failure - Any
Sending email for trigger: Failure - Any



Mime
View raw message