lucene-dev mailing list archives

Site index · List index
Message view « Date » · « Thread »
Top « Date » · « Thread »
From Policeman Jenkins Server <jenk...@thetaphi.de>
Subject [JENKINS] Lucene-Solr-5.x-Linux (64bit/jdk1.8.0_72) - Build # 15516 - Still Failing!
Date Tue, 09 Feb 2016 01:37:14 GMT
Build: http://jenkins.thetaphi.de/job/Lucene-Solr-5.x-Linux/15516/
Java: 64bit/jdk1.8.0_72 -XX:+UseCompressedOops -XX:+UseSerialGC

1 tests failed.
FAILED:  org.apache.solr.core.TestNRTOpen.testSharedCores

Error Message:
expected:<3> but was:<1>

Stack Trace:
java.lang.AssertionError: expected:<3> but was:<1>
	at __randomizedtesting.SeedInfo.seed([1A4EC986938AC08C:FC4D83C91B7CED83]:0)
	at org.junit.Assert.fail(Assert.java:93)
	at org.junit.Assert.failNotEquals(Assert.java:647)
	at org.junit.Assert.assertEquals(Assert.java:128)
	at org.junit.Assert.assertEquals(Assert.java:472)
	at org.junit.Assert.assertEquals(Assert.java:456)
	at org.apache.solr.core.TestNRTOpen.testSharedCores(TestNRTOpen.java:116)
	at sun.reflect.NativeMethodAccessorImpl.invoke0(Native Method)
	at sun.reflect.NativeMethodAccessorImpl.invoke(NativeMethodAccessorImpl.java:62)
	at sun.reflect.DelegatingMethodAccessorImpl.invoke(DelegatingMethodAccessorImpl.java:43)
	at java.lang.reflect.Method.invoke(Method.java:498)
	at com.carrotsearch.randomizedtesting.RandomizedRunner.invoke(RandomizedRunner.java:1764)
	at com.carrotsearch.randomizedtesting.RandomizedRunner$8.evaluate(RandomizedRunner.java:871)
	at com.carrotsearch.randomizedtesting.RandomizedRunner$9.evaluate(RandomizedRunner.java:907)
	at com.carrotsearch.randomizedtesting.RandomizedRunner$10.evaluate(RandomizedRunner.java:921)
	at com.carrotsearch.randomizedtesting.rules.SystemPropertiesRestoreRule$1.evaluate(SystemPropertiesRestoreRule.java:57)
	at org.apache.lucene.util.TestRuleSetupTeardownChained$1.evaluate(TestRuleSetupTeardownChained.java:49)
	at org.apache.lucene.util.AbstractBeforeAfterRule$1.evaluate(AbstractBeforeAfterRule.java:45)
	at org.apache.lucene.util.TestRuleThreadAndTestName$1.evaluate(TestRuleThreadAndTestName.java:48)
	at org.apache.lucene.util.TestRuleIgnoreAfterMaxFailures$1.evaluate(TestRuleIgnoreAfterMaxFailures.java:64)
	at org.apache.lucene.util.TestRuleMarkFailure$1.evaluate(TestRuleMarkFailure.java:47)
	at com.carrotsearch.randomizedtesting.rules.StatementAdapter.evaluate(StatementAdapter.java:36)
	at com.carrotsearch.randomizedtesting.ThreadLeakControl$StatementRunner.run(ThreadLeakControl.java:367)
	at com.carrotsearch.randomizedtesting.ThreadLeakControl.forkTimeoutingTask(ThreadLeakControl.java:809)
	at com.carrotsearch.randomizedtesting.ThreadLeakControl$3.evaluate(ThreadLeakControl.java:460)
	at com.carrotsearch.randomizedtesting.RandomizedRunner.runSingleTest(RandomizedRunner.java:880)
	at com.carrotsearch.randomizedtesting.RandomizedRunner$5.evaluate(RandomizedRunner.java:781)
	at com.carrotsearch.randomizedtesting.RandomizedRunner$6.evaluate(RandomizedRunner.java:816)
	at com.carrotsearch.randomizedtesting.RandomizedRunner$7.evaluate(RandomizedRunner.java:827)
	at com.carrotsearch.randomizedtesting.rules.StatementAdapter.evaluate(StatementAdapter.java:36)
	at com.carrotsearch.randomizedtesting.rules.SystemPropertiesRestoreRule$1.evaluate(SystemPropertiesRestoreRule.java:57)
	at org.apache.lucene.util.AbstractBeforeAfterRule$1.evaluate(AbstractBeforeAfterRule.java:45)
	at com.carrotsearch.randomizedtesting.rules.StatementAdapter.evaluate(StatementAdapter.java:36)
	at org.apache.lucene.util.TestRuleStoreClassName$1.evaluate(TestRuleStoreClassName.java:41)
	at com.carrotsearch.randomizedtesting.rules.NoShadowingOrOverridesOnMethodsRule$1.evaluate(NoShadowingOrOverridesOnMethodsRule.java:40)
	at com.carrotsearch.randomizedtesting.rules.NoShadowingOrOverridesOnMethodsRule$1.evaluate(NoShadowingOrOverridesOnMethodsRule.java:40)
	at com.carrotsearch.randomizedtesting.rules.StatementAdapter.evaluate(StatementAdapter.java:36)
	at com.carrotsearch.randomizedtesting.rules.StatementAdapter.evaluate(StatementAdapter.java:36)
	at com.carrotsearch.randomizedtesting.rules.StatementAdapter.evaluate(StatementAdapter.java:36)
	at org.apache.lucene.util.TestRuleAssertionsRequired$1.evaluate(TestRuleAssertionsRequired.java:53)
	at org.apache.lucene.util.TestRuleMarkFailure$1.evaluate(TestRuleMarkFailure.java:47)
	at org.apache.lucene.util.TestRuleIgnoreAfterMaxFailures$1.evaluate(TestRuleIgnoreAfterMaxFailures.java:64)
	at org.apache.lucene.util.TestRuleIgnoreTestSuites$1.evaluate(TestRuleIgnoreTestSuites.java:54)
	at com.carrotsearch.randomizedtesting.rules.StatementAdapter.evaluate(StatementAdapter.java:36)
	at com.carrotsearch.randomizedtesting.ThreadLeakControl$StatementRunner.run(ThreadLeakControl.java:367)
	at java.lang.Thread.run(Thread.java:745)




Build Log:
[...truncated 11419 lines...]
   [junit4] Suite: org.apache.solr.core.TestNRTOpen
   [junit4]   2> Creating dataDir: /home/jenkins/workspace/Lucene-Solr-5.x-Linux/solr/build/solr-core/test/J1/temp/solr.core.TestNRTOpen_1A4EC986938AC08C-001/init-core-data-001
   [junit4]   2> 858793 INFO  (SUITE-TestNRTOpen-seed#[1A4EC986938AC08C]-worker) [    ] o.a.s.SolrTestCaseJ4 Randomized ssl (false) and clientAuth (false)
   [junit4]   2> 858794 INFO  (SUITE-TestNRTOpen-seed#[1A4EC986938AC08C]-worker) [    ] o.a.s.SolrTestCaseJ4 ####initCore
   [junit4]   2> 858794 INFO  (SUITE-TestNRTOpen-seed#[1A4EC986938AC08C]-worker) [    ] o.a.s.c.SolrResourceLoader new SolrResourceLoader for directory: '/home/jenkins/workspace/Lucene-Solr-5.x-Linux/solr/core/src/test-files/solr/collection1'
   [junit4]   2> 858794 INFO  (SUITE-TestNRTOpen-seed#[1A4EC986938AC08C]-worker) [    ] o.a.s.c.SolrResourceLoader JNDI not configured for solr (NoInitialContextEx)
   [junit4]   2> 858794 INFO  (SUITE-TestNRTOpen-seed#[1A4EC986938AC08C]-worker) [    ] o.a.s.c.SolrResourceLoader using system property solr.solr.home: /home/jenkins/workspace/Lucene-Solr-5.x-Linux/solr/core/src/test-files/solr
   [junit4]   2> 858794 INFO  (SUITE-TestNRTOpen-seed#[1A4EC986938AC08C]-worker) [    ] o.a.s.c.SolrResourceLoader Adding 'file:/home/jenkins/workspace/Lucene-Solr-5.x-Linux/solr/core/src/test-files/solr/collection1/lib/classes/' to classloader
   [junit4]   2> 858794 INFO  (SUITE-TestNRTOpen-seed#[1A4EC986938AC08C]-worker) [    ] o.a.s.c.SolrResourceLoader Adding 'file:/home/jenkins/workspace/Lucene-Solr-5.x-Linux/solr/core/src/test-files/solr/collection1/lib/README' to classloader
   [junit4]   2> 858818 INFO  (SUITE-TestNRTOpen-seed#[1A4EC986938AC08C]-worker) [    ] o.a.s.c.SolrConfig current version of requestparams : -1
   [junit4]   2> 858820 INFO  (SUITE-TestNRTOpen-seed#[1A4EC986938AC08C]-worker) [    ] o.a.s.c.SolrConfig Using Lucene MatchVersion: 5.5.0
   [junit4]   2> 858822 INFO  (SUITE-TestNRTOpen-seed#[1A4EC986938AC08C]-worker) [    ] o.a.s.c.SolrConfig Loaded SolrConfig: solrconfig-basic.xml
   [junit4]   2> 858824 INFO  (SUITE-TestNRTOpen-seed#[1A4EC986938AC08C]-worker) [    ] o.a.s.s.IndexSchema [null] Schema name=minimal
   [junit4]   2> 858825 WARN  (SUITE-TestNRTOpen-seed#[1A4EC986938AC08C]-worker) [    ] o.a.s.s.IndexSchema no uniqueKey specified in schema.
   [junit4]   2> 858825 INFO  (SUITE-TestNRTOpen-seed#[1A4EC986938AC08C]-worker) [    ] o.a.s.c.SolrResourceLoader JNDI not configured for solr (NoInitialContextEx)
   [junit4]   2> 858825 INFO  (SUITE-TestNRTOpen-seed#[1A4EC986938AC08C]-worker) [    ] o.a.s.c.SolrResourceLoader using system property solr.solr.home: /home/jenkins/workspace/Lucene-Solr-5.x-Linux/solr/core/src/test-files/solr
   [junit4]   2> 858825 INFO  (SUITE-TestNRTOpen-seed#[1A4EC986938AC08C]-worker) [    ] o.a.s.c.SolrResourceLoader new SolrResourceLoader for directory: '/home/jenkins/workspace/Lucene-Solr-5.x-Linux/solr/core/src/test-files/solr'
   [junit4]   2> 858825 INFO  (SUITE-TestNRTOpen-seed#[1A4EC986938AC08C]-worker) [    ] o.a.s.c.SolrResourceLoader JNDI not configured for solr (NoInitialContextEx)
   [junit4]   2> 858825 INFO  (SUITE-TestNRTOpen-seed#[1A4EC986938AC08C]-worker) [    ] o.a.s.c.SolrResourceLoader using system property solr.solr.home: /home/jenkins/workspace/Lucene-Solr-5.x-Linux/solr/core/src/test-files/solr
   [junit4]   2> 858825 INFO  (SUITE-TestNRTOpen-seed#[1A4EC986938AC08C]-worker) [    ] o.a.s.c.CoreContainer New CoreContainer 1797038420
   [junit4]   2> 858825 INFO  (SUITE-TestNRTOpen-seed#[1A4EC986938AC08C]-worker) [    ] o.a.s.c.CoreContainer Loading cores into CoreContainer [instanceDir=/home/jenkins/workspace/Lucene-Solr-5.x-Linux/solr/core/src/test-files/solr]
   [junit4]   2> 858826 WARN  (SUITE-TestNRTOpen-seed#[1A4EC986938AC08C]-worker) [    ] o.a.s.c.CoreContainer Couldn't add files from /home/jenkins/workspace/Lucene-Solr-5.x-Linux/solr/core/src/test-files/solr/lib to classpath: /home/jenkins/workspace/Lucene-Solr-5.x-Linux/solr/core/src/test-files/solr/lib
   [junit4]   2> 858826 INFO  (SUITE-TestNRTOpen-seed#[1A4EC986938AC08C]-worker) [    ] o.a.s.h.c.HttpShardHandlerFactory created with socketTimeout : 600000,connTimeout : 60000,maxConnectionsPerHost : 20,maxConnections : 10000,corePoolSize : 0,maximumPoolSize : 2147483647,maxThreadIdleTime : 5,sizeOfQueue : -1,fairnessPolicy : false,useRetries : false,
   [junit4]   2> 858827 INFO  (SUITE-TestNRTOpen-seed#[1A4EC986938AC08C]-worker) [    ] o.a.s.u.UpdateShardHandler Creating UpdateShardHandler HTTP client with params: socketTimeout=30000&connTimeout=30000&retry=true
   [junit4]   2> 858827 INFO  (SUITE-TestNRTOpen-seed#[1A4EC986938AC08C]-worker) [    ] o.a.s.l.LogWatcher SLF4J impl is org.slf4j.impl.Log4jLoggerFactory
   [junit4]   2> 858827 INFO  (SUITE-TestNRTOpen-seed#[1A4EC986938AC08C]-worker) [    ] o.a.s.l.LogWatcher Registering Log Listener [Log4j (org.slf4j.impl.Log4jLoggerFactory)]
   [junit4]   2> 858827 INFO  (SUITE-TestNRTOpen-seed#[1A4EC986938AC08C]-worker) [    ] o.a.s.c.CoreContainer Security conf doesn't exist. Skipping setup for authorization module.
   [junit4]   2> 858827 INFO  (SUITE-TestNRTOpen-seed#[1A4EC986938AC08C]-worker) [    ] o.a.s.c.CoreContainer No authentication plugin used.
   [junit4]   2> 858828 INFO  (SUITE-TestNRTOpen-seed#[1A4EC986938AC08C]-worker) [    ] o.a.s.c.CoreDescriptor Created CoreDescriptor: {name=collection1, config=solrconfig-basic.xml, transient=false, schema=schema-minimal.xml, loadOnStartup=true, configSetProperties=configsetprops.json, collection=collection1, dataDir=/home/jenkins/workspace/Lucene-Solr-5.x-Linux/solr/build/solr-core/test/J1/temp/solr.core.TestNRTOpen_1A4EC986938AC08C-001/init-core-data-001, shard=shard1}
   [junit4]   2> 858828 INFO  (coreLoadExecutor-2582-thread-1) [    ] o.a.s.c.SolrResourceLoader new SolrResourceLoader for directory: '/home/jenkins/workspace/Lucene-Solr-5.x-Linux/solr/core/src/test-files/solr/collection1'
   [junit4]   2> 858828 INFO  (coreLoadExecutor-2582-thread-1) [    ] o.a.s.c.SolrResourceLoader JNDI not configured for solr (NoInitialContextEx)
   [junit4]   2> 858828 INFO  (coreLoadExecutor-2582-thread-1) [    ] o.a.s.c.SolrResourceLoader using system property solr.solr.home: /home/jenkins/workspace/Lucene-Solr-5.x-Linux/solr/core/src/test-files/solr
   [junit4]   2> 858828 INFO  (coreLoadExecutor-2582-thread-1) [    ] o.a.s.c.SolrResourceLoader Adding 'file:/home/jenkins/workspace/Lucene-Solr-5.x-Linux/solr/core/src/test-files/solr/collection1/lib/classes/' to classloader
   [junit4]   2> 858828 INFO  (coreLoadExecutor-2582-thread-1) [    ] o.a.s.c.SolrResourceLoader Adding 'file:/home/jenkins/workspace/Lucene-Solr-5.x-Linux/solr/core/src/test-files/solr/collection1/lib/README' to classloader
   [junit4]   2> 858839 INFO  (coreLoadExecutor-2582-thread-1) [    ] o.a.s.c.SolrConfig current version of requestparams : -1
   [junit4]   2> 858841 INFO  (coreLoadExecutor-2582-thread-1) [    ] o.a.s.c.SolrConfig Using Lucene MatchVersion: 5.5.0
   [junit4]   2> 858844 INFO  (coreLoadExecutor-2582-thread-1) [    ] o.a.s.c.SolrConfig Loaded SolrConfig: solrconfig-basic.xml
   [junit4]   2> 858845 INFO  (coreLoadExecutor-2582-thread-1) [    ] o.a.s.s.IndexSchema [collection1] Schema name=minimal
   [junit4]   2> 858846 WARN  (coreLoadExecutor-2582-thread-1) [    ] o.a.s.s.IndexSchema no uniqueKey specified in schema.
   [junit4]   2> 858847 INFO  (coreLoadExecutor-2582-thread-1) [    ] o.a.s.c.ConfigSetProperties Did not find ConfigSet properties, assuming default properties: Can't find resource 'configsetprops.json' in classpath or '/home/jenkins/workspace/Lucene-Solr-5.x-Linux/solr/core/src/test-files/solr/collection1'
   [junit4]   2> 858847 INFO  (coreLoadExecutor-2582-thread-1) [    ] o.a.s.c.CoreContainer Creating SolrCore 'collection1' using configuration from instancedir /home/jenkins/workspace/Lucene-Solr-5.x-Linux/solr/core/src/test-files/solr/collection1
   [junit4]   2> 858848 INFO  (coreLoadExecutor-2582-thread-1) [    x:collection1] o.a.s.c.SolrCore solr.StandardDirectoryFactory
   [junit4]   2> 858848 INFO  (coreLoadExecutor-2582-thread-1) [    x:collection1] o.a.s.c.SolrCore [[collection1] ] Opening new SolrCore at [/home/jenkins/workspace/Lucene-Solr-5.x-Linux/solr/core/src/test-files/solr/collection1], dataDir=[/home/jenkins/workspace/Lucene-Solr-5.x-Linux/solr/build/solr-core/test/J1/temp/solr.core.TestNRTOpen_1A4EC986938AC08C-001/init-core-data-001/]
   [junit4]   2> 858848 INFO  (coreLoadExecutor-2582-thread-1) [    x:collection1] o.a.s.c.SolrCore JMX monitoring not detected for core: collection1
   [junit4]   2> 858848 INFO  (coreLoadExecutor-2582-thread-1) [    x:collection1] o.a.s.c.CachingDirectoryFactory return new directory for /home/jenkins/workspace/Lucene-Solr-5.x-Linux/solr/build/solr-core/test/J1/temp/solr.core.TestNRTOpen_1A4EC986938AC08C-001/init-core-data-001
   [junit4]   2> 858848 INFO  (coreLoadExecutor-2582-thread-1) [    x:collection1] o.a.s.c.SolrCore New index directory detected: old=null new=/home/jenkins/workspace/Lucene-Solr-5.x-Linux/solr/build/solr-core/test/J1/temp/solr.core.TestNRTOpen_1A4EC986938AC08C-001/init-core-data-001/index/
   [junit4]   2> 858848 WARN  (coreLoadExecutor-2582-thread-1) [    x:collection1] o.a.s.c.SolrCore [collection1] Solr index directory '/home/jenkins/workspace/Lucene-Solr-5.x-Linux/solr/build/solr-core/test/J1/temp/solr.core.TestNRTOpen_1A4EC986938AC08C-001/init-core-data-001/index' doesn't exist. Creating new index...
   [junit4]   2> 858849 INFO  (coreLoadExecutor-2582-thread-1) [    x:collection1] o.a.s.c.CachingDirectoryFactory return new directory for /home/jenkins/workspace/Lucene-Solr-5.x-Linux/solr/build/solr-core/test/J1/temp/solr.core.TestNRTOpen_1A4EC986938AC08C-001/init-core-data-001/index
   [junit4]   2> 858849 INFO  (coreLoadExecutor-2582-thread-1) [    x:collection1] o.a.s.u.RandomMergePolicy RandomMergePolicy wrapping class org.apache.lucene.index.MockRandomMergePolicy: org.apache.lucene.index.MockRandomMergePolicy@5da0cdb3
   [junit4]   2> 858907 INFO  (coreLoadExecutor-2582-thread-1) [    x:collection1] o.a.s.c.SolrDeletionPolicy SolrDeletionPolicy.onCommit: commits: num=1
   [junit4]   2> 	commit{dir=/home/jenkins/workspace/Lucene-Solr-5.x-Linux/solr/build/solr-core/test/J1/temp/solr.core.TestNRTOpen_1A4EC986938AC08C-001/init-core-data-001/index,segFN=segments_1,generation=1}
   [junit4]   2> 858907 INFO  (coreLoadExecutor-2582-thread-1) [    x:collection1] o.a.s.c.SolrDeletionPolicy newest commit generation = 1
   [junit4]   2> 858908 INFO  (OldIndexDirectoryCleanupThreadForCore-collection1) [    x:collection1] o.a.s.c.SolrCore Looking for old index directories to cleanup for core collection1 in /home/jenkins/workspace/Lucene-Solr-5.x-Linux/solr/build/solr-core/test/J1/temp/solr.core.TestNRTOpen_1A4EC986938AC08C-001/init-core-data-001/
   [junit4]   2> 858909 INFO  (coreLoadExecutor-2582-thread-1) [    x:collection1] o.a.s.c.SolrCore no updateRequestProcessorChain defined as default, creating implicit default
   [junit4]   2> 858910 INFO  (coreLoadExecutor-2582-thread-1) [    x:collection1] o.a.s.h.l.XMLLoader xsltCacheLifetimeSeconds=60
   [junit4]   2> 858910 INFO  (coreLoadExecutor-2582-thread-1) [    x:collection1] o.a.s.h.l.XMLLoader xsltCacheLifetimeSeconds=60
   [junit4]   2> 858911 INFO  (coreLoadExecutor-2582-thread-1) [    x:collection1] o.a.s.h.l.XMLLoader xsltCacheLifetimeSeconds=60
   [junit4]   2> 858911 INFO  (coreLoadExecutor-2582-thread-1) [    x:collection1] o.a.s.h.l.XMLLoader xsltCacheLifetimeSeconds=60
   [junit4]   2> 858912 INFO  (coreLoadExecutor-2582-thread-1) [    x:collection1] o.a.s.c.RequestHandlers Registered paths: /admin/mbeans,standard,/update/csv,/update/json/docs,/admin/luke,/admin/segments,/get,/admin/system,/replication,/admin/properties,/config,/schema,/admin/plugins,/admin/logging,/update/json,/admin/threads,/admin/ping,/update,/admin/file
   [junit4]   2> 858912 INFO  (coreLoadExecutor-2582-thread-1) [    x:collection1] o.a.s.c.SolrCore Using default statsCache cache: org.apache.solr.search.stats.LocalStatsCache
   [junit4]   2> 858912 INFO  (coreLoadExecutor-2582-thread-1) [    x:collection1] o.a.s.u.CommitTracker Hard AutoCommit: disabled
   [junit4]   2> 858912 INFO  (coreLoadExecutor-2582-thread-1) [    x:collection1] o.a.s.u.CommitTracker Soft AutoCommit: disabled
   [junit4]   2> 858912 INFO  (coreLoadExecutor-2582-thread-1) [    x:collection1] o.a.s.u.RandomMergePolicy RandomMergePolicy wrapping class org.apache.lucene.index.LogDocMergePolicy: [LogDocMergePolicy: minMergeSize=1000, mergeFactor=30, maxMergeSize=9223372036854775807, maxMergeSizeForForcedMerge=9223372036854775807, calibrateSizeByDeletes=false, maxMergeDocs=2147483647, maxCFSSegmentSizeMB=8.796093022207999E12, noCFSRatio=0.6463440388017891]
   [junit4]   2> 858912 INFO  (coreLoadExecutor-2582-thread-1) [    x:collection1] o.a.s.c.SolrDeletionPolicy SolrDeletionPolicy.onInit: commits: num=1
   [junit4]   2> 	commit{dir=/home/jenkins/workspace/Lucene-Solr-5.x-Linux/solr/build/solr-core/test/J1/temp/solr.core.TestNRTOpen_1A4EC986938AC08C-001/init-core-data-001/index,segFN=segments_1,generation=1}
   [junit4]   2> 858913 INFO  (coreLoadExecutor-2582-thread-1) [    x:collection1] o.a.s.c.SolrDeletionPolicy newest commit generation = 1
   [junit4]   2> 858913 INFO  (coreLoadExecutor-2582-thread-1) [    x:collection1] o.a.s.s.SolrIndexSearcher Opening Searcher@14bd1762[collection1] main
   [junit4]   2> 858913 WARN  (coreLoadExecutor-2582-thread-1) [    x:collection1] o.a.s.r.ManagedResourceStorage Cannot write to config directory /home/jenkins/workspace/Lucene-Solr-5.x-Linux/solr/core/src/test-files/solr/collection1/conf; switching to use InMemory storage instead.
   [junit4]   2> 858913 INFO  (coreLoadExecutor-2582-thread-1) [    x:collection1] o.a.s.r.RestManager Initializing RestManager with initArgs: {}
   [junit4]   2> 858913 INFO  (coreLoadExecutor-2582-thread-1) [    x:collection1] o.a.s.r.ManagedResourceStorage Reading _rest_managed.json using InMemoryStorage
   [junit4]   2> 858913 INFO  (coreLoadExecutor-2582-thread-1) [    x:collection1] o.a.s.r.RestManager Initializing 0 registered ManagedResources
   [junit4]   2> 858913 INFO  (coreLoadExecutor-2582-thread-1) [    x:collection1] o.a.s.h.ReplicationHandler Commits will be reserved for  10000
   [junit4]   2> 858913 INFO  (searcherExecutor-2583-thread-1-processing-x:collection1) [    x:collection1] o.a.s.c.SolrCore [collection1] Registered new searcher Searcher@14bd1762[collection1] main{ExitableDirectoryReader(UninvertingDirectoryReader())}
   [junit4]   2> 858913 INFO  (coreLoadExecutor-2582-thread-1) [    x:collection1] o.a.s.c.CoreContainer registering core: collection1
   [junit4]   2> 858914 INFO  (SUITE-TestNRTOpen-seed#[1A4EC986938AC08C]-worker) [    ] o.a.s.SolrTestCaseJ4 ####initCore end
   [junit4]   2> 858914 INFO  (SUITE-TestNRTOpen-seed#[1A4EC986938AC08C]-worker) [    ] o.a.s.u.p.LogUpdateProcessorFactory [collection1]  webapp=null path=null params={}{add=[(null)]} 0 0
   [junit4]   2> 858915 INFO  (SUITE-TestNRTOpen-seed#[1A4EC986938AC08C]-worker) [    ] o.a.s.u.DirectUpdateHandler2 start commit{,optimize=false,openSearcher=true,waitSearcher=true,expungeDeletes=false,softCommit=false,prepareCommit=false}
   [junit4]   2> 859022 INFO  (SUITE-TestNRTOpen-seed#[1A4EC986938AC08C]-worker) [    ] o.a.s.c.SolrDeletionPolicy SolrDeletionPolicy.onCommit: commits: num=2
   [junit4]   2> 	commit{dir=/home/jenkins/workspace/Lucene-Solr-5.x-Linux/solr/build/solr-core/test/J1/temp/solr.core.TestNRTOpen_1A4EC986938AC08C-001/init-core-data-001/index,segFN=segments_1,generation=1}
   [junit4]   2> 	commit{dir=/home/jenkins/workspace/Lucene-Solr-5.x-Linux/solr/build/solr-core/test/J1/temp/solr.core.TestNRTOpen_1A4EC986938AC08C-001/init-core-data-001/index,segFN=segments_2,generation=2}
   [junit4]   2> 859023 INFO  (SUITE-TestNRTOpen-seed#[1A4EC986938AC08C]-worker) [    ] o.a.s.c.SolrDeletionPolicy newest commit generation = 2
   [junit4]   2> 859024 INFO  (SUITE-TestNRTOpen-seed#[1A4EC986938AC08C]-worker) [    ] o.a.s.s.SolrIndexSearcher Opening Searcher@32f6ba89[collection1] main
   [junit4]   2> 859024 INFO  (SUITE-TestNRTOpen-seed#[1A4EC986938AC08C]-worker) [    ] o.a.s.u.DirectUpdateHandler2 end_commit_flush
   [junit4]   2> 859024 INFO  (searcherExecutor-2583-thread-1) [    ] o.a.s.c.SolrCore [collection1] Registered new searcher Searcher@32f6ba89[collection1] main{ExitableDirectoryReader(UninvertingDirectoryReader(Uninverting(_0(5.5.0):c1)))}
   [junit4]   2> 859024 INFO  (SUITE-TestNRTOpen-seed#[1A4EC986938AC08C]-worker) [    ] o.a.s.u.p.LogUpdateProcessorFactory [collection1]  webapp=null path=null params={}{commit=} 0 109
   [junit4]   2> 859025 INFO  (SUITE-TestNRTOpen-seed#[1A4EC986938AC08C]-worker) [    ] o.a.s.SolrTestCaseJ4 ###deleteCore
   [junit4]   2> 859025 INFO  (SUITE-TestNRTOpen-seed#[1A4EC986938AC08C]-worker) [    ] o.a.s.c.CoreContainer Shutting down CoreContainer instance=1797038420
   [junit4]   2> 859025 INFO  (SUITE-TestNRTOpen-seed#[1A4EC986938AC08C]-worker) [    x:collection1] o.a.s.c.SolrCore [collection1]  CLOSING SolrCore org.apache.solr.core.SolrCore@45460e4c
   [junit4]   2> 859025 INFO  (SUITE-TestNRTOpen-seed#[1A4EC986938AC08C]-worker) [    x:collection1] o.a.s.u.DirectUpdateHandler2 closing DirectUpdateHandler2{commits=1,autocommits=0,soft autocommits=0,optimizes=0,rollbacks=0,expungeDeletes=0,docsPending=0,adds=0,deletesById=0,deletesByQuery=0,errors=0,cumulative_adds=1,cumulative_deletesById=0,cumulative_deletesByQuery=0,cumulative_errors=0}
   [junit4]   2> 859025 INFO  (SUITE-TestNRTOpen-seed#[1A4EC986938AC08C]-worker) [    x:collection1] o.a.s.u.SolrCoreState Closing SolrCoreState
   [junit4]   2> 859025 INFO  (SUITE-TestNRTOpen-seed#[1A4EC986938AC08C]-worker) [    x:collection1] o.a.s.u.DefaultSolrCoreState SolrCoreState ref count has reached 0 - closing IndexWriter
   [junit4]   2> 859025 INFO  (SUITE-TestNRTOpen-seed#[1A4EC986938AC08C]-worker) [    x:collection1] o.a.s.u.DefaultSolrCoreState closing IndexWriter with IndexWriterCloser
   [junit4]   2> 859025 INFO  (SUITE-TestNRTOpen-seed#[1A4EC986938AC08C]-worker) [    x:collection1] o.a.s.c.SolrCore [collection1] Closing main searcher on request.
   [junit4]   2> 859025 INFO  (SUITE-TestNRTOpen-seed#[1A4EC986938AC08C]-worker) [    x:collection1] o.a.s.c.CachingDirectoryFactory Closing StandardDirectoryFactory - 2 directories currently being tracked
   [junit4]   2> 859025 INFO  (SUITE-TestNRTOpen-seed#[1A4EC986938AC08C]-worker) [    x:collection1] o.a.s.c.CachingDirectoryFactory looking to close /home/jenkins/workspace/Lucene-Solr-5.x-Linux/solr/build/solr-core/test/J1/temp/solr.core.TestNRTOpen_1A4EC986938AC08C-001/init-core-data-001 [CachedDir<<refCount=0;path=/home/jenkins/workspace/Lucene-Solr-5.x-Linux/solr/build/solr-core/test/J1/temp/solr.core.TestNRTOpen_1A4EC986938AC08C-001/init-core-data-001;done=false>>]
   [junit4]   2> 859025 INFO  (SUITE-TestNRTOpen-seed#[1A4EC986938AC08C]-worker) [    x:collection1] o.a.s.c.CachingDirectoryFactory Closing directory: /home/jenkins/workspace/Lucene-Solr-5.x-Linux/solr/build/solr-core/test/J1/temp/solr.core.TestNRTOpen_1A4EC986938AC08C-001/init-core-data-001
   [junit4]   2> 859025 INFO  (SUITE-TestNRTOpen-seed#[1A4EC986938AC08C]-worker) [    x:collection1] o.a.s.c.CachingDirectoryFactory looking to close /home/jenkins/workspace/Lucene-Solr-5.x-Linux/solr/build/solr-core/test/J1/temp/solr.core.TestNRTOpen_1A4EC986938AC08C-001/init-core-data-001/index [CachedDir<<refCount=0;path=/home/jenkins/workspace/Lucene-Solr-5.x-Linux/solr/build/solr-core/test/J1/temp/solr.core.TestNRTOpen_1A4EC986938AC08C-001/init-core-data-001/index;done=false>>]
   [junit4]   2> 859025 INFO  (SUITE-TestNRTOpen-seed#[1A4EC986938AC08C]-worker) [    x:collection1] o.a.s.c.CachingDirectoryFactory Closing directory: /home/jenkins/workspace/Lucene-Solr-5.x-Linux/solr/build/solr-core/test/J1/temp/solr.core.TestNRTOpen_1A4EC986938AC08C-001/init-core-data-001/index
   [junit4]   2> 859026 INFO  (SUITE-TestNRTOpen-seed#[1A4EC986938AC08C]-worker) [    x:collection1] o.a.s.SolrTestCaseJ4 ####initCore
   [junit4]   2> 859026 INFO  (SUITE-TestNRTOpen-seed#[1A4EC986938AC08C]-worker) [    x:collection1] o.a.s.c.SolrResourceLoader new SolrResourceLoader for directory: '/home/jenkins/workspace/Lucene-Solr-5.x-Linux/solr/core/src/test-files/solr/collection1'
   [junit4]   2> 859026 INFO  (SUITE-TestNRTOpen-seed#[1A4EC986938AC08C]-worker) [    x:collection1] o.a.s.c.SolrResourceLoader JNDI not configured for solr (NoInitialContextEx)
   [junit4]   2> 859026 INFO  (SUITE-TestNRTOpen-seed#[1A4EC986938AC08C]-worker) [    x:collection1] o.a.s.c.SolrResourceLoader using system property solr.solr.home: /home/jenkins/workspace/Lucene-Solr-5.x-Linux/solr/core/src/test-files/solr
   [junit4]   2> 859026 INFO  (SUITE-TestNRTOpen-seed#[1A4EC986938AC08C]-worker) [    x:collection1] o.a.s.c.SolrResourceLoader Adding 'file:/home/jenkins/workspace/Lucene-Solr-5.x-Linux/solr/core/src/test-files/solr/collection1/lib/classes/' to classloader
   [junit4]   2> 859026 INFO  (SUITE-TestNRTOpen-seed#[1A4EC986938AC08C]-worker) [    x:collection1] o.a.s.c.SolrResourceLoader Adding 'file:/home/jenkins/workspace/Lucene-Solr-5.x-Linux/solr/core/src/test-files/solr/collection1/lib/README' to classloader
   [junit4]   2> 859040 INFO  (SUITE-TestNRTOpen-seed#[1A4EC986938AC08C]-worker) [    x:collection1] o.a.s.c.SolrConfig current version of requestparams : -1
   [junit4]   2> 859042 INFO  (SUITE-TestNRTOpen-seed#[1A4EC986938AC08C]-worker) [    x:collection1] o.a.s.c.SolrConfig Using Lucene MatchVersion: 5.5.0
   [junit4]   2> 859045 INFO  (SUITE-TestNRTOpen-seed#[1A4EC986938AC08C]-worker) [    x:collection1] o.a.s.c.SolrConfig Loaded SolrConfig: solrconfig-basic.xml
   [junit4]   2> 859046 INFO  (SUITE-TestNRTOpen-seed#[1A4EC986938AC08C]-worker) [    x:collection1] o.a.s.s.IndexSchema [null] Schema name=minimal
   [junit4]   2> 859048 WARN  (SUITE-TestNRTOpen-seed#[1A4EC986938AC08C]-worker) [    x:collection1] o.a.s.s.IndexSchema no uniqueKey specified in schema.
   [junit4]   2> 859048 INFO  (SUITE-TestNRTOpen-seed#[1A4EC986938AC08C]-worker) [    x:collection1] o.a.s.c.SolrResourceLoader JNDI not configured for solr (NoInitialContextEx)
   [junit4]   2> 859048 INFO  (SUITE-TestNRTOpen-seed#[1A4EC986938AC08C]-worker) [    x:collection1] o.a.s.c.SolrResourceLoader using system property solr.solr.home: /home/jenkins/workspace/Lucene-Solr-5.x-Linux/solr/core/src/test-files/solr
   [junit4]   2> 859048 INFO  (SUITE-TestNRTOpen-seed#[1A4EC986938AC08C]-worker) [    x:collection1] o.a.s.c.SolrResourceLoader new SolrResourceLoader for directory: '/home/jenkins/workspace/Lucene-Solr-5.x-Linux/solr/core/src/test-files/solr'
   [junit4]   2> 859048 INFO  (SUITE-TestNRTOpen-seed#[1A4EC986938AC08C]-worker) [    x:collection1] o.a.s.c.SolrResourceLoader JNDI not configured for solr (NoInitialContextEx)
   [junit4]   2> 859048 INFO  (SUITE-TestNRTOpen-seed#[1A4EC986938AC08C]-worker) [    x:collection1] o.a.s.c.SolrResourceLoader using system property solr.solr.home: /home/jenkins/workspace/Lucene-Solr-5.x-Linux/solr/core/src/test-files/solr
   [junit4]   2> 859048 INFO  (SUITE-TestNRTOpen-seed#[1A4EC986938AC08C]-worker) [    x:collection1] o.a.s.c.CoreContainer New CoreContainer 1984909449
   [junit4]   2> 859048 INFO  (SUITE-TestNRTOpen-seed#[1A4EC986938AC08C]-worker) [    x:collection1] o.a.s.c.CoreContainer Loading cores into CoreContainer [instanceDir=/home/jenkins/workspace/Lucene-Solr-5.x-Linux/solr/core/src/test-files/solr]
   [junit4]   2> 859048 WARN  (SUITE-TestNRTOpen-seed#[1A4EC986938AC08C]-worker) [    x:collection1] o.a.s.c.CoreContainer Couldn't add files from /home/jenkins/workspace/Lucene-Solr-5.x-Linux/solr/core/src/test-files/solr/lib to classpath: /home/jenkins/workspace/Lucene-Solr-5.x-Linux/solr/core/src/test-files/solr/lib
   [junit4]   2> 859048 INFO  (SUITE-TestNRTOpen-seed#[1A4EC986938AC08C]-worker) [    x:collection1] o.a.s.h.c.HttpShardHandlerFactory created with socketTimeout : 600000,connTimeout : 60000,maxConnectionsPerHost : 20,maxConnections : 10000,corePoolSize : 0,maximumPoolSize : 2147483647,maxThreadIdleTime : 5,sizeOfQueue : -1,fairnessPolicy : false,useRetries : false,
   [junit4]   2> 859049 INFO  (SUITE-TestNRTOpen-seed#[1A4EC986938AC08C]-worker) [    x:collection1] o.a.s.u.UpdateShardHandler Creating UpdateShardHandler HTTP client with params: socketTimeout=30000&connTimeout=30000&retry=true
   [junit4]   2> 859049 INFO  (SUITE-TestNRTOpen-seed#[1A4EC986938AC08C]-worker) [    x:collection1] o.a.s.l.LogWatcher SLF4J impl is org.slf4j.impl.Log4jLoggerFactory
   [junit4]   2> 859049 INFO  (SUITE-TestNRTOpen-seed#[1A4EC986938AC08C]-worker) [    x:collection1] o.a.s.l.LogWatcher Registering Log Listener [Log4j (org.slf4j.impl.Log4jLoggerFactory)]
   [junit4]   2> 859049 INFO  (SUITE-TestNRTOpen-seed#[1A4EC986938AC08C]-worker) [    x:collection1] o.a.s.c.CoreContainer Security conf doesn't exist. Skipping setup for authorization module.
   [junit4]   2> 859049 INFO  (SUITE-TestNRTOpen-seed#[1A4EC986938AC08C]-worker) [    x:collection1] o.a.s.c.CoreContainer No authentication plugin used.
   [junit4]   2> 859050 INFO  (SUITE-TestNRTOpen-seed#[1A4EC986938AC08C]-worker) [    x:collection1] o.a.s.c.CoreDescriptor Created CoreDescriptor: {name=collection1, config=solrconfig-basic.xml, transient=false, schema=schema-minimal.xml, loadOnStartup=true, configSetProperties=configsetprops.json, collection=collection1, dataDir=/home/jenkins/workspace/Lucene-Solr-5.x-Linux/solr/build/solr-core/test/J1/temp/solr.core.TestNRTOpen_1A4EC986938AC08C-001/init-core-data-001, shard=shard1}
   [junit4]   2> 859050 INFO  (coreLoadExecutor-2592-thread-1-processing-x:collection1) [    x:collection1] o.a.s.c.SolrResourceLoader new SolrResourceLoader for directory: '/home/jenkins/workspace/Lucene-Solr-5.x-Linux/solr/core/src/test-files/solr/collection1'
   [junit4]   2> 859050 INFO  (coreLoadExecutor-2592-thread-1-processing-x:collection1) [    x:collection1] o.a.s.c.SolrResourceLoader JNDI not configured for solr (NoInitialContextEx)
   [junit4]   2> 859050 INFO  (coreLoadExecutor-2592-thread-1-processing-x:collection1) [    x:collection1] o.a.s.c.SolrResourceLoader using system property solr.solr.home: /home/jenkins/workspace/Lucene-Solr-5.x-Linux/solr/core/src/test-files/solr
   [junit4]   2> 859050 INFO  (coreLoadExecutor-2592-thread-1-processing-x:collection1) [    x:collection1] o.a.s.c.SolrResourceLoader Adding 'file:/home/jenkins/workspace/Lucene-Solr-5.x-Linux/solr/core/src/test-files/solr/collection1/lib/classes/' to classloader
   [junit4]   2> 859050 INFO  (coreLoadExecutor-2592-thread-1-processing-x:collection1) [    x:collection1] o.a.s.c.SolrResourceLoader Adding 'file:/home/jenkins/workspace/Lucene-Solr-5.x-Linux/solr/core/src/test-files/solr/collection1/lib/README' to classloader
   [junit4]   2> 859061 INFO  (coreLoadExecutor-2592-thread-1-processing-x:collection1) [    x:collection1] o.a.s.c.SolrConfig current version of requestparams : -1
   [junit4]   2> 859063 INFO  (coreLoadExecutor-2592-thread-1-processing-x:collection1) [    x:collection1] o.a.s.c.SolrConfig Using Lucene MatchVersion: 5.5.0
   [junit4]   2> 859066 INFO  (coreLoadExecutor-2592-thread-1-processing-x:collection1) [    x:collection1] o.a.s.c.SolrConfig Loaded SolrConfig: solrconfig-basic.xml
   [junit4]   2> 859068 INFO  (coreLoadExecutor-2592-thread-1-processing-x:collection1) [    x:collection1] o.a.s.s.IndexSchema [collection1] Schema name=minimal
   [junit4]   2> 859069 WARN  (coreLoadExecutor-2592-thread-1-processing-x:collection1) [    x:collection1] o.a.s.s.IndexSchema no uniqueKey specified in schema.
   [junit4]   2> 859070 INFO  (coreLoadExecutor-2592-thread-1-processing-x:collection1) [    x:collection1] o.a.s.c.ConfigSetProperties Did not find ConfigSet properties, assuming default properties: Can't find resource 'configsetprops.json' in classpath or '/home/jenkins/workspace/Lucene-Solr-5.x-Linux/solr/core/src/test-files/solr/collection1'
   [junit4]   2> 859070 INFO  (coreLoadExecutor-2592-thread-1-processing-x:collection1) [    x:collection1] o.a.s.c.CoreContainer Creating SolrCore 'collection1' using configuration from instancedir /home/jenkins/workspace/Lucene-Solr-5.x-Linux/solr/core/src/test-files/solr/collection1
   [junit4]   2> 859070 INFO  (coreLoadExecutor-2592-thread-1-processing-x:collection1) [    x:collection1] o.a.s.c.SolrCore solr.StandardDirectoryFactory
   [junit4]   2> 859070 INFO  (coreLoadExecutor-2592-thread-1-processing-x:collection1) [    x:collection1] o.a.s.c.SolrCore [[collection1] ] Opening new SolrCore at [/home/jenkins/workspace/Lucene-Solr-5.x-Linux/solr/core/src/test-files/solr/collection1], dataDir=[/home/jenkins/workspace/Lucene-Solr-5.x-Linux/solr/build/solr-core/test/J1/temp/solr.core.TestNRTOpen_1A4EC986938AC08C-001/init-core-data-001/]
   [junit4]   2> 859070 INFO  (coreLoadExecutor-2592-thread-1-processing-x:collection1) [    x:collection1] o.a.s.c.SolrCore JMX monitoring not detected for core: collection1
   [junit4]   2> 859070 INFO  (coreLoadExecutor-2592-thread-1-processing-x:collection1) [    x:collection1] o.a.s.c.CachingDirectoryFactory return new directory for /home/jenkins/workspace/Lucene-Solr-5.x-Linux/solr/build/solr-core/test/J1/temp/solr.core.TestNRTOpen_1A4EC986938AC08C-001/init-core-data-001
   [junit4]   2> 859070 INFO  (coreLoadExecutor-2592-thread-1-processing-x:collection1) [    x:collection1] o.a.s.c.SolrCore New index directory detected: old=null new=/home/jenkins/workspace/Lucene-Solr-5.x-Linux/solr/build/solr-core/test/J1/temp/solr.core.TestNRTOpen_1A4EC986938AC08C-001/init-core-data-001/index/
   [junit4]   2> 859071 INFO  (OldIndexDirectoryCleanupThreadForCore-collection1) [    x:collection1] o.a.s.c.SolrCore Looking for old index directories to cleanup for core collection1 in /home/jenkins/workspace/Lucene-Solr-5.x-Linux/solr/build/solr-core/test/J1/temp/solr.core.TestNRTOpen_1A4EC986938AC08C-001/init-core-data-001/
   [junit4]   2> 859072 INFO  (coreLoadExecutor-2592-thread-1-processing-x:collection1) [    x:collection1] o.a.s.c.SolrCore no updateRequestProcessorChain defined as default, creating implicit default
   [junit4]   2> 859073 INFO  (coreLoadExecutor-2592-thread-1-processing-x:collection1) [    x:collection1] o.a.s.h.l.XMLLoader xsltCacheLifetimeSeconds=60
   [junit4]   2> 859073 INFO  (coreLoadExecutor-2592-thread-1-processing-x:collection1) [    x:collection1] o.a.s.h.l.XMLLoader xsltCacheLifetimeSeconds=60
   [junit4]   2> 859074 INFO  (coreLoadExecutor-2592-thread-1-processing-x:collection1) [    x:collection1] o.a.s.h.l.XMLLoader xsltCacheLifetimeSeconds=60
   [junit4]   2> 859074 INFO  (coreLoadExecutor-2592-thread-1-processing-x:collection1) [    x:collection1] o.a.s.h.l.XMLLoader xsltCacheLifetimeSeconds=60
   [junit4]   2> 859075 INFO  (coreLoadExecutor-2592-thread-1-processing-x:collection1) [    x:collection1] o.a.s.c.RequestHandlers Registered paths: /admin/mbeans,standard,/update/csv,/update/json/docs,/admin/luke,/admin/segments,/get,/admin/system,/replication,/admin/properties,/config,/schema,/admin/plugins,/admin/logging,/update/json,/admin/threads,/admin/ping,/update,/admin/file
   [junit4]   2> 859088 INFO  (coreLoadExecutor-2592-thread-1-processing-x:collection1) [    x:collection1] o.a.s.c.SolrCore Using default statsCache cache: org.apache.solr.search.stats.LocalStatsCache
   [junit4]   2> 859088 INFO  (coreLoadExecutor-2592-thread-1-processing-x:collection1) [    x:collection1] o.a.s.u.CommitTracker Hard AutoCommit: disabled
   [junit4]   2> 859088 INFO  (coreLoadExecutor-2592-thread-1-processing-x:collection1) [    x:collection1] o.a.s.u.CommitTracker Soft AutoCommit: disabled
   [junit4]   2> 859089 INFO  (coreLoadExecutor-2592-thread-1-processing-x:collection1) [    x:collection1] o.a.s.c.CachingDirectoryFactory return new directory for /home/jenkins/workspace/Lucene-Solr-5.x-Linux/solr/build/solr-core/test/J1/temp/solr.core.TestNRTOpen_1A4EC986938AC08C-001/init-core-data-001/index
   [junit4]   2> 859089 INFO  (coreLoadExecutor-2592-thread-1-processing-x:collection1) [    x:collection1] o.a.s.u.RandomMergePolicy RandomMergePolicy wrapping class org.apache.lucene.index.MockRandomMergePolicy: org.apache.lucene.index.MockRandomMergePolicy@26eb7e12
   [junit4]   2> 859090 INFO  (coreLoadExecutor-2592-thread-1-processing-x:collection1) [    x:collection1] o.a.s.c.SolrDeletionPolicy SolrDeletionPolicy.onInit: commits: num=1
   [junit4]   2> 	commit{dir=/home/jenkins/workspace/Lucene-Solr-5.x-Linux/solr/build/solr-core/test/J1/temp/solr.core.TestNRTOpen_1A4EC986938AC08C-001/init-core-data-001/index,segFN=segments_2,generation=2}
   [junit4]   2> 859090 INFO  (coreLoadExecutor-2592-thread-1-processing-x:collection1) [    x:collection1] o.a.s.c.SolrDeletionPolicy newest commit generation = 2
   [junit4]   2> 859090 INFO  (coreLoadExecutor-2592-thread-1-processing-x:collection1) [    x:collection1] o.a.s.s.SolrIndexSearcher Opening Searcher@4e1d0b75[collection1] main
   [junit4]   2> 859090 WARN  (coreLoadExecutor-2592-thread-1-processing-x:collection1) [    x:collection1] o.a.s.r.ManagedResourceStorage Cannot write to config directory /home/jenkins/workspace/Lucene-Solr-5.x-Linux/solr/core/src/test-files/solr/collection1/conf; switching to use InMemory storage instead.
   [junit4]   2> 859091 INFO  (coreLoadExecutor-2592-thread-1-processing-x:collection1) [    x:collection1] o.a.s.r.RestManager Initializing RestManager with initArgs: {}
   [junit4]   2> 859091 INFO  (coreLoadExecutor-2592-thread-1-processing-x:collection1) [    x:collection1] o.a.s.r.ManagedResourceStorage Reading _rest_managed.json using InMemoryStorage
   [junit4]   2> 859091 INFO  (coreLoadExecutor-2592-thread-1-processing-x:collection1) [    x:collection1] o.a.s.r.RestManager Initializing 0 registered ManagedResources
   [junit4]   2> 859091 INFO  (coreLoadExecutor-2592-thread-1-processing-x:collection1) [    x:collection1] o.a.s.h.ReplicationHandler Commits will be reserved for  10000
   [junit4]   2> 859091 INFO  (searcherExecutor-2593-thread-1-processing-x:collection1) [    x:collection1] o.a.s.c.SolrCore [collection1] Registered new searcher Searcher@4e1d0b75[collection1] main{ExitableDirectoryReader(UninvertingDirectoryReader(Uninverting(_0(5.5.0):c1)))}
   [junit4]   2> 859091 INFO  (coreLoadExecutor-2592-thread-1-processing-x:collection1) [    x:collection1] o.a.s.c.CoreContainer registering core: collection1
   [junit4]   2> 859092 INFO  (SUITE-TestNRTOpen-seed#[1A4EC986938AC08C]-worker) [    x:collection1] o.a.s.SolrTestCaseJ4 ####initCore end
   [junit4]   2> 859094 INFO  (TEST-TestNRTOpen.testSharedCores-seed#[1A4EC986938AC08C]) [    x:collection1] o.a.s.SolrTestCaseJ4 ###Starting testSharedCores
   [junit4]   2> 859094 INFO  (TEST-TestNRTOpen.testSharedCores-seed#[1A4EC986938AC08C]) [    x:collection1] o.a.s.u.DirectUpdateHandler2 [collection1] REMOVING ALL DOCUMENTS FROM INDEX
   [junit4]   2> 859095 INFO  (TEST-TestNRTOpen.testSharedCores-seed#[1A4EC986938AC08C]) [    x:collection1] o.a.s.u.p.LogUpdateProcessorFactory [collection1]  webapp=null path=null params={}{deleteByQuery=*:*} 0 0
   [junit4]   2> 859096 INFO  (TEST-TestNRTOpen.testSharedCores-seed#[1A4EC986938AC08C]) [    x:collection1] o.a.s.u.p.LogUpdateProcessorFactory [collection1]  webapp=null path=null params={}{add=[(null)]} 0 0
   [junit4]   2> 859096 INFO  (TEST-TestNRTOpen.testSharedCores-seed#[1A4EC986938AC08C]) [    x:collection1] o.a.s.u.DirectUpdateHandler2 start commit{,optimize=false,openSearcher=true,waitSearcher=true,expungeDeletes=false,softCommit=false,prepareCommit=false}
   [junit4]   2> 859235 INFO  (TEST-TestNRTOpen.testSharedCores-seed#[1A4EC986938AC08C]) [    x:collection1] o.a.s.c.SolrDeletionPolicy SolrDeletionPolicy.onCommit: commits: num=2
   [junit4]   2> 	commit{dir=/home/jenkins/workspace/Lucene-Solr-5.x-Linux/solr/build/solr-core/test/J1/temp/solr.core.TestNRTOpen_1A4EC986938AC08C-001/init-core-data-001/index,segFN=segments_2,generation=2}
   [junit4]   2> 	commit{dir=/home/jenkins/workspace/Lucene-Solr-5.x-Linux/solr/build/solr-core/test/J1/temp/solr.core.TestNRTOpen_1A4EC986938AC08C-001/init-core-data-001/index,segFN=segments_3,generation=3}
   [junit4]   2> 859235 INFO  (TEST-TestNRTOpen.testSharedCores-seed#[1A4EC986938AC08C]) [    x:collection1] o.a.s.c.SolrDeletionPolicy newest commit generation = 3
   [junit4]   2> 859237 INFO  (TEST-TestNRTOpen.testSharedCores-seed#[1A4EC986938AC08C]) [    x:collection1] o.a.s.s.SolrIndexSearcher Opening Searcher@3b6d92ed[collection1] main
   [junit4]   2> 859237 INFO  (TEST-TestNRTOpen.testSharedCores-seed#[1A4EC986938AC08C]) [    x:collection1] o.a.s.u.DirectUpdateHandler2 end_commit_flush
   [junit4]   2> 859237 INFO  (searcherExecutor-2593-thread-1-processing-x:collection1) [    x:collection1] o.a.s.c.SolrCore [collection1] Registered new searcher Searcher@3b6d92ed[collection1] main{ExitableDirectoryReader(UninvertingDirectoryReader(Uninverting(_1(5.5.0):c1)))}
   [junit4]   2> 859237 INFO  (TEST-TestNRTOpen.testSharedCores-seed#[1A4EC986938AC08C]) [    x:collection1] o.a.s.u.p.LogUpdateProcessorFactory [collection1]  webapp=null path=null params={}{commit=} 0 141
   [junit4]   2> 859237 INFO  (TEST-TestNRTOpen.testSharedCores-seed#[1A4EC986938AC08C]) [    x:collection1] o.a.s.u.DirectUpdateHandler2 start commit{,optimize=true,openSearcher=true,waitSearcher=true,expungeDeletes=false,softCommit=false,prepareCommit=false}
   [junit4]   2> 859238 INFO  (TEST-TestNRTOpen.testSharedCores-seed#[1A4EC986938AC08C]) [    x:collection1] o.a.s.u.DirectUpdateHandler2 No uncommitted changes. Skipping IW.commit.
   [junit4]   2> 859238 INFO  (TEST-TestNRTOpen.testSharedCores-seed#[1A4EC986938AC08C]) [    x:collection1] o.a.s.c.SolrCore SolrIndexSearcher has not changed - not re-opening: org.apache.solr.search.SolrIndexSearcher
   [junit4]   2> 859238 INFO  (TEST-TestNRTOpen.testSharedCores-seed#[1A4EC986938AC08C]) [    x:collection1] o.a.s.u.DirectUpdateHandler2 end_commit_flush
   [junit4]   2> 859238 INFO  (TEST-TestNRTOpen.testSharedCores-seed#[1A4EC986938AC08C]) [    x:collection1] o.a.s.u.p.LogUpdateProcessorFactory [collection1]  webapp=null path=null params={}{optimize=} 0 0
   [junit4]   2> 859238 INFO  (TEST-TestNRTOpen.testSharedCores-seed#[1A4EC986938AC08C]) [    x:collection1] o.a.s.u.p.LogUpdateProcessorFactory [collection1]  webapp=null path=null params={}{add=[(null)]} 0 0
   [junit4]   2> 859239 INFO  (TEST-TestNRTOpen.testSharedCores-seed#[1A4EC986938AC08C]) [    x:collection1] o.a.s.u.DirectUpdateHandler2 start commit{,optimize=false,openSearcher=true,waitSearcher=true,expungeDeletes=false,softCommit=true,prepareCommit=false}
   [junit4]   2> 859242 INFO  (TEST-TestNRTOpen.testSharedCores-seed#[1A4EC986938AC08C]) [    x:collection1] o.a.s.s.SolrIndexSearcher Opening Searcher@1a76036b[collection1] main
   [junit4]   2> 859242 INFO  (TEST-TestNRTOpen.testSharedCores-seed#[1A4EC986938AC08C]) [    x:collection1] o.a.s.u.DirectUpdateHandler2 end_commit_flush
   [junit4]   2> 859242 INFO  (searcherExecutor-2593-thread-1-processing-x:collection1) [    x:collection1] o.a.s.c.SolrCore [collection1] Registered new searcher Searcher@1a76036b[collection1] main{ExitableDirectoryReader(UninvertingDirectoryReader(Uninverting(_1(5.5.0):c1) Uninverting(_2(5.5.0):c1)))}
   [junit4]   2> 859242 INFO  (TEST-TestNRTOpen.testSharedCores-seed#[1A4EC986938AC08C]) [    x:collection1] o.a.s.u.p.LogUpdateProcessorFactory [collection1]  webapp=null path=null params={}{commit=} 0 3
   [junit4]   2> 859243 INFO  (TEST-TestNRTOpen.testSharedCores-seed#[1A4EC986938AC08C]) [    x:collection1] o.a.s.u.p.LogUpdateProcessorFactory [collection1]  webapp=null path=null params={}{add=[(null)]} 0 0
   [junit4]   2> 859243 INFO  (TEST-TestNRTOpen.testSharedCores-seed#[1A4EC986938AC08C]) [    x:collection1] o.a.s.u.p.LogUpdateProcessorFactory [collection1]  webapp=null path=null params={}{add=[(null)]} 0 0
   [junit4]   2> 859243 INFO  (TEST-TestNRTOpen.testSharedCores-seed#[1A4EC986938AC08C]) [    x:collection1] o.a.s.u.DirectUpdateHandler2 start commit{,optimize=false,openSearcher=true,waitSearcher=true,expungeDeletes=false,softCommit=false,prepareCommit=false}
   [junit4]   2> 859396 INFO  (TEST-TestNRTOpen.testSharedCores-seed#[1A4EC986938AC08C]) [    x:collection1] o.a.s.c.SolrDeletionPolicy SolrDeletionPolicy.onCommit: commits: num=2
   [junit4]   2> 	commit{dir=/home/jenkins/workspace/Lucene-Solr-5.x-Linux/solr/build/solr-core/test/J1/temp/solr.core.TestNRTOpen_1A4EC986938AC08C-001/init-core-data-001/index,segFN=segments_3,generation=3}
   [junit4]   2> 	commit{dir=/home/jenkins/workspace/Lucene-Solr-5.x-Linux/solr/build/solr-core/test/J1/temp/solr.core.TestNRTOpen_1A4EC986938AC08C-001/init-core-data-001/index,segFN=segments_4,generation=4}
   [junit4]   2> 859396 INFO  (TEST-TestNRTOpen.testSharedCores-seed#[1A4EC986938AC08C]) [    x:collection1] o.a.s.c.SolrDeletionPolicy newest commit generation = 4
   [junit4]   2> 859397 INFO  (TEST-TestNRTOpen.testSharedCores-seed#[1A4EC986938AC08C]) [    x:collection1] o.a.s.s.SolrIndexSearcher Opening Searcher@485c207f[collection1] main
   [junit4]   2> 859397 INFO  (TEST-TestNRTOpen.testSharedCores-seed#[1A4EC986938AC08C]) [    x:collection1] o.a.s.u.DirectUpdateHandler2 end_commit_flush
   [junit4]   2> 859397 INFO  (searcherExecutor-2593-thread-1-processing-x:collection1) [    x:collection1] o.a.s.c.SolrCore [collection1] Registered new searcher Searcher@485c207f[collection1] main{ExitableDirectoryReader(UninvertingDirectoryReader(Uninverting(_6(5.5.0):c4)))}
   [junit4]   2> 859398 INFO  (TEST-TestNRTOpen.testSharedCores-seed#[1A4EC986938AC08C]) [    x:collection1] o.a.s.u.p.LogUpdateProcessorFactory [collection1]  webapp=null path=null params={}{commit=} 0 154
   [junit4]   2> 859398 INFO  (TEST-TestNRTOpen.testSharedCores-seed#[1A4EC986938AC08C]) [    x:collection1] o.a.s.SolrTestCaseJ4 ###Ending testSharedCores
   [junit4]   2> NOTE: reproduce with: ant test  -Dtestcase=TestNRTOpen -Dtests.method=testSharedCores -Dtests.seed=1A4EC986938AC08C -Dtests.multiplier=3 -Dtests.slow=true -Dtests.locale=en-PH -Dtests.timezone=America/Cayman -Dtests.asserts=true -Dtests.file.encoding=ISO-8859-1
   [junit4] FAILURE 0.31s J1 | TestNRTOpen.testSharedCores <<<
   [junit4]    > Throwable #1: java.lang.AssertionError: expected:<3> but was:<1>
   [junit4]    > 	at __randomizedtesting.SeedInfo.seed([1A4EC986938AC08C:FC4D83C91B7CED83]:0)
   [junit4]    > 	at org.apache.solr.core.TestNRTOpen.testSharedCores(TestNRTOpen.java:116)
   [junit4]    > 	at java.lang.Thread.run(Thread.java:745)
   [junit4]   2> 859401 INFO  (TEST-TestNRTOpen.testReaderIsNRT-seed#[1A4EC986938AC08C]) [    x:collection1] o.a.s.SolrTestCaseJ4 ###Starting testReaderIsNRT
   [junit4]   2> 859401 INFO  (TEST-TestNRTOpen.testReaderIsNRT-seed#[1A4EC986938AC08C]) [    x:collection1] o.a.s.u.DirectUpdateHandler2 [collection1] REMOVING ALL DOCUMENTS FROM INDEX
   [junit4]   2> 859401 INFO  (TEST-TestNRTOpen.testReaderIsNRT-seed#[1A4EC986938AC08C]) [    x:collection1] o.a.s.u.p.LogUpdateProcessorFactory [collection1]  webapp=null path=null params={}{deleteByQuery=*:*} 0 0
   [junit4]   2> 859402 INFO  (TEST-TestNRTOpen.testReaderIsNRT-seed#[1A4EC986938AC08C]) [    x:collection1] o.a.s.u.p.LogUpdateProcessorFactory [collection1]  webapp=null path=null params={}{add=[(null)]} 0 0
   [junit4]   2> 859402 INFO  (TEST-TestNRTOpen.testReaderIsNRT-seed#[1A4EC986938AC08C]) [    x:collection1] o.a.s.u.DirectUpdateHandler2 start commit{,optimize=false,openSearcher=true,waitSearcher=true,expungeDeletes=false,softCommit=false,prepareCommit=false}
   [junit4]   2> 859508 INFO  (TEST-TestNRTOpen.testReaderIsNRT-seed#[1A4EC986938AC08C]) [    x:collection1] o.a.s.c.SolrDeletionPolicy SolrDeletionPolicy.onCommit: commits: num=2
   [junit4]   2> 	commit{dir=/home/jenkins/workspace/Lucene-Solr-5.x-Linux/solr/build/solr-core/test/J1/temp/solr.core.TestNRTOpen_1A4EC986938AC08C-001/init-core-data-001/index,segFN=segments_4,generation=4}
   [junit4]   2> 	commit{dir=/home/jenkins/workspace/Lucene-Solr-5.x-Linux/solr/build/solr-core/test/J1/temp/solr.core.TestNRTOpen_1A4EC986938AC08C-001/init-core-data-001/index,segFN=segments_5,generation=5}
   [junit4]   2> 859509 INFO  (TEST-TestNRTOpen.testReaderIsNRT-seed#[1A4EC986938AC08C]) [    x:collection1] o.a.s.c.SolrDeletionPolicy newest commit generation = 5
   [junit4]   2> 859510 INFO  (TEST-TestNRTOpen.testReaderIsNRT-seed#[1A4EC986938AC08C]) [    x:collection1] o.a.s.s.SolrIndexSearcher Opening Searcher@2035216d[collection1] main
   [junit4]   2> 859510 INFO  (TEST-TestNRTOpen.testReaderIsNRT-seed#[1A4EC986938AC08C]) [    x:collection1] o.a.s.u.DirectUpdateHandler2 end_commit_flush
   [junit4]   2> 859510 INFO  (searcherExecutor-2593-thread-1-processing-x:collection1) [    x:collection1] o.a.s.c.SolrCore [collection1] Registered new searcher Searcher@2035216d[collection1] main{ExitableDirectoryReader(UninvertingDirectoryReader(Uninverting(_7(5.5.0):c1)))}
   [junit4]   2> 859510 INFO  (TEST-TestNRTOpen.testReaderIsNRT-seed#[1A4EC986938AC08C]) [    x:collection1] o.a.s.u.p.LogUpdateProcessorFactory [collection1]  webapp=null path=null params={}{commit=} 0 107
   [junit4]   2> 859510 INFO  (TEST-TestNRTOpen.testReaderIsNRT-seed#[1A4EC986938AC08C]) [    x:collection1] o.a.s.c.SolrResourceLoader new SolrResourceLoader for directory: '/home/jenkins/workspace/Lucene-Solr-5.x-Linux/solr/core/src/test-files/solr/collection1'
   [junit4]   2> 859510 INFO  (TEST-TestNRTOpen.testReaderIsNRT-seed#[1A4EC986938AC08C]) [    x:collection1] o.a.s.c.SolrResourceLoader JNDI not configured for solr (NoInitialContextEx)
   [junit4]   2> 859510 INFO  (TEST-TestNRTOpen.testReaderIsNRT-seed#[1A4EC986938AC08C]) [    x:collection1] o.a.s.c.SolrResourceLoader using system property solr.solr.home: /home/jenkins/workspace/Lucene-Solr-5.x-Linux/solr/core/src/test-files/solr
   [junit4]   2> 859510 INFO  (TEST-TestNRTOpen.testReaderIsNRT-seed#[1A4EC986938AC08C]) [    x:collection1] o.a.s.c.SolrResourceLoader Adding 'file:/home/jenkins/workspace/Lucene-Solr-5.x-Linux/solr/core/src/test-files/solr/collection1/lib/classes/' to classloader
   [junit4]   2> 859510 INFO  (TEST-TestNRTOpen.testReaderIsNRT-seed#[1A4EC986938AC08C]) [    x:collection1] o.a.s.c.SolrResourceLoader Adding 'file:/home/jenkins/workspace/Lucene-Solr-5.x-Linux/solr/core/src/test-files/solr/collection1/lib/README' to classloader
   [junit4]   2> 859523 INFO  (TEST-TestNRTOpen.testReaderIsNRT-seed#[1A4EC986938AC08C]) [    x:collection1] o.a.s.c.SolrConfig current version of requestparams : -1
   [junit4]   2> 859525 INFO  (TEST-TestNRTOpen.testReaderIsNRT-seed#[1A4EC986938AC08C]) [    x:collection1] o.a.s.c.SolrConfig Using Lucene MatchVersion: 5.5.0
   [junit4]   2> 859527 INFO  (TEST-TestNRTOpen.testReaderIsNRT-seed#[1A4EC986938AC08C]) [    x:collection1] o.a.s.c.SolrConfig Loaded SolrConfig: solrconfig-basic.xml
   [junit4]   2> 859528 INFO  (TEST-TestNRTOpen.testReaderIsNRT-seed#[1A4EC986938AC08C]) [    x:collection1] o.a.s.s.IndexSchema [collection1] Schema name=minimal
   [junit4]   2> 859529 WARN  (TEST-TestNRTOpen.testReaderIsNRT-seed#[1A4EC986938AC08C]) [    x:collection1] o.a.s.s.IndexSchema no uniqueKey specified in schema.
   [junit4]   2> 859530 INFO  (TEST-TestNRTOpen.testReaderIsNRT-seed#[1A4EC986938AC08C]) [    x:collection1] o.a.s.c.ConfigSetProperties Did not find ConfigSet properties, assuming default properties: Can't find resource 'configsetprops.json' in classpath or '/home/jenkins/workspace/Lucene-Solr-5.x-Linux/solr/core/src/test-files/solr/collection1'
   [junit4]   2> 859530 INFO  (TEST-TestNRTOpen.testReaderIsNRT-seed#[1A4EC986938AC08C]) [    x:collection1] o.a.s.c.CoreContainer Reloading SolrCore 'collection1' using configuration from instancedir /home/jenkins/workspace/Lucene-Solr-5.x-Linux/solr/core/src/test-files/solr/collection1
   [junit4]   2> 859531 INFO  (TEST-TestNRTOpen.testReaderIsNRT-seed#[1A4EC986938AC08C]) [    x:collection1] o.a.s.c.SolrCore [[collection1] ] Opening new SolrCore at [/home/jenkins/workspace/Lucene-Solr-5.x-Linux/solr/core/src/test-files/solr/collection1], dataDir=[/home/jenkins/workspace/Lucene-Solr-5.x-Linux/solr/build/solr-core/test/J1/temp/solr.core.TestNRTOpen_1A4EC986938AC08C-001/init-core-data-001/]
   [junit4]   2> 859531 INFO  (TEST-TestNRTOpen.testReaderIsNRT-seed#[1A4EC986938AC08C]) [    x:collection1] o.a.s.c.SolrCore JMX monitoring not detected for core: collection1
   [junit4]   2> 859531 INFO  (TEST-TestNRTOpen.testReaderIsNRT-seed#[1A4EC986938AC08C]) [    x:collection1] o.a.s.c.SolrCore New index directory detected: old=null new=/home/jenkins/workspace/Lucene-Solr-5.x-Linux/solr/build/solr-core/test/J1/temp/solr.core.TestNRTOpen_1A4EC986938AC08C-001/init-core-data-001/index/
   [junit4]   2> 859531 INFO  (OldIndexDirectoryCleanupThreadForCore-collection1) [    x:collection1] o.a.s.c.SolrCore Looking for old index directories to cleanup for core collection1 in /home/jenkins/workspace/Lucene-Solr-5.x-Linux/solr/build/solr-core/test/J1/temp/solr.core.TestNRTOpen_1A4EC986938AC08C-001/init-core-data-001/
   [junit4]   2> 859533 INFO  (TEST-TestNRTOpen.testReaderIsNRT-seed#[1A4EC986938AC08C]) [    x:collection1] o.a.s.c.SolrCore no updateRequestProcessorChain defined as default, creating implicit default
   [junit4]   2> 859533 INFO  (TEST-TestNRTOpen.testReaderIsNRT-seed#[1A4EC986938AC08C]) [    x:collection1] o.a.s.h.l.XMLLoader xsltCacheLifetimeSeconds=60
   [junit4]   2> 859534 INFO  (TEST-TestNRTOpen.testReaderIsNRT-seed#[1A4EC986938AC08C]) [    x:collection1] o.a.s.h.l.XMLLoader xsltCacheLifetimeSeconds=60
   [junit4]   2> 859534 INFO  (TEST-TestNRTOpen.testReaderIsNRT-seed#[1A4EC986938AC08C]) [    x:collection1] o.a.s.h.l.XMLLoader xsltCacheLifetimeSeconds=60
   [junit4]   2> 859535 INFO  (TEST-TestNRTOpen.testReaderIsNRT-seed#[1A4EC986938AC08C]) [    x:collection1] o.a.s.h.l.XMLLoader xsltCacheLifetimeSeconds=60
   [junit4]   2> 859535 INFO  (TEST-TestNRTOpen.testReaderIsNRT-seed#[1A4EC986938AC08C]) [    x:collection1] o.a.s.c.RequestHandlers Registered paths: /admin/mbeans,standard,/update/csv,/update/json/docs,/admin/luke,/admin/segments,/get,/admin/system,/replication,/admin/properties,/config,/schema,/admin/plugins,/admin/logging,/update/json,/admin/threads,/admin/ping,/update,/admin/file
   [junit4]   2> 859535 INFO  (TEST-TestNRTOpen.testReaderIsNRT-seed#[1A4EC986938AC08C]) [    x:collection1] o.a.s.c.SolrCore Using default statsCache cache: org.apache.solr.search.stats.LocalStatsCache
   [junit4]   2> 859535 INFO  (TEST-TestNRTOpen.testReaderIsNRT-seed#[1A4EC986938AC08C]) [    x:collection1] o.a.s.u.CommitTracker Hard AutoCommit: disabled
   [junit4]   2> 859535 INFO  (TEST-TestNRTOpen.testReaderIsNRT-seed#[1A4EC986938AC08C]) [    x:collection1] o.a.s.u.CommitTracker Soft AutoCommit: disabled
   [junit4]   2> 859536 INFO  (TEST-TestNRTOpen.testReaderIsNRT-seed#[1A4EC986938AC08C]) [    x:collection1] o.a.s.s.SolrIndexSearcher Opening Searcher@29548b58[collection1] main
   [junit4]   2> 859536 WARN  (TEST-TestNRTOpen.testReaderIsNRT-seed#[1A4EC986938AC08C]) [    x:collection1] o.a.s.r.ManagedResourceStorage Cannot write to config directory /home/jenkins/workspace/Lucene-Solr-5.x-Linux/solr/core/src/test-files/solr/collection1/conf; switching to use InMemory storage instead.
   [junit4]   2> 859536 INFO  (TEST-TestNRTOpen.testReaderIsNRT-seed#[1A4EC986938AC08C]) [    x:collection1] o.a.s.r.RestManager Initializing RestManager with initArgs: {}
   [junit4]   2> 859536 INFO  (TEST-TestNRTOpen.testReaderIsNRT-seed#[1A4EC986938AC08C]) [    x:collection1] o.a.s.r.ManagedResourceStorage Reading _rest_managed.json using InMemoryStorage
   [junit4]   2> 859536 INFO  (TEST-TestNRTOpen.testReaderIsNRT-seed#[1A4EC986938AC08C]) [    x:collection1] o.a.s.r.RestManager Initializing 0 registered ManagedResources
   [junit4]   2> 859536 INFO  (TEST-TestNRTOpen.testReaderIsNRT-seed#[1A4EC986938AC08C]) [    x:collection1] o.a.s.h.ReplicationHandler Commits will be reserved for  10000
   [junit4]   2> 859536 INFO  (searcherExecutor-2597-thread-1-processing-x:collection1) [    x:collection1] o.a.s.c.SolrCore [collection1] Registered new searcher Searcher@29548b58[collection1] main{ExitableDirectoryReader(UninvertingDirectoryReader(Uninverting(_7(5.5.0):c1)))}
   [junit4]   2> 859536 INFO  (TEST-TestNRTOpen.testReaderIsNRT-seed#[1A4EC986938AC08C]) [    x:collection1] o.a.s.u.DefaultSolrCoreState Closing old IndexWriter... core=collection1
   [junit4]   2> 859537 INFO  (TEST-TestNRTOpen.testReaderIsNRT-seed#[1A4EC986938AC08C]) [    x:collection1] o.a.s.u.RandomMergePolicy RandomMergePolicy wrapping class org.apache.lucene.index.TieredMergePolicy: [TieredMergePolicy: maxMergeAtOnce=40, maxMergeAtOnceExplicit=16, maxMergedSegmentMB=61.7578125, floorSegmentMB=1.509765625, forceMergeDeletesPctAllowed=22.661069267279444, segmentsPerTier=26.0, maxCFSSegmentSizeMB=8.796093022207999E12, noCFSRatio=1.0
   [junit4]   2> 859537 INFO  (TEST-TestNRTOpen.testReaderIsNRT-seed#[1A4EC986938AC08C]) [    x:collection1] o.a.s.c.SolrDeletionPolicy SolrDeletionPolicy.onInit: commits: num=1
   [junit4]   2> 	commit{dir=/home/jenkins/workspace/Lucene-Solr-5.x-Linux/solr/build/solr-core/test/J1/temp/solr.core.TestNRTOpen_1A4EC986938AC08C-001/init-core-data-001/index,segFN=segments_5,generation=5}
   [junit4]   2> 859537 INFO  (TEST-TestNRTOpen.testReaderIsNRT-seed#[1A4EC986938AC08C]) [    x:collection1] o.a.s.c.SolrDeletionPolicy newest commit generation = 5
   [junit4]   2> 859537 INFO  (TEST-TestNRTOpen.testReaderIsNRT-seed#[1A4EC986938AC08C]) [    x:collection1] o.a.s.u.DefaultSolrCoreState New IndexWriter is ready to be used.
   [junit4]   2> 859538 INFO  (TEST-TestNRTOpen.testReaderIsNRT-seed#[1A4EC986938AC08C]) [    x:collection1] o.a.s.s.SolrIndexSearcher Opening Searcher@5a98cf70[collection1] main
   [junit4]   2> 859538 INFO  (TEST-TestNRTOpen.testReaderIsNRT-seed#[1A4EC986938AC08C]) [    x:collection1] o.a.s.c.CoreContainer replacing core: collection1
   [junit4]   2> 859538 INFO  (searcherExecutor-2597-thread-1-processing-x:collection1) [    x:collection1] o.a.s.c.SolrCore [collection1] Registered new searcher Searcher@5a98cf70[collection1] main{ExitableDirectoryReader(UninvertingDirectoryReader(Uninverting(_7(5.5.0):c1)))}
   [junit4]   2> 859538 INFO  (TEST-TestNRTOpen.testReaderIsNRT-seed#[1A4EC986938AC08C]) [    x:collection1] o.a.s.c.SolrCore [collection1]  CLOSING SolrCore org.apache.solr.core.SolrCore@31a71990
   [junit4]   2> 859538 INFO  (TEST-TestNRTOpen.testReaderIsNRT-seed#[1A4EC986938AC08C]) [    x:collection1] o.a.s.u.DirectUpdateHandler2 closing DirectUpdateHandler2{commits=4,autocommits=0,soft autocommits=0,optimizes=1,rollbacks=0,expungeDeletes=0,docsPending=0,adds=0,deletesById=0,deletesByQuery=0,errors=0,cumulative_adds=5,cumulative_deletesById=0,cumulative_deletesByQuery=2,cumulative_errors=0}
   [junit4]   2> 859538 INFO  (TEST-TestNRTOpen.testReaderIsNRT-seed#[1A4EC986938AC08C]) [    x:collection1] o.a.s.c.SolrCore [collection1] Closing main searcher on request.
   [junit4]   2> 859539 INFO  (TEST-TestNRTOpen.testReaderIsNRT-seed#[1A4EC986938AC08C]) [    x:collection1] o.a.s.u.p.LogUpdateProcessorFactory [collection1]  webapp=null path=null params={}{add=[(null)]} 0 0
   [junit4]   2> 859539 INFO  (TEST-TestNRTOpen.testReaderIsNRT-seed#[1A4EC986938AC08C]) [    x:collection1] o.a.s.u.DirectUpdateHandler2 start commit{,optimize=false,openSearcher=true,waitSearcher=true,expungeDeletes=false,softCommit=true,prepareCommit=false}
   [junit4]   2> 859542 INFO  (TEST-TestNRTOpen.testReaderIsNRT-seed#[1A4EC986938AC08C]) [    x:collection1] o.a.s.s.SolrIndexSearcher Opening Searcher@38f2d72c[collection1] main
   [junit4]   2> 859542 INFO  (TEST-TestNRTOpen.testReaderIsNRT-seed#[1A4EC986938AC08C]) [    x:collection1] o.a.s.u.DirectUpdateHandler2 end_commit_flush
   [junit4]   2> 859542 INFO  (searcherExecutor-2597-thread-1-processing-x:collection1) [    x:collection1] o.a.s.c.SolrCore [collection1] Registered new searcher Searcher@38f2d72c[collection1] main{ExitableDirectoryReader(UninvertingDirectoryReader(Uninverting(_7(5.5.0):c1) Uninverting(_8(5.5.0):c1)))}
   [junit4]   2> 859542 INFO  (TEST-TestNRTOpen.testReaderIsNRT-seed#[1A4EC986938AC08C]) [    x:collection1] o.a.s.u.p.LogUpdateProcessorFactory [collection1]  webapp=null path=null params={}{commit=} 0 3
   [junit4]   2> 859543 INFO  (TEST-TestNRTOpen.testReaderIsNRT-seed#[1A4EC986938AC08C]) [    x:collection1] o.a.s.u.p.LogUpdateProcessorFactory [collection1]  webapp=null path=null params={}{add=[(null)]} 0 0
   [junit4]   2> 859543 INFO  (TEST-TestNRTOpen.testReaderIsNRT-seed#[1A4EC986938AC08C]) [    x:collection1] o.a.s.u.DirectUpdateHandler2 start commit{,optimize=false,openSearcher=true,waitSearcher=true,expungeDeletes=false,softCommit=false,prepareCommit=false}
   [junit4]   2> 859745 INFO  (TEST-TestNRTOpen.testReaderIsNRT-seed#[1A4EC986938AC08C]) [    x:collection1] o.a.s.c.SolrDeletionPolicy SolrDeletionPolicy.onCommit: commits: num=2
   [junit4]   2> 	commit{dir=/home/jenkins/workspace/Lucene-Solr-5.x-Linux/solr/build/solr-core/test/J1/temp/solr.core.TestNRTOpen_1A4EC986938AC08C-001/init-core-data-001/index,segFN=segments_5,generation=5}
   [junit4]   2> 	commit{dir=/home/jenkins/workspace/Lucene-Solr-5.x-Linux/solr/build/solr-core/test/J1/temp/solr.core.TestNRTOpen_1A4EC986938AC08C-001/init-core-data-001/index,segFN=segments_6,generation=6}
   [junit4]   2> 859745 INFO  (TEST-TestNRTOpen.testReaderIsNRT-seed#[1A4EC986938AC08C]) [    x:collection1] o.a.s.c.SolrDeletionPolicy newest commit generation = 6
   [junit4]   2> 859746 INFO  (TEST-TestNRTOpen.testReaderIsNRT-seed#[1A4EC986938AC08C]) [    x:collection1] o.a.s.s.SolrIndexSearcher Opening Searcher@5814ade0[collection1] main
   [junit4]   2> 859746 INFO  (TEST-TestNRTOpen.testReaderIsNRT-seed#[1A4EC986938AC08C]) [    x:collection1] o.a.s.u.DirectUpdateHandler2 end_commit_flush
   [junit4]   2> 859746 INFO  (searcherExecutor-2597-thread-1-processing-x:collection1) [    x:collection1] o.a.s.c.SolrCore [collection1] Registered new searcher Searcher@5814ade0[collection1] main{ExitableDirectoryReader(UninvertingDirectoryReader(Uninverting(_7(5.5.0):c1) Uninverting(_8(5.5.0):c1) Uninverting(_9(5.5.0):c1)))}
   [junit4]   2> 859746 INFO  (TEST-TestNRTOpen.testReaderIsNRT-seed#[1A4EC986938AC08C]) [    x:collection1] o.a.s.u.p.LogUpdateProcessorFactory [collection1]  webapp=null path=null params={}{commit=} 0 203
   [junit4]   2> 859747 INFO  (TEST-TestNRTOpen.testReaderIsNRT-seed#[1A4EC986938AC08C]) [    x:collection1] o.a.s.u.p.LogUpdateProcessorFactory [collection1]  webapp=null path=null params={}{add=[(null)]} 0 0
   [junit4]   2> 859747 INFO  (TEST-TestNRTOpen.testReaderIsNRT-seed#[1A4EC986938AC08C]) [    x:collection1] o.a.s.c.SolrResourceLoader new SolrResourceLoader for directory: '/home/jenkins/workspace/Lucene-Solr-5.x-Linux/solr/core/src/test-files/solr/collection1'
   [junit4]   2> 859747 INFO  (TEST-TestNRTOpen.testReaderIsNRT-seed#[1A4EC986938AC08C]) [    x:collection1] o.a.s.c.SolrResourceLoader JNDI not configured for solr (NoInitialContextEx)
   [junit4]   2> 859747 INFO  (TEST-TestNRTOpen.testReaderIsNRT-seed#[1A4EC986938AC08C]) [    x:collection1] o.a.s.c.SolrResourceLoader using system property solr.solr.home: /home/jenkins/workspace/Lucene-Solr-5.x-Linux/solr/core/src/test-files/solr
   [junit4]   2> 859748 INFO  (TEST-TestNRTOpen.testReaderIsNRT-seed#[1A4EC986938AC08C]) [    x:collection1] o.a.s.c.SolrResourceLoader Adding 'file:/home/jenkins/workspace/Lucene-Solr-5.x-Linux/solr/core/src/test-files/solr/collection1/lib/classes/' to classloader
   [junit4]   2> 859748 INFO  (TEST-TestNRTOpen.testReaderIsNRT-seed#[1A4EC986938AC08C]) [    x:collection1] o.a.s.c.SolrResourceLoader Adding 'file:/home/jenkins/workspace/Lucene-Solr-5.x-Linux/solr/core/src/test-files/solr/collection1/lib/README' to classloader
   [junit4]   2> 859762 INFO  (TEST-TestNRTOpen.testReaderIsNRT-seed#[1A4EC986938AC08C]) [    x:collection1] o.a.s.c.SolrConfig current version of requestparams : -1
   [junit4]   2> 859763 INFO  (TEST-TestNRTOpen.testReaderIsNRT-seed#[1A4EC986938AC08C]) [    x:collection1] o.a.s.c.SolrConfig Using Lucene MatchVersion: 5.5.0
   [junit4]   2> 859766 INFO  (TEST-TestNRTOpen.testReaderIsNRT-seed#[1A4EC986938AC08C]) [    x:collection1] o.a.s.c.SolrConfig Loaded SolrConfig: solrconfig-basic.xml
   [junit4]   2> 859768 INFO  (TEST-TestNRTOpen.testReaderIsNRT-seed#[1A4EC986938AC08C]) [    x:collection1] o.a.s.s.IndexSchema [collection1] Schema name=minimal
   [junit4]   2> 859769 WARN  (TEST-TestNRTOpen.testReaderIsNRT-seed#[1A4EC986938AC08C]) [    x:collection1] o.a.s.s.IndexSchema no uniqueKey specified in schema.
   [junit4]   2> 859770 INFO  (TEST-TestNRTOpen.testReaderIsNRT-seed#[1A4EC986938AC08C]) [    x:collection1] o.a.s.c.ConfigSetProperties Did not find ConfigSet properties, assuming default properties: Can't find resource 'configsetprops.json' in classpath or '/home/jenkins/workspace/Lucene-Solr-5.x-Linux/solr/core/src/test-files/solr/collection1'
   [junit4]   2> 859770 INFO  (TEST-TestNRTOpen.testReaderIsNRT-seed#[1A4EC986938AC08C]) [    x:collection1] o.a.s.c.CoreContainer Reloading SolrCore 'collection1' using configuration from instancedir /home/jenkins/workspace/Lucene-Solr-5.x-Linux/solr/core/src/test-files/solr/collection1
   [junit4]   2> 859770 INFO  (TEST-TestNRTOpen.testReaderIsNRT-seed#[1A4EC986938AC08C]) [    x:collection1] o.a.s.c.SolrCore [[collection1] ] Opening new SolrCore at [/home/jenkins/workspace/Lucene-Solr-5.x-Linux/solr/core/src/test-files/solr/collection1], dataDir=[/home/jenkins/workspace/Lucene-Solr-5.x-Linux/solr/build/solr-core/test/J1/temp/solr.core.TestNRTOpen_1A4EC986938AC08C-001/init-core-data-001/]
   [junit4]   2> 859770 INFO  (TEST-TestNRTOpen.testReaderIsNRT-seed#[1A4EC986938AC08C]) [    x:collection1] o.a.s.c.SolrCore JMX monitoring not detected for core: collection1
   [junit4]   2> 859770 INFO  (TEST-TestNRTOpen.testReaderIsNRT-seed#[1A4EC986938AC08C]) [    x:collection1] o.a.s.c.SolrCore New index directory detected: old=null new=/home/jenkins/workspace/Lucene-Solr-5.x-Linux/solr/build/solr-core/test/J1/temp/solr.core.TestNRTOpen_1A4EC986938AC08C-001/init-core-data-001/index/
   [junit4]   2> 859771 INFO  (OldIndexDirectoryCleanupThreadForCore-collection1) [    x:collection1] o.a.s.c.SolrCore Looking for old index directories to cleanup for core collection1 in /home/jenkins/workspace/Lucene-Solr-5.x-Linux/solr/build/solr-core/test/J1/temp/solr.core.TestNRTOpen_1A4EC986938AC08C-001/init-core-data-001/
   [junit4]   2> 859772 INFO  (TEST-TestNRTOpen.testReaderIsNRT-seed#[1A4EC986938AC08C]) [    x:collection1] o.a.s.c.SolrCore no updateRequestProcessorChain defined as default, creating implicit default
   [junit4]   2> 859773 INFO  (TEST-TestNRTOpen.testReaderIsNRT-seed#[1A4EC986938AC08C]) [    x:collection1] o.a.s.h.l.XMLLoader xsltCacheLifetimeSeconds=60
   [junit4]   2> 859774 INFO  (TEST-TestNRTOpen.testReaderIsNRT-seed#[1A4EC986938AC08C]) [    x:collection1] o.a.s.h.l.XMLLoader xsltCacheLifetimeSeconds=60
   [junit4]   2> 859774 INFO  (TEST-TestNRTOpen.testReaderIsNRT-seed#[1A4EC986938AC08C]) [    x:collection1] o.a.s.h.l.XMLLoader xsltCacheLifetimeSeconds=60
   [junit4]   2> 859775 INFO  (TEST-TestNRTOpen.testReaderIsNRT-seed#[1A4EC986938AC08C]) [    x:collection1] o.a.s.h.l.XMLLoader xsltCacheLifetimeSeconds=60
   [junit4]   2> 859775 INFO  (TEST-TestNRTOpen.testReaderIsNRT-seed#[1A4EC986938AC08C]) [    x:collection1] o.a.s.c.RequestHandlers Registered paths: /admin/mbeans,standard,/update/csv,/update/json/docs,/admin/luke,/admin/segments,/get,/admin/system,/replication,/admin/properties,/config,/schema,/admin/plugins,/admin/logging,/update/json,/admin/threads,/admin/ping,/update,/admin/file
   [junit4]   2> 859776 INFO  (TEST-TestNRTOpen.testReaderIsNRT-seed#[1A4EC986938AC08C]) [    x:collection1] o.a.s.c.SolrCore Using default statsCache cache: org.apache.solr.search.stats.LocalStatsCache
   [junit4]   2> 859776 INFO  (TEST-TestNRTOpen.testReaderIsNRT-seed#[1A4EC986938AC08C]) [    x:collection1] o.a.s.u.CommitTracker Hard AutoCommit: disabled
   [junit4]   2> 859776 INFO  (TEST-TestNRTOpen.testReaderIsNRT-seed#[1A4EC986938AC08C]) [    x:collection1] o.a.s.u.CommitTracker Soft AutoCommit: disabled
   [junit4]   2> 859778 INFO  (TEST-TestNRTOpen.testReaderIsNRT-seed#[1A4EC986938AC08C]) [    x:collection1] o.a.s.s.SolrIndexSearcher Opening Searcher@2cc984b[collection1] main
   [junit4]   2> 859779 WARN  (TEST-TestNRTOpen.testReaderIsNRT-seed#[1A4EC986938AC08C]) [    x:collection1] o.a.s.r.ManagedResourceStorage Cannot write to config directory /home/jenkins/workspace/Lucene-Solr-5.x-Linux/solr/core/src/test-files/solr/collection1/conf; switching to use InMemory storage instead.
   [junit4]   2> 859779 INFO  (TEST-TestNRTOpen.testReaderIsNRT-seed#[1A4EC986938AC08C]) [    x:collection1] o.a.s.r.RestManager Initializing RestManager with initArgs: {}
   [junit4]   2> 859779 INFO  (TEST-TestNRTOpen.testReaderIsNRT-seed#[1A4EC986938AC08C]) [    x:collection1] o.a.s.r.ManagedResourceStorage Reading _rest_managed.json using InMemoryStorage
   [junit4]   2> 859779 INFO  (TEST-TestNRTOpen.testReaderIsNRT-seed#[1A4EC986938AC08C]) [    x:collection1] o.a.s.r.RestManager Initializing 0 registered ManagedResources
   [junit4]   2> 859779 INFO  (TEST-TestNRTOpen.testReaderIsNRT-seed#[1A4EC986938AC08C]) [    x:collection1] o.a.s.h.ReplicationHandler Commits will be reserved for  10000
   [junit4]   2> 859779 INFO  (searcherExecutor-2601-thread-1-processing-x:collection1) [    x:collection1] o.a.s.c.SolrCore [collection1] Registered new searcher Searcher@2cc984b[collection1] main{ExitableDirectoryReader(UninvertingDirectoryReader(Uninverting(_7(5.5.0):c1) Uninverting(_8(5.5.0):c1) Uninverting(_9(5.5.0):c1) Uninverting(_a(5.5.0):c1)))}
   [junit4]   2> 859779 INFO  (TEST-TestNRTOpen.testReaderIsNRT-seed#[1A4EC986938AC08C]) [    x:collection1] o.a.s.u.DefaultSolrCoreState Closing old IndexWriter... core=collection1
   [junit4]   2> 859918 INFO  (TEST-TestNRTOpen.testReaderIsNRT-seed#[1A4EC986938AC08C]) [    x:collection1] o.a.s.c.SolrDeletionPolicy SolrDeletionPolicy.onCommit: commits: num=2
   [junit4]   2> 	commit{dir=/home/jenkins/workspace/Lucene-Solr-5.x-Linux/solr/build/solr-core/test/J1/temp/solr.core.TestNRTOpen_1A4EC986938AC08C-001/init-core-data-001/index,segFN=segments_6,generation=6}
   [junit4]   2> 	commit{dir=/home/jenkins/workspace/Lucene-Solr-5.x-Linux/solr/build/solr-core/test/J1/temp/solr.core.TestNRTOpen_1A4EC986938AC08C-001/init-core-data-001/index,segFN=segments_7,generation=7}
   [junit4]   2> 859918 INFO  (TEST-TestNRTOpen.testReaderIsNRT-seed#[1A4EC986938AC08C]) [    x:collection1] o.a.s.c.SolrDeletionPolicy newest commit generation = 7
   [junit4]   2> 859918 INFO  (TEST-TestNRTOpen.testReaderIsNRT-seed#[1A4EC986938AC08C]) [    x:collection1] o.a.s.u.RandomMergePolicy RandomMergePolicy wrapping class org.apache.lucene.index.LogByteSizeMergePolicy: [LogByteSizeMergePolicy: minMergeSize=1677721, mergeFactor=48, maxMergeSize=2147483648, maxMergeSizeForForcedMerge=9223372036854775807, calibrateSizeByDeletes=false, maxMergeDocs=2147483647, maxCFSSegmentSizeMB=8.796093022207999E12, noCFSRatio=0.355652031552683]
   [junit4]   2> 859920 INFO  (TEST-TestNRTOpen.testReaderIsNRT-seed#[1A4EC986938AC08C]) [    x:collection1] o.a.s.c.SolrDeletionPolicy SolrDeletionPolicy.onInit: commits: num=1
   [junit4]   2> 	commit{dir=/home/jenkins/workspace/Lucene-Solr-5.x-Linux/solr/build/solr-core/test/J1/temp/solr.core.TestNRTOpen_1A4EC986938AC08C-001/init-core-data-001/index,segFN=segments_7,generation=7}
   [junit4]   2> 859920 INFO  (TEST-TestNRTOpen.testReaderIsNRT-seed#[1A4EC986938AC08C]) [    x:collection1] o.a.s.c.SolrDeletionPolicy newest commit generation = 7
   [junit4]   2> 859921 INFO  (TEST-TestNRTOpen.testReaderIsNRT-seed#[1A4EC986938AC08C]) [    x:collection1] o.a.s.u.DefaultSolrCoreState New IndexWriter is ready to be used.
   [junit4]   2> 859922 INFO  (TEST-TestNRTOpen.testReaderIsNRT-seed#[1A4EC986938AC08C]) [    x:collection1] o.a.s.s.SolrIndexSearcher Opening Searcher@6a05e37b[collection1] main
   [junit4]   2> 859922 INFO  (TEST-TestNRTOpen.testReaderIsNRT-seed#[1A4EC986938AC08C]) [    x:collection1] o.a.s.c.CoreContainer replacing core: collection1
   [junit4]   2> 859922 INFO  (searcherExecutor-2601-thread-1-processing-x:collection1) [    x:collection1] o.a.s.c.SolrCore [collection1] Registered new searcher Searcher@6a05e37b[collection1] main{ExitableDirectoryReader(UninvertingDirectoryReader(Uninverting(_7(5.5.0):c1) Uninverting(_8(5.5.0):c1) Uninverting(_9(5.5.0):c1) Uninverting(_a(5.5.0):c1)))}
   [junit4]   2> 859922 INFO  (TEST-TestNRTOpen.testReaderIsNRT-seed#[1A4EC986938AC08C]) [    x:collection1] o.a.s.c.SolrCore [collection1]  CLOSING SolrCore org.apache.solr.core.SolrCore@424629f8
   [junit4]   2> 859922 INFO  (TEST-TestNRTOpen.testReaderIsNRT-seed#[1A4EC986938AC08C]) [    x:collection1] o.a.s.u.DirectUpdateHandler2 closing DirectUpdateHandler2{commits=2,autocommits=0,soft autocommits=0,optimizes=0,rollbacks=0,expungeDeletes=0,docsPending=1,adds=1,deletesById=0,deletesByQuery=0,errors=0,cumulative_adds=3,cumulative_deletesById=0,cumulative_deletesByQuery=0,cumulative_errors=0}
   [junit4]   2> 859922 INFO  (TEST-TestNRTOpen.testReaderIsNRT-seed#[1A4EC986938AC08C]) [    x:collection1] o.a.s.c.SolrCore [collection1] Closing main searcher on request.
   [junit4]   2> 859922 INFO  (TEST-TestNRTOpen.testReaderIsNRT-seed#[1A4EC986938AC08C]) [    x:collection1] o.a.s.SolrTestCaseJ4 ###Ending testReaderIsNRT
   [junit4]   2> 859923 INFO  (SUITE-TestNRTOpen-seed#[1A4EC986938AC08C]-worker) [    x:collection1] o.a.s.SolrTestCaseJ4 ###deleteCore
   [junit4]   2> 859923 INFO  (SUITE-TestNRTOpen-seed#[1A4EC986938AC08C]-worker) [    x:collection1] o.a.s.c.CoreContainer Shutting down CoreContainer instance=1984909449
   [junit4]   2> 859923 INFO  (SUITE-TestNRTOpen-seed#[1A4EC986938AC08C]-worker) [    x:collection1] o.a.s.c.SolrCore [collection1]  CLOSING SolrCore org.apache.solr.core.SolrCore@1af5ae96
   [junit4]   2> 859923 INFO  (SUITE-TestNRTOpen-seed#[1A4EC986938AC08C]-worker) [    x:collection1] o.a.s.u.DirectUpdateHandler2 closing DirectUpdateHandler2{commits=0,autocommits=0,soft autocommits=0,optimizes=0,rollbacks=0,expungeDeletes=0,docsPending=0,adds=0,deletesById=0,deletesByQuery=0,errors=0,cumulative_adds=0,cumulative_deletesById=0,cumulative_deletesByQuery=0,cumulative_errors=0}
   [junit4]   2> 859923 INFO  (SUITE-TestNRTOpen-seed#[1A4EC986938AC08C]-worker) [    x:collection1] o.a.s.u.SolrCoreState Closing SolrCoreState
   [junit4]   2> 859923 INFO  (SUITE-TestNRTOpen-seed#[1A4EC986938AC08C]-worker) [    x:collection1] o.a.s.u.DefaultSolrCoreState SolrCoreState ref count has reached 0 - closing IndexWriter
   [junit4]   2> 859923 INFO  (SUITE-TestNRTOpen-seed#[1A4EC986938AC08C]-worker) [    x:collection1] o.a.s.u.DefaultSolrCoreState closing IndexWriter with IndexWriterCloser
   [junit4]   2> 859924 INFO  (SUITE-TestNRTOpen-seed#[1A4EC986938AC08C]-worker) [    x:collection1] o.a.s.c.SolrCore [collection1] Closing main searcher on request.
   [junit4]   2> 859924 INFO  (SUITE-TestNRTOpen-seed#[1A4EC986938AC08C]-worker) [    x:collection1] o.a.s.c.CachingDirectoryFactory Closing StandardDirectoryFactory - 2 directories currently being tracked
   [junit4]   2> 859924 INFO  (SUITE-TestNRTOpen-seed#[1A4EC986938AC08C]-worker) [    x:collection1] o.a.s.c.CachingDirectoryFactory looking to close /home/jenkins/workspace/Lucene-Solr-5.x-Linux/solr/build/solr-core/test/J1/temp/solr.core.TestNRTOpen_1A4EC986938AC08C-001/init-core-data-001 [CachedDir<<refCount=0;path=/home/jenkins/workspace/Lucene-Solr-5.x-Linux/solr/build/solr-core/test/J1/temp/solr.core.TestNRTOpen_1A4EC986938AC08C-001/init-core-data-001;done=false>>]
   [junit4]   2> 859924 INFO  (SUITE-TestNRTOpen-seed#[1A4EC986938AC08C]-worker) [    x:collection1] o.a.s.c.CachingDirectoryFactory Closing directory: /home/jenkins/workspace/Lucene-Solr-5.x-Linux/solr/build/solr-core/test/J1/temp/solr.core.TestNRTOpen_1A4EC986938AC08C-001/init-core-data-001
   [junit4]   2> 859924 INFO  (SUITE-TestNRTOpen-seed#[1A4EC986938AC08C]-worker) [    x:collection1] o.a.s.c.CachingDirectoryFactory looking to close /home/jenkins/workspace/Lucene-Solr-5.x-Linux/solr/build/solr-core/test/J1/temp/solr.core.TestNRTOpen_1A4EC986938AC08C-001/init-core-data-001/index [CachedDir<<refCount=0;path=/home/jenkins/workspace/Lucene-Solr-5.x-Linux/solr/build/solr-core/test/J1/temp/solr.core.TestNRTOpen_1A4EC986938AC08C-001/init-core-data-001/index;done=false>>]
   [junit4]   2> 859924 INFO  (SUITE-TestNRTOpen-seed#[1A4EC986938AC08C]-worker) [    x:collection1] o.a.s.c.CachingDirectoryFactory Closing directory: /home/jenkins/workspace/Lucene-Solr-5.x-Linux/solr/build/solr-core/test/J1/temp/solr.core.TestNRTOpen_1A4EC986938AC08C-001/init-core-data-001/index
   [junit4]   2> NOTE: leaving temporary files on disk at: /home/jenkins/workspace/Lucene-Solr-5.x-Linux/solr/build/solr-core/test/J1/temp/solr.core.TestNRTOpen_1A4EC986938AC08C-001
   [junit4]   2> NOTE: test params are: codec=Asserting(Lucene54): {bazz=PostingsFormat(name=LuceneFixedGap), foo=PostingsFormat(name=MockRandom), bazzz=PostingsFormat(name=LuceneFixedGap), baz=PostingsFormat(name=LuceneFixedGap), foo2=FST50}, docValues:{}, sim=DefaultSimilarity, locale=en-PH, timezone=America/Cayman
   [junit4]   2> NOTE: Linux 3.19.0-47-generic amd64/Oracle Corporation 1.8.0_72 (64-bit)/cpus=12,threads=1,free=150219696,total=509673472
   [junit4]   2> NOTE: All tests run in this JVM: [TestLMJelinekMercerSimilarityFactory, SolrPluginUtilsTest, TestQueryUtils, TestRawResponseWriter, SortByFunctionTest, SimplePostToolTest, DocumentBuilderTest, ZkSolrClientTest, DistributedExpandComponentTest, TlogReplayBufferedWhileIndexingTest, UniqFieldsUpdateProcessorFactoryTest, SolrCmdDistributorTest, TestDFRSimilarityFactory, TimeZoneUtilsTest, ChaosMonkeyNothingIsSafeTest, TestPerFieldSimilarityWithDefaultOverride, ChaosMonkeySafeLeaderTest, TestClusterStateMutator, DistributedQueryComponentCustomSortTest, TestLFUCache, TestCopyFieldCollectionResource, HLLSerializationTest, TestManagedSynonymFilterFactory, FastVectorHighlighterTest, TestSortingResponseWriter, CoreAdminRequestStatusTest, TestJsonRequest, FileUtilsTest, TestOverriddenPrefixQueryForCustomFieldType, TestStressVersions, RequestLoggingTest, HighlighterTest, TestImplicitCoreProperties, TestCollectionAPI, TestSolrConfigHandler, TestMacros, DocValuesTest, TestDownShardTolerantSearch, TestHdfsUpdateLog, TestCloudManagedSchemaConcurrent, SchemaVersionSpecificBehaviorTest, TestFiltering, TestAuthorizationFramework, TermVectorComponentTest, DirectoryFactoryTest, DistributedTermsComponentTest, CloudExitableDirectoryReaderTest, TestBM25SimilarityFactory, TestSchemaVersionResource, TestRestManager, BlockDirectoryTest, TestFastLRUCache, TestRequestStatusCollectionAPI, ShardSplitTest, SoftAutoCommitTest, TestReRankQParserPlugin, RemoteQueryErrorTest, SolrIndexConfigTest, TestFieldSortValues, TestTrieFacet, CSVRequestHandlerTest, TestManagedSchema, RollingRestartTest, TestConfigSetProperties, BlockJoinFacetSimpleTest, HighlighterMaxOffsetTest, DistributedFacetPivotSmallAdvancedTest, TestDistributedGrouping, SpellingQueryConverterTest, FacetPivotSmallTest, AsyncMigrateRouteKeyTest, HdfsChaosMonkeySafeLeaderTest, MoreLikeThisHandlerTest, CursorMarkTest, ShardRoutingTest, TestNRTOpen]
   [junit4] Completed [260/568 (1!)] on J1 in 1.14s, 2 tests, 1 failure <<< FAILURES!

[...truncated 986 lines...]
BUILD FAILED
/home/jenkins/workspace/Lucene-Solr-5.x-Linux/build.xml:750: The following error occurred while executing this line:
/home/jenkins/workspace/Lucene-Solr-5.x-Linux/build.xml:694: The following error occurred while executing this line:
/home/jenkins/workspace/Lucene-Solr-5.x-Linux/build.xml:59: The following error occurred while executing this line:
/home/jenkins/workspace/Lucene-Solr-5.x-Linux/solr/build.xml:233: The following error occurred while executing this line:
/home/jenkins/workspace/Lucene-Solr-5.x-Linux/solr/common-build.xml:534: The following error occurred while executing this line:
/home/jenkins/workspace/Lucene-Solr-5.x-Linux/lucene/common-build.xml:1477: The following error occurred while executing this line:
/home/jenkins/workspace/Lucene-Solr-5.x-Linux/lucene/common-build.xml:1033: There were test failures: 568 suites (7 ignored), 2273 tests, 1 failure, 85 ignored (41 assumptions) [seed: 1A4EC986938AC08C]

Total time: 52 minutes 23 seconds
Build step 'Invoke Ant' marked build as failure
Archiving artifacts
[WARNINGS] Skipping publisher since build result is FAILURE
Recording test results
Email was triggered for: Failure - Any
Sending email for trigger: Failure - Any



Mime
View raw message