lucene-dev mailing list archives

Site index · List index
Message view « Date » · « Thread »
Top « Date » · « Thread »
From Policeman Jenkins Server <jenk...@thetaphi.de>
Subject [JENKINS-EA] Lucene-Solr-trunk-Linux (32bit/jdk-9-ea+102) - Build # 15727 - Failure!
Date Mon, 01 Feb 2016 08:44:47 GMT
Build: http://jenkins.thetaphi.de/job/Lucene-Solr-trunk-Linux/15727/
Java: 32bit/jdk-9-ea+102 -server -XX:+UseG1GC -XX:-CompactStrings

2 tests failed.
FAILED:  junit.framework.TestSuite.org.apache.lucene.search.TestShardSearching

Error Message:
The test or suite printed 11178 bytes to stdout and stderr, even though the limit was set
to 8192 bytes. Increase the limit with @Limit, ignore it completely with @SuppressSysoutChecks
or run with -Dtests.verbose=true

Stack Trace:
java.lang.AssertionError: The test or suite printed 11178 bytes to stdout and stderr, even
though the limit was set to 8192 bytes. Increase the limit with @Limit, ignore it completely
with @SuppressSysoutChecks or run with -Dtests.verbose=true
	at __randomizedtesting.SeedInfo.seed([9DFA01FA93D1AD56]:0)
	at org.apache.lucene.util.TestRuleLimitSysouts.afterIfSuccessful(TestRuleLimitSysouts.java:212)
	at com.carrotsearch.randomizedtesting.rules.TestRuleAdapter$1.afterIfSuccessful(TestRuleAdapter.java:36)
	at com.carrotsearch.randomizedtesting.rules.StatementAdapter.evaluate(StatementAdapter.java:37)
	at org.apache.lucene.util.TestRuleAssertionsRequired$1.evaluate(TestRuleAssertionsRequired.java:54)
	at org.apache.lucene.util.TestRuleMarkFailure$1.evaluate(TestRuleMarkFailure.java:48)
	at org.apache.lucene.util.TestRuleIgnoreAfterMaxFailures$1.evaluate(TestRuleIgnoreAfterMaxFailures.java:65)
	at org.apache.lucene.util.TestRuleIgnoreTestSuites$1.evaluate(TestRuleIgnoreTestSuites.java:55)
	at com.carrotsearch.randomizedtesting.rules.StatementAdapter.evaluate(StatementAdapter.java:36)
	at com.carrotsearch.randomizedtesting.ThreadLeakControl$StatementRunner.run(ThreadLeakControl.java:367)
	at java.lang.Thread.run(Thread.java:804)


FAILED:  org.apache.lucene.search.TestShardSearching.testSimple

Error Message:
Captured an uncaught exception in thread: Thread[id=937, name=Thread-745, state=RUNNABLE,
group=TGRP-TestShardSearching]

Stack Trace:
com.carrotsearch.randomizedtesting.UncaughtExceptionError: Captured an uncaught exception
in thread: Thread[id=937, name=Thread-745, state=RUNNABLE, group=TGRP-TestShardSearching]
	at __randomizedtesting.SeedInfo.seed([9DFA01FA93D1AD56:A5492504B4227987]:0)
Caused by: java.lang.RuntimeException: java.lang.AssertionError
	at __randomizedtesting.SeedInfo.seed([9DFA01FA93D1AD56]:0)
	at org.apache.lucene.search.ShardSearchingTestBase$ChangeIndices.run(ShardSearchingTestBase.java:584)
Caused by: java.lang.AssertionError
	at org.apache.lucene.util.packed.BulkOperationPacked.encode(BulkOperationPacked.java:224)
	at org.apache.lucene.util.packed.AbstractBlockPackedWriter.writeValues(AbstractBlockPackedWriter.java:128)
	at org.apache.lucene.util.packed.BlockPackedWriter.flush(BlockPackedWriter.java:101)
	at org.apache.lucene.util.packed.AbstractBlockPackedWriter.finish(AbstractBlockPackedWriter.java:106)
	at org.apache.lucene.util.packed.BlockPackedWriter.finish(BlockPackedWriter.java:60)
	at org.apache.lucene.codecs.compressing.CompressingTermVectorsWriter.flushOffsets(CompressingTermVectorsWriter.java:628)
	at org.apache.lucene.codecs.compressing.CompressingTermVectorsWriter.flush(CompressingTermVectorsWriter.java:353)
	at org.apache.lucene.codecs.compressing.CompressingTermVectorsWriter.finish(CompressingTermVectorsWriter.java:648)
	at org.apache.lucene.index.TermVectorsConsumer.flush(TermVectorsConsumer.java:65)
	at org.apache.lucene.index.TermsHash.flush(TermsHash.java:85)
	at org.apache.lucene.index.FreqProxTermsWriter.flush(FreqProxTermsWriter.java:83)
	at org.apache.lucene.index.DefaultIndexingChain.flush(DefaultIndexingChain.java:115)
	at org.apache.lucene.index.DocumentsWriterPerThread.flush(DocumentsWriterPerThread.java:425)
	at org.apache.lucene.index.DocumentsWriter.doFlush(DocumentsWriter.java:502)
	at org.apache.lucene.index.DocumentsWriter.flushAllThreads(DocumentsWriter.java:614)
	at org.apache.lucene.index.IndexWriter.getReader(IndexWriter.java:423)
	at org.apache.lucene.index.StandardDirectoryReader.doOpenFromWriter(StandardDirectoryReader.java:286)
	at org.apache.lucene.index.StandardDirectoryReader.doOpenIfChanged(StandardDirectoryReader.java:261)
	at org.apache.lucene.index.StandardDirectoryReader.doOpenIfChanged(StandardDirectoryReader.java:251)
	at org.apache.lucene.index.DirectoryReader.openIfChanged(DirectoryReader.java:137)
	at org.apache.lucene.search.SearcherManager.refreshIfNeeded(SearcherManager.java:154)
	at org.apache.lucene.search.SearcherManager.refreshIfNeeded(SearcherManager.java:58)
	at org.apache.lucene.search.ReferenceManager.doMaybeRefresh(ReferenceManager.java:176)
	at org.apache.lucene.search.ReferenceManager.maybeRefresh(ReferenceManager.java:225)
	at org.apache.lucene.search.ShardSearchingTestBase$NodeState.reopen(ShardSearchingTestBase.java:523)
	at org.apache.lucene.search.ShardSearchingTestBase$ChangeIndices.run(ShardSearchingTestBase.java:578)




Build Log:
[...truncated 896 lines...]
   [junit4] Suite: org.apache.lucene.search.TestShardSearching
   [junit4]   1> FAILED:
   [junit4]   1> java.lang.AssertionError
   [junit4]   1> 	at org.apache.lucene.util.packed.BulkOperationPacked.encode(BulkOperationPacked.java:224)
   [junit4]   1> 	at org.apache.lucene.util.packed.AbstractBlockPackedWriter.writeValues(AbstractBlockPackedWriter.java:128)
   [junit4]   1> 	at org.apache.lucene.util.packed.BlockPackedWriter.flush(BlockPackedWriter.java:101)
   [junit4]   1> 	at org.apache.lucene.util.packed.AbstractBlockPackedWriter.finish(AbstractBlockPackedWriter.java:106)
   [junit4]   1> 	at org.apache.lucene.util.packed.BlockPackedWriter.finish(BlockPackedWriter.java:60)
   [junit4]   1> 	at org.apache.lucene.codecs.compressing.CompressingTermVectorsWriter.flushOffsets(CompressingTermVectorsWriter.java:628)
   [junit4]   1> 	at org.apache.lucene.codecs.compressing.CompressingTermVectorsWriter.flush(CompressingTermVectorsWriter.java:353)
   [junit4]   1> 	at org.apache.lucene.codecs.compressing.CompressingTermVectorsWriter.finish(CompressingTermVectorsWriter.java:648)
   [junit4]   1> 	at org.apache.lucene.index.TermVectorsConsumer.flush(TermVectorsConsumer.java:65)
   [junit4]   1> 	at org.apache.lucene.index.TermsHash.flush(TermsHash.java:85)
   [junit4]   1> 	at org.apache.lucene.index.FreqProxTermsWriter.flush(FreqProxTermsWriter.java:83)
   [junit4]   1> 	at org.apache.lucene.index.DefaultIndexingChain.flush(DefaultIndexingChain.java:115)
   [junit4]   1> 	at org.apache.lucene.index.DocumentsWriterPerThread.flush(DocumentsWriterPerThread.java:425)
   [junit4]   1> 	at org.apache.lucene.index.DocumentsWriter.doFlush(DocumentsWriter.java:502)
   [junit4]   1> 	at org.apache.lucene.index.DocumentsWriter.flushAllThreads(DocumentsWriter.java:614)
   [junit4]   1> 	at org.apache.lucene.index.IndexWriter.getReader(IndexWriter.java:423)
   [junit4]   1> 	at org.apache.lucene.index.StandardDirectoryReader.doOpenFromWriter(StandardDirectoryReader.java:286)
   [junit4]   1> 	at org.apache.lucene.index.StandardDirectoryReader.doOpenIfChanged(StandardDirectoryReader.java:261)
   [junit4]   1> 	at org.apache.lucene.index.StandardDirectoryReader.doOpenIfChanged(StandardDirectoryReader.java:251)
   [junit4]   1> 	at org.apache.lucene.index.DirectoryReader.openIfChanged(DirectoryReader.java:137)
   [junit4]   1> 	at org.apache.lucene.search.SearcherManager.refreshIfNeeded(SearcherManager.java:154)
   [junit4]   1> 	at org.apache.lucene.search.SearcherManager.refreshIfNeeded(SearcherManager.java:58)
   [junit4]   1> 	at org.apache.lucene.search.ReferenceManager.doMaybeRefresh(ReferenceManager.java:176)
   [junit4]   1> 	at org.apache.lucene.search.ReferenceManager.maybeRefresh(ReferenceManager.java:225)
   [junit4]   1> 	at org.apache.lucene.search.ShardSearchingTestBase$NodeState.reopen(ShardSearchingTestBase.java:523)
   [junit4]   1> 	at org.apache.lucene.search.ShardSearchingTestBase$ChangeIndices.run(ShardSearchingTestBase.java:578)
   [junit4]   2> Kaw 01, 2016 9:40:17 LUMA LWA K com.carrotsearch.randomizedtesting.RandomizedRunner$QueueUncaughtExceptionsHandler
uncaughtException
   [junit4]   2> WARNING: Uncaught exception in thread: Thread[Thread-745,5,TGRP-TestShardSearching]
   [junit4]   2> java.lang.RuntimeException: java.lang.AssertionError
   [junit4]   2> 	at __randomizedtesting.SeedInfo.seed([9DFA01FA93D1AD56]:0)
   [junit4]   2> 	at org.apache.lucene.search.ShardSearchingTestBase$ChangeIndices.run(ShardSearchingTestBase.java:584)
   [junit4]   2> Caused by: java.lang.AssertionError
   [junit4]   2> 	at org.apache.lucene.util.packed.BulkOperationPacked.encode(BulkOperationPacked.java:224)
   [junit4]   2> 	at org.apache.lucene.util.packed.AbstractBlockPackedWriter.writeValues(AbstractBlockPackedWriter.java:128)
   [junit4]   2> 	at org.apache.lucene.util.packed.BlockPackedWriter.flush(BlockPackedWriter.java:101)
   [junit4]   2> 	at org.apache.lucene.util.packed.AbstractBlockPackedWriter.finish(AbstractBlockPackedWriter.java:106)
   [junit4]   2> 	at org.apache.lucene.util.packed.BlockPackedWriter.finish(BlockPackedWriter.java:60)
   [junit4]   2> 	at org.apache.lucene.codecs.compressing.CompressingTermVectorsWriter.flushOffsets(CompressingTermVectorsWriter.java:628)
   [junit4]   2> 	at org.apache.lucene.codecs.compressing.CompressingTermVectorsWriter.flush(CompressingTermVectorsWriter.java:353)
   [junit4]   2> 	at org.apache.lucene.codecs.compressing.CompressingTermVectorsWriter.finish(CompressingTermVectorsWriter.java:648)
   [junit4]   2> 	at org.apache.lucene.index.TermVectorsConsumer.flush(TermVectorsConsumer.java:65)
   [junit4]   2> 	at org.apache.lucene.index.TermsHash.flush(TermsHash.java:85)
   [junit4]   2> 	at org.apache.lucene.index.FreqProxTermsWriter.flush(FreqProxTermsWriter.java:83)
   [junit4]   2> 	at org.apache.lucene.index.DefaultIndexingChain.flush(DefaultIndexingChain.java:115)
   [junit4]   2> 	at org.apache.lucene.index.DocumentsWriterPerThread.flush(DocumentsWriterPerThread.java:425)
   [junit4]   2> 	at org.apache.lucene.index.DocumentsWriter.doFlush(DocumentsWriter.java:502)
   [junit4]   2> 	at org.apache.lucene.index.DocumentsWriter.flushAllThreads(DocumentsWriter.java:614)
   [junit4]   2> 	at org.apache.lucene.index.IndexWriter.getReader(IndexWriter.java:423)
   [junit4]   2> 	at org.apache.lucene.index.StandardDirectoryReader.doOpenFromWriter(StandardDirectoryReader.java:286)
   [junit4]   2> 	at org.apache.lucene.index.StandardDirectoryReader.doOpenIfChanged(StandardDirectoryReader.java:261)
   [junit4]   2> 	at org.apache.lucene.index.StandardDirectoryReader.doOpenIfChanged(StandardDirectoryReader.java:251)
   [junit4]   2> 	at org.apache.lucene.index.DirectoryReader.openIfChanged(DirectoryReader.java:137)
   [junit4]   2> 	at org.apache.lucene.search.SearcherManager.refreshIfNeeded(SearcherManager.java:154)
   [junit4]   2> 	at org.apache.lucene.search.SearcherManager.refreshIfNeeded(SearcherManager.java:58)
   [junit4]   2> 	at org.apache.lucene.search.ReferenceManager.doMaybeRefresh(ReferenceManager.java:176)
   [junit4]   2> 	at org.apache.lucene.search.ReferenceManager.maybeRefresh(ReferenceManager.java:225)
   [junit4]   2> 	at org.apache.lucene.search.ShardSearchingTestBase$NodeState.reopen(ShardSearchingTestBase.java:523)
   [junit4]   2> 	at org.apache.lucene.search.ShardSearchingTestBase$ChangeIndices.run(ShardSearchingTestBase.java:578)
   [junit4]   2> 
   [junit4]   2> NOTE: reproduce with: ant test  -Dtestcase=TestShardSearching -Dtests.method=testSimple
-Dtests.seed=9DFA01FA93D1AD56 -Dtests.multiplier=3 -Dtests.slow=true -Dtests.locale=dav -Dtests.timezone=Europe/Monaco
-Dtests.asserts=true -Dtests.file.encoding=UTF-8
   [junit4] ERROR   9.46s J0 | TestShardSearching.testSimple <<<
   [junit4]    > Throwable #1: com.carrotsearch.randomizedtesting.UncaughtExceptionError:
Captured an uncaught exception in thread: Thread[id=937, name=Thread-745, state=RUNNABLE,
group=TGRP-TestShardSearching]
   [junit4]    > 	at __randomizedtesting.SeedInfo.seed([9DFA01FA93D1AD56:A5492504B4227987]:0)
   [junit4]    > Caused by: java.lang.RuntimeException: java.lang.AssertionError
   [junit4]    > 	at __randomizedtesting.SeedInfo.seed([9DFA01FA93D1AD56]:0)
   [junit4]    > 	at org.apache.lucene.search.ShardSearchingTestBase$ChangeIndices.run(ShardSearchingTestBase.java:584)
   [junit4]    > Caused by: java.lang.AssertionError
   [junit4]    > 	at org.apache.lucene.util.packed.BulkOperationPacked.encode(BulkOperationPacked.java:224)
   [junit4]    > 	at org.apache.lucene.util.packed.AbstractBlockPackedWriter.writeValues(AbstractBlockPackedWriter.java:128)
   [junit4]    > 	at org.apache.lucene.util.packed.BlockPackedWriter.flush(BlockPackedWriter.java:101)
   [junit4]    > 	at org.apache.lucene.util.packed.AbstractBlockPackedWriter.finish(AbstractBlockPackedWriter.java:106)
   [junit4]    > 	at org.apache.lucene.util.packed.BlockPackedWriter.finish(BlockPackedWriter.java:60)
   [junit4]    > 	at org.apache.lucene.codecs.compressing.CompressingTermVectorsWriter.flushOffsets(CompressingTermVectorsWriter.java:628)
   [junit4]    > 	at org.apache.lucene.codecs.compressing.CompressingTermVectorsWriter.flush(CompressingTermVectorsWriter.java:353)
   [junit4]    > 	at org.apache.lucene.codecs.compressing.CompressingTermVectorsWriter.finish(CompressingTermVectorsWriter.java:648)
   [junit4]    > 	at org.apache.lucene.index.TermVectorsConsumer.flush(TermVectorsConsumer.java:65)
   [junit4]    > 	at org.apache.lucene.index.TermsHash.flush(TermsHash.java:85)
   [junit4]    > 	at org.apache.lucene.index.FreqProxTermsWriter.flush(FreqProxTermsWriter.java:83)
   [junit4]    > 	at org.apache.lucene.index.DefaultIndexingChain.flush(DefaultIndexingChain.java:115)
   [junit4]    > 	at org.apache.lucene.index.DocumentsWriterPerThread.flush(DocumentsWriterPerThread.java:425)
   [junit4]    > 	at org.apache.lucene.index.DocumentsWriter.doFlush(DocumentsWriter.java:502)
   [junit4]    > 	at org.apache.lucene.index.DocumentsWriter.flushAllThreads(DocumentsWriter.java:614)
   [junit4]    > 	at org.apache.lucene.index.IndexWriter.getReader(IndexWriter.java:423)
   [junit4]    > 	at org.apache.lucene.index.StandardDirectoryReader.doOpenFromWriter(StandardDirectoryReader.java:286)
   [junit4]    > 	at org.apache.lucene.index.StandardDirectoryReader.doOpenIfChanged(StandardDirectoryReader.java:261)
   [junit4]    > 	at org.apache.lucene.index.StandardDirectoryReader.doOpenIfChanged(StandardDirectoryReader.java:251)
   [junit4]    > 	at org.apache.lucene.index.DirectoryReader.openIfChanged(DirectoryReader.java:137)
   [junit4]    > 	at org.apache.lucene.search.SearcherManager.refreshIfNeeded(SearcherManager.java:154)
   [junit4]    > 	at org.apache.lucene.search.SearcherManager.refreshIfNeeded(SearcherManager.java:58)
   [junit4]    > 	at org.apache.lucene.search.ReferenceManager.doMaybeRefresh(ReferenceManager.java:176)
   [junit4]    > 	at org.apache.lucene.search.ReferenceManager.maybeRefresh(ReferenceManager.java:225)
   [junit4]    > 	at org.apache.lucene.search.ShardSearchingTestBase$NodeState.reopen(ShardSearchingTestBase.java:523)
   [junit4]    > 	at org.apache.lucene.search.ShardSearchingTestBase$ChangeIndices.run(ShardSearchingTestBase.java:578)
   [junit4]   2> NOTE: test params are: codec=Lucene60, sim=RandomSimilarity(queryNorm=true,coord=yes):
{}, locale=dav, timezone=Europe/Monaco
   [junit4]   2> NOTE: Linux 3.19.0-47-generic i386/Oracle Corporation 9-ea (32-bit)/cpus=12,threads=1,free=336112152,total=536870912
   [junit4]   2> NOTE: All tests run in this JVM: [TestTimSorterWorstCase, TestMultiPhraseEnum,
TestPointQueries, TestSortedSetSelector, TestSegmentReader, TestBinaryDocument, TestTimeLimitingCollector,
Test2BNumericDocValues, TestSizeBoundedForceMerge, TestThreadedForceMerge, TestOfflineSorter,
TestBKD, TestOrdinalMap, TestIndexWriterDelete, TestNeverDelete, TestPersistentSnapshotDeletionPolicy,
TestAllFilesCheckIndexHeader, TestBooleanRewrites, TestPhraseQuery, TestAttributeSource, TestControlledRealTimeReopenThread,
TestSwappedIndexFiles, TestIndexWriterConfig, TestMultiLevelSkipList, TestMathUtil, TestIntroSorter,
TestBooleanMinShouldMatch, TestPositiveScoresOnlyCollector, TestInfoStream, TestDocInverterPerFieldErrorInfo,
TestMultiTermConstantScore, TestCharsRefBuilder, TestSleepingLockWrapper, TestTwoPhaseCommitTool,
TestFilterDirectoryReader, TestSloppyPhraseQuery2, TestPagedBytes, TestSumDocFreq, TestReusableStringReader,
TestExceedMaxTermLength, TestMaxPosition, TestReaderWrapperDVTypeCheck, TestUsageTrackingFilterCachingPolicy,
MultiCollectorTest, TestParallelCompositeReader, TestIndexCommit, TestIndexWriterMergePolicy,
TestDeletionPolicy, TestSimpleFSDirectory, TestFilterSpans, TestIndexWriterWithThreads, TestAutomatonQuery,
TestDoc, TestNumericRangeQuery64, TestSpanContainQuery, TestPerSegmentDeletes, TestSimilarity2,
TestIndexWriterForceMerge, TestPositionIncrement, TestSpanOrQuery, TestIndexWriterOnVMError,
TestFixedBitSet, TestFrequencyTrackingRingBuffer, TestSetOnce, TestIndexWriter, TestMultiDocValues,
TestDeterminizeLexicon, TestMultiTermsEnum, TestFSTs, TestNumericRangeQuery32, TestAddIndexes,
TestShardSearching]
   [junit4]   2> NOTE: reproduce with: ant test  -Dtestcase=TestShardSearching -Dtests.seed=9DFA01FA93D1AD56
-Dtests.multiplier=3 -Dtests.slow=true -Dtests.locale=dav -Dtests.timezone=Europe/Monaco -Dtests.asserts=true
-Dtests.file.encoding=UTF-8
   [junit4] ERROR   0.00s J0 | TestShardSearching (suite) <<<
   [junit4]    > Throwable #1: java.lang.AssertionError: The test or suite printed 11178
bytes to stdout and stderr, even though the limit was set to 8192 bytes. Increase the limit
with @Limit, ignore it completely with @SuppressSysoutChecks or run with -Dtests.verbose=true
   [junit4]    > 	at __randomizedtesting.SeedInfo.seed([9DFA01FA93D1AD56]:0)
   [junit4]    > 	at java.lang.Thread.run(Thread.java:804)
   [junit4] Completed [215/410 (1!)] on J0 in 9.51s, 1 test, 1 failure, 1 error <<<
FAILURES!

[...truncated 650 lines...]
BUILD FAILED
/home/jenkins/workspace/Lucene-Solr-trunk-Linux/build.xml:740: The following error occurred
while executing this line:
/home/jenkins/workspace/Lucene-Solr-trunk-Linux/build.xml:684: The following error occurred
while executing this line:
/home/jenkins/workspace/Lucene-Solr-trunk-Linux/build.xml:59: The following error occurred
while executing this line:
/home/jenkins/workspace/Lucene-Solr-trunk-Linux/lucene/build.xml:50: The following error occurred
while executing this line:
/home/jenkins/workspace/Lucene-Solr-trunk-Linux/lucene/common-build.xml:1457: The following
error occurred while executing this line:
/home/jenkins/workspace/Lucene-Solr-trunk-Linux/lucene/common-build.xml:1014: There were test
failures: 410 suites (1 ignored), 3363 tests, 1 suite-level error, 1 error, 58 ignored (54
assumptions) [seed: 9DFA01FA93D1AD56]

Total time: 7 minutes 34 seconds
Build step 'Invoke Ant' marked build as failure
Archiving artifacts
[WARNINGS] Skipping publisher since build result is FAILURE
Recording test results
Email was triggered for: Failure - Any
Sending email for trigger: Failure - Any



Mime
View raw message