lucene-dev mailing list archives

Site index · List index
Message view « Date » · « Thread »
Top « Date » · « Thread »
From Policeman Jenkins Server <jenk...@thetaphi.de>
Subject [JENKINS] Lucene-Solr-trunk-Windows (32bit/jdk1.8.0_72) - Build # 5608 - Still Failing!
Date Tue, 09 Feb 2016 04:50:51 GMT
Build: http://jenkins.thetaphi.de/job/Lucene-Solr-trunk-Windows/5608/
Java: 32bit/jdk1.8.0_72 -client -XX:+UseParallelGC

6 tests failed.
FAILED:  junit.framework.TestSuite.org.apache.solr.handler.TestSolrConfigHandlerCloud

Error Message:
ObjectTracker found 2 object(s) that were not released!!! [MockDirectoryWrapper, MockDirectoryWrapper]

Stack Trace:
java.lang.AssertionError: ObjectTracker found 2 object(s) that were not released!!! [MockDirectoryWrapper, MockDirectoryWrapper]
	at __randomizedtesting.SeedInfo.seed([B94F82D8026220FB]:0)
	at org.junit.Assert.fail(Assert.java:93)
	at org.junit.Assert.assertTrue(Assert.java:43)
	at org.junit.Assert.assertNull(Assert.java:551)
	at org.apache.solr.SolrTestCaseJ4.afterClass(SolrTestCaseJ4.java:228)
	at sun.reflect.GeneratedMethodAccessor14.invoke(Unknown Source)
	at sun.reflect.DelegatingMethodAccessorImpl.invoke(DelegatingMethodAccessorImpl.java:43)
	at java.lang.reflect.Method.invoke(Method.java:498)
	at com.carrotsearch.randomizedtesting.RandomizedRunner.invoke(RandomizedRunner.java:1764)
	at com.carrotsearch.randomizedtesting.RandomizedRunner$7.evaluate(RandomizedRunner.java:834)
	at com.carrotsearch.randomizedtesting.rules.StatementAdapter.evaluate(StatementAdapter.java:36)
	at com.carrotsearch.randomizedtesting.rules.SystemPropertiesRestoreRule$1.evaluate(SystemPropertiesRestoreRule.java:57)
	at org.apache.lucene.util.AbstractBeforeAfterRule$1.evaluate(AbstractBeforeAfterRule.java:45)
	at com.carrotsearch.randomizedtesting.rules.StatementAdapter.evaluate(StatementAdapter.java:36)
	at org.apache.lucene.util.TestRuleStoreClassName$1.evaluate(TestRuleStoreClassName.java:41)
	at com.carrotsearch.randomizedtesting.rules.NoShadowingOrOverridesOnMethodsRule$1.evaluate(NoShadowingOrOverridesOnMethodsRule.java:40)
	at com.carrotsearch.randomizedtesting.rules.NoShadowingOrOverridesOnMethodsRule$1.evaluate(NoShadowingOrOverridesOnMethodsRule.java:40)
	at com.carrotsearch.randomizedtesting.rules.StatementAdapter.evaluate(StatementAdapter.java:36)
	at com.carrotsearch.randomizedtesting.rules.StatementAdapter.evaluate(StatementAdapter.java:36)
	at com.carrotsearch.randomizedtesting.rules.StatementAdapter.evaluate(StatementAdapter.java:36)
	at org.apache.lucene.util.TestRuleAssertionsRequired$1.evaluate(TestRuleAssertionsRequired.java:53)
	at org.apache.lucene.util.TestRuleMarkFailure$1.evaluate(TestRuleMarkFailure.java:47)
	at org.apache.lucene.util.TestRuleIgnoreAfterMaxFailures$1.evaluate(TestRuleIgnoreAfterMaxFailures.java:64)
	at org.apache.lucene.util.TestRuleIgnoreTestSuites$1.evaluate(TestRuleIgnoreTestSuites.java:54)
	at com.carrotsearch.randomizedtesting.rules.StatementAdapter.evaluate(StatementAdapter.java:36)
	at com.carrotsearch.randomizedtesting.ThreadLeakControl$StatementRunner.run(ThreadLeakControl.java:367)
	at java.lang.Thread.run(Thread.java:745)


FAILED:  org.apache.solr.handler.component.SpellCheckComponentTest.testRebuildOnCommit

Error Message:
Exception during query

Stack Trace:
java.lang.RuntimeException: Exception during query
	at __randomizedtesting.SeedInfo.seed([B94F82D8026220FB:F343FFB5516E8398]:0)
	at org.apache.solr.SolrTestCaseJ4.assertQ(SolrTestCaseJ4.java:754)
	at org.apache.solr.SolrTestCaseJ4.assertQ(SolrTestCaseJ4.java:721)
	at org.apache.solr.handler.component.SpellCheckComponentTest.testRebuildOnCommit(SpellCheckComponentTest.java:267)
	at sun.reflect.NativeMethodAccessorImpl.invoke0(Native Method)
	at sun.reflect.NativeMethodAccessorImpl.invoke(NativeMethodAccessorImpl.java:62)
	at sun.reflect.DelegatingMethodAccessorImpl.invoke(DelegatingMethodAccessorImpl.java:43)
	at java.lang.reflect.Method.invoke(Method.java:498)
	at com.carrotsearch.randomizedtesting.RandomizedRunner.invoke(RandomizedRunner.java:1764)
	at com.carrotsearch.randomizedtesting.RandomizedRunner$8.evaluate(RandomizedRunner.java:871)
	at com.carrotsearch.randomizedtesting.RandomizedRunner$9.evaluate(RandomizedRunner.java:907)
	at com.carrotsearch.randomizedtesting.RandomizedRunner$10.evaluate(RandomizedRunner.java:921)
	at com.carrotsearch.randomizedtesting.rules.SystemPropertiesRestoreRule$1.evaluate(SystemPropertiesRestoreRule.java:57)
	at org.apache.lucene.util.TestRuleSetupTeardownChained$1.evaluate(TestRuleSetupTeardownChained.java:49)
	at org.apache.lucene.util.AbstractBeforeAfterRule$1.evaluate(AbstractBeforeAfterRule.java:45)
	at org.apache.lucene.util.TestRuleThreadAndTestName$1.evaluate(TestRuleThreadAndTestName.java:48)
	at org.apache.lucene.util.TestRuleIgnoreAfterMaxFailures$1.evaluate(TestRuleIgnoreAfterMaxFailures.java:64)
	at org.apache.lucene.util.TestRuleMarkFailure$1.evaluate(TestRuleMarkFailure.java:47)
	at com.carrotsearch.randomizedtesting.rules.StatementAdapter.evaluate(StatementAdapter.java:36)
	at com.carrotsearch.randomizedtesting.ThreadLeakControl$StatementRunner.run(ThreadLeakControl.java:367)
	at com.carrotsearch.randomizedtesting.ThreadLeakControl.forkTimeoutingTask(ThreadLeakControl.java:809)
	at com.carrotsearch.randomizedtesting.ThreadLeakControl$3.evaluate(ThreadLeakControl.java:460)
	at com.carrotsearch.randomizedtesting.RandomizedRunner.runSingleTest(RandomizedRunner.java:880)
	at com.carrotsearch.randomizedtesting.RandomizedRunner$5.evaluate(RandomizedRunner.java:781)
	at com.carrotsearch.randomizedtesting.RandomizedRunner$6.evaluate(RandomizedRunner.java:816)
	at com.carrotsearch.randomizedtesting.RandomizedRunner$7.evaluate(RandomizedRunner.java:827)
	at com.carrotsearch.randomizedtesting.rules.StatementAdapter.evaluate(StatementAdapter.java:36)
	at com.carrotsearch.randomizedtesting.rules.SystemPropertiesRestoreRule$1.evaluate(SystemPropertiesRestoreRule.java:57)
	at org.apache.lucene.util.AbstractBeforeAfterRule$1.evaluate(AbstractBeforeAfterRule.java:45)
	at com.carrotsearch.randomizedtesting.rules.StatementAdapter.evaluate(StatementAdapter.java:36)
	at org.apache.lucene.util.TestRuleStoreClassName$1.evaluate(TestRuleStoreClassName.java:41)
	at com.carrotsearch.randomizedtesting.rules.NoShadowingOrOverridesOnMethodsRule$1.evaluate(NoShadowingOrOverridesOnMethodsRule.java:40)
	at com.carrotsearch.randomizedtesting.rules.NoShadowingOrOverridesOnMethodsRule$1.evaluate(NoShadowingOrOverridesOnMethodsRule.java:40)
	at com.carrotsearch.randomizedtesting.rules.StatementAdapter.evaluate(StatementAdapter.java:36)
	at com.carrotsearch.randomizedtesting.rules.StatementAdapter.evaluate(StatementAdapter.java:36)
	at com.carrotsearch.randomizedtesting.rules.StatementAdapter.evaluate(StatementAdapter.java:36)
	at org.apache.lucene.util.TestRuleAssertionsRequired$1.evaluate(TestRuleAssertionsRequired.java:53)
	at org.apache.lucene.util.TestRuleMarkFailure$1.evaluate(TestRuleMarkFailure.java:47)
	at org.apache.lucene.util.TestRuleIgnoreAfterMaxFailures$1.evaluate(TestRuleIgnoreAfterMaxFailures.java:64)
	at org.apache.lucene.util.TestRuleIgnoreTestSuites$1.evaluate(TestRuleIgnoreTestSuites.java:54)
	at com.carrotsearch.randomizedtesting.rules.StatementAdapter.evaluate(StatementAdapter.java:36)
	at com.carrotsearch.randomizedtesting.ThreadLeakControl$StatementRunner.run(ThreadLeakControl.java:367)
	at java.lang.Thread.run(Thread.java:745)
Caused by: java.lang.RuntimeException: REQUEST FAILED: xpath=//arr[@name='suggestion'][.='lucenejava']
	xml response was: <?xml version="1.0" encoding="UTF-8"?>
<response>
<lst name="responseHeader"><int name="status">0</int><int name="QTime">589</int></lst><result name="response" numFound="0" start="0"></result><lst name="spellcheck"><lst name="suggestions"/></lst>
</response>

	request was:q=lowerfilt:lucenejavt&qt=spellCheckCompRH&spellcheck=true&wt=xml
	at org.apache.solr.SolrTestCaseJ4.assertQ(SolrTestCaseJ4.java:747)
	... 41 more


FAILED:  org.apache.solr.handler.component.SpellCheckComponentTest.test

Error Message:
List size mismatch @ spellcheck/suggestions

Stack Trace:
java.lang.RuntimeException: List size mismatch @ spellcheck/suggestions
	at __randomizedtesting.SeedInfo.seed([B94F82D8026220FB:311BBD02AC9E4D03]:0)
	at org.apache.solr.SolrTestCaseJ4.assertJQ(SolrTestCaseJ4.java:842)
	at org.apache.solr.SolrTestCaseJ4.assertJQ(SolrTestCaseJ4.java:789)
	at org.apache.solr.handler.component.SpellCheckComponentTest.test(SpellCheckComponentTest.java:147)
	at sun.reflect.NativeMethodAccessorImpl.invoke0(Native Method)
	at sun.reflect.NativeMethodAccessorImpl.invoke(NativeMethodAccessorImpl.java:62)
	at sun.reflect.DelegatingMethodAccessorImpl.invoke(DelegatingMethodAccessorImpl.java:43)
	at java.lang.reflect.Method.invoke(Method.java:498)
	at com.carrotsearch.randomizedtesting.RandomizedRunner.invoke(RandomizedRunner.java:1764)
	at com.carrotsearch.randomizedtesting.RandomizedRunner$8.evaluate(RandomizedRunner.java:871)
	at com.carrotsearch.randomizedtesting.RandomizedRunner$9.evaluate(RandomizedRunner.java:907)
	at com.carrotsearch.randomizedtesting.RandomizedRunner$10.evaluate(RandomizedRunner.java:921)
	at com.carrotsearch.randomizedtesting.rules.SystemPropertiesRestoreRule$1.evaluate(SystemPropertiesRestoreRule.java:57)
	at org.apache.lucene.util.TestRuleSetupTeardownChained$1.evaluate(TestRuleSetupTeardownChained.java:49)
	at org.apache.lucene.util.AbstractBeforeAfterRule$1.evaluate(AbstractBeforeAfterRule.java:45)
	at org.apache.lucene.util.TestRuleThreadAndTestName$1.evaluate(TestRuleThreadAndTestName.java:48)
	at org.apache.lucene.util.TestRuleIgnoreAfterMaxFailures$1.evaluate(TestRuleIgnoreAfterMaxFailures.java:64)
	at org.apache.lucene.util.TestRuleMarkFailure$1.evaluate(TestRuleMarkFailure.java:47)
	at com.carrotsearch.randomizedtesting.rules.StatementAdapter.evaluate(StatementAdapter.java:36)
	at com.carrotsearch.randomizedtesting.ThreadLeakControl$StatementRunner.run(ThreadLeakControl.java:367)
	at com.carrotsearch.randomizedtesting.ThreadLeakControl.forkTimeoutingTask(ThreadLeakControl.java:809)
	at com.carrotsearch.randomizedtesting.ThreadLeakControl$3.evaluate(ThreadLeakControl.java:460)
	at com.carrotsearch.randomizedtesting.RandomizedRunner.runSingleTest(RandomizedRunner.java:880)
	at com.carrotsearch.randomizedtesting.RandomizedRunner$5.evaluate(RandomizedRunner.java:781)
	at com.carrotsearch.randomizedtesting.RandomizedRunner$6.evaluate(RandomizedRunner.java:816)
	at com.carrotsearch.randomizedtesting.RandomizedRunner$7.evaluate(RandomizedRunner.java:827)
	at com.carrotsearch.randomizedtesting.rules.StatementAdapter.evaluate(StatementAdapter.java:36)
	at com.carrotsearch.randomizedtesting.rules.SystemPropertiesRestoreRule$1.evaluate(SystemPropertiesRestoreRule.java:57)
	at org.apache.lucene.util.AbstractBeforeAfterRule$1.evaluate(AbstractBeforeAfterRule.java:45)
	at com.carrotsearch.randomizedtesting.rules.StatementAdapter.evaluate(StatementAdapter.java:36)
	at org.apache.lucene.util.TestRuleStoreClassName$1.evaluate(TestRuleStoreClassName.java:41)
	at com.carrotsearch.randomizedtesting.rules.NoShadowingOrOverridesOnMethodsRule$1.evaluate(NoShadowingOrOverridesOnMethodsRule.java:40)
	at com.carrotsearch.randomizedtesting.rules.NoShadowingOrOverridesOnMethodsRule$1.evaluate(NoShadowingOrOverridesOnMethodsRule.java:40)
	at com.carrotsearch.randomizedtesting.rules.StatementAdapter.evaluate(StatementAdapter.java:36)
	at com.carrotsearch.randomizedtesting.rules.StatementAdapter.evaluate(StatementAdapter.java:36)
	at com.carrotsearch.randomizedtesting.rules.StatementAdapter.evaluate(StatementAdapter.java:36)
	at org.apache.lucene.util.TestRuleAssertionsRequired$1.evaluate(TestRuleAssertionsRequired.java:53)
	at org.apache.lucene.util.TestRuleMarkFailure$1.evaluate(TestRuleMarkFailure.java:47)
	at org.apache.lucene.util.TestRuleIgnoreAfterMaxFailures$1.evaluate(TestRuleIgnoreAfterMaxFailures.java:64)
	at org.apache.lucene.util.TestRuleIgnoreTestSuites$1.evaluate(TestRuleIgnoreTestSuites.java:54)
	at com.carrotsearch.randomizedtesting.rules.StatementAdapter.evaluate(StatementAdapter.java:36)
	at com.carrotsearch.randomizedtesting.ThreadLeakControl$StatementRunner.run(ThreadLeakControl.java:367)
	at java.lang.Thread.run(Thread.java:745)


FAILED:  org.apache.solr.handler.component.SpellCheckComponentTest.testMaximumResultsForSuggest

Error Message:
Directory SimpleFSDirectory@C:\Users\JenkinsSlave\workspace\Lucene-Solr-trunk-Windows\solr\build\solr-core\test\J0\temp\solr.handler.component.SpellCheckComponentTest_B94F82D8026220FB-001\init-core-data-001\spellchecker1 lockFactory=org.apache.lucene.store.NativeFSLockFactory@1ead463 still has pending deleted files; cannot initialize IndexWriter

Stack Trace:
java.lang.IllegalArgumentException: Directory SimpleFSDirectory@C:\Users\JenkinsSlave\workspace\Lucene-Solr-trunk-Windows\solr\build\solr-core\test\J0\temp\solr.handler.component.SpellCheckComponentTest_B94F82D8026220FB-001\init-core-data-001\spellchecker1 lockFactory=org.apache.lucene.store.NativeFSLockFactory@1ead463 still has pending deleted files; cannot initialize IndexWriter
	at __randomizedtesting.SeedInfo.seed([B94F82D8026220FB:3542021BCC4E7FB6]:0)
	at org.apache.lucene.index.IndexWriter.<init>(IndexWriter.java:758)
	at org.apache.lucene.search.spell.SpellChecker.clearIndex(SpellChecker.java:455)
	at org.apache.solr.spelling.IndexBasedSpellChecker.build(IndexBasedSpellChecker.java:87)
	at org.apache.solr.handler.component.SpellCheckComponent.prepare(SpellCheckComponent.java:131)
	at org.apache.solr.handler.component.SearchHandler.handleRequestBody(SearchHandler.java:246)
	at org.apache.solr.handler.RequestHandlerBase.handleRequest(RequestHandlerBase.java:155)
	at org.apache.solr.core.SolrCore.execute(SolrCore.java:2082)
	at org.apache.solr.util.TestHarness.query(TestHarness.java:310)
	at org.apache.solr.util.TestHarness.query(TestHarness.java:292)
	at org.apache.solr.SolrTestCaseJ4.assertJQ(SolrTestCaseJ4.java:820)
	at org.apache.solr.SolrTestCaseJ4.assertJQ(SolrTestCaseJ4.java:789)
	at org.apache.solr.handler.component.SpellCheckComponentTest.testMaximumResultsForSuggest(SpellCheckComponentTest.java:83)
	at sun.reflect.NativeMethodAccessorImpl.invoke0(Native Method)
	at sun.reflect.NativeMethodAccessorImpl.invoke(NativeMethodAccessorImpl.java:62)
	at sun.reflect.DelegatingMethodAccessorImpl.invoke(DelegatingMethodAccessorImpl.java:43)
	at java.lang.reflect.Method.invoke(Method.java:498)
	at com.carrotsearch.randomizedtesting.RandomizedRunner.invoke(RandomizedRunner.java:1764)
	at com.carrotsearch.randomizedtesting.RandomizedRunner$8.evaluate(RandomizedRunner.java:871)
	at com.carrotsearch.randomizedtesting.RandomizedRunner$9.evaluate(RandomizedRunner.java:907)
	at com.carrotsearch.randomizedtesting.RandomizedRunner$10.evaluate(RandomizedRunner.java:921)
	at com.carrotsearch.randomizedtesting.rules.SystemPropertiesRestoreRule$1.evaluate(SystemPropertiesRestoreRule.java:57)
	at org.apache.lucene.util.TestRuleSetupTeardownChained$1.evaluate(TestRuleSetupTeardownChained.java:49)
	at org.apache.lucene.util.AbstractBeforeAfterRule$1.evaluate(AbstractBeforeAfterRule.java:45)
	at org.apache.lucene.util.TestRuleThreadAndTestName$1.evaluate(TestRuleThreadAndTestName.java:48)
	at org.apache.lucene.util.TestRuleIgnoreAfterMaxFailures$1.evaluate(TestRuleIgnoreAfterMaxFailures.java:64)
	at org.apache.lucene.util.TestRuleMarkFailure$1.evaluate(TestRuleMarkFailure.java:47)
	at com.carrotsearch.randomizedtesting.rules.StatementAdapter.evaluate(StatementAdapter.java:36)
	at com.carrotsearch.randomizedtesting.ThreadLeakControl$StatementRunner.run(ThreadLeakControl.java:367)
	at com.carrotsearch.randomizedtesting.ThreadLeakControl.forkTimeoutingTask(ThreadLeakControl.java:809)
	at com.carrotsearch.randomizedtesting.ThreadLeakControl$3.evaluate(ThreadLeakControl.java:460)
	at com.carrotsearch.randomizedtesting.RandomizedRunner.runSingleTest(RandomizedRunner.java:880)
	at com.carrotsearch.randomizedtesting.RandomizedRunner$5.evaluate(RandomizedRunner.java:781)
	at com.carrotsearch.randomizedtesting.RandomizedRunner$6.evaluate(RandomizedRunner.java:816)
	at com.carrotsearch.randomizedtesting.RandomizedRunner$7.evaluate(RandomizedRunner.java:827)
	at com.carrotsearch.randomizedtesting.rules.StatementAdapter.evaluate(StatementAdapter.java:36)
	at com.carrotsearch.randomizedtesting.rules.SystemPropertiesRestoreRule$1.evaluate(SystemPropertiesRestoreRule.java:57)
	at org.apache.lucene.util.AbstractBeforeAfterRule$1.evaluate(AbstractBeforeAfterRule.java:45)
	at com.carrotsearch.randomizedtesting.rules.StatementAdapter.evaluate(StatementAdapter.java:36)
	at org.apache.lucene.util.TestRuleStoreClassName$1.evaluate(TestRuleStoreClassName.java:41)
	at com.carrotsearch.randomizedtesting.rules.NoShadowingOrOverridesOnMethodsRule$1.evaluate(NoShadowingOrOverridesOnMethodsRule.java:40)
	at com.carrotsearch.randomizedtesting.rules.NoShadowingOrOverridesOnMethodsRule$1.evaluate(NoShadowingOrOverridesOnMethodsRule.java:40)
	at com.carrotsearch.randomizedtesting.rules.StatementAdapter.evaluate(StatementAdapter.java:36)
	at com.carrotsearch.randomizedtesting.rules.StatementAdapter.evaluate(StatementAdapter.java:36)
	at com.carrotsearch.randomizedtesting.rules.StatementAdapter.evaluate(StatementAdapter.java:36)
	at org.apache.lucene.util.TestRuleAssertionsRequired$1.evaluate(TestRuleAssertionsRequired.java:53)
	at org.apache.lucene.util.TestRuleMarkFailure$1.evaluate(TestRuleMarkFailure.java:47)
	at org.apache.lucene.util.TestRuleIgnoreAfterMaxFailures$1.evaluate(TestRuleIgnoreAfterMaxFailures.java:64)
	at org.apache.lucene.util.TestRuleIgnoreTestSuites$1.evaluate(TestRuleIgnoreTestSuites.java:54)
	at com.carrotsearch.randomizedtesting.rules.StatementAdapter.evaluate(StatementAdapter.java:36)
	at com.carrotsearch.randomizedtesting.ThreadLeakControl$StatementRunner.run(ThreadLeakControl.java:367)
	at java.lang.Thread.run(Thread.java:745)


FAILED:  org.apache.solr.handler.component.SpellCheckComponentTest.testExtendedResultsCount

Error Message:
Directory SimpleFSDirectory@C:\Users\JenkinsSlave\workspace\Lucene-Solr-trunk-Windows\solr\build\solr-core\test\J0\temp\solr.handler.component.SpellCheckComponentTest_B94F82D8026220FB-001\init-core-data-001\spellchecker1 lockFactory=org.apache.lucene.store.NativeFSLockFactory@1ead463 still has pending deleted files; cannot initialize IndexWriter

Stack Trace:
java.lang.IllegalArgumentException: Directory SimpleFSDirectory@C:\Users\JenkinsSlave\workspace\Lucene-Solr-trunk-Windows\solr\build\solr-core\test\J0\temp\solr.handler.component.SpellCheckComponentTest_B94F82D8026220FB-001\init-core-data-001\spellchecker1 lockFactory=org.apache.lucene.store.NativeFSLockFactory@1ead463 still has pending deleted files; cannot initialize IndexWriter
	at __randomizedtesting.SeedInfo.seed([B94F82D8026220FB:877BAD61277FB51C]:0)
	at org.apache.lucene.index.IndexWriter.<init>(IndexWriter.java:758)
	at org.apache.lucene.search.spell.SpellChecker.clearIndex(SpellChecker.java:455)
	at org.apache.solr.spelling.IndexBasedSpellChecker.build(IndexBasedSpellChecker.java:87)
	at org.apache.solr.handler.component.SpellCheckComponent.prepare(SpellCheckComponent.java:131)
	at org.apache.solr.handler.component.SearchHandler.handleRequestBody(SearchHandler.java:246)
	at org.apache.solr.handler.RequestHandlerBase.handleRequest(RequestHandlerBase.java:155)
	at org.apache.solr.core.SolrCore.execute(SolrCore.java:2082)
	at org.apache.solr.util.TestHarness.query(TestHarness.java:310)
	at org.apache.solr.util.TestHarness.query(TestHarness.java:292)
	at org.apache.solr.SolrTestCaseJ4.assertJQ(SolrTestCaseJ4.java:820)
	at org.apache.solr.SolrTestCaseJ4.assertJQ(SolrTestCaseJ4.java:789)
	at org.apache.solr.handler.component.SpellCheckComponentTest.testExtendedResultsCount(SpellCheckComponentTest.java:135)
	at sun.reflect.NativeMethodAccessorImpl.invoke0(Native Method)
	at sun.reflect.NativeMethodAccessorImpl.invoke(NativeMethodAccessorImpl.java:62)
	at sun.reflect.DelegatingMethodAccessorImpl.invoke(DelegatingMethodAccessorImpl.java:43)
	at java.lang.reflect.Method.invoke(Method.java:498)
	at com.carrotsearch.randomizedtesting.RandomizedRunner.invoke(RandomizedRunner.java:1764)
	at com.carrotsearch.randomizedtesting.RandomizedRunner$8.evaluate(RandomizedRunner.java:871)
	at com.carrotsearch.randomizedtesting.RandomizedRunner$9.evaluate(RandomizedRunner.java:907)
	at com.carrotsearch.randomizedtesting.RandomizedRunner$10.evaluate(RandomizedRunner.java:921)
	at com.carrotsearch.randomizedtesting.rules.SystemPropertiesRestoreRule$1.evaluate(SystemPropertiesRestoreRule.java:57)
	at org.apache.lucene.util.TestRuleSetupTeardownChained$1.evaluate(TestRuleSetupTeardownChained.java:49)
	at org.apache.lucene.util.AbstractBeforeAfterRule$1.evaluate(AbstractBeforeAfterRule.java:45)
	at org.apache.lucene.util.TestRuleThreadAndTestName$1.evaluate(TestRuleThreadAndTestName.java:48)
	at org.apache.lucene.util.TestRuleIgnoreAfterMaxFailures$1.evaluate(TestRuleIgnoreAfterMaxFailures.java:64)
	at org.apache.lucene.util.TestRuleMarkFailure$1.evaluate(TestRuleMarkFailure.java:47)
	at com.carrotsearch.randomizedtesting.rules.StatementAdapter.evaluate(StatementAdapter.java:36)
	at com.carrotsearch.randomizedtesting.ThreadLeakControl$StatementRunner.run(ThreadLeakControl.java:367)
	at com.carrotsearch.randomizedtesting.ThreadLeakControl.forkTimeoutingTask(ThreadLeakControl.java:809)
	at com.carrotsearch.randomizedtesting.ThreadLeakControl$3.evaluate(ThreadLeakControl.java:460)
	at com.carrotsearch.randomizedtesting.RandomizedRunner.runSingleTest(RandomizedRunner.java:880)
	at com.carrotsearch.randomizedtesting.RandomizedRunner$5.evaluate(RandomizedRunner.java:781)
	at com.carrotsearch.randomizedtesting.RandomizedRunner$6.evaluate(RandomizedRunner.java:816)
	at com.carrotsearch.randomizedtesting.RandomizedRunner$7.evaluate(RandomizedRunner.java:827)
	at com.carrotsearch.randomizedtesting.rules.StatementAdapter.evaluate(StatementAdapter.java:36)
	at com.carrotsearch.randomizedtesting.rules.SystemPropertiesRestoreRule$1.evaluate(SystemPropertiesRestoreRule.java:57)
	at org.apache.lucene.util.AbstractBeforeAfterRule$1.evaluate(AbstractBeforeAfterRule.java:45)
	at com.carrotsearch.randomizedtesting.rules.StatementAdapter.evaluate(StatementAdapter.java:36)
	at org.apache.lucene.util.TestRuleStoreClassName$1.evaluate(TestRuleStoreClassName.java:41)
	at com.carrotsearch.randomizedtesting.rules.NoShadowingOrOverridesOnMethodsRule$1.evaluate(NoShadowingOrOverridesOnMethodsRule.java:40)
	at com.carrotsearch.randomizedtesting.rules.NoShadowingOrOverridesOnMethodsRule$1.evaluate(NoShadowingOrOverridesOnMethodsRule.java:40)
	at com.carrotsearch.randomizedtesting.rules.StatementAdapter.evaluate(StatementAdapter.java:36)
	at com.carrotsearch.randomizedtesting.rules.StatementAdapter.evaluate(StatementAdapter.java:36)
	at com.carrotsearch.randomizedtesting.rules.StatementAdapter.evaluate(StatementAdapter.java:36)
	at org.apache.lucene.util.TestRuleAssertionsRequired$1.evaluate(TestRuleAssertionsRequired.java:53)
	at org.apache.lucene.util.TestRuleMarkFailure$1.evaluate(TestRuleMarkFailure.java:47)
	at org.apache.lucene.util.TestRuleIgnoreAfterMaxFailures$1.evaluate(TestRuleIgnoreAfterMaxFailures.java:64)
	at org.apache.lucene.util.TestRuleIgnoreTestSuites$1.evaluate(TestRuleIgnoreTestSuites.java:54)
	at com.carrotsearch.randomizedtesting.rules.StatementAdapter.evaluate(StatementAdapter.java:36)
	at com.carrotsearch.randomizedtesting.ThreadLeakControl$StatementRunner.run(ThreadLeakControl.java:367)
	at java.lang.Thread.run(Thread.java:745)


FAILED:  org.apache.solr.handler.component.DistributedSpellCheckComponentTest.test

Error Message:
Error from server at https://127.0.0.1:50952//collection1: Directory SimpleFSDirectory@C:\Users\JenkinsSlave\workspace\Lucene-Solr-trunk-Windows\solr\build\solr-core\test\J0\temp\solr.handler.component.DistributedSpellCheckComponentTest_B94F82D8026220FB-001\tempDir-001\control\cores\collection1\data\spellchecker1 lockFactory=org.apache.lucene.store.NativeFSLockFactory@1ead463 still has pending deleted files; cannot initialize IndexWriter

Stack Trace:
org.apache.solr.client.solrj.impl.HttpSolrClient$RemoteSolrException: Error from server at https://127.0.0.1:50952//collection1: Directory SimpleFSDirectory@C:\Users\JenkinsSlave\workspace\Lucene-Solr-trunk-Windows\solr\build\solr-core\test\J0\temp\solr.handler.component.DistributedSpellCheckComponentTest_B94F82D8026220FB-001\tempDir-001\control\cores\collection1\data\spellchecker1 lockFactory=org.apache.lucene.store.NativeFSLockFactory@1ead463 still has pending deleted files; cannot initialize IndexWriter
	at __randomizedtesting.SeedInfo.seed([B94F82D8026220FB:311BBD02AC9E4D03]:0)
	at org.apache.solr.client.solrj.impl.HttpSolrClient.executeMethod(HttpSolrClient.java:576)
	at org.apache.solr.client.solrj.impl.HttpSolrClient.request(HttpSolrClient.java:240)
	at org.apache.solr.client.solrj.impl.HttpSolrClient.request(HttpSolrClient.java:229)
	at org.apache.solr.client.solrj.SolrRequest.process(SolrRequest.java:149)
	at org.apache.solr.client.solrj.SolrClient.query(SolrClient.java:942)
	at org.apache.solr.client.solrj.SolrClient.query(SolrClient.java:957)
	at org.apache.solr.handler.component.DistributedSpellCheckComponentTest.q(DistributedSpellCheckComponentTest.java:67)
	at org.apache.solr.handler.component.DistributedSpellCheckComponentTest.test(DistributedSpellCheckComponentTest.java:146)
	at sun.reflect.NativeMethodAccessorImpl.invoke0(Native Method)
	at sun.reflect.NativeMethodAccessorImpl.invoke(NativeMethodAccessorImpl.java:62)
	at sun.reflect.DelegatingMethodAccessorImpl.invoke(DelegatingMethodAccessorImpl.java:43)
	at java.lang.reflect.Method.invoke(Method.java:498)
	at com.carrotsearch.randomizedtesting.RandomizedRunner.invoke(RandomizedRunner.java:1764)
	at com.carrotsearch.randomizedtesting.RandomizedRunner$8.evaluate(RandomizedRunner.java:871)
	at com.carrotsearch.randomizedtesting.RandomizedRunner$9.evaluate(RandomizedRunner.java:907)
	at com.carrotsearch.randomizedtesting.RandomizedRunner$10.evaluate(RandomizedRunner.java:921)
	at org.apache.solr.BaseDistributedSearchTestCase$ShardsRepeatRule$ShardsRepeatStatement.callStatement(BaseDistributedSearchTestCase.java:990)
	at org.apache.solr.BaseDistributedSearchTestCase$ShardsRepeatRule$ShardsStatement.evaluate(BaseDistributedSearchTestCase.java:939)
	at com.carrotsearch.randomizedtesting.rules.SystemPropertiesRestoreRule$1.evaluate(SystemPropertiesRestoreRule.java:57)
	at org.apache.lucene.util.TestRuleSetupTeardownChained$1.evaluate(TestRuleSetupTeardownChained.java:49)
	at org.apache.lucene.util.AbstractBeforeAfterRule$1.evaluate(AbstractBeforeAfterRule.java:45)
	at org.apache.lucene.util.TestRuleThreadAndTestName$1.evaluate(TestRuleThreadAndTestName.java:48)
	at org.apache.lucene.util.TestRuleIgnoreAfterMaxFailures$1.evaluate(TestRuleIgnoreAfterMaxFailures.java:64)
	at org.apache.lucene.util.TestRuleMarkFailure$1.evaluate(TestRuleMarkFailure.java:47)
	at com.carrotsearch.randomizedtesting.rules.StatementAdapter.evaluate(StatementAdapter.java:36)
	at com.carrotsearch.randomizedtesting.ThreadLeakControl$StatementRunner.run(ThreadLeakControl.java:367)
	at com.carrotsearch.randomizedtesting.ThreadLeakControl.forkTimeoutingTask(ThreadLeakControl.java:809)
	at com.carrotsearch.randomizedtesting.ThreadLeakControl$3.evaluate(ThreadLeakControl.java:460)
	at com.carrotsearch.randomizedtesting.RandomizedRunner.runSingleTest(RandomizedRunner.java:880)
	at com.carrotsearch.randomizedtesting.RandomizedRunner$5.evaluate(RandomizedRunner.java:781)
	at com.carrotsearch.randomizedtesting.RandomizedRunner$6.evaluate(RandomizedRunner.java:816)
	at com.carrotsearch.randomizedtesting.RandomizedRunner$7.evaluate(RandomizedRunner.java:827)
	at com.carrotsearch.randomizedtesting.rules.StatementAdapter.evaluate(StatementAdapter.java:36)
	at com.carrotsearch.randomizedtesting.rules.SystemPropertiesRestoreRule$1.evaluate(SystemPropertiesRestoreRule.java:57)
	at org.apache.lucene.util.AbstractBeforeAfterRule$1.evaluate(AbstractBeforeAfterRule.java:45)
	at com.carrotsearch.randomizedtesting.rules.StatementAdapter.evaluate(StatementAdapter.java:36)
	at org.apache.lucene.util.TestRuleStoreClassName$1.evaluate(TestRuleStoreClassName.java:41)
	at com.carrotsearch.randomizedtesting.rules.NoShadowingOrOverridesOnMethodsRule$1.evaluate(NoShadowingOrOverridesOnMethodsRule.java:40)
	at com.carrotsearch.randomizedtesting.rules.NoShadowingOrOverridesOnMethodsRule$1.evaluate(NoShadowingOrOverridesOnMethodsRule.java:40)
	at com.carrotsearch.randomizedtesting.rules.StatementAdapter.evaluate(StatementAdapter.java:36)
	at com.carrotsearch.randomizedtesting.rules.StatementAdapter.evaluate(StatementAdapter.java:36)
	at com.carrotsearch.randomizedtesting.rules.StatementAdapter.evaluate(StatementAdapter.java:36)
	at org.apache.lucene.util.TestRuleAssertionsRequired$1.evaluate(TestRuleAssertionsRequired.java:53)
	at org.apache.lucene.util.TestRuleMarkFailure$1.evaluate(TestRuleMarkFailure.java:47)
	at org.apache.lucene.util.TestRuleIgnoreAfterMaxFailures$1.evaluate(TestRuleIgnoreAfterMaxFailures.java:64)
	at org.apache.lucene.util.TestRuleIgnoreTestSuites$1.evaluate(TestRuleIgnoreTestSuites.java:54)
	at com.carrotsearch.randomizedtesting.rules.StatementAdapter.evaluate(StatementAdapter.java:36)
	at com.carrotsearch.randomizedtesting.ThreadLeakControl$StatementRunner.run(ThreadLeakControl.java:367)
	at java.lang.Thread.run(Thread.java:745)




Build Log:
[...truncated 10437 lines...]
   [junit4] Suite: org.apache.solr.handler.component.DistributedSpellCheckComponentTest
   [junit4]   2> Creating dataDir: C:\Users\JenkinsSlave\workspace\Lucene-Solr-trunk-Windows\solr\build\solr-core\test\J0\temp\solr.handler.component.DistributedSpellCheckComponentTest_B94F82D8026220FB-001\init-core-data-001
   [junit4]   2> 264604 INFO  (SUITE-DistributedSpellCheckComponentTest-seed#[B94F82D8026220FB]-worker) [    ] o.a.s.SolrTestCaseJ4 Randomized ssl (true) and clientAuth (true)
   [junit4]   2> 264604 INFO  (SUITE-DistributedSpellCheckComponentTest-seed#[B94F82D8026220FB]-worker) [    ] o.a.s.BaseDistributedSearchTestCase Setting hostContext system property: /
   [junit4]   2> 265234 INFO  (TEST-DistributedSpellCheckComponentTest.test-seed#[B94F82D8026220FB]) [    ] o.a.s.SolrTestCaseJ4 Writing core.properties file to C:\Users\JenkinsSlave\workspace\Lucene-Solr-trunk-Windows\solr\build\solr-core\test\J0\temp\solr.handler.component.DistributedSpellCheckComponentTest_B94F82D8026220FB-001\tempDir-001\control\cores\collection1
   [junit4]   2> 265237 INFO  (TEST-DistributedSpellCheckComponentTest.test-seed#[B94F82D8026220FB]) [    ] o.e.j.s.Server jetty-9.2.13.v20150730
   [junit4]   2> 265240 INFO  (TEST-DistributedSpellCheckComponentTest.test-seed#[B94F82D8026220FB]) [    ] o.e.j.s.h.ContextHandler Started o.e.j.s.ServletContextHandler@204715{/,null,AVAILABLE}
   [junit4]   2> 265253 INFO  (TEST-DistributedSpellCheckComponentTest.test-seed#[B94F82D8026220FB]) [    ] o.e.j.s.ServerConnector Started ServerConnector@1727cb7{SSL-http/1.1}{127.0.0.1:50919}
   [junit4]   2> 265253 INFO  (TEST-DistributedSpellCheckComponentTest.test-seed#[B94F82D8026220FB]) [    ] o.e.j.s.Server Started @269011ms
   [junit4]   2> 265255 INFO  (TEST-DistributedSpellCheckComponentTest.test-seed#[B94F82D8026220FB]) [    ] o.a.s.c.s.e.JettySolrRunner Jetty properties: {hostContext=/, hostPort=50919, coreRootDirectory=C:\Users\JenkinsSlave\workspace\Lucene-Solr-trunk-Windows\solr\build\solr-core\test\J0\temp\solr.handler.component.DistributedSpellCheckComponentTest_B94F82D8026220FB-001\tempDir-001\control\cores}
   [junit4]   2> 265256 INFO  (TEST-DistributedSpellCheckComponentTest.test-seed#[B94F82D8026220FB]) [    ] o.a.s.s.SolrDispatchFilter SolrDispatchFilter.init(): sun.misc.Launcher$AppClassLoader@1d16e93
   [junit4]   2> 265256 INFO  (TEST-DistributedSpellCheckComponentTest.test-seed#[B94F82D8026220FB]) [    ] o.a.s.c.SolrResourceLoader new SolrResourceLoader for directory: 'C:\Users\JenkinsSlave\workspace\Lucene-Solr-trunk-Windows\solr\build\solr-core\test\J0\temp\solr.handler.component.DistributedSpellCheckComponentTest_B94F82D8026220FB-001\tempDir-001\control'
   [junit4]   2> 265256 INFO  (TEST-DistributedSpellCheckComponentTest.test-seed#[B94F82D8026220FB]) [    ] o.a.s.c.SolrResourceLoader JNDI not configured for solr (NoInitialContextEx)
   [junit4]   2> 265256 INFO  (TEST-DistributedSpellCheckComponentTest.test-seed#[B94F82D8026220FB]) [    ] o.a.s.c.SolrResourceLoader solr home defaulted to 'solr/' (could not find system property or JNDI)
   [junit4]   2> 265257 INFO  (TEST-DistributedSpellCheckComponentTest.test-seed#[B94F82D8026220FB]) [    ] o.a.s.c.SolrXmlConfig Loading container configuration from C:\Users\JenkinsSlave\workspace\Lucene-Solr-trunk-Windows\solr\build\solr-core\test\J0\temp\solr.handler.component.DistributedSpellCheckComponentTest_B94F82D8026220FB-001\tempDir-001\control\solr.xml
   [junit4]   2> 265267 INFO  (TEST-DistributedSpellCheckComponentTest.test-seed#[B94F82D8026220FB]) [    ] o.a.s.c.CorePropertiesLocator Config-defined core root directory: C:\Users\JenkinsSlave\workspace\Lucene-Solr-trunk-Windows\solr\build\solr-core\test\J0\temp\solr.handler.component.DistributedSpellCheckComponentTest_B94F82D8026220FB-001\tempDir-001\control\cores
   [junit4]   2> 265267 INFO  (TEST-DistributedSpellCheckComponentTest.test-seed#[B94F82D8026220FB]) [    ] o.a.s.c.CoreContainer New CoreContainer 25099895
   [junit4]   2> 265267 INFO  (TEST-DistributedSpellCheckComponentTest.test-seed#[B94F82D8026220FB]) [    ] o.a.s.c.CoreContainer Loading cores into CoreContainer [instanceDir=C:\Users\JenkinsSlave\workspace\Lucene-Solr-trunk-Windows\solr\build\solr-core\test\J0\temp\solr.handler.component.DistributedSpellCheckComponentTest_B94F82D8026220FB-001\tempDir-001\control]
   [junit4]   2> 265268 WARN  (TEST-DistributedSpellCheckComponentTest.test-seed#[B94F82D8026220FB]) [    ] o.a.s.c.CoreContainer Couldn't add files from C:\Users\JenkinsSlave\workspace\Lucene-Solr-trunk-Windows\solr\build\solr-core\test\J0\temp\solr.handler.component.DistributedSpellCheckComponentTest_B94F82D8026220FB-001\tempDir-001\control\lib to classpath: C:\Users\JenkinsSlave\workspace\Lucene-Solr-trunk-Windows\solr\build\solr-core\test\J0\temp\solr.handler.component.DistributedSpellCheckComponentTest_B94F82D8026220FB-001\tempDir-001\control\lib
   [junit4]   2> 265269 INFO  (TEST-DistributedSpellCheckComponentTest.test-seed#[B94F82D8026220FB]) [    ] o.a.s.h.c.HttpShardHandlerFactory created with socketTimeout : 90000,urlScheme : https,connTimeout : 15000,maxConnectionsPerHost : 20,maxConnections : 10000,corePoolSize : 0,maximumPoolSize : 2147483647,maxThreadIdleTime : 5,sizeOfQueue : -1,fairnessPolicy : false,useRetries : false,
   [junit4]   2> 265275 INFO  (TEST-DistributedSpellCheckComponentTest.test-seed#[B94F82D8026220FB]) [    ] o.a.s.u.UpdateShardHandler Creating UpdateShardHandler HTTP client with params: socketTimeout=340000&connTimeout=45000&retry=true
   [junit4]   2> 265278 INFO  (TEST-DistributedSpellCheckComponentTest.test-seed#[B94F82D8026220FB]) [    ] o.a.s.l.LogWatcher SLF4J impl is org.slf4j.impl.Log4jLoggerFactory
   [junit4]   2> 265278 INFO  (TEST-DistributedSpellCheckComponentTest.test-seed#[B94F82D8026220FB]) [    ] o.a.s.l.LogWatcher Registering Log Listener [Log4j (org.slf4j.impl.Log4jLoggerFactory)]
   [junit4]   2> 265278 INFO  (TEST-DistributedSpellCheckComponentTest.test-seed#[B94F82D8026220FB]) [    ] o.a.s.c.CoreContainer Security conf doesn't exist. Skipping setup for authorization module.
   [junit4]   2> 265278 INFO  (TEST-DistributedSpellCheckComponentTest.test-seed#[B94F82D8026220FB]) [    ] o.a.s.c.CoreContainer No authentication plugin used.
   [junit4]   2> 265279 INFO  (TEST-DistributedSpellCheckComponentTest.test-seed#[B94F82D8026220FB]) [    ] o.a.s.c.CorePropertiesLocator Looking for core definitions underneath C:\Users\JenkinsSlave\workspace\Lucene-Solr-trunk-Windows\solr\build\solr-core\test\J0\temp\solr.handler.component.DistributedSpellCheckComponentTest_B94F82D8026220FB-001\tempDir-001\control\cores
   [junit4]   2> 265281 INFO  (TEST-DistributedSpellCheckComponentTest.test-seed#[B94F82D8026220FB]) [    ] o.a.s.c.CoreDescriptor Created CoreDescriptor: {name=collection1, config=solrconfig.xml, loadOnStartup=true, schema=schema.xml, configSetProperties=configsetprops.json, transient=false, dataDir=data\, configSet=collection1}
   [junit4]   2> 265281 INFO  (TEST-DistributedSpellCheckComponentTest.test-seed#[B94F82D8026220FB]) [    ] o.a.s.c.CorePropertiesLocator Found core collection1 in C:\Users\JenkinsSlave\workspace\Lucene-Solr-trunk-Windows\solr\build\solr-core\test\J0\temp\solr.handler.component.DistributedSpellCheckComponentTest_B94F82D8026220FB-001\tempDir-001\control\cores\collection1
   [junit4]   2> 265281 INFO  (TEST-DistributedSpellCheckComponentTest.test-seed#[B94F82D8026220FB]) [    ] o.a.s.c.CorePropertiesLocator Found 1 core definitions
   [junit4]   2> 265282 INFO  (coreLoadExecutor-1191-thread-1) [    ] o.a.s.c.SolrResourceLoader new SolrResourceLoader for directory: 'C:\Users\JenkinsSlave\workspace\Lucene-Solr-trunk-Windows\solr\core\src\test-files\solr\collection1'
   [junit4]   2> 265282 INFO  (TEST-DistributedSpellCheckComponentTest.test-seed#[B94F82D8026220FB]) [    ] o.a.s.s.SolrDispatchFilter user.dir=C:\Users\JenkinsSlave\workspace\Lucene-Solr-trunk-Windows\solr\build\solr-core\test\J0
   [junit4]   2> 265282 INFO  (coreLoadExecutor-1191-thread-1) [    ] o.a.s.c.SolrResourceLoader JNDI not configured for solr (NoInitialContextEx)
   [junit4]   2> 265282 INFO  (coreLoadExecutor-1191-thread-1) [    ] o.a.s.c.SolrResourceLoader solr home defaulted to 'solr/' (could not find system property or JNDI)
   [junit4]   2> 265282 INFO  (TEST-DistributedSpellCheckComponentTest.test-seed#[B94F82D8026220FB]) [    ] o.a.s.s.SolrDispatchFilter SolrDispatchFilter.init() done
   [junit4]   2> 265283 INFO  (coreLoadExecutor-1191-thread-1) [    ] o.a.s.c.SolrResourceLoader Adding 'file:/C:/Users/JenkinsSlave/workspace/Lucene-Solr-trunk-Windows/solr/core/src/test-files/solr/collection1/lib/classes/' to classloader
   [junit4]   2> 265283 INFO  (coreLoadExecutor-1191-thread-1) [    ] o.a.s.c.SolrResourceLoader Adding 'file:/C:/Users/JenkinsSlave/workspace/Lucene-Solr-trunk-Windows/solr/core/src/test-files/solr/collection1/lib/README' to classloader
   [junit4]   2> 265338 INFO  (coreLoadExecutor-1191-thread-1) [    ] o.a.s.c.SolrConfig current version of requestparams : -1
   [junit4]   2> 265346 INFO  (coreLoadExecutor-1191-thread-1) [    ] o.a.s.c.SolrConfig Using Lucene MatchVersion: 6.0.0
   [junit4]   2> 265366 INFO  (coreLoadExecutor-1191-thread-1) [    ] o.a.s.c.SolrConfig Loaded SolrConfig: solrconfig.xml
   [junit4]   2> 265378 INFO  (coreLoadExecutor-1191-thread-1) [    ] o.a.s.s.IndexSchema [collection1] Schema name=test
   [junit4]   2> 265469 INFO  (coreLoadExecutor-1191-thread-1) [    ] o.a.s.s.OpenExchangeRatesOrgProvider Initialized with rates=open-exchange-rates.json, refreshInterval=1440.
   [junit4]   2> 265479 INFO  (coreLoadExecutor-1191-thread-1) [    ] o.a.s.s.IndexSchema default search field in schema is text
   [junit4]   2> 265480 INFO  (coreLoadExecutor-1191-thread-1) [    ] o.a.s.s.IndexSchema unique key field: id
   [junit4]   2> 265492 INFO  (coreLoadExecutor-1191-thread-1) [    ] o.a.s.s.FileExchangeRateProvider Reloading exchange rates from file currency.xml
   [junit4]   2> 265493 INFO  (coreLoadExecutor-1191-thread-1) [    ] o.a.s.s.FileExchangeRateProvider Reloading exchange rates from file currency.xml
   [junit4]   2> 265495 INFO  (coreLoadExecutor-1191-thread-1) [    ] o.a.s.s.OpenExchangeRatesOrgProvider Reloading exchange rates from open-exchange-rates.json
   [junit4]   2> 265495 INFO  (coreLoadExecutor-1191-thread-1) [    ] o.a.s.s.OpenExchangeRatesOrgProvider Reloading exchange rates from open-exchange-rates.json
   [junit4]   2> 265505 INFO  (coreLoadExecutor-1191-thread-1) [    ] o.a.s.c.ConfigSetProperties Did not find ConfigSet properties, assuming default properties: Can't find resource 'configsetprops.json' in classpath or 'C:\Users\JenkinsSlave\workspace\Lucene-Solr-trunk-Windows\solr\core\src\test-files\solr\collection1'
   [junit4]   2> 265505 INFO  (coreLoadExecutor-1191-thread-1) [    ] o.a.s.c.CoreContainer Creating SolrCore 'collection1' using configuration from configset C:\Users\JenkinsSlave\workspace\Lucene-Solr-trunk-Windows\solr\core\src\test-files\solr\collection1
   [junit4]   2> 265506 INFO  (coreLoadExecutor-1191-thread-1) [    x:collection1] o.a.s.c.SolrCore solr.NRTCachingDirectoryFactory
   [junit4]   2> 265506 INFO  (coreLoadExecutor-1191-thread-1) [    x:collection1] o.a.s.c.SolrCore [[collection1] ] Opening new SolrCore at [C:\Users\JenkinsSlave\workspace\Lucene-Solr-trunk-Windows\solr\core\src\test-files\solr\collection1], dataDir=[C:\Users\JenkinsSlave\workspace\Lucene-Solr-trunk-Windows\solr\build\solr-core\test\J0\temp\solr.handler.component.DistributedSpellCheckComponentTest_B94F82D8026220FB-001\tempDir-001\control\cores\collection1\data\]
   [junit4]   2> 265506 INFO  (coreLoadExecutor-1191-thread-1) [    x:collection1] o.a.s.c.JmxMonitoredMap JMX monitoring is enabled. Adding Solr mbeans to JMX Server: com.sun.jmx.mbeanserver.JmxMBeanServer@9826ef
   [junit4]   2> 265509 INFO  (coreLoadExecutor-1191-thread-1) [    x:collection1] o.a.s.c.CachingDirectoryFactory return new directory for C:\Users\JenkinsSlave\workspace\Lucene-Solr-trunk-Windows\solr\build\solr-core\test\J0\temp\solr.handler.component.DistributedSpellCheckComponentTest_B94F82D8026220FB-001\tempDir-001\control\cores\collection1\data
   [junit4]   2> 265509 INFO  (coreLoadExecutor-1191-thread-1) [    x:collection1] o.a.s.c.SolrCore New index directory detected: old=null new=C:\Users\JenkinsSlave\workspace\Lucene-Solr-trunk-Windows\solr\build\solr-core\test\J0\temp\solr.handler.component.DistributedSpellCheckComponentTest_B94F82D8026220FB-001\tempDir-001\control\cores\collection1\data\index/
   [junit4]   2> 265510 WARN  (coreLoadExecutor-1191-thread-1) [    x:collection1] o.a.s.c.SolrCore [collection1] Solr index directory 'C:\Users\JenkinsSlave\workspace\Lucene-Solr-trunk-Windows\solr\build\solr-core\test\J0\temp\solr.handler.component.DistributedSpellCheckComponentTest_B94F82D8026220FB-001\tempDir-001\control\cores\collection1\data\index' doesn't exist. Creating new index...
   [junit4]   2> 265512 INFO  (coreLoadExecutor-1191-thread-1) [    x:collection1] o.a.s.c.CachingDirectoryFactory return new directory for C:\Users\JenkinsSlave\workspace\Lucene-Solr-trunk-Windows\solr\build\solr-core\test\J0\temp\solr.handler.component.DistributedSpellCheckComponentTest_B94F82D8026220FB-001\tempDir-001\control\cores\collection1\data\index
   [junit4]   2> 265512 INFO  (coreLoadExecutor-1191-thread-1) [    x:collection1] o.a.s.u.RandomMergePolicy RandomMergePolicy wrapping class org.apache.lucene.index.TieredMergePolicy: [TieredMergePolicy: maxMergeAtOnce=50, maxMergeAtOnceExplicit=38, maxMergedSegmentMB=43.9765625, floorSegmentMB=1.6689453125, forceMergeDeletesPctAllowed=26.87039154773523, segmentsPerTier=34.0, maxCFSSegmentSizeMB=8.796093022207999E12, noCFSRatio=1.0
   [junit4]   2> 265594 INFO  (coreLoadExecutor-1191-thread-1) [    x:collection1] o.a.s.c.SolrDeletionPolicy SolrDeletionPolicy.onCommit: commits: num=1
   [junit4]   2> 	commit{dir=NRTCachingDirectory(SimpleFSDirectory@C:\Users\JenkinsSlave\workspace\Lucene-Solr-trunk-Windows\solr\build\solr-core\test\J0\temp\solr.handler.component.DistributedSpellCheckComponentTest_B94F82D8026220FB-001\tempDir-001\control\cores\collection1\data\index lockFactory=org.apache.lucene.store.SingleInstanceLockFactory@1c86d70; maxCacheMB=48.0 maxMergeSizeMB=4.0),segFN=segments_1,generation=1}
   [junit4]   2> 265594 INFO  (coreLoadExecutor-1191-thread-1) [    x:collection1] o.a.s.c.SolrDeletionPolicy newest commit generation = 1
   [junit4]   2> 265595 INFO  (OldIndexDirectoryCleanupThreadForCore-collection1) [    x:collection1] o.a.s.c.SolrCore Looking for old index directories to cleanup for core collection1 in C:\Users\JenkinsSlave\workspace\Lucene-Solr-trunk-Windows\solr\build\solr-core\test\J0\temp\solr.handler.component.DistributedSpellCheckComponentTest_B94F82D8026220FB-001\tempDir-001\control\cores\collection1\data\
   [junit4]   2> 265601 INFO  (coreLoadExecutor-1191-thread-1) [    x:collection1] o.a.s.u.p.UpdateRequestProcessorChain creating updateRequestProcessorChain "dedupe"
   [junit4]   2> 265601 INFO  (coreLoadExecutor-1191-thread-1) [    x:collection1] o.a.s.u.p.UpdateRequestProcessorChain inserting DistributedUpdateProcessorFactory into updateRequestProcessorChain "dedupe"
   [junit4]   2> 265601 INFO  (coreLoadExecutor-1191-thread-1) [    x:collection1] o.a.s.u.p.UpdateRequestProcessorChain creating updateRequestProcessorChain "dedupe-allfields"
   [junit4]   2> 265601 INFO  (coreLoadExecutor-1191-thread-1) [    x:collection1] o.a.s.u.p.UpdateRequestProcessorChain inserting DistributedUpdateProcessorFactory into updateRequestProcessorChain "dedupe-allfields"
   [junit4]   2> 265601 INFO  (coreLoadExecutor-1191-thread-1) [    x:collection1] o.a.s.u.p.UpdateRequestProcessorChain creating updateRequestProcessorChain "stored_sig"
   [junit4]   2> 265601 INFO  (coreLoadExecutor-1191-thread-1) [    x:collection1] o.a.s.u.p.UpdateRequestProcessorChain inserting DistributedUpdateProcessorFactory into updateRequestProcessorChain "stored_sig"
   [junit4]   2> 265601 INFO  (coreLoadExecutor-1191-thread-1) [    x:collection1] o.a.s.u.p.UpdateRequestProcessorChain creating updateRequestProcessorChain "uniq-fields"
   [junit4]   2> 265602 INFO  (coreLoadExecutor-1191-thread-1) [    x:collection1] o.a.s.u.p.UpdateRequestProcessorChain inserting DistributedUpdateProcessorFactory into updateRequestProcessorChain "uniq-fields"
   [junit4]   2> 265602 INFO  (coreLoadExecutor-1191-thread-1) [    x:collection1] o.a.s.u.p.UpdateRequestProcessorChain creating updateRequestProcessorChain "distrib-dup-test-chain-explicit"
   [junit4]   2> 265602 INFO  (coreLoadExecutor-1191-thread-1) [    x:collection1] o.a.s.u.p.UpdateRequestProcessorChain creating updateRequestProcessorChain "distrib-dup-test-chain-implicit"
   [junit4]   2> 265602 INFO  (coreLoadExecutor-1191-thread-1) [    x:collection1] o.a.s.u.p.UpdateRequestProcessorChain inserting DistributedUpdateProcessorFactory into updateRequestProcessorChain "distrib-dup-test-chain-implicit"
   [junit4]   2> 265602 INFO  (coreLoadExecutor-1191-thread-1) [    x:collection1] o.a.s.c.SolrCore no updateRequestProcessorChain defined as default, creating implicit default
   [junit4]   2> 265608 INFO  (coreLoadExecutor-1191-thread-1) [    x:collection1] o.a.s.h.l.XMLLoader xsltCacheLifetimeSeconds=60
   [junit4]   2> 265610 INFO  (coreLoadExecutor-1191-thread-1) [    x:collection1] o.a.s.h.l.XMLLoader xsltCacheLifetimeSeconds=60
   [junit4]   2> 265611 INFO  (coreLoadExecutor-1191-thread-1) [    x:collection1] o.a.s.h.l.XMLLoader xsltCacheLifetimeSeconds=60
   [junit4]   2> 265613 INFO  (coreLoadExecutor-1191-thread-1) [    x:collection1] o.a.s.h.l.XMLLoader xsltCacheLifetimeSeconds=60
   [junit4]   2> 265621 INFO  (coreLoadExecutor-1191-thread-1) [    x:collection1] o.a.s.c.PluginBag requestHandler : 'lazy' created with startup=lazy 
   [junit4]   2> 265625 INFO  (coreLoadExecutor-1191-thread-1) [    x:collection1] o.a.s.c.RequestHandlers Registered paths: /admin/mbeans,standard,spellCheckCompRH,lazy,/update/json/docs,/admin/luke,/export,spellCheckWithWordbreak_Direct,tvrh,/get,/admin/properties,/update/json,mltrh,/admin/threads,/search-facet-def,/update/csv,/sql,/search-facet-invariants,/admin/segments,spellCheckCompRH1,/mlt,/admin/system,/replication,dismax,defaults,/config,/stream,/schema,/admin/plugins,/admin/logging,spellCheckWithWordbreak,mock,/admin/ping,/update,/admin/file,/terms,spellCheckCompRH_Direct,/debug/dump
   [junit4]   2> 265626 WARN  (coreLoadExecutor-1191-thread-1) [    x:collection1] o.a.s.c.SolrCore solrconfig.xml uses deprecated <admin/gettableFiles>, Please update your config to use the ShowFileRequestHandler.
   [junit4]   2> 265627 INFO  (coreLoadExecutor-1191-thread-1) [    x:collection1] o.a.s.c.SolrCore Using default statsCache cache: org.apache.solr.search.stats.LocalStatsCache
   [junit4]   2> 265627 INFO  (coreLoadExecutor-1191-thread-1) [    x:collection1] o.a.s.u.UpdateHandler Using UpdateLog implementation: org.apache.solr.update.UpdateLog
   [junit4]   2> 265627 INFO  (coreLoadExecutor-1191-thread-1) [    x:collection1] o.a.s.u.UpdateLog Initializing UpdateLog: dataDir= defaultSyncLevel=FLUSH numRecordsToKeep=100 maxNumLogsToKeep=10 numVersionBuckets=65536
   [junit4]   2> 265630 INFO  (coreLoadExecutor-1191-thread-1) [    x:collection1] o.a.s.u.CommitTracker Hard AutoCommit: disabled
   [junit4]   2> 265630 INFO  (coreLoadExecutor-1191-thread-1) [    x:collection1] o.a.s.u.CommitTracker Soft AutoCommit: disabled
   [junit4]   2> 265631 INFO  (coreLoadExecutor-1191-thread-1) [    x:collection1] o.a.s.u.RandomMergePolicy RandomMergePolicy wrapping class org.apache.lucene.index.AlcoholicMergePolicy: [AlcoholicMergePolicy: minMergeSize=0, mergeFactor=10, maxMergeSize=1487128900, maxMergeSizeForForcedMerge=9223372036854775807, calibrateSizeByDeletes=true, maxMergeDocs=2147483647, maxCFSSegmentSizeMB=8.796093022207999E12, noCFSRatio=0.1]
   [junit4]   2> 265631 INFO  (coreLoadExecutor-1191-thread-1) [    x:collection1] o.a.s.c.SolrDeletionPolicy SolrDeletionPolicy.onInit: commits: num=1
   [junit4]   2> 	commit{dir=NRTCachingDirectory(SimpleFSDirectory@C:\Users\JenkinsSlave\workspace\Lucene-Solr-trunk-Windows\solr\build\solr-core\test\J0\temp\solr.handler.component.DistributedSpellCheckComponentTest_B94F82D8026220FB-001\tempDir-001\control\cores\collection1\data\index lockFactory=org.apache.lucene.store.SingleInstanceLockFactory@1c86d70; maxCacheMB=48.0 maxMergeSizeMB=4.0),segFN=segments_1,generation=1}
   [junit4]   2> 265631 INFO  (coreLoadExecutor-1191-thread-1) [    x:collection1] o.a.s.c.SolrDeletionPolicy newest commit generation = 1
   [junit4]   2> 265631 INFO  (coreLoadExecutor-1191-thread-1) [    x:collection1] o.a.s.s.SolrIndexSearcher Opening [Searcher@1cc33cd[collection1] main]
   [junit4]   2> 265632 INFO  (coreLoadExecutor-1191-thread-1) [    x:collection1] o.a.s.r.RestManager Initializing RestManager with initArgs: {storageIO=org.apache.solr.rest.ManagedResourceStorage$InMemoryStorageIO}
   [junit4]   2> 265632 INFO  (coreLoadExecutor-1191-thread-1) [    x:collection1] o.a.s.r.ManagedResourceStorage Reading _rest_managed.json using InMemoryStorage
   [junit4]   2> 265632 INFO  (coreLoadExecutor-1191-thread-1) [    x:collection1] o.a.s.r.RestManager Initializing 0 registered ManagedResources
   [junit4]   2> 265632 INFO  (coreLoadExecutor-1191-thread-1) [    x:collection1] o.a.s.h.c.SpellCheckComponent Initializing spell checkers
   [junit4]   2> 265662 INFO  (coreLoadExecutor-1191-thread-1) [    x:collection1] o.a.s.s.DirectSolrSpellChecker init: {name=direct,classname=DirectSolrSpellChecker,field=lowerfilt,minQueryLength=3}
   [junit4]   2> 265921 INFO  (coreLoadExecutor-1191-thread-1) [    x:collection1] o.a.s.h.ReplicationHandler Commits will be reserved for  10000
   [junit4]   2> 265922 INFO  (searcherExecutor-1192-thread-1-processing-x:collection1) [    x:collection1] o.a.s.h.c.SpellCheckComponent Loading spell index for spellchecker: default
   [junit4]   2> 265922 INFO  (searcherExecutor-1192-thread-1-processing-x:collection1) [    x:collection1] o.a.s.h.c.SpellCheckComponent Loading spell index for spellchecker: direct
   [junit4]   2> 265922 INFO  (searcherExecutor-1192-thread-1-processing-x:collection1) [    x:collection1] o.a.s.h.c.SpellCheckComponent Loading spell index for spellchecker: wordbreak
   [junit4]   2> 265922 INFO  (searcherExecutor-1192-thread-1-processing-x:collection1) [    x:collection1] o.a.s.h.c.SpellCheckComponent Loading spell index for spellchecker: multipleFields
   [junit4]   2> 265923 INFO  (searcherExecutor-1192-thread-1-processing-x:collection1) [    x:collection1] o.a.s.h.c.SpellCheckComponent Loading spell index for spellchecker: jarowinkler
   [junit4]   2> 265923 INFO  (coreLoadExecutor-1191-thread-1) [    x:collection1] o.a.s.u.UpdateLog Looking up max value of version field to seed version buckets
   [junit4]   2> 265923 INFO  (coreLoadExecutor-1191-thread-1) [    x:collection1] o.a.s.u.VersionInfo Refreshing highest value of _version_ for 65536 version buckets from index
   [junit4]   2> 265923 INFO  (searcherExecutor-1192-thread-1-processing-x:collection1) [    x:collection1] o.a.s.h.c.SpellCheckComponent Loading spell index for spellchecker: external
   [junit4]   2> 265923 INFO  (coreLoadExecutor-1191-thread-1) [    x:collection1] o.a.s.u.VersionInfo No terms found for _version_, cannot seed version bucket highest value from index
   [junit4]   2> 265923 INFO  (coreLoadExecutor-1191-thread-1) [    x:collection1] o.a.s.u.UpdateLog Could not find max version in index or recent updates, using new clock 1525668148644151296
   [junit4]   2> 265924 INFO  (searcherExecutor-1192-thread-1-processing-x:collection1) [    x:collection1] o.a.s.h.c.SpellCheckComponent Loading spell index for spellchecker: freq
   [junit4]   2> 265924 INFO  (searcherExecutor-1192-thread-1-processing-x:collection1) [    x:collection1] o.a.s.h.c.SpellCheckComponent Loading spell index for spellchecker: fqcn
   [junit4]   2> 265924 INFO  (searcherExecutor-1192-thread-1-processing-x:collection1) [    x:collection1] o.a.s.h.c.SpellCheckComponent Loading spell index for spellchecker: perDict
   [junit4]   2> 265925 INFO  (coreLoadExecutor-1191-thread-1) [    x:collection1] o.a.s.u.UpdateLog Took 2.0ms to seed version buckets with highest version 1525668148644151296
   [junit4]   2> 265925 INFO  (coreLoadExecutor-1191-thread-1) [    x:collection1] o.a.s.c.CoreContainer registering core: collection1
   [junit4]   2> 265926 INFO  (searcherExecutor-1192-thread-1-processing-x:collection1) [    x:collection1] o.a.s.c.SolrCore [collection1] Registered new searcher Searcher@1cc33cd[collection1] main{ExitableDirectoryReader(UninvertingDirectoryReader())}
   [junit4]   2> 266923 INFO  (TEST-DistributedSpellCheckComponentTest.test-seed#[B94F82D8026220FB]) [    ] o.a.s.SolrTestCaseJ4 Writing core.properties file to C:\Users\JenkinsSlave\workspace\Lucene-Solr-trunk-Windows\solr\build\solr-core\test\J0\temp\solr.handler.component.DistributedSpellCheckComponentTest_B94F82D8026220FB-001\tempDir-001\shard0\cores\collection1
   [junit4]   2> 266926 INFO  (TEST-DistributedSpellCheckComponentTest.test-seed#[B94F82D8026220FB]) [    ] o.e.j.s.Server jetty-9.2.13.v20150730
   [junit4]   2> 266929 INFO  (TEST-DistributedSpellCheckComponentTest.test-seed#[B94F82D8026220FB]) [    ] o.e.j.s.h.ContextHandler Started o.e.j.s.ServletContextHandler@752529{/,null,AVAILABLE}
   [junit4]   2> 266938 INFO  (TEST-DistributedSpellCheckComponentTest.test-seed#[B94F82D8026220FB]) [    ] o.e.j.s.ServerConnector Started ServerConnector@193b815{SSL-http/1.1}{127.0.0.1:50922}
   [junit4]   2> 266938 INFO  (TEST-DistributedSpellCheckComponentTest.test-seed#[B94F82D8026220FB]) [    ] o.e.j.s.Server Started @270696ms
   [junit4]   2> 266938 INFO  (TEST-DistributedSpellCheckComponentTest.test-seed#[B94F82D8026220FB]) [    ] o.a.s.c.s.e.JettySolrRunner Jetty properties: {hostContext=/, hostPort=50922, coreRootDirectory=C:\Users\JenkinsSlave\workspace\Lucene-Solr-trunk-Windows\solr\build\solr-core\test\J0\temp\solr.handler.component.DistributedSpellCheckComponentTest_B94F82D8026220FB-001\tempDir-001\shard0\cores}
   [junit4]   2> 266939 INFO  (TEST-DistributedSpellCheckComponentTest.test-seed#[B94F82D8026220FB]) [    ] o.a.s.s.SolrDispatchFilter SolrDispatchFilter.init(): sun.misc.Launcher$AppClassLoader@1d16e93
   [junit4]   2> 266939 INFO  (TEST-DistributedSpellCheckComponentTest.test-seed#[B94F82D8026220FB]) [    ] o.a.s.c.SolrResourceLoader new SolrResourceLoader for directory: 'C:\Users\JenkinsSlave\workspace\Lucene-Solr-trunk-Windows\solr\build\solr-core\test\J0\temp\solr.handler.component.DistributedSpellCheckComponentTest_B94F82D8026220FB-001\tempDir-001\shard0'
   [junit4]   2> 266939 INFO  (TEST-DistributedSpellCheckComponentTest.test-seed#[B94F82D8026220FB]) [    ] o.a.s.c.SolrResourceLoader JNDI not configured for solr (NoInitialContextEx)
   [junit4]   2> 266939 INFO  (TEST-DistributedSpellCheckComponentTest.test-seed#[B94F82D8026220FB]) [    ] o.a.s.c.SolrResourceLoader solr home defaulted to 'solr/' (could not find system property or JNDI)
   [junit4]   2> 266940 INFO  (TEST-DistributedSpellCheckComponentTest.test-seed#[B94F82D8026220FB]) [    ] o.a.s.c.SolrXmlConfig Loading container configuration from C:\Users\JenkinsSlave\workspace\Lucene-Solr-trunk-Windows\solr\build\solr-core\test\J0\temp\solr.handler.component.DistributedSpellCheckComponentTest_B94F82D8026220FB-001\tempDir-001\shard0\solr.xml
   [junit4]   2> 266948 INFO  (TEST-DistributedSpellCheckComponentTest.test-seed#[B94F82D8026220FB]) [    ] o.a.s.c.CorePropertiesLocator Config-defined core root directory: C:\Users\JenkinsSlave\workspace\Lucene-Solr-trunk-Windows\solr\build\solr-core\test\J0\temp\solr.handler.component.DistributedSpellCheckComponentTest_B94F82D8026220FB-001\tempDir-001\shard0\cores
   [junit4]   2> 266949 INFO  (TEST-DistributedSpellCheckComponentTest.test-seed#[B94F82D8026220FB]) [    ] o.a.s.c.CoreContainer New CoreContainer 29751253
   [junit4]   2> 266949 INFO  (TEST-DistributedSpellCheckComponentTest.test-seed#[B94F82D8026220FB]) [    ] o.a.s.c.CoreContainer Loading cores into CoreContainer [instanceDir=C:\Users\JenkinsSlave\workspace\Lucene-Solr-trunk-Windows\solr\build\solr-core\test\J0\temp\solr.handler.component.DistributedSpellCheckComponentTest_B94F82D8026220FB-001\tempDir-001\shard0]
   [junit4]   2> 266949 WARN  (TEST-DistributedSpellCheckComponentTest.test-seed#[B94F82D8026220FB]) [    ] o.a.s.c.CoreContainer Couldn't add files from C:\Users\JenkinsSlave\workspace\Lucene-Solr-trunk-Windows\solr\build\solr-core\test\J0\temp\solr.handler.component.DistributedSpellCheckComponentTest_B94F82D8026220FB-001\tempDir-001\shard0\lib to classpath: C:\Users\JenkinsSlave\workspace\Lucene-Solr-trunk-Windows\solr\build\solr-core\test\J0\temp\solr.handler.component.DistributedSpellCheckComponentTest_B94F82D8026220FB-001\tempDir-001\shard0\lib
   [junit4]   2> 266949 INFO  (TEST-DistributedSpellCheckComponentTest.test-seed#[B94F82D8026220FB]) [    ] o.a.s.h.c.HttpShardHandlerFactory created with socketTimeout : 90000,urlScheme : https,connTimeout : 15000,maxConnectionsPerHost : 20,maxConnections : 10000,corePoolSize : 0,maximumPoolSize : 2147483647,maxThreadIdleTime : 5,sizeOfQueue : -1,fairnessPolicy : false,useRetries : false,
   [junit4]   2> 266953 INFO  (TEST-DistributedSpellCheckComponentTest.test-seed#[B94F82D8026220FB]) [    ] o.a.s.u.UpdateShardHandler Creating UpdateShardHandler HTTP client with params: socketTimeout=340000&connTimeout=45000&retry=true
   [junit4]   2> 266957 INFO  (TEST-DistributedSpellCheckComponentTest.test-seed#[B94F82D8026220FB]) [    ] o.a.s.l.LogWatcher SLF4J impl is org.slf4j.impl.Log4jLoggerFactory
   [junit4]   2> 266957 INFO  (TEST-DistributedSpellCheckComponentTest.test-seed#[B94F82D8026220FB]) [    ] o.a.s.l.LogWatcher Registering Log Listener [Log4j (org.slf4j.impl.Log4jLoggerFactory)]
   [junit4]   2> 266957 INFO  (TEST-DistributedSpellCheckComponentTest.test-seed#[B94F82D8026220FB]) [    ] o.a.s.c.CoreContainer Security conf doesn't exist. Skipping setup for authorization module.
   [junit4]   2> 266957 INFO  (TEST-DistributedSpellCheckComponentTest.test-seed#[B94F82D8026220FB]) [    ] o.a.s.c.CoreContainer No authentication plugin used.
   [junit4]   2> 266958 INFO  (TEST-DistributedSpellCheckComponentTest.test-seed#[B94F82D8026220FB]) [    ] o.a.s.c.CorePropertiesLocator Looking for core definitions underneath C:\Users\JenkinsSlave\workspace\Lucene-Solr-trunk-Windows\solr\build\solr-core\test\J0\temp\solr.handler.component.DistributedSpellCheckComponentTest_B94F82D8026220FB-001\tempDir-001\shard0\cores
   [junit4]   2> 266959 INFO  (TEST-DistributedSpellCheckComponentTest.test-seed#[B94F82D8026220FB]) [    ] o.a.s.c.CoreDescriptor Created CoreDescriptor: {name=collection1, config=solrconfig.xml, loadOnStartup=true, schema=schema.xml, configSetProperties=configsetprops.json, transient=false, dataDir=data\, configSet=collection1}
   [junit4]   2> 266959 INFO  (TEST-DistributedSpellCheckComponentTest.test-seed#[B94F82D8026220FB]) [    ] o.a.s.c.CorePropertiesLocator Found core collection1 in C:\Users\JenkinsSlave\workspace\Lucene-Solr-trunk-Windows\solr\build\solr-core\test\J0\temp\solr.handler.component.DistributedSpellCheckComponentTest_B94F82D8026220FB-001\tempDir-001\shard0\cores\collection1
   [junit4]   2> 266960 INFO  (TEST-DistributedSpellCheckComponentTest.test-seed#[B94F82D8026220FB]) [    ] o.a.s.c.CorePropertiesLocator Found 1 core definitions
   [junit4]   2> 266960 INFO  (coreLoadExecutor-1202-thread-1) [    ] o.a.s.c.SolrResourceLoader new SolrResourceLoader for directory: 'C:\Users\JenkinsSlave\workspace\Lucene-Solr-trunk-Windows\solr\core\src\test-files\solr\collection1'
   [junit4]   2> 266960 INFO  (TEST-DistributedSpellCheckComponentTest.test-seed#[B94F82D8026220FB]) [    ] o.a.s.s.SolrDispatchFilter user.dir=C:\Users\JenkinsSlave\workspace\Lucene-Solr-trunk-Windows\solr\build\solr-core\test\J0
   [junit4]   2> 266961 INFO  (TEST-DistributedSpellCheckComponentTest.test-seed#[B94F82D8026220FB]) [    ] o.a.s.s.SolrDispatchFilter SolrDispatchFilter.init() done
   [junit4]   2> 266961 INFO  (coreLoadExecutor-1202-thread-1) [    ] o.a.s.c.SolrResourceLoader JNDI not configured for solr (NoInitialContextEx)
   [junit4]   2> 266961 INFO  (coreLoadExecutor-1202-thread-1) [    ] o.a.s.c.SolrResourceLoader solr home defaulted to 'solr/' (could not find system property or JNDI)
   [junit4]   2> 266961 INFO  (coreLoadExecutor-1202-thread-1) [    ] o.a.s.c.SolrResourceLoader Adding 'file:/C:/Users/JenkinsSlave/workspace/Lucene-Solr-trunk-Windows/solr/core/src/test-files/solr/collection1/lib/classes/' to classloader
   [junit4]   2> 266961 INFO  (coreLoadExecutor-1202-thread-1) [    ] o.a.s.c.SolrResourceLoader Adding 'file:/C:/Users/JenkinsSlave/workspace/Lucene-Solr-trunk-Windows/solr/core/src/test-files/solr/collection1/lib/README' to classloader
   [junit4]   2> 267010 INFO  (coreLoadExecutor-1202-thread-1) [    ] o.a.s.c.SolrConfig current version of requestparams : -1
   [junit4]   2> 267026 INFO  (coreLoadExecutor-1202-thread-1) [    ] o.a.s.c.SolrConfig Using Lucene MatchVersion: 6.0.0
   [junit4]   2> 267043 INFO  (coreLoadExecutor-1202-thread-1) [    ] o.a.s.c.SolrConfig Loaded SolrConfig: solrconfig.xml
   [junit4]   2> 267051 INFO  (coreLoadExecutor-1202-thread-1) [    ] o.a.s.s.IndexSchema [collection1] Schema name=test
   [junit4]   2> 267139 INFO  (coreLoadExecutor-1202-thread-1) [    ] o.a.s.s.OpenExchangeRatesOrgProvider Initialized with rates=open-exchange-rates.json, refreshInterval=1440.
   [junit4]   2> 267148 INFO  (coreLoadExecutor-1202-thread-1) [    ] o.a.s.s.IndexSchema default search field in schema is text
   [junit4]   2> 267149 INFO  (coreLoadExecutor-1202-thread-1) [    ] o.a.s.s.IndexSchema unique key field: id
   [junit4]   2> 267159 INFO  (coreLoadExecutor-1202-thread-1) [    ] o.a.s.s.FileExchangeRateProvider Reloading exchange rates from file currency.xml
   [junit4]   2> 267160 INFO  (coreLoadExecutor-1202-thread-1) [    ] o.a.s.s.FileExchangeRateProvider Reloading exchange rates from file currency.xml
   [junit4]   2> 267163 INFO  (coreLoadExecutor-1202-thread-1) [    ] o.a.s.s.OpenExchangeRatesOrgProvider Reloading exchange rates from open-exchange-rates.json
   [junit4]   2> 267163 INFO  (coreLoadExecutor-1202-thread-1) [    ] o.a.s.s.OpenExchangeRatesOrgProvider Reloading exchange rates from open-exchange-rates.json
   [junit4]   2> 267170 INFO  (coreLoadExecutor-1202-thread-1) [    ] o.a.s.c.ConfigSetProperties Did not find ConfigSet properties, assuming default properties: Can't find resource 'configsetprops.json' in classpath or 'C:\Users\JenkinsSlave\workspace\Lucene-Solr-trunk-Windows\solr\core\src\test-files\solr\collection1'
   [junit4]   2> 267170 INFO  (coreLoadExecutor-1202-thread-1) [    ] o.a.s.c.CoreContainer Creating SolrCore 'collection1' using configuration from configset C:\Users\JenkinsSlave\workspace\Lucene-Solr-trunk-Windows\solr\core\src\test-files\solr\collection1
   [junit4]   2> 267171 INFO  (coreLoadExecutor-1202-thread-1) [    x:collection1] o.a.s.c.SolrCore solr.NRTCachingDirectoryFactory
   [junit4]   2> 267171 INFO  (coreLoadExecutor-1202-thread-1) [    x:collection1] o.a.s.c.SolrCore [[collection1] ] Opening new SolrCore at [C:\Users\JenkinsSlave\workspace\Lucene-Solr-trunk-Windows\solr\core\src\test-files\solr\collection1], dataDir=[C:\Users\JenkinsSlave\workspace\Lucene-Solr-trunk-Windows\solr\build\solr-core\test\J0\temp\solr.handler.component.DistributedSpellCheckComponentTest_B94F82D8026220FB-001\tempDir-001\shard0\cores\collection1\data\]
   [junit4]   2> 267171 INFO  (coreLoadExecutor-1202-thread-1) [    x:collection1] o.a.s.c.JmxMonitoredMap JMX monitoring is enabled. Adding Solr mbeans to JMX Server: com.sun.jmx.mbeanserver.JmxMBeanServer@9826ef
   [junit4]   2> 267172 INFO  (coreLoadExecutor-1202-thread-1) [    x:collection1] o.a.s.c.CachingDirectoryFactory return new directory for C:\Users\JenkinsSlave\workspace\Lucene-Solr-trunk-Windows\solr\build\solr-core\test\J0\temp\solr.handler.component.DistributedSpellCheckComponentTest_B94F82D8026220FB-001\tempDir-001\shard0\cores\collection1\data
   [junit4]   2> 267173 INFO  (coreLoadExecutor-1202-thread-1) [    x:collection1] o.a.s.c.SolrCore New index directory detected: old=null new=C:\Users\JenkinsSlave\workspace\Lucene-Solr-trunk-Windows\solr\build\solr-core\test\J0\temp\solr.handler.component.DistributedSpellCheckComponentTest_B94F82D8026220FB-001\tempDir-001\shard0\cores\collection1\data\index/
   [junit4]   2> 267174 WARN  (coreLoadExecutor-1202-thread-1) [    x:collection1] o.a.s.c.SolrCore [collection1] Solr index directory 'C:\Users\JenkinsSlave\workspace\Lucene-Solr-trunk-Windows\solr\build\solr-core\test\J0\temp\solr.handler.component.DistributedSpellCheckComponentTest_B94F82D8026220FB-001\tempDir-001\shard0\cores\collection1\data\index' doesn't exist. Creating new index...
   [junit4]   2> 267175 INFO  (coreLoadExecutor-1202-thread-1) [    x:collection1] o.a.s.c.CachingDirectoryFactory return new directory for C:\Users\JenkinsSlave\workspace\Lucene-Solr-trunk-Windows\solr\build\solr-core\test\J0\temp\solr.handler.component.DistributedSpellCheckComponentTest_B94F82D8026220FB-001\tempDir-001\shard0\cores\collection1\data\index
   [junit4]   2> 267176 INFO  (coreLoadExecutor-1202-thread-1) [    x:collection1] o.a.s.u.RandomMergePolicy RandomMergePolicy wrapping class org.apache.lucene.index.TieredMergePolicy: [TieredMergePolicy: maxMergeAtOnce=50, maxMergeAtOnceExplicit=38, maxMergedSegmentMB=43.9765625, floorSegmentMB=1.6689453125, forceMergeDeletesPctAllowed=26.87039154773523, segmentsPerTier=34.0, maxCFSSegmentSizeMB=8.796093022207999E12, noCFSRatio=1.0
   [junit4]   2> 267301 INFO  (coreLoadExecutor-1202-thread-1) [    x:collection1] o.a.s.c.SolrDeletionPolicy SolrDeletionPolicy.onCommit: commits: num=1
   [junit4]   2> 	commit{dir=NRTCachingDirectory(SimpleFSDirectory@C:\Users\JenkinsSlave\workspace\Lucene-Solr-trunk-Windows\solr\build\solr-core\test\J0\temp\solr.handler.component.DistributedSpellCheckComponentTest_B94F82D8026220FB-001\tempDir-001\shard0\cores\collection1\data\index lockFactory=org.apache.lucene.store.SingleInstanceLockFactory@ab242b; maxCacheMB=48.0 maxMergeSizeMB=4.0),segFN=segments_1,generation=1}
   [junit4]   2> 267301 INFO  (coreLoadExecutor-1202-thread-1) [    x:collection1] o.a.s.c.SolrDeletionPolicy newest commit generation = 1
   [junit4]   2> 267302 INFO  (OldIndexDirectoryCleanupThreadForCore-collection1) [    x:collection1] o.a.s.c.SolrCore Looking for old index directories to cleanup for core collection1 in C:\Users\JenkinsSlave\workspace\Lucene-Solr-trunk-Windows\solr\build\solr-core\test\J0\temp\solr.handler.component.DistributedSpellCheckComponentTest_B94F82D8026220FB-001\tempDir-001\shard0\cores\collection1\data\
   [junit4]   2> 267309 INFO  (coreLoadExecutor-1202-thread-1) [    x:collection1] o.a.s.u.p.UpdateRequestProcessorChain creating updateRequestProcessorChain "dedupe"
   [junit4]   2> 267309 INFO  (coreLoadExecutor-1202-thread-1) [    x:collection1] o.a.s.u.p.UpdateRequestProcessorChain inserting DistributedUpdateProcessorFactory into updateRequestProcessorChain "dedupe"
   [junit4]   2> 267309 INFO  (coreLoadExecutor-1202-thread-1) [    x:collection1] o.a.s.u.p.UpdateRequestProcessorChain creating updateRequestProcessorChain "dedupe-allfields"
   [junit4]   2> 267309 INFO  (coreLoadExecutor-1202-thread-1) [    x:collection1] o.a.s.u.p.UpdateRequestProcessorChain inserting DistributedUpdateProcessorFactory into updateRequestProcessorChain "dedupe-allfields"
   [junit4]   2> 267309 INFO  (coreLoadExecutor-1202-thread-1) [    x:collection1] o.a.s.u.p.UpdateRequestProcessorChain creating updateRequestProcessorChain "stored_sig"
   [junit4]   2> 267309 INFO  (coreLoadExecutor-1202-thread-1) [    x:collection1] o.a.s.u.p.UpdateRequestProcessorChain inserting DistributedUpdateProcessorFactory into updateRequestProcessorChain "stored_sig"
   [junit4]   2> 267309 INFO  (coreLoadExecutor-1202-thread-1) [    x:collection1] o.a.s.u.p.UpdateRequestProcessorChain creating updateRequestProcessorChain "uniq-fields"
   [junit4]   2> 267309 INFO  (coreLoadExecutor-1202-thread-1) [    x:collection1] o.a.s.u.p.UpdateRequestProcessorChain inserting DistributedUpdateProcessorFactory into updateRequestProcessorChain "uniq-fields"
   [junit4]   2> 267309 INFO  (coreLoadExecutor-1202-thread-1) [    x:collection1] o.a.s.u.p.UpdateRequestProcessorChain creating updateRequestProcessorChain "distrib-dup-test-chain-explicit"
   [junit4]   2> 267309 INFO  (coreLoadExecutor-1202-thread-1) [    x:collection1] o.a.s.u.p.UpdateRequestProcessorChain creating updateRequestProcessorChain "distrib-dup-test-chain-implicit"
   [junit4]   2> 267310 INFO  (coreLoadExecutor-1202-thread-1) [    x:collection1] o.a.s.u.p.UpdateRequestProcessorChain inserting DistributedUpdateProcessorFactory into updateRequestProcessorChain "distrib-dup-test-chain-implicit"
   [junit4]   2> 267310 INFO  (coreLoadExecutor-1202-thread-1) [    x:collection1] o.a.s.c.SolrCore no updateRequestProcessorChain defined as default, creating implicit default
   [junit4]   2> 267318 INFO  (coreLoadExecutor-1202-thread-1) [    x:collection1] o.a.s.h.l.XMLLoader xsltCacheLifetimeSeconds=60
   [junit4]   2> 267320 INFO  (coreLoadExecutor-1202-thread-1) [    x:collection1] o.a.s.h.l.XMLLoader xsltCacheLifetimeSeconds=60
   [junit4]   2> 267321 INFO  (coreLoadExecutor-1202-thread-1) [    x:collection1] o.a.s.h.l.XMLLoader xsltCacheLifetimeSeconds=60
   [junit4]   2> 267323 INFO  (coreLoadExecutor-1202-thread-1) [    x:collection1] o.a.s.h.l.XMLLoader xsltCacheLifetimeSeconds=60
   [junit4]   2> 267343 INFO  (coreLoadExecutor-1202-thread-1) [    x:collection1] o.a.s.c.PluginBag requestHandler : 'lazy' created with startup=lazy 
   [junit4]   2> 267352 INFO  (coreLoadExecutor-1202-thread-1) [    x:collection1] o.a.s.c.RequestHandlers Registered paths: /admin/mbeans,standard,spellCheckCompRH,lazy,/update/json/docs,/admin/luke,/export,spellCheckWithWordbreak_Direct,tvrh,/get,/admin/properties,/update/json,mltrh,/admin/threads,/search-facet-def,/update/csv,/sql,/search-facet-invariants,/admin/segments,spellCheckCompRH1,/mlt,/admin/system,/replication,dismax,defaults,/config,/stream,/schema,/admin/plugins,/admin/logging,spellCheckWithWordbreak,mock,/admin/ping,/update,/admin/file,/terms,spellCheckCompRH_Direct,/debug/dump
   [junit4]   2> 267352 WARN  (coreLoadExecutor-1202-thread-1) [    x:collection1] o.a.s.c.SolrCore solrconfig.xml uses deprecated <admin/gettableFiles>, Please update your config to use the ShowFileRequestHandler.
   [junit4]   2> 267353 INFO  (coreLoadExecutor-1202-thread-1) [    x:collection1] o.a.s.c.SolrCore Using default statsCache cache: org.apache.solr.search.stats.LocalStatsCache
   [junit4]   2> 267354 INFO  (coreLoadExecutor-1202-thread-1) [    x:collection1] o.a.s.u.UpdateHandler Using UpdateLog implementation: org.apache.solr.update.UpdateLog
   [junit4]   2> 267354 INFO  (coreLoadExecutor-1202-thread-1) [    x:collection1] o.a.s.u.UpdateLog Initializing UpdateLog: dataDir= defaultSyncLevel=FLUSH numRecordsToKeep=100 maxNumLogsToKeep=10 numVersionBuckets=65536
   [junit4]   2> 267356 INFO  (coreLoadExecutor-1202-thread-1) [    x:collection1] o.a.s.u.CommitTracker Hard AutoCommit: disabled
   [junit4]   2> 267356 INFO  (coreLoadExecutor-1202-thread-1) [    x:collection1] o.a.s.u.CommitTracker Soft AutoCommit: disabled
   [junit4]   2> 267358 INFO  (coreLoadExecutor-1202-thread-1) [    x:collection1] o.a.s.u.RandomMergePolicy RandomMergePolicy wrapping class org.apache.lucene.index.AlcoholicMergePolicy: [AlcoholicMergePolicy: minMergeSize=0, mergeFactor=10, maxMergeSize=1487128900, maxMergeSizeForForcedMerge=9223372036854775807, calibrateSizeByDeletes=true, maxMergeDocs=2147483647, maxCFSSegmentSizeMB=8.796093022207999E12, noCFSRatio=0.1]
   [junit4]   2> 267359 INFO  (coreLoadExecutor-1202-thread-1) [    x:collection1] o.a.s.c.SolrDeletionPolicy SolrDeletionPolicy.onInit: commits: num=1
   [junit4]   2> 	commit{dir=NRTCachingDirectory(SimpleFSDirectory@C:\Users\JenkinsSlave\workspace\Lucene-Solr-trunk-Windows\solr\build\solr-core\test\J0\temp\solr.handler.component.DistributedSpellCheckComponentTest_B94F82D8026220FB-001\tempDir-001\shard0\cores\collection1\data\index lockFactory=org.apache.lucene.store.SingleInstanceLockFactory@ab242b; maxCacheMB=48.0 maxMergeSizeMB=4.0),segFN=segments_1,generation=1}
   [junit4]   2> 267359 INFO  (coreLoadExecutor-1202-thread-1) [    x:collection1] o.a.s.c.SolrDeletionPolicy newest commit generation = 1
   [junit4]   2> 267359 INFO  (coreLoadExecutor-1202-thread-1) [    x:collection1] o.a.s.s.SolrIndexSearcher Opening [Searcher@235908[collection1] main]
   [junit4]   2> 267360 INFO  (coreLoadExecutor-1202-thread-1) [    x:collection1] o.a.s.r.RestManager Initializing RestManager with initArgs: {storageIO=org.apache.solr.rest.ManagedResourceStorage$InMemoryStorageIO}
   [junit4]   2> 267360 INFO  (coreLoadExecutor-1202-thread-1) [    x:collection1] o.a.s.r.ManagedResourceStorage Reading _rest_managed.json using InMemoryStorage
   [junit4]   2> 267360 INFO  (coreLoadExecutor-1202-thread-1) [    x:collection1] o.a.s.r.RestManager Initializing 0 registered ManagedResources
   [junit4]   2> 267360 INFO  (coreLoadExecutor-1202-thread-1) [    x:collection1] o.a.s.h.c.SpellCheckComponent Initializing spell checkers
   [junit4]   2> 267410 INFO  (coreLoadExecutor-1202-thread-1) [    x:collection1] o.a.s.s.DirectSolrSpellChecker init: {name=direct,classname=DirectSolrSpellChecker,field=lowerfilt,minQueryLength=3}
   [junit4]   2> 267566 INFO  (coreLoadExecutor-1202-thread-1) [    x:collection1] o.a.s.h.ReplicationHandler Commits will be reserved for  10000
   [junit4]   2> 267566 INFO  (searcherExecutor-1203-thread-1-processing-x:collection1) [    x:collection1] o.a.s.h.c.SpellCheckComponent Loading spell index for spellchecker: default
   [junit4]   2> 267567 INFO  (searcherExecutor-1203-thread-1-processing-x:collection1) [    x:collection1] o.a.s.h.c.SpellCheckComponent Loading spell index for spellchecker: direct
   [junit4]   2> 267567 INFO  (searcherExecutor-1203-thread-1-processing-x:collection1) [    x:collection1] o.a.s.h.c.SpellCheckComponent Loading spell index for spellchecker: wordbreak
   [junit4]   2> 267567 INFO  (searcherExecutor-1203-thread-1-processing-x:collection1) [    x:collection1] o.a.s.h.c.SpellCheckComponent Loading spell index for spellchecker: multipleFields
   [junit4]   2> 267568 INFO  (searcherExecutor-1203-thread-1-processing-x:collection1) [    x:collection1] o.a.s.h.c.SpellCheckComponent Loading spell index for spellchecker: jarowinkler
   [junit4]   2> 267568 INFO  (searcherExecutor-1203-thread-1-processing-x:collection1) [    x:collection1] o.a.s.h.c.SpellCheckComponent Loading spell index for spellchecker: external
   [junit4]   2> 267568 INFO  (searcherExecutor-1203-thread-1-processing-x:collection1) [    x:collection1] o.a.s.h.c.SpellCheckComponent Loading spell index for spellchecker: freq
   [junit4]   2> 267569 INFO  (searcherExecutor-1203-thread-1-processing-x:collection1) [    x:collection1] o.a.s.h.c.SpellCheckComponent Loading spell index for spellchecker: fqcn
   [junit4]   2> 267569 INFO  (searcherExecutor-1203-thread-1-processing-x:collection1) [    x:collection1] o.a.s.h.c.SpellCheckComponent Loading spell index for spellchecker: perDict
   [junit4]   2> 267571 INFO  (searcherExecutor-1203-thread-1-processing-x:collection1) [    x:collection1] o.a.s.c.SolrCore [collection1] Registered new searcher Searcher@235908[collection1] main{ExitableDirectoryReader(UninvertingDirectoryReader())}
   [junit4]   2> 267572 INFO  (coreLoadExecutor-1202-thread-1) [    x:collection1] o.a.s.u.UpdateLog Looking up max value of version field to seed version buckets
   [junit4]   2> 267572 INFO  (coreLoadExecutor-1202-thread-1) [    x:collection1] o.a.s.u.VersionInfo Refreshing highest value of _version_ for 65536 version buckets from index
   [junit4]   2> 267572 INFO  (coreLoadExecutor-1202-thread-1) [    x:collection1] o.a.s.u.VersionInfo No terms found for _version_, cannot seed version bucket highest value from index
   [junit4]   2> 267572 INFO  (coreLoadExecutor-1202-thread-1) [    x:collection1] o.a.s.u.UpdateLog Could not find max version in index or recent updates, using new clock 1525668150373253120
   [junit4]   2> 267573 INFO  (coreLoadExecutor-1202-thread-1) [    x:collection1] o.a.s.u.UpdateLog Took 1.0ms to seed version buckets with highest version 1525668150373253120
   [junit4]   2> 267573 INFO  (coreLoadExecutor-1202-thread-1) [    x:collection1] o.a.s.c.CoreContainer registering core: collection1
   [junit4]   2> 267968 INFO  (TEST-DistributedSpellCheckComponentTest.test-seed#[B94F82D8026220FB]) [    ] o.a.s.SolrTestCaseJ4 ###Starting test
   [junit4]   2> 268053 INFO  (qtp18931032-2308) [    x:collection1] o.a.s.u.p.LogUpdateProcessorFactory [collection1]  webapp= path=/update params={wt=javabin&version=2}{deleteByQuery=*:* (-1525668150872375296)} 0 4
   [junit4]   2> 268125 INFO  (qtp21857174-2326) [    x:collection1] o.a.s.u.p.LogUpdateProcessorFactory [collection1]  webapp= path=/update params={wt=javabin&version=2}{deleteByQuery=*:* (-1525668150949969920)} 0 3
   [junit4]   2> 268136 INFO  (qtp18931032-2309) [    x:collection1] o.a.s.u.p.LogUpdateProcessorFactory [collection1]  webapp= path=/update params={wt=javabin&version=2}{add=[1 (1525668150957309952)]} 0 7
   [junit4]   2> 268145 INFO  (qtp21857174-2327) [    x:collection1] o.a.s.u.p.LogUpdateProcessorFactory [collection1]  webapp= path=/update params={wt=javabin&version=2}{add=[1 (1525668150969892864)]} 0 3
   [junit4]   2> 268150 INFO  (qtp18931032-2310) [    x:collection1] o.a.s.u.p.LogUpdateProcessorFactory [collection1]  webapp= path=/update params={wt=javabin&version=2}{add=[2 (1525668150978281472)]} 0 1
   [junit4]   2> 268156 INFO  (qtp21857174-2328) [    x:collection1] o.a.s.u.p.LogUpdateProcessorFactory [collection1]  webapp= path=/update params={wt=javabin&version=2}{add=[2 (1525668150984572928)]} 0 1
   [junit4]   2> 268160 INFO  (qtp18931032-2311) [    x:collection1] o.a.s.u.p.LogUpdateProcessorFactory [collection1]  webapp= path=/update params={wt=javabin&version=2}{add=[3 (1525668150989815808)]} 0 1
   [junit4]   2> 268166 INFO  (qtp21857174-2329) [    x:collection1] o.a.s.u.p.LogUpdateProcessorFactory [collection1]  webapp= path=/update params={wt=javabin&version=2}{add=[3 (1525668150995058688)]} 0 1
   [junit4]   2> 268172 INFO  (qtp18931032-2306) [    x:collection1] o.a.s.u.p.LogUpdateProcessorFactory [collection1]  webapp= path=/update params={wt=javabin&version=2}{add=[4 (1525668151000301568)]} 0 1
   [junit4]   2> 268177 INFO  (qtp21857174-2324) [    x:collection1] o.a.s.u.p.LogUpdateProcessorFactory [collection1]  webapp= path=/update params={wt=javabin&version=2}{add=[4 (1525668151006593024)]} 0 1
   [junit4]   2> 268182 INFO  (qtp18931032-2307) [    x:collection1] o.a.s.u.p.LogUpdateProcessorFactory [collection1]  webapp= path=/update params={wt=javabin&version=2}{add=[5 (1525668151011835904)]} 0 1
   [junit4]   2> 268186 INFO  (qtp21857174-2325) [    x:collection1] o.a.s.u.p.LogUpdateProcessorFactory [collection1]  webapp= path=/update params={wt=javabin&version=2}{add=[5 (1525668151016030208)]} 0 1
   [junit4]   2> 268191 INFO  (qtp18931032-2308) [    x:collection1] o.a.s.u.p.LogUpdateProcessorFactory [collection1]  webapp= path=/update params={wt=javabin&version=2}{add=[6 (1525668151020224512)]} 0 1
   [junit4]   2> 268195 INFO  (qtp21857174-2326) [    x:collection1] o.a.s.u.p.LogUpdateProcessorFactory [collection1]  webapp= path=/update params={wt=javabin&version=2}{add=[6 (1525668151025467392)]} 0 1
   [junit4]   2> 268200 INFO  (qtp18931032-2309) [    x:collection1] o.a.s.u.p.LogUpdateProcessorFactory [collection1]  webapp= path=/update params={wt=javabin&version=2}{add=[7 (1525668151030710272)]} 0 1
   [junit4]   2> 268203 INFO  (qtp21857174-2327) [    x:collection1] o.a.s.u.p.LogUpdateProcessorFactory [collection1]  webapp= path=/update params={wt=javabin&version=2}{add=[7 (1525668151033856000)]} 0 0
   [junit4]   2> 268208 INFO  (qtp18931032-2310) [    x:collection1] o.a.s.u.p.LogUpdateProcessorFactory [collection1]  webapp= path=/update params={wt=javabin&version=2}{add=[8 (1525668151038050304)]} 0 0
   [junit4]   2> 268212 INFO  (qtp21857174-2328) [    x:collection1] o.a.s.u.p.LogUpdateProcessorFactory [collection1]  webapp= path=/update params={wt=javabin&version=2}{add=[8 (1525668151043293184)]} 0 0
   [junit4]   2> 268217 INFO  (qtp18931032-2311) [    x:collection1] o.a.s.u.p.LogUpdateProcessorFactory [collection1]  webapp= path=/update params={wt=javabin&version=2}{add=[9 (1525668151047487488)]} 0 0
   [junit4]   2> 268220 INFO  (qtp21857174-2329) [    x:collection1] o.a.s.u.p.LogUpdateProcessorFactory [collection1]  webapp= path=/update params={wt=javabin&version=2}{add=[9 (1525668151051681792)]} 0 0
   [junit4]   2> 268224 INFO  (qtp18931032-2306) [    x:collection1] o.a.s.u.p.LogUpdateProcessorFactory [collection1]  webapp= path=/update params={wt=javabin&version=2}{add=[10 (1525668151055876096)]} 0 0
   [junit4]   2> 268228 INFO  (qtp21857174-2324) [    x:collection1] o.a.s.u.p.LogUpdateProcessorFactory [collection1]  webapp= path=/update params={wt=javabin&version=2}{add=[10 (1525668151060070400)]} 0 0
   [junit4]   2> 268232 INFO  (qtp18931032-2307) [    x:collection1] o.a.s.u.p.LogUpdateProcessorFactory [collection1]  webapp= path=/update params={wt=javabin&version=2}{add=[12 (1525668151065313280)]} 0 1
   [junit4]   2> 268236 INFO  (qtp21857174-2325) [    x:collection1] o.a.s.u.p.LogUpdateProcessorFactory [collection1]  webapp= path=/update params={wt=javabin&version=2}{add=[12 (1525668151068459008)]} 0 0
   [junit4]   2> 268240 INFO  (qtp18931032-2308) [    x:collection1] o.a.s.u.p.LogUpdateProcessorFactory [collection1]  webapp= path=/update params={wt=javabin&version=2}{add=[13 (1525668151072653312)]} 0 0
   [junit4]   2> 268243 INFO  (qtp21857174-2326) [    x:collection1] o.a.s.u.p.LogUpdateProcessorFactory [collection1]  webapp= path=/update params={wt=javabin&version=2}{add=[13 (1525668151076847616)]} 0 0
   [junit4]   2> 268247 INFO  (qtp18931032-2309) [    x:collection1] o.a.s.u.p.LogUpdateProcessorFactory [collection1]  webapp= path=/update params={wt=javabin&version=2}{add=[14 (1525668151081041920)]} 0 1
   [junit4]   2> 268251 INFO  (qtp21857174-2327) [    x:collection1] o.a.s.u.p.LogUpdateProcessorFactory [collection1]  webapp= path=/update params={wt=javabin&version=2}{add=[14 (1525668151084187648)]} 0 0
   [junit4]   2> 268255 INFO  (qtp18931032-2310) [    x:collection1] o.a.s.u.p.LogUpdateProcessorFactory [collection1]  webapp= path=/update params={wt=javabin&version=2}{add=[15 (1525668151088381952)]} 0 0
   [junit4]   2> 268259 INFO  (qtp21857174-2328) [    x:collection1] o.a.s.u.p.LogUpdateProcessorFactory [collection1]  webapp= path=/update params={wt=javabin&version=2}{add=[15 (1525668151093624832)]} 0 0
   [junit4]   2> 268263 INFO  (qtp18931032-2311) [    x:collection1] o.a.s.u.p.LogUpdateProcessorFactory [collection1]  webapp= path=/update params={wt=javabin&version=2}{add=[16 (1525668151097819136)]} 0 0
   [junit4]   2> 268267 INFO  (qtp21857174-2329) [    x:collection1] o.a.s.u.p.LogUpdateProcessorFactory [collection1]  webapp= path=/update params={wt=javabin&version=2}{add=[16 (1525668151100964864)]} 0 0
   [junit4]   2> 268271 INFO  (qtp18931032-2306) [    x:collection1] o.a.s.u.p.LogUpdateProcessorFactory [collection1]  webapp= path=/update params={wt=javabin&version=2}{add=[17 (1525668151105159168)]} 0 0
   [junit4]   2> 268275 INFO  (qtp21857174-2324) [    x:collection1] o.a.s.u.p.LogUpdateProcessorFactory [collection1]  webapp= path=/update params={wt=javabin&version=2}{add=[17 (1525668151110402048)]} 0 0
   [junit4]   2> 268279 INFO  (qtp18931032-2307) [    x:collection1] o.a.s.u.p.LogUpdateProcessorFactory [collection1]  webapp= path=/update params={wt=javabin&version=2}{add=[18 (1525668151113547776)]} 0 0
   [junit4]   2> 268283 INFO  (qtp21857174-2325) [    x:collection1] o.a.s.u.p.LogUpdateProcessorFactory [collection1]  webapp= path=/update params={wt=javabin&version=2}{add=[18 (1525668151117742080)]} 0 0
   [junit4]   2> 268285 INFO  (qtp18931032-2308) [    x:collection1] o.a.s.u.p.LogUpdateProcessorFactory [collection1]  webapp= path=/update params={wt=javabin&version=2}{add=[19 (1525668151120887808)]} 0 0
   [junit4]   2> 268289 INFO  (qtp21857174-2326) [    x:collection1] o.a.s.u.p.LogUpdateProcessorFactory [collection1]  webapp= path=/update params={wt=javabin&version=2}{add=[19 (1525668151124033536)]} 0 0
   [junit4]   2> 268293 INFO  (qtp18931032-2309) [    x:collection1] o.a.s.u.p.LogUpdateProcessorFactory [collection1]  webapp= path=/update params={wt=javabin&version=2}{add=[20 (1525668151128227840)]} 0 0
   [junit4]   2> 268297 INFO  (qtp21857174-2327) [    x:collection1] o.a.s.u.p.LogUpdateProcessorFactory [collection1]  webapp= path=/update params={wt=javabin&version=2}{add=[20 (1525668151132422144)]} 0 0
   [junit4]   2> 268300 INFO  (qtp18931032-2310) [    x:collection1] o.a.s.u.p.LogUpdateProcessorFactory [collection1]  webapp= path=/update params={wt=javabin&version=2}{add=[21 (1525668151136616448)]} 0 0
   [junit4]   2> 268304 INFO  (qtp21857174-2328) [    x:collection1] o.a.s.u.p.LogUpdateProcessorFactory [collection1]  webapp= path=/update params={wt=javabin&version=2}{add=[21 (1525668151139762176)]} 0 0
   [junit4]   2> 268307 INFO  (qtp18931032-2311) [    x:collection1] o.a.s.u.p.LogUpdateProcessorFactory [collection1]  webapp= path=/update params={wt=javabin&version=2}{add=[22 (1525668151142907904)]} 0 0
   [junit4]   2> 268310 INFO  (qtp21857174-2329) [    x:collection1] o.a.s.u.p.LogUpdateProcessorFactory [collection1]  webapp= path=/update params={wt=javabin&version=2}{add=[22 (1525668151146053632)]} 0 0
   [junit4]   2> 268314 INFO  (qtp18931032-2306) [    x:collection1] o.a.s.u.p.LogUpdateProcessorFactory [collection1]  webapp= path=/update params={wt=javabin&version=2}{add=[23 (1525668151150247936)]} 0 0
   [junit4]   2> 268318 INFO  (qtp21857174-2324) [    x:collection1] o.a.s.u.p.LogUpdateProcessorFactory [collection1]  webapp= path=/update params={wt=javabin&version=2}{add=[23 (1525668151154442240)]} 0 0
   [junit4]   2> 268322 INFO  (qtp18931032-2307) [    x:collection1] o.a.s.u.p.LogUpdateProcessorFactory [collection1]  webapp= path=/update params={wt=javabin&version=2}{add=[24 (1525668151158636544)]} 0 1
   [junit4]   2> 268326 INFO  (qtp21857174-2325) [    x:collection1] o.a.s.u.p.LogUpdateProcessorFactory [collection1]  webapp= path=/update params={wt=javabin&version=2}{add=[24 (1525668151162830848)]} 0 0
   [junit4]   2> 268328 INFO  (qtp18931032-2308) [    x:collection1] o.a.s.u.p.LogUpdateProcessorFactory [collection1]  webapp= path=/update params={wt=javabin&version=2}{add=[25 (1525668151164928000)]} 0 0
   [junit4]   2> 268332 INFO  (qtp21857174-2326) [    x:collection1] o.a.s.u.p.LogUpdateProcessorFactory [collection1]  webapp= path=/update params={wt=javabin&version=2}{add=[25 (1525668151169122304)]} 0 0
   [junit4]   2> 268335 INFO  (qtp18931032-2309) [    x:collection1] o.a.s.u.p.LogUpdateProcessorFactory [collection1]  webapp= path=/update params={wt=javabin&version=2}{add=[26 (1525668151172268032)]} 0 0
   [junit4]   2> 268338 INFO  (qtp21857174-2327) [    x:collection1] o.a.s.u.p.LogUpdateProcessorFactory [collection1]  webapp= path=/update params={wt=javabin&version=2}{add=[26 (1525668151176462336)]} 0 0
   [junit4]   2> 268341 INFO  (qtp18931032-2310) [    x:collection1] o.a.s.u.DirectUpdateHandler2 start commit{,optimize=false,openSearcher=true,waitSearcher=true,expungeDeletes=false,softCommit=false,prepareCommit=false}
   [junit4]   2> 268584 INFO  (qtp18931032-2310) [    x:collection1] o.a.s.c.SolrDeletionPolicy SolrDeletionPolicy.onCommit: commits: num=2
   [junit4]   2> 	commit{dir=NRTCachingDirectory(SimpleFSDirectory@C:\Users\JenkinsSlave\workspace\Lucene-Solr-trunk-Windows\solr\build\solr-core\test\J0\temp\solr.handler.component.DistributedSpellCheckComponentTest_B94F82D80262

[...truncated too long message...]

SUITE-SpellCheckComponentTest-seed#[B94F82D8026220FB]-worker) [    ] o.a.s.c.CoreContainer Shutting down CoreContainer instance=19418071
   [junit4]   2> 1930054 INFO  (coreCloseExecutor-6193-thread-1) [    x:collection1] o.a.s.c.SolrCore [collection1]  CLOSING SolrCore org.apache.solr.core.SolrCore@6bf801
   [junit4]   2> 1930054 INFO  (coreCloseExecutor-6193-thread-1) [    x:collection1] o.a.s.u.DirectUpdateHandler2 closing DirectUpdateHandler2{commits=24,autocommits=0,soft autocommits=0,optimizes=0,rollbacks=0,expungeDeletes=0,docsPending=0,adds=0,deletesById=0,deletesByQuery=0,errors=0,cumulative_adds=112,cumulative_deletesById=0,cumulative_deletesByQuery=11,cumulative_errors=0}
   [junit4]   2> 1930055 INFO  (coreCloseExecutor-6193-thread-1) [    x:collection1] o.a.s.u.SolrCoreState Closing SolrCoreState
   [junit4]   2> 1930055 INFO  (coreCloseExecutor-6193-thread-1) [    x:collection1] o.a.s.u.DefaultSolrCoreState SolrCoreState ref count has reached 0 - closing IndexWriter
   [junit4]   2> 1930055 INFO  (coreCloseExecutor-6193-thread-1) [    x:collection1] o.a.s.u.DefaultSolrCoreState closing IndexWriter with IndexWriterCloser
   [junit4]   2> 1930055 INFO  (coreCloseExecutor-6193-thread-1) [    x:collection1] o.a.s.c.SolrCore [collection1] Closing main searcher on request.
   [junit4]   2> 1930055 INFO  (coreCloseExecutor-6193-thread-1) [    x:collection1] o.a.s.c.CachingDirectoryFactory Closing MockDirectoryFactory - 2 directories currently being tracked
   [junit4]   2> 1930055 INFO  (coreCloseExecutor-6193-thread-1) [    x:collection1] o.a.s.c.CachingDirectoryFactory looking to close C:\Users\JenkinsSlave\workspace\Lucene-Solr-trunk-Windows\solr\build\solr-core\test\J0\temp\solr.handler.component.SpellCheckComponentTest_B94F82D8026220FB-001\init-core-data-001\index [CachedDir<<refCount=0;path=C:\Users\JenkinsSlave\workspace\Lucene-Solr-trunk-Windows\solr\build\solr-core\test\J0\temp\solr.handler.component.SpellCheckComponentTest_B94F82D8026220FB-001\init-core-data-001\index;done=false>>]
   [junit4]   2> 1930056 INFO  (coreCloseExecutor-6193-thread-1) [    x:collection1] o.a.s.c.CachingDirectoryFactory Closing directory: C:\Users\JenkinsSlave\workspace\Lucene-Solr-trunk-Windows\solr\build\solr-core\test\J0\temp\solr.handler.component.SpellCheckComponentTest_B94F82D8026220FB-001\init-core-data-001\index
   [junit4]   2> 1930056 INFO  (coreCloseExecutor-6193-thread-1) [    x:collection1] o.a.s.c.CachingDirectoryFactory looking to close C:\Users\JenkinsSlave\workspace\Lucene-Solr-trunk-Windows\solr\build\solr-core\test\J0\temp\solr.handler.component.SpellCheckComponentTest_B94F82D8026220FB-001\init-core-data-001\ [CachedDir<<refCount=0;path=C:\Users\JenkinsSlave\workspace\Lucene-Solr-trunk-Windows\solr\build\solr-core\test\J0\temp\solr.handler.component.SpellCheckComponentTest_B94F82D8026220FB-001\init-core-data-001\;done=false>>]
   [junit4]   2> 1930056 INFO  (coreCloseExecutor-6193-thread-1) [    x:collection1] o.a.s.c.CachingDirectoryFactory Closing directory: C:\Users\JenkinsSlave\workspace\Lucene-Solr-trunk-Windows\solr\build\solr-core\test\J0\temp\solr.handler.component.SpellCheckComponentTest_B94F82D8026220FB-001\init-core-data-001\
   [junit4]   2> NOTE: leaving temporary files on disk at: C:\Users\JenkinsSlave\workspace\Lucene-Solr-trunk-Windows\solr\build\solr-core\test\J0\temp\solr.handler.component.SpellCheckComponentTest_B94F82D8026220FB-001
   [junit4]   2> NOTE: test params are: codec=Asserting(Lucene60): {start1=Lucene50(blocksize=128), range_facet_l_dv=PostingsFormat(name=Memory doPackFST= true), multiDefault=PostingsFormat(name=Direct), intDefault=PostingsFormat(name=MockRandom), range_facet_l=PostingsFormat(name=MockRandom), lowerfilt1and2=PostingsFormat(name=Direct), end4=Lucene50(blocksize=128), end3=PostingsFormat(name=Direct), end2=PostingsFormat(name=Memory doPackFST= true), end1=PostingsFormat(name=MockRandom), lowerfilt=PostingsFormat(name=Direct), gram1=PostingsFormat(name=MockRandom), id=PostingsFormat(name=Memory doPackFST= true), range_facet_i_dv=PostingsFormat(name=MockRandom), gram2=PostingsFormat(name=Memory doPackFST= true), gram3=PostingsFormat(name=Direct), start3=PostingsFormat(name=Memory doPackFST= true), gram4=Lucene50(blocksize=128), start2=PostingsFormat(name=Direct), word=PostingsFormat(name=MockRandom), timestamp=PostingsFormat(name=MockRandom), start4=PostingsFormat(name=MockRandom)}, docValues:{range_facet_l_dv=DocValuesFormat(name=Asserting), range_facet_i_dv=DocValuesFormat(name=Lucene54), timestamp=DocValuesFormat(name=Lucene54)}, sim=RandomSimilarity(queryNorm=true,coord=no): {}, locale=ar-IQ, timezone=America/Argentina/ComodRivadavia
   [junit4]   2> NOTE: Windows 7 6.1 x86/Oracle Corporation 1.8.0_72 (32-bit)/cpus=3,threads=1,free=181559840,total=354156544
   [junit4]   2> NOTE: All tests run in this JVM: [TestLFUCache, DistribCursorPagingTest, TestRemoteStreaming, DirectUpdateHandlerTest, HdfsUnloadDistributedZkTest, TestReplicationHandler, HdfsBasicDistributedZk2Test, ShardRoutingTest, ZkCLITest, TestDownShardTolerantSearch, TestManagedSchema, HdfsThreadLeakTest, DistributedSpellCheckComponentTest, LeaderElectionTest, TestQuerySenderNoQuery, TestPerFieldSimilarityClassic, ResponseHeaderTest, DistributedQueryComponentOptimizationTest, TestDocumentBuilder, AlternateDirectoryTest, DistributedFacetPivotWhiteBoxTest, AsyncMigrateRouteKeyTest, TestSolrCloudWithKerberosAlt, DistribJoinFromCollectionTest, TimeZoneUtilsTest, TestFastLRUCache, TestSolrDeletionPolicy1, SimplePostToolTest, TestImplicitCoreProperties, JavabinLoaderTest, TestUseDocValuesAsStored, DocumentBuilderTest, TestSolrQueryParserDefaultOperatorResource, TestExactStatsCache, BlockJoinFacetSimpleTest, TestDocBasedVersionConstraints, SoftAutoCommitTest, DeleteLastCustomShardedReplicaTest, SystemInfoHandlerTest, WrapperMergePolicyFactoryTest, CursorMarkTest, CircularListTest, SolrRequestParserTest, UpdateParamsTest, RankQueryTest, PathHierarchyTokenizerFactoryTest, SyncSliceTest, ActionThrottleTest, OutOfBoxZkACLAndCredentialsProvidersTest, StressHdfsTest, DeleteShardTest, TestPartialUpdateDeduplication, HdfsCollectionsAPIDistributedZkTest, HdfsChaosMonkeyNothingIsSafeTest, QueryElevationComponentTest, HdfsDirectoryTest, BigEndianAscendingWordDeserializerTest, TestStressUserVersions, TestDistribIDF, BadComponentTest, TestUniqueKeyFieldResource, TestHashPartitioner, ReplicationFactorTest, ClusterStateTest, TestElisionMultitermQuery, SolrXmlInZkTest, TestConfigSets, TestCloudSchemaless, ConfigSetsAPITest, TestFunctionQuery, DirectSolrSpellCheckerTest, TestCollectionAPI, ZkControllerTest, TestFieldTypeResource, TestIntervalFaceting, TestConfigSetsAPIExclusivity, DistributedQueryElevationComponentTest, FullHLLTest, TestBlobHandler, DisMaxRequestHandlerTest, TestRestManager, TestFieldResource, SolrIndexConfigTest, PrimUtilsTest, TestArbitraryIndexDir, TestReRankQParserPlugin, TestDFISimilarityFactory, TestAnalyzedSuggestions, CollectionStateFormat2Test, TestDocSet, TriLevelCompositeIdRoutingTest, TermsComponentTest, TestRandomRequestDistribution, TestSort, SaslZkACLProviderTest, CdcrUpdateLogTest, TestMinMaxOnMultiValuedField, TestSchemaVersionResource, TestComponentsName, TestJsonRequest, UnloadDistributedZkTest, TestRandomDVFaceting, TestSolrConfigHandlerCloud, TestDistributedStatsComponentCardinality, ExternalFileFieldSortTest, TestLMDirichletSimilarityFactory, SolrTestCaseJ4Test, SpatialFilterTest, TestRawResponseWriter, TestMergePolicyConfig, SharedFSAutoReplicaFailoverTest, TestSimpleQParserPlugin, HardAutoCommitTest, ZkStateReaderTest, SuggesterFSTTest, ExitableDirectoryReaderTest, TestFileDictionaryLookup, TestLRUCache, TestRuleBasedAuthorizationPlugin, AddBlockUpdateTest, DistributedDebugComponentTest, FastVectorHighlighterTest, TestLazyCores, ChaosMonkeyNothingIsSafeTest, PeerSyncTest, RollingRestartTest, TestEmbeddedSolrServerConstructors, TestLeaderElectionZkExpiry, SimpleMLTQParserTest, TestScoreJoinQPNoScore, TestIBSimilarityFactory, TestPivotHelperCode, TestRandomCollapseQParserPlugin, TestManagedResource, CursorPagingTest, BlockJoinFacetDistribTest, TestStressLucene, TestJmxIntegration, BasicDistributedZkTest, OverseerTest, RecoveryZkTest, FullSolrCloudDistribCmdsTest, TestDistributedGrouping, TestFaceting, TermVectorComponentDistributedTest, TestRealTimeGet, TestStressReorder, TestJoin, TestStressVersions, DistributedTermsComponentTest, TestRangeQuery, TestCoreContainer, SimpleFacetsTest, TestSolr4Spatial, SolrCoreTest, SpellCheckComponentTest]
   [junit4] Completed [313/579 (3!)] on J0 in 11.63s, 11 tests, 4 errors <<< FAILURES!

[...truncated 872 lines...]
BUILD FAILED
C:\Users\JenkinsSlave\workspace\Lucene-Solr-trunk-Windows\build.xml:740: The following error occurred while executing this line:
C:\Users\JenkinsSlave\workspace\Lucene-Solr-trunk-Windows\build.xml:684: The following error occurred while executing this line:
C:\Users\JenkinsSlave\workspace\Lucene-Solr-trunk-Windows\build.xml:59: The following error occurred while executing this line:
C:\Users\JenkinsSlave\workspace\Lucene-Solr-trunk-Windows\solr\build.xml:233: The following error occurred while executing this line:
C:\Users\JenkinsSlave\workspace\Lucene-Solr-trunk-Windows\solr\common-build.xml:524: The following error occurred while executing this line:
C:\Users\JenkinsSlave\workspace\Lucene-Solr-trunk-Windows\lucene\common-build.xml:1457: The following error occurred while executing this line:
C:\Users\JenkinsSlave\workspace\Lucene-Solr-trunk-Windows\lucene\common-build.xml:1014: There were test failures: 579 suites (8 ignored), 2323 tests, 1 suite-level error, 5 errors, 126 ignored (82 assumptions) [seed: B94F82D8026220FB]

Total time: 69 minutes 48 seconds
Build step 'Invoke Ant' marked build as failure
Archiving artifacts
[WARNINGS] Skipping publisher since build result is FAILURE
Recording test results
Email was triggered for: Failure - Any
Sending email for trigger: Failure - Any



Mime
View raw message