lucene-dev mailing list archives

Site index · List index
Message view « Date » · « Thread »
Top « Date » · « Thread »
From "Christine Poerschke (BLOOMBERG/ LONDON)" <cpoersc...@bloomberg.net>
Subject Re:[JENKINS] Lucene-Solr-5.x-MacOSX (64bit/jdk1.8.0) - Build # 2999 - Failure!
Date Mon, 01 Feb 2016 20:24:17 GMT
This is due to my LUCENE-7006 change adding this test. Able to reproduce (3 out of 3 times)
with given seed and args. Will look into further (though not today).

Christine

----- Original Message -----
From: dev@lucene.apache.org
To: cpoerschke@apache.org, dev@lucene.apache.org, sarowe@gmail.com
At: Feb  1 2016 20:16:19

Build: http://jenkins.thetaphi.de/job/Lucene-Solr-5.x-MacOSX/2999/
Java: 64bit/jdk1.8.0 -XX:+UseCompressedOops -XX:+UseConcMarkSweepGC

1 tests failed.
FAILED:  org.apache.lucene.index.TestSortingMergePolicy.testForceMergeNotNeeded

Error Message:


Stack Trace:
java.lang.AssertionError
    at __randomizedtesting.SeedInfo.seed([BAF97ED1D97DDEEE:A6DA06CB422235FB]:0)
    at org.apache.lucene.index.BaseMergePolicyTestCase$1.merge(BaseMergePolicyTestCase.java:44)
    at org.apache.lucene.index.IndexWriter.maybeMerge(IndexWriter.java:1931)
    at org.apache.lucene.index.IndexWriter.forceMerge(IndexWriter.java:1764)
    at org.apache.lucene.index.IndexWriter.forceMerge(IndexWriter.java:1721)
    at org.apache.lucene.index.BaseMergePolicyTestCase.testForceMergeNotNeeded(BaseMergePolicyTestCase.java:63)
    at sun.reflect.NativeMethodAccessorImpl.invoke0(Native Method)
    at sun.reflect.NativeMethodAccessorImpl.invoke(NativeMethodAccessorImpl.java:62)
    at sun.reflect.DelegatingMethodAccessorImpl.invoke(DelegatingMethodAccessorImpl.java:43)
    at java.lang.reflect.Method.invoke(Method.java:498)
    at com.carrotsearch.randomizedtesting.RandomizedRunner.invoke(RandomizedRunner.java:1764)
    at com.carrotsearch.randomizedtesting.RandomizedRunner$8.evaluate(RandomizedRunner.java:871)
    at com.carrotsearch.randomizedtesting.RandomizedRunner$9.evaluate(RandomizedRunner.java:907)
    at com.carrotsearch.randomizedtesting.RandomizedRunner$10.evaluate(RandomizedRunner.java:921)
    at org.apache.lucene.util.TestRuleSetupTeardownChained$1.evaluate(TestRuleSetupTeardownChained.java:50)
    at org.apache.lucene.util.AbstractBeforeAfterRule$1.evaluate(AbstractBeforeAfterRule.java:46)
    at org.apache.lucene.util.TestRuleThreadAndTestName$1.evaluate(TestRuleThreadAndTestName.java:49)
    at org.apache.lucene.util.TestRuleIgnoreAfterMaxFailures$1.evaluate(TestRuleIgnoreAfterMaxFailures.java:65)
    at org.apache.lucene.util.TestRuleMarkFailure$1.evaluate(TestRuleMarkFailure.java:48)
    at com.carrotsearch.randomizedtesting.rules.StatementAdapter.evaluate(StatementAdapter.java:36)
    at com.carrotsearch.randomizedtesting.ThreadLeakControl$StatementRunner.run(ThreadLeakControl.java:367)
    at com.carrotsearch.randomizedtesting.ThreadLeakControl.forkTimeoutingTask(ThreadLeakControl.java:809)
    at com.carrotsearch.randomizedtesting.ThreadLeakControl$3.evaluate(ThreadLeakControl.java:460)
    at com.carrotsearch.randomizedtesting.RandomizedRunner.runSingleTest(RandomizedRunner.java:880)
    at com.carrotsearch.randomizedtesting.RandomizedRunner$5.evaluate(RandomizedRunner.java:781)
    at com.carrotsearch.randomizedtesting.RandomizedRunner$6.evaluate(RandomizedRunner.java:816)
    at com.carrotsearch.randomizedtesting.RandomizedRunner$7.evaluate(RandomizedRunner.java:827)
    at org.apache.lucene.util.AbstractBeforeAfterRule$1.evaluate(AbstractBeforeAfterRule.java:46)
    at com.carrotsearch.randomizedtesting.rules.StatementAdapter.evaluate(StatementAdapter.java:36)
    at org.apache.lucene.util.TestRuleStoreClassName$1.evaluate(TestRuleStoreClassName.java:42)
    at com.carrotsearch.randomizedtesting.rules.NoShadowingOrOverridesOnMethodsRule$1.evaluate(NoShadowingOrOverridesOnMethodsRule.java:40)
    at com.carrotsearch.randomizedtesting.rules.NoShadowingOrOverridesOnMethodsRule$1.evaluate(NoShadowingOrOverridesOnMethodsRule.java:40)
    at com.carrotsearch.randomizedtesting.rules.StatementAdapter.evaluate(StatementAdapter.java:36)
    at com.carrotsearch.randomizedtesting.rules.StatementAdapter.evaluate(StatementAdapter.java:36)
    at com.carrotsearch.randomizedtesting.rules.StatementAdapter.evaluate(StatementAdapter.java:36)
    at org.apache.lucene.util.TestRuleAssertionsRequired$1.evaluate(TestRuleAssertionsRequired.java:54)
    at org.apache.lucene.util.TestRuleMarkFailure$1.evaluate(TestRuleMarkFailure.java:48)
    at org.apache.lucene.util.TestRuleIgnoreAfterMaxFailures$1.evaluate(TestRuleIgnoreAfterMaxFailures.java:65)
    at org.apache.lucene.util.TestRuleIgnoreTestSuites$1.evaluate(TestRuleIgnoreTestSuites.java:55)
    at com.carrotsearch.randomizedtesting.rules.StatementAdapter.evaluate(StatementAdapter.java:36)
    at com.carrotsearch.randomizedtesting.ThreadLeakControl$StatementRunner.run(ThreadLeakControl.java:367)
    at java.lang.Thread.run(Thread.java:745)




Build Log:
[...truncated 7636 lines...]
   [junit4] Suite: org.apache.lucene.index.TestSortingMergePolicy
   [junit4]   2> NOTE: reproduce with: ant test  -Dtestcase=TestSortingMergePolicy -Dtests.method=testForceMergeNotNeeded
-Dtests.seed=BAF97ED1D97DDEEE -Dtests.slow=true -Dtests.locale=nl-NL -Dtests.timezone=CST6CDT
-Dtests.asserts=true -Dtests.file.encoding=ISO-8859-1
   [junit4] FAILURE 0.57s J1 | TestSortingMergePolicy.testForceMergeNotNeeded <<<
   [junit4]    > Throwable #1: java.lang.AssertionError
   [junit4]    >     at __randomizedtesting.SeedInfo.seed([BAF97ED1D97DDEEE:A6DA06CB422235FB]:0)
   [junit4]    >     at org.apache.lucene.index.BaseMergePolicyTestCase$1.merge(BaseMergePolicyTestCase.java:44)
   [junit4]    >     at org.apache.lucene.index.IndexWriter.maybeMerge(IndexWriter.java:1931)
   [junit4]    >     at org.apache.lucene.index.IndexWriter.forceMerge(IndexWriter.java:1764)
   [junit4]    >     at org.apache.lucene.index.IndexWriter.forceMerge(IndexWriter.java:1721)
   [junit4]    >     at org.apache.lucene.index.BaseMergePolicyTestCase.testForceMergeNotNeeded(BaseMergePolicyTestCase.java:63)
   [junit4]    >     at java.lang.Thread.run(Thread.java:745)
   [junit4]   2> NOTE: leaving temporary files on disk at: /Users/jenkins/workspace/Lucene-Solr-5.x-MacOSX/lucene/build/misc/test/J1/temp/lucene.index.TestSortingMergePolicy_BAF97ED1D97DDEEE-001
   [junit4]   2> NOTE: test params are: codec=Asserting(Lucene54): {s=PostingsFormat(name=Memory
doPackFST= true)}, docValues:{ndv=DocValuesFormat(name=Direct)}, sim=RandomSimilarity(queryNorm=false,coord=yes):
{}, locale=nl-NL, timezone=CST6CDT
   [junit4]   2> NOTE: Mac OS X 10.8.5 x86_64/Oracle Corporation 1.8.0_72 (64-bit)/cpus=3,threads=1,free=28049296,total=54788096
   [junit4]   2> NOTE: All tests run in this JVM: [TestIndexSplitter, TestFieldCacheSanityChecker,
IndexSortingTest, TestDiversifiedTopDocsCollector, TestFieldCacheSortRandom, SweetSpotSimilarityTest,
TestPKIndexSplitter, TestMultiPassIndexSplitter, TestBlockJoinSorter, TestSortingMergePolicy]
   [junit4] Completed [13/25 (1!)] on J1 in 3.93s, 4 tests, 1 failure <<< FAILURES!

[...truncated 48 lines...]
BUILD FAILED
/Users/jenkins/workspace/Lucene-Solr-5.x-MacOSX/build.xml:750: The following error occurred
while executing this line:
/Users/jenkins/workspace/Lucene-Solr-5.x-MacOSX/build.xml:694: The following error occurred
while executing this line:
/Users/jenkins/workspace/Lucene-Solr-5.x-MacOSX/build.xml:59: The following error occurred
while executing this line:
/Users/jenkins/workspace/Lucene-Solr-5.x-MacOSX/lucene/build.xml:475: The following error
occurred while executing this line:
/Users/jenkins/workspace/Lucene-Solr-5.x-MacOSX/lucene/common-build.xml:2273: The following
error occurred while executing this line:
/Users/jenkins/workspace/Lucene-Solr-5.x-MacOSX/lucene/module-build.xml:58: The following
error occurred while executing this line:
/Users/jenkins/workspace/Lucene-Solr-5.x-MacOSX/lucene/common-build.xml:1477: The following
error occurred while executing this line:
/Users/jenkins/workspace/Lucene-Solr-5.x-MacOSX/lucene/common-build.xml:1033: There were test
failures: 25 suites, 188 tests, 1 failure, 1 ignored (1 assumption) [seed: BAF97ED1D97DDEEE]

Total time: 18 minutes 26 seconds
Build step 'Invoke Ant' marked build as failure
Archiving artifacts
[WARNINGS] Skipping publisher since build result is FAILURE
Recording test results
Email was triggered for: Failure - Any
Sending email for trigger: Failure - Any



----------------------------


---------------------------------------------------------------------
To unsubscribe, e-mail: dev-unsubscribe@lucene.apache.org
For additional commands, e-mail: dev-help@lucene.apache.org

Mime
View raw message