lucene-dev mailing list archives

Site index · List index
Message view « Date » · « Thread »
Top « Date » · « Thread »
From Apache Jenkins Server <jenk...@builds.apache.org>
Subject [JENKINS] Lucene-Solr-Tests-trunk-Java8 - Build # 837 - Still Failing
Date Mon, 15 Feb 2016 14:53:26 GMT
Build: https://builds.apache.org/job/Lucene-Solr-Tests-trunk-Java8/837/

1 tests failed.
FAILED:  org.apache.solr.update.AutoCommitTest.testMaxDocs

Error Message:
Exception during query

Stack Trace:
java.lang.RuntimeException: Exception during query
	at __randomizedtesting.SeedInfo.seed([1CD09CDE4A4839F6:A5514A0166A23D7C]:0)
	at org.apache.solr.SolrTestCaseJ4.assertQ(SolrTestCaseJ4.java:754)
	at org.apache.solr.update.AutoCommitTest.testMaxDocs(AutoCommitTest.java:198)
	at sun.reflect.NativeMethodAccessorImpl.invoke0(Native Method)
	at sun.reflect.NativeMethodAccessorImpl.invoke(NativeMethodAccessorImpl.java:62)
	at sun.reflect.DelegatingMethodAccessorImpl.invoke(DelegatingMethodAccessorImpl.java:43)
	at java.lang.reflect.Method.invoke(Method.java:497)
	at com.carrotsearch.randomizedtesting.RandomizedRunner.invoke(RandomizedRunner.java:1764)
	at com.carrotsearch.randomizedtesting.RandomizedRunner$8.evaluate(RandomizedRunner.java:871)
	at com.carrotsearch.randomizedtesting.RandomizedRunner$9.evaluate(RandomizedRunner.java:907)
	at com.carrotsearch.randomizedtesting.RandomizedRunner$10.evaluate(RandomizedRunner.java:921)
	at com.carrotsearch.randomizedtesting.rules.SystemPropertiesRestoreRule$1.evaluate(SystemPropertiesRestoreRule.java:57)
	at org.apache.lucene.util.TestRuleSetupTeardownChained$1.evaluate(TestRuleSetupTeardownChained.java:49)
	at org.apache.lucene.util.AbstractBeforeAfterRule$1.evaluate(AbstractBeforeAfterRule.java:45)
	at org.apache.lucene.util.TestRuleThreadAndTestName$1.evaluate(TestRuleThreadAndTestName.java:48)
	at org.apache.lucene.util.TestRuleIgnoreAfterMaxFailures$1.evaluate(TestRuleIgnoreAfterMaxFailures.java:64)
	at org.apache.lucene.util.TestRuleMarkFailure$1.evaluate(TestRuleMarkFailure.java:47)
	at com.carrotsearch.randomizedtesting.rules.StatementAdapter.evaluate(StatementAdapter.java:36)
	at com.carrotsearch.randomizedtesting.ThreadLeakControl$StatementRunner.run(ThreadLeakControl.java:367)
	at com.carrotsearch.randomizedtesting.ThreadLeakControl.forkTimeoutingTask(ThreadLeakControl.java:809)
	at com.carrotsearch.randomizedtesting.ThreadLeakControl$3.evaluate(ThreadLeakControl.java:460)
	at com.carrotsearch.randomizedtesting.RandomizedRunner.runSingleTest(RandomizedRunner.java:880)
	at com.carrotsearch.randomizedtesting.RandomizedRunner$5.evaluate(RandomizedRunner.java:781)
	at com.carrotsearch.randomizedtesting.RandomizedRunner$6.evaluate(RandomizedRunner.java:816)
	at com.carrotsearch.randomizedtesting.RandomizedRunner$7.evaluate(RandomizedRunner.java:827)
	at com.carrotsearch.randomizedtesting.rules.StatementAdapter.evaluate(StatementAdapter.java:36)
	at com.carrotsearch.randomizedtesting.rules.SystemPropertiesRestoreRule$1.evaluate(SystemPropertiesRestoreRule.java:57)
	at org.apache.lucene.util.AbstractBeforeAfterRule$1.evaluate(AbstractBeforeAfterRule.java:45)
	at com.carrotsearch.randomizedtesting.rules.StatementAdapter.evaluate(StatementAdapter.java:36)
	at org.apache.lucene.util.TestRuleStoreClassName$1.evaluate(TestRuleStoreClassName.java:41)
	at com.carrotsearch.randomizedtesting.rules.NoShadowingOrOverridesOnMethodsRule$1.evaluate(NoShadowingOrOverridesOnMethodsRule.java:40)
	at com.carrotsearch.randomizedtesting.rules.NoShadowingOrOverridesOnMethodsRule$1.evaluate(NoShadowingOrOverridesOnMethodsRule.java:40)
	at com.carrotsearch.randomizedtesting.rules.StatementAdapter.evaluate(StatementAdapter.java:36)
	at com.carrotsearch.randomizedtesting.rules.StatementAdapter.evaluate(StatementAdapter.java:36)
	at com.carrotsearch.randomizedtesting.rules.StatementAdapter.evaluate(StatementAdapter.java:36)
	at org.apache.lucene.util.TestRuleAssertionsRequired$1.evaluate(TestRuleAssertionsRequired.java:53)
	at org.apache.lucene.util.TestRuleMarkFailure$1.evaluate(TestRuleMarkFailure.java:47)
	at org.apache.lucene.util.TestRuleIgnoreAfterMaxFailures$1.evaluate(TestRuleIgnoreAfterMaxFailures.java:64)
	at org.apache.lucene.util.TestRuleIgnoreTestSuites$1.evaluate(TestRuleIgnoreTestSuites.java:54)
	at com.carrotsearch.randomizedtesting.rules.StatementAdapter.evaluate(StatementAdapter.java:36)
	at com.carrotsearch.randomizedtesting.ThreadLeakControl$StatementRunner.run(ThreadLeakControl.java:367)
	at java.lang.Thread.run(Thread.java:745)
Caused by: java.lang.RuntimeException: REQUEST FAILED: xpath=//result[@numFound=1]
	xml response was: <?xml version="1.0" encoding="UTF-8"?>
<response>
<lst name="responseHeader"><int name="status">0</int><int name="QTime">0</int></lst><result name="response" numFound="0" start="0"></result>
</response>

	request was:q=id:14&qt=standard&start=0&rows=20&version=2.2
	at org.apache.solr.SolrTestCaseJ4.assertQ(SolrTestCaseJ4.java:747)
	... 40 more




Build Log:
[...truncated 10419 lines...]
   [junit4] Suite: org.apache.solr.update.AutoCommitTest
   [junit4]   2> Creating dataDir: /x1/jenkins/jenkins-slave/workspace/Lucene-Solr-Tests-trunk-Java8/solr/build/solr-core/test/J2/temp/solr.update.AutoCommitTest_1CD09CDE4A4839F6-001/init-core-data-001
   [junit4]   2> 34083 INFO  (SUITE-AutoCommitTest-seed#[1CD09CDE4A4839F6]-worker) [    ] o.a.s.SolrTestCaseJ4 Randomized ssl (false) and clientAuth (true)
   [junit4]   2> 34083 INFO  (SUITE-AutoCommitTest-seed#[1CD09CDE4A4839F6]-worker) [    ] o.a.s.SolrTestCaseJ4 ####initCore
   [junit4]   2> 34083 INFO  (SUITE-AutoCommitTest-seed#[1CD09CDE4A4839F6]-worker) [    ] o.a.s.c.SolrResourceLoader new SolrResourceLoader for directory: '/x1/jenkins/jenkins-slave/workspace/Lucene-Solr-Tests-trunk-Java8/solr/core/src/test-files/solr/collection1'
   [junit4]   2> 34083 INFO  (SUITE-AutoCommitTest-seed#[1CD09CDE4A4839F6]-worker) [    ] o.a.s.c.SolrResourceLoader JNDI not configured for solr (NoInitialContextEx)
   [junit4]   2> 34083 INFO  (SUITE-AutoCommitTest-seed#[1CD09CDE4A4839F6]-worker) [    ] o.a.s.c.SolrResourceLoader using system property solr.solr.home: /x1/jenkins/jenkins-slave/workspace/Lucene-Solr-Tests-trunk-Java8/solr/core/src/test-files/solr
   [junit4]   2> 34085 INFO  (SUITE-AutoCommitTest-seed#[1CD09CDE4A4839F6]-worker) [    ] o.a.s.c.SolrResourceLoader Adding 'file:/x1/jenkins/jenkins-slave/workspace/Lucene-Solr-Tests-trunk-Java8/solr/core/src/test-files/solr/collection1/lib/classes/' to classloader
   [junit4]   2> 34085 INFO  (SUITE-AutoCommitTest-seed#[1CD09CDE4A4839F6]-worker) [    ] o.a.s.c.SolrResourceLoader Adding 'file:/x1/jenkins/jenkins-slave/workspace/Lucene-Solr-Tests-trunk-Java8/solr/core/src/test-files/solr/collection1/lib/README' to classloader
   [junit4]   2> 34154 INFO  (SUITE-AutoCommitTest-seed#[1CD09CDE4A4839F6]-worker) [    ] o.a.s.c.SolrConfig current version of requestparams : -1
   [junit4]   2> 34174 INFO  (SUITE-AutoCommitTest-seed#[1CD09CDE4A4839F6]-worker) [    ] o.a.s.c.SolrConfig Using Lucene MatchVersion: 6.0.0
   [junit4]   2> 34223 INFO  (SUITE-AutoCommitTest-seed#[1CD09CDE4A4839F6]-worker) [    ] o.a.s.c.SolrConfig Loaded SolrConfig: solrconfig.xml
   [junit4]   2> 34236 INFO  (SUITE-AutoCommitTest-seed#[1CD09CDE4A4839F6]-worker) [    ] o.a.s.s.IndexSchema [null] Schema name=test
   [junit4]   2> 34589 INFO  (SUITE-AutoCommitTest-seed#[1CD09CDE4A4839F6]-worker) [    ] o.a.s.s.OpenExchangeRatesOrgProvider Initialized with rates=open-exchange-rates.json, refreshInterval=1440.
   [junit4]   2> 34613 INFO  (SUITE-AutoCommitTest-seed#[1CD09CDE4A4839F6]-worker) [    ] o.a.s.s.IndexSchema default search field in schema is text
   [junit4]   2> 34614 INFO  (SUITE-AutoCommitTest-seed#[1CD09CDE4A4839F6]-worker) [    ] o.a.s.s.IndexSchema unique key field: id
   [junit4]   2> 34649 INFO  (SUITE-AutoCommitTest-seed#[1CD09CDE4A4839F6]-worker) [    ] o.a.s.s.FileExchangeRateProvider Reloading exchange rates from file currency.xml
   [junit4]   2> 34651 INFO  (SUITE-AutoCommitTest-seed#[1CD09CDE4A4839F6]-worker) [    ] o.a.s.s.FileExchangeRateProvider Reloading exchange rates from file currency.xml
   [junit4]   2> 34657 INFO  (SUITE-AutoCommitTest-seed#[1CD09CDE4A4839F6]-worker) [    ] o.a.s.s.OpenExchangeRatesOrgProvider Reloading exchange rates from open-exchange-rates.json
   [junit4]   2> 34659 INFO  (SUITE-AutoCommitTest-seed#[1CD09CDE4A4839F6]-worker) [    ] o.a.s.s.OpenExchangeRatesOrgProvider Reloading exchange rates from open-exchange-rates.json
   [junit4]   2> 34666 INFO  (SUITE-AutoCommitTest-seed#[1CD09CDE4A4839F6]-worker) [    ] o.a.s.c.SolrResourceLoader JNDI not configured for solr (NoInitialContextEx)
   [junit4]   2> 34666 INFO  (SUITE-AutoCommitTest-seed#[1CD09CDE4A4839F6]-worker) [    ] o.a.s.c.SolrResourceLoader using system property solr.solr.home: /x1/jenkins/jenkins-slave/workspace/Lucene-Solr-Tests-trunk-Java8/solr/core/src/test-files/solr
   [junit4]   2> 34666 INFO  (SUITE-AutoCommitTest-seed#[1CD09CDE4A4839F6]-worker) [    ] o.a.s.c.SolrResourceLoader new SolrResourceLoader for directory: '/x1/jenkins/jenkins-slave/workspace/Lucene-Solr-Tests-trunk-Java8/solr/core/src/test-files/solr'
   [junit4]   2> 34666 INFO  (SUITE-AutoCommitTest-seed#[1CD09CDE4A4839F6]-worker) [    ] o.a.s.c.SolrResourceLoader JNDI not configured for solr (NoInitialContextEx)
   [junit4]   2> 34666 INFO  (SUITE-AutoCommitTest-seed#[1CD09CDE4A4839F6]-worker) [    ] o.a.s.c.SolrResourceLoader using system property solr.solr.home: /x1/jenkins/jenkins-slave/workspace/Lucene-Solr-Tests-trunk-Java8/solr/core/src/test-files/solr
   [junit4]   2> 34666 INFO  (SUITE-AutoCommitTest-seed#[1CD09CDE4A4839F6]-worker) [    ] o.a.s.c.CoreContainer New CoreContainer 550672865
   [junit4]   2> 34666 INFO  (SUITE-AutoCommitTest-seed#[1CD09CDE4A4839F6]-worker) [    ] o.a.s.c.CoreContainer Loading cores into CoreContainer [instanceDir=/x1/jenkins/jenkins-slave/workspace/Lucene-Solr-Tests-trunk-Java8/solr/core/src/test-files/solr]
   [junit4]   2> 34667 WARN  (SUITE-AutoCommitTest-seed#[1CD09CDE4A4839F6]-worker) [    ] o.a.s.c.CoreContainer Couldn't add files from /x1/jenkins/jenkins-slave/workspace/Lucene-Solr-Tests-trunk-Java8/solr/core/src/test-files/solr/lib to classpath: /x1/jenkins/jenkins-slave/workspace/Lucene-Solr-Tests-trunk-Java8/solr/core/src/test-files/solr/lib
   [junit4]   2> 34667 INFO  (SUITE-AutoCommitTest-seed#[1CD09CDE4A4839F6]-worker) [    ] o.a.s.h.c.HttpShardHandlerFactory created with socketTimeout : 600000,connTimeout : 60000,maxConnectionsPerHost : 20,maxConnections : 10000,corePoolSize : 0,maximumPoolSize : 2147483647,maxThreadIdleTime : 5,sizeOfQueue : -1,fairnessPolicy : false,useRetries : false,
   [junit4]   2> 34678 INFO  (SUITE-AutoCommitTest-seed#[1CD09CDE4A4839F6]-worker) [    ] o.a.s.u.UpdateShardHandler Creating UpdateShardHandler HTTP client with params: socketTimeout=30000&connTimeout=30000&retry=true
   [junit4]   2> 34678 INFO  (SUITE-AutoCommitTest-seed#[1CD09CDE4A4839F6]-worker) [    ] o.a.s.l.LogWatcher SLF4J impl is org.slf4j.impl.Log4jLoggerFactory
   [junit4]   2> 34678 INFO  (SUITE-AutoCommitTest-seed#[1CD09CDE4A4839F6]-worker) [    ] o.a.s.l.LogWatcher Registering Log Listener [Log4j (org.slf4j.impl.Log4jLoggerFactory)]
   [junit4]   2> 34678 INFO  (SUITE-AutoCommitTest-seed#[1CD09CDE4A4839F6]-worker) [    ] o.a.s.c.CoreContainer Security conf doesn't exist. Skipping setup for authorization module.
   [junit4]   2> 34679 INFO  (SUITE-AutoCommitTest-seed#[1CD09CDE4A4839F6]-worker) [    ] o.a.s.c.CoreContainer No authentication plugin used.
   [junit4]   2> 34679 INFO  (SUITE-AutoCommitTest-seed#[1CD09CDE4A4839F6]-worker) [    ] o.a.s.c.CoreDescriptor Created CoreDescriptor: {name=collection1, config=solrconfig.xml, transient=false, schema=schema.xml, loadOnStartup=true, configSetProperties=configsetprops.json, collection=collection1, dataDir=/x1/jenkins/jenkins-slave/workspace/Lucene-Solr-Tests-trunk-Java8/solr/build/solr-core/test/J2/temp/solr.update.AutoCommitTest_1CD09CDE4A4839F6-001/init-core-data-001, shard=shard1}
   [junit4]   2> 34693 INFO  (coreLoadExecutor-298-thread-1) [    ] o.a.s.c.SolrResourceLoader new SolrResourceLoader for directory: '/x1/jenkins/jenkins-slave/workspace/Lucene-Solr-Tests-trunk-Java8/solr/core/src/test-files/solr/collection1'
   [junit4]   2> 34713 INFO  (coreLoadExecutor-298-thread-1) [    ] o.a.s.c.SolrResourceLoader JNDI not configured for solr (NoInitialContextEx)
   [junit4]   2> 34713 INFO  (coreLoadExecutor-298-thread-1) [    ] o.a.s.c.SolrResourceLoader using system property solr.solr.home: /x1/jenkins/jenkins-slave/workspace/Lucene-Solr-Tests-trunk-Java8/solr/core/src/test-files/solr
   [junit4]   2> 34714 INFO  (coreLoadExecutor-298-thread-1) [    ] o.a.s.c.SolrResourceLoader Adding 'file:/x1/jenkins/jenkins-slave/workspace/Lucene-Solr-Tests-trunk-Java8/solr/core/src/test-files/solr/collection1/lib/classes/' to classloader
   [junit4]   2> 34714 INFO  (coreLoadExecutor-298-thread-1) [    ] o.a.s.c.SolrResourceLoader Adding 'file:/x1/jenkins/jenkins-slave/workspace/Lucene-Solr-Tests-trunk-Java8/solr/core/src/test-files/solr/collection1/lib/README' to classloader
   [junit4]   2> 34759 INFO  (coreLoadExecutor-298-thread-1) [    ] o.a.s.c.SolrConfig current version of requestparams : -1
   [junit4]   2> 34930 INFO  (coreLoadExecutor-298-thread-1) [    ] o.a.s.c.SolrConfig Using Lucene MatchVersion: 6.0.0
   [junit4]   2> 34972 INFO  (coreLoadExecutor-298-thread-1) [    ] o.a.s.c.SolrConfig Loaded SolrConfig: solrconfig.xml
   [junit4]   2> 34990 INFO  (coreLoadExecutor-298-thread-1) [    ] o.a.s.s.IndexSchema [collection1] Schema name=test
   [junit4]   2> 35168 INFO  (coreLoadExecutor-298-thread-1) [    ] o.a.s.s.OpenExchangeRatesOrgProvider Initialized with rates=open-exchange-rates.json, refreshInterval=1440.
   [junit4]   2> 35176 INFO  (coreLoadExecutor-298-thread-1) [    ] o.a.s.s.IndexSchema default search field in schema is text
   [junit4]   2> 35177 INFO  (coreLoadExecutor-298-thread-1) [    ] o.a.s.s.IndexSchema unique key field: id
   [junit4]   2> 35206 INFO  (coreLoadExecutor-298-thread-1) [    ] o.a.s.s.FileExchangeRateProvider Reloading exchange rates from file currency.xml
   [junit4]   2> 35209 INFO  (coreLoadExecutor-298-thread-1) [    ] o.a.s.s.FileExchangeRateProvider Reloading exchange rates from file currency.xml
   [junit4]   2> 35210 INFO  (coreLoadExecutor-298-thread-1) [    ] o.a.s.s.OpenExchangeRatesOrgProvider Reloading exchange rates from open-exchange-rates.json
   [junit4]   2> 35210 INFO  (coreLoadExecutor-298-thread-1) [    ] o.a.s.s.OpenExchangeRatesOrgProvider Reloading exchange rates from open-exchange-rates.json
   [junit4]   2> 35237 INFO  (coreLoadExecutor-298-thread-1) [    ] o.a.s.c.ConfigSetProperties Did not find ConfigSet properties, assuming default properties: Can't find resource 'configsetprops.json' in classpath or '/x1/jenkins/jenkins-slave/workspace/Lucene-Solr-Tests-trunk-Java8/solr/core/src/test-files/solr/collection1'
   [junit4]   2> 35237 INFO  (coreLoadExecutor-298-thread-1) [    ] o.a.s.c.CoreContainer Creating SolrCore 'collection1' using configuration from instancedir /x1/jenkins/jenkins-slave/workspace/Lucene-Solr-Tests-trunk-Java8/solr/core/src/test-files/solr/collection1
   [junit4]   2> 35237 INFO  (coreLoadExecutor-298-thread-1) [    x:collection1] o.a.s.c.SolrCore org.apache.solr.core.MockDirectoryFactory
   [junit4]   2> 35238 INFO  (coreLoadExecutor-298-thread-1) [    x:collection1] o.a.s.c.SolrCore [[collection1] ] Opening new SolrCore at [/x1/jenkins/jenkins-slave/workspace/Lucene-Solr-Tests-trunk-Java8/solr/core/src/test-files/solr/collection1], dataDir=[/x1/jenkins/jenkins-slave/workspace/Lucene-Solr-Tests-trunk-Java8/solr/build/solr-core/test/J2/temp/solr.update.AutoCommitTest_1CD09CDE4A4839F6-001/init-core-data-001/]
   [junit4]   2> 35238 INFO  (coreLoadExecutor-298-thread-1) [    x:collection1] o.a.s.c.JmxMonitoredMap No JMX servers found, not exposing Solr information with JMX.
   [junit4]   2> 35238 INFO  (coreLoadExecutor-298-thread-1) [    x:collection1] o.a.s.c.CachingDirectoryFactory return new directory for /x1/jenkins/jenkins-slave/workspace/Lucene-Solr-Tests-trunk-Java8/solr/build/solr-core/test/J2/temp/solr.update.AutoCommitTest_1CD09CDE4A4839F6-001/init-core-data-001
   [junit4]   2> 35248 INFO  (coreLoadExecutor-298-thread-1) [    x:collection1] o.a.s.c.SolrCore New index directory detected: old=null new=/x1/jenkins/jenkins-slave/workspace/Lucene-Solr-Tests-trunk-Java8/solr/build/solr-core/test/J2/temp/solr.update.AutoCommitTest_1CD09CDE4A4839F6-001/init-core-data-001/index/
   [junit4]   2> 35248 WARN  (coreLoadExecutor-298-thread-1) [    x:collection1] o.a.s.c.SolrCore [collection1] Solr index directory '/x1/jenkins/jenkins-slave/workspace/Lucene-Solr-Tests-trunk-Java8/solr/build/solr-core/test/J2/temp/solr.update.AutoCommitTest_1CD09CDE4A4839F6-001/init-core-data-001/index' doesn't exist. Creating new index...
   [junit4]   2> 35253 INFO  (coreLoadExecutor-298-thread-1) [    x:collection1] o.a.s.c.CachingDirectoryFactory return new directory for /x1/jenkins/jenkins-slave/workspace/Lucene-Solr-Tests-trunk-Java8/solr/build/solr-core/test/J2/temp/solr.update.AutoCommitTest_1CD09CDE4A4839F6-001/init-core-data-001/index
   [junit4]   2> 35254 INFO  (coreLoadExecutor-298-thread-1) [    x:collection1] o.a.s.u.RandomMergePolicy RandomMergePolicy wrapping class org.apache.lucene.index.LogByteSizeMergePolicy: [LogByteSizeMergePolicy: minMergeSize=1677721, mergeFactor=34, maxMergeSize=2147483648, maxMergeSizeForForcedMerge=9223372036854775807, calibrateSizeByDeletes=true, maxMergeDocs=2147483647, maxCFSSegmentSizeMB=8.796093022207999E12, noCFSRatio=0.565392463062566]
   [junit4]   2> 35256 INFO  (coreLoadExecutor-298-thread-1) [    x:collection1] o.a.s.c.SolrDeletionPolicy SolrDeletionPolicy.onCommit: commits: num=1
   [junit4]   2> 	commit{dir=MockDirectoryWrapper(RAMDirectory@47450fc4 lockFactory=org.apache.lucene.store.SingleInstanceLockFactory@587f23ce),segFN=segments_1,generation=1}
   [junit4]   2> 35256 INFO  (coreLoadExecutor-298-thread-1) [    x:collection1] o.a.s.c.SolrDeletionPolicy newest commit generation = 1
   [junit4]   2> 35268 INFO  (coreLoadExecutor-298-thread-1) [    x:collection1] o.a.s.u.p.UpdateRequestProcessorChain creating updateRequestProcessorChain "dedupe"
   [junit4]   2> 35268 INFO  (coreLoadExecutor-298-thread-1) [    x:collection1] o.a.s.u.p.UpdateRequestProcessorChain inserting DistributedUpdateProcessorFactory into updateRequestProcessorChain "dedupe"
   [junit4]   2> 35268 INFO  (coreLoadExecutor-298-thread-1) [    x:collection1] o.a.s.u.p.UpdateRequestProcessorChain creating updateRequestProcessorChain "dedupe-allfields"
   [junit4]   2> 35268 INFO  (coreLoadExecutor-298-thread-1) [    x:collection1] o.a.s.u.p.UpdateRequestProcessorChain inserting DistributedUpdateProcessorFactory into updateRequestProcessorChain "dedupe-allfields"
   [junit4]   2> 35268 INFO  (coreLoadExecutor-298-thread-1) [    x:collection1] o.a.s.u.p.UpdateRequestProcessorChain creating updateRequestProcessorChain "stored_sig"
   [junit4]   2> 35268 INFO  (coreLoadExecutor-298-thread-1) [    x:collection1] o.a.s.u.p.UpdateRequestProcessorChain inserting DistributedUpdateProcessorFactory into updateRequestProcessorChain "stored_sig"
   [junit4]   2> 35268 INFO  (coreLoadExecutor-298-thread-1) [    x:collection1] o.a.s.u.p.UpdateRequestProcessorChain creating updateRequestProcessorChain "uniq-fields"
   [junit4]   2> 35269 INFO  (coreLoadExecutor-298-thread-1) [    x:collection1] o.a.s.u.p.UpdateRequestProcessorChain inserting DistributedUpdateProcessorFactory into updateRequestProcessorChain "uniq-fields"
   [junit4]   2> 35269 INFO  (coreLoadExecutor-298-thread-1) [    x:collection1] o.a.s.u.p.UpdateRequestProcessorChain creating updateRequestProcessorChain "distrib-dup-test-chain-explicit"
   [junit4]   2> 35269 INFO  (coreLoadExecutor-298-thread-1) [    x:collection1] o.a.s.u.p.UpdateRequestProcessorChain creating updateRequestProcessorChain "distrib-dup-test-chain-implicit"
   [junit4]   2> 35269 INFO  (coreLoadExecutor-298-thread-1) [    x:collection1] o.a.s.u.p.UpdateRequestProcessorChain inserting DistributedUpdateProcessorFactory into updateRequestProcessorChain "distrib-dup-test-chain-implicit"
   [junit4]   2> 35269 INFO  (coreLoadExecutor-298-thread-1) [    x:collection1] o.a.s.c.SolrCore no updateRequestProcessorChain defined as default, creating implicit default
   [junit4]   2> 35271 INFO  (coreLoadExecutor-298-thread-1) [    x:collection1] o.a.s.h.l.XMLLoader xsltCacheLifetimeSeconds=60
   [junit4]   2> 35272 INFO  (coreLoadExecutor-298-thread-1) [    x:collection1] o.a.s.h.l.XMLLoader xsltCacheLifetimeSeconds=60
   [junit4]   2> 35273 INFO  (coreLoadExecutor-298-thread-1) [    x:collection1] o.a.s.h.l.XMLLoader xsltCacheLifetimeSeconds=60
   [junit4]   2> 35274 INFO  (coreLoadExecutor-298-thread-1) [    x:collection1] o.a.s.h.l.XMLLoader xsltCacheLifetimeSeconds=60
   [junit4]   2> 35275 INFO  (OldIndexDirectoryCleanupThreadForCore-collection1) [    x:collection1] o.a.s.c.SolrCore Looking for old index directories to cleanup for core collection1 in /x1/jenkins/jenkins-slave/workspace/Lucene-Solr-Tests-trunk-Java8/solr/build/solr-core/test/J2/temp/solr.update.AutoCommitTest_1CD09CDE4A4839F6-001/init-core-data-001/
   [junit4]   2> 35277 INFO  (coreLoadExecutor-298-thread-1) [    x:collection1] o.a.s.c.PluginBag requestHandler : 'lazy' created with startup=lazy 
   [junit4]   2> 35277 INFO  (coreLoadExecutor-298-thread-1) [    x:collection1] o.a.s.c.RequestHandlers Registered paths: /admin/mbeans,standard,spellCheckCompRH,lazy,/update/json/docs,/admin/luke,/export,spellCheckWithWordbreak_Direct,tvrh,/get,/admin/properties,/update/json,mltrh,/admin/threads,/search-facet-def,/update/csv,/sql,/search-facet-invariants,/admin/segments,spellCheckCompRH1,/mlt,/admin/system,/replication,dismax,defaults,/config,/stream,/schema,/admin/plugins,/admin/logging,spellCheckWithWordbreak,mock,/admin/ping,/update,/admin/file,/terms,spellCheckCompRH_Direct,/debug/dump
   [junit4]   2> 35278 WARN  (coreLoadExecutor-298-thread-1) [    x:collection1] o.a.s.c.SolrCore solrconfig.xml uses deprecated <admin/gettableFiles>, Please update your config to use the ShowFileRequestHandler.
   [junit4]   2> 35278 INFO  (coreLoadExecutor-298-thread-1) [    x:collection1] o.a.s.c.SolrCore Using default statsCache cache: org.apache.solr.search.stats.LocalStatsCache
   [junit4]   2> 35293 INFO  (coreLoadExecutor-298-thread-1) [    x:collection1] o.a.s.u.UpdateHandler Using UpdateLog implementation: org.apache.solr.update.UpdateLog
   [junit4]   2> 35293 INFO  (coreLoadExecutor-298-thread-1) [    x:collection1] o.a.s.u.UpdateLog Initializing UpdateLog: dataDir= defaultSyncLevel=FLUSH numRecordsToKeep=100 maxNumLogsToKeep=10 numVersionBuckets=65536
   [junit4]   2> 35294 INFO  (coreLoadExecutor-298-thread-1) [    x:collection1] o.a.s.u.CommitTracker Hard AutoCommit: disabled
   [junit4]   2> 35294 INFO  (coreLoadExecutor-298-thread-1) [    x:collection1] o.a.s.u.CommitTracker Soft AutoCommit: disabled
   [junit4]   2> 35294 INFO  (coreLoadExecutor-298-thread-1) [    x:collection1] o.a.s.u.RandomMergePolicy RandomMergePolicy wrapping class org.apache.lucene.index.TieredMergePolicy: [TieredMergePolicy: maxMergeAtOnce=30, maxMergeAtOnceExplicit=25, maxMergedSegmentMB=95.15234375, floorSegmentMB=2.103515625, forceMergeDeletesPctAllowed=5.737694571419474, segmentsPerTier=27.0, maxCFSSegmentSizeMB=8.796093022207999E12, noCFSRatio=0.19001994331306343
   [junit4]   2> 35302 INFO  (coreLoadExecutor-298-thread-1) [    x:collection1] o.a.s.c.SolrDeletionPolicy SolrDeletionPolicy.onInit: commits: num=1
   [junit4]   2> 	commit{dir=MockDirectoryWrapper(RAMDirectory@47450fc4 lockFactory=org.apache.lucene.store.SingleInstanceLockFactory@587f23ce),segFN=segments_1,generation=1}
   [junit4]   2> 35302 INFO  (coreLoadExecutor-298-thread-1) [    x:collection1] o.a.s.c.SolrDeletionPolicy newest commit generation = 1
   [junit4]   2> 35302 INFO  (coreLoadExecutor-298-thread-1) [    x:collection1] o.a.s.s.SolrIndexSearcher Opening [Searcher@1dc77b98[collection1] main]
   [junit4]   2> 35303 INFO  (coreLoadExecutor-298-thread-1) [    x:collection1] o.a.s.r.RestManager Initializing RestManager with initArgs: {storageIO=org.apache.solr.rest.ManagedResourceStorage$InMemoryStorageIO}
   [junit4]   2> 35303 INFO  (coreLoadExecutor-298-thread-1) [    x:collection1] o.a.s.r.ManagedResourceStorage Reading _rest_managed.json using InMemoryStorage
   [junit4]   2> 35303 INFO  (coreLoadExecutor-298-thread-1) [    x:collection1] o.a.s.r.RestManager Initializing 0 registered ManagedResources
   [junit4]   2> 35303 INFO  (coreLoadExecutor-298-thread-1) [    x:collection1] o.a.s.h.c.SpellCheckComponent Initializing spell checkers
   [junit4]   2> 35313 INFO  (coreLoadExecutor-298-thread-1) [    x:collection1] o.a.s.s.DirectSolrSpellChecker init: {name=direct,classname=DirectSolrSpellChecker,field=lowerfilt,minQueryLength=3}
   [junit4]   2> 35392 INFO  (coreLoadExecutor-298-thread-1) [    x:collection1] o.a.s.h.ReplicationHandler Commits will be reserved for  10000
   [junit4]   2> 35392 INFO  (searcherExecutor-299-thread-1-processing-x:collection1) [    x:collection1] o.a.s.h.c.SpellCheckComponent Loading spell index for spellchecker: default
   [junit4]   2> 35393 INFO  (coreLoadExecutor-298-thread-1) [    x:collection1] o.a.s.u.UpdateLog Looking up max value of version field to seed version buckets
   [junit4]   2> 35393 INFO  (coreLoadExecutor-298-thread-1) [    x:collection1] o.a.s.u.VersionInfo Refreshing highest value of _version_ for 65536 version buckets from index
   [junit4]   2> 35393 INFO  (coreLoadExecutor-298-thread-1) [    x:collection1] o.a.s.u.VersionInfo No terms found for _version_, cannot seed version bucket highest value from index
   [junit4]   2> 35393 INFO  (coreLoadExecutor-298-thread-1) [    x:collection1] o.a.s.u.UpdateLog Could not find max version in index or recent updates, using new clock 1526250648206573568
   [junit4]   2> 35393 INFO  (searcherExecutor-299-thread-1-processing-x:collection1) [    x:collection1] o.a.s.h.c.SpellCheckComponent Loading spell index for spellchecker: direct
   [junit4]   2> 35393 INFO  (searcherExecutor-299-thread-1-processing-x:collection1) [    x:collection1] o.a.s.h.c.SpellCheckComponent Loading spell index for spellchecker: wordbreak
   [junit4]   2> 35393 INFO  (searcherExecutor-299-thread-1-processing-x:collection1) [    x:collection1] o.a.s.h.c.SpellCheckComponent Loading spell index for spellchecker: multipleFields
   [junit4]   2> 35393 INFO  (searcherExecutor-299-thread-1-processing-x:collection1) [    x:collection1] o.a.s.h.c.SpellCheckComponent Loading spell index for spellchecker: jarowinkler
   [junit4]   2> 35394 INFO  (searcherExecutor-299-thread-1-processing-x:collection1) [    x:collection1] o.a.s.h.c.SpellCheckComponent Loading spell index for spellchecker: external
   [junit4]   2> 35394 INFO  (searcherExecutor-299-thread-1-processing-x:collection1) [    x:collection1] o.a.s.h.c.SpellCheckComponent Loading spell index for spellchecker: freq
   [junit4]   2> 35394 INFO  (searcherExecutor-299-thread-1-processing-x:collection1) [    x:collection1] o.a.s.h.c.SpellCheckComponent Loading spell index for spellchecker: fqcn
   [junit4]   2> 35395 INFO  (coreLoadExecutor-298-thread-1) [    x:collection1] o.a.s.u.UpdateLog Took 2.0ms to seed version buckets with highest version 1526250648206573568
   [junit4]   2> 35395 INFO  (searcherExecutor-299-thread-1-processing-x:collection1) [    x:collection1] o.a.s.h.c.SpellCheckComponent Loading spell index for spellchecker: perDict
   [junit4]   2> 35395 INFO  (searcherExecutor-299-thread-1-processing-x:collection1) [    x:collection1] o.a.s.c.SolrCore [collection1] Registered new searcher Searcher@1dc77b98[collection1] main{ExitableDirectoryReader(UninvertingDirectoryReader())}
   [junit4]   2> 35395 INFO  (coreLoadExecutor-298-thread-1) [    x:collection1] o.a.s.c.CoreContainer registering core: collection1
   [junit4]   2> 35396 INFO  (SUITE-AutoCommitTest-seed#[1CD09CDE4A4839F6]-worker) [    ] o.a.s.SolrTestCaseJ4 ####initCore end
   [junit4]   2> 35405 INFO  (TEST-AutoCommitTest.testMaxTime-seed#[1CD09CDE4A4839F6]) [    ] o.a.s.SolrTestCaseJ4 ###Starting testMaxTime
   [junit4]   2> 35408 INFO  (TEST-AutoCommitTest.testMaxTime-seed#[1CD09CDE4A4839F6]) [    ] o.a.s.u.p.LogUpdateProcessorFactory [collection1]  webapp=null path=null params={}{deleteByQuery=*:* (-1526250648220205056)} 0 2
   [junit4]   2> 35410 INFO  (TEST-AutoCommitTest.testMaxTime-seed#[1CD09CDE4A4839F6]) [    ] o.a.s.c.SolrResourceLoader new SolrResourceLoader for directory: '/x1/jenkins/jenkins-slave/workspace/Lucene-Solr-Tests-trunk-Java8/solr/core/src/test-files/solr/collection1'
   [junit4]   2> 35410 INFO  (TEST-AutoCommitTest.testMaxTime-seed#[1CD09CDE4A4839F6]) [    ] o.a.s.c.SolrResourceLoader JNDI not configured for solr (NoInitialContextEx)
   [junit4]   2> 35411 INFO  (TEST-AutoCommitTest.testMaxTime-seed#[1CD09CDE4A4839F6]) [    ] o.a.s.c.SolrResourceLoader using system property solr.solr.home: /x1/jenkins/jenkins-slave/workspace/Lucene-Solr-Tests-trunk-Java8/solr/core/src/test-files/solr
   [junit4]   2> 35411 INFO  (TEST-AutoCommitTest.testMaxTime-seed#[1CD09CDE4A4839F6]) [    ] o.a.s.c.SolrResourceLoader Adding 'file:/x1/jenkins/jenkins-slave/workspace/Lucene-Solr-Tests-trunk-Java8/solr/core/src/test-files/solr/collection1/lib/classes/' to classloader
   [junit4]   2> 35411 INFO  (TEST-AutoCommitTest.testMaxTime-seed#[1CD09CDE4A4839F6]) [    ] o.a.s.c.SolrResourceLoader Adding 'file:/x1/jenkins/jenkins-slave/workspace/Lucene-Solr-Tests-trunk-Java8/solr/core/src/test-files/solr/collection1/lib/README' to classloader
   [junit4]   2> 35453 INFO  (TEST-AutoCommitTest.testMaxTime-seed#[1CD09CDE4A4839F6]) [    ] o.a.s.c.SolrConfig current version of requestparams : -1
   [junit4]   2> 35461 INFO  (TEST-AutoCommitTest.testMaxTime-seed#[1CD09CDE4A4839F6]) [    ] o.a.s.c.SolrConfig Using Lucene MatchVersion: 6.0.0
   [junit4]   2> 35480 INFO  (TEST-AutoCommitTest.testMaxTime-seed#[1CD09CDE4A4839F6]) [    ] o.a.s.c.SolrConfig Loaded SolrConfig: solrconfig.xml
   [junit4]   2> 35485 INFO  (TEST-AutoCommitTest.testMaxTime-seed#[1CD09CDE4A4839F6]) [    ] o.a.s.s.IndexSchema [collection1] Schema name=test
   [junit4]   2> 35576 INFO  (TEST-AutoCommitTest.testMaxTime-seed#[1CD09CDE4A4839F6]) [    ] o.a.s.s.OpenExchangeRatesOrgProvider Initialized with rates=open-exchange-rates.json, refreshInterval=1440.
   [junit4]   2> 35669 INFO  (TEST-AutoCommitTest.testMaxTime-seed#[1CD09CDE4A4839F6]) [    ] o.a.s.s.IndexSchema default search field in schema is text
   [junit4]   2> 35670 INFO  (TEST-AutoCommitTest.testMaxTime-seed#[1CD09CDE4A4839F6]) [    ] o.a.s.s.IndexSchema unique key field: id
   [junit4]   2> 35690 INFO  (TEST-AutoCommitTest.testMaxTime-seed#[1CD09CDE4A4839F6]) [    ] o.a.s.s.FileExchangeRateProvider Reloading exchange rates from file currency.xml
   [junit4]   2> 35693 INFO  (TEST-AutoCommitTest.testMaxTime-seed#[1CD09CDE4A4839F6]) [    ] o.a.s.s.FileExchangeRateProvider Reloading exchange rates from file currency.xml
   [junit4]   2> 35694 INFO  (TEST-AutoCommitTest.testMaxTime-seed#[1CD09CDE4A4839F6]) [    ] o.a.s.s.OpenExchangeRatesOrgProvider Reloading exchange rates from open-exchange-rates.json
   [junit4]   2> 35695 INFO  (TEST-AutoCommitTest.testMaxTime-seed#[1CD09CDE4A4839F6]) [    ] o.a.s.s.OpenExchangeRatesOrgProvider Reloading exchange rates from open-exchange-rates.json
   [junit4]   2> 35697 INFO  (TEST-AutoCommitTest.testMaxTime-seed#[1CD09CDE4A4839F6]) [    ] o.a.s.c.ConfigSetProperties Did not find ConfigSet properties, assuming default properties: Can't find resource 'configsetprops.json' in classpath or '/x1/jenkins/jenkins-slave/workspace/Lucene-Solr-Tests-trunk-Java8/solr/core/src/test-files/solr/collection1'
   [junit4]   2> 35697 INFO  (TEST-AutoCommitTest.testMaxTime-seed#[1CD09CDE4A4839F6]) [    ] o.a.s.c.CoreContainer Reloading SolrCore 'collection1' using configuration from instancedir /x1/jenkins/jenkins-slave/workspace/Lucene-Solr-Tests-trunk-Java8/solr/core/src/test-files/solr/collection1
   [junit4]   2> 35706 INFO  (TEST-AutoCommitTest.testMaxTime-seed#[1CD09CDE4A4839F6]) [    x:collection1] o.a.s.c.SolrCore [[collection1] ] Opening new SolrCore at [/x1/jenkins/jenkins-slave/workspace/Lucene-Solr-Tests-trunk-Java8/solr/core/src/test-files/solr/collection1], dataDir=[/x1/jenkins/jenkins-slave/workspace/Lucene-Solr-Tests-trunk-Java8/solr/build/solr-core/test/J2/temp/solr.update.AutoCommitTest_1CD09CDE4A4839F6-001/init-core-data-001/]
   [junit4]   2> 35706 INFO  (TEST-AutoCommitTest.testMaxTime-seed#[1CD09CDE4A4839F6]) [    x:collection1] o.a.s.c.JmxMonitoredMap No JMX servers found, not exposing Solr information with JMX.
   [junit4]   2> 35706 INFO  (TEST-AutoCommitTest.testMaxTime-seed#[1CD09CDE4A4839F6]) [    x:collection1] o.a.s.c.SolrCore New index directory detected: old=null new=/x1/jenkins/jenkins-slave/workspace/Lucene-Solr-Tests-trunk-Java8/solr/build/solr-core/test/J2/temp/solr.update.AutoCommitTest_1CD09CDE4A4839F6-001/init-core-data-001/index/
   [junit4]   2> 35709 INFO  (TEST-AutoCommitTest.testMaxTime-seed#[1CD09CDE4A4839F6]) [    x:collection1] o.a.s.u.p.UpdateRequestProcessorChain creating updateRequestProcessorChain "dedupe"
   [junit4]   2> 35709 INFO  (TEST-AutoCommitTest.testMaxTime-seed#[1CD09CDE4A4839F6]) [    x:collection1] o.a.s.u.p.UpdateRequestProcessorChain inserting DistributedUpdateProcessorFactory into updateRequestProcessorChain "dedupe"
   [junit4]   2> 35709 INFO  (TEST-AutoCommitTest.testMaxTime-seed#[1CD09CDE4A4839F6]) [    x:collection1] o.a.s.u.p.UpdateRequestProcessorChain creating updateRequestProcessorChain "dedupe-allfields"
   [junit4]   2> 35709 INFO  (TEST-AutoCommitTest.testMaxTime-seed#[1CD09CDE4A4839F6]) [    x:collection1] o.a.s.u.p.UpdateRequestProcessorChain inserting DistributedUpdateProcessorFactory into updateRequestProcessorChain "dedupe-allfields"
   [junit4]   2> 35709 INFO  (TEST-AutoCommitTest.testMaxTime-seed#[1CD09CDE4A4839F6]) [    x:collection1] o.a.s.u.p.UpdateRequestProcessorChain creating updateRequestProcessorChain "stored_sig"
   [junit4]   2> 35709 INFO  (TEST-AutoCommitTest.testMaxTime-seed#[1CD09CDE4A4839F6]) [    x:collection1] o.a.s.u.p.UpdateRequestProcessorChain inserting DistributedUpdateProcessorFactory into updateRequestProcessorChain "stored_sig"
   [junit4]   2> 35709 INFO  (TEST-AutoCommitTest.testMaxTime-seed#[1CD09CDE4A4839F6]) [    x:collection1] o.a.s.u.p.UpdateRequestProcessorChain creating updateRequestProcessorChain "uniq-fields"
   [junit4]   2> 35709 INFO  (TEST-AutoCommitTest.testMaxTime-seed#[1CD09CDE4A4839F6]) [    x:collection1] o.a.s.u.p.UpdateRequestProcessorChain inserting DistributedUpdateProcessorFactory into updateRequestProcessorChain "uniq-fields"
   [junit4]   2> 35710 INFO  (TEST-AutoCommitTest.testMaxTime-seed#[1CD09CDE4A4839F6]) [    x:collection1] o.a.s.u.p.UpdateRequestProcessorChain creating updateRequestProcessorChain "distrib-dup-test-chain-explicit"
   [junit4]   2> 35710 INFO  (TEST-AutoCommitTest.testMaxTime-seed#[1CD09CDE4A4839F6]) [    x:collection1] o.a.s.u.p.UpdateRequestProcessorChain creating updateRequestProcessorChain "distrib-dup-test-chain-implicit"
   [junit4]   2> 35710 INFO  (TEST-AutoCommitTest.testMaxTime-seed#[1CD09CDE4A4839F6]) [    x:collection1] o.a.s.u.p.UpdateRequestProcessorChain inserting DistributedUpdateProcessorFactory into updateRequestProcessorChain "distrib-dup-test-chain-implicit"
   [junit4]   2> 35710 INFO  (TEST-AutoCommitTest.testMaxTime-seed#[1CD09CDE4A4839F6]) [    x:collection1] o.a.s.c.SolrCore no updateRequestProcessorChain defined as default, creating implicit default
   [junit4]   2> 35715 INFO  (TEST-AutoCommitTest.testMaxTime-seed#[1CD09CDE4A4839F6]) [    x:collection1] o.a.s.h.l.XMLLoader xsltCacheLifetimeSeconds=60
   [junit4]   2> 35716 INFO  (TEST-AutoCommitTest.testMaxTime-seed#[1CD09CDE4A4839F6]) [    x:collection1] o.a.s.h.l.XMLLoader xsltCacheLifetimeSeconds=60
   [junit4]   2> 35717 INFO  (OldIndexDirectoryCleanupThreadForCore-collection1) [    x:collection1] o.a.s.c.SolrCore Looking for old index directories to cleanup for core collection1 in /x1/jenkins/jenkins-slave/workspace/Lucene-Solr-Tests-trunk-Java8/solr/build/solr-core/test/J2/temp/solr.update.AutoCommitTest_1CD09CDE4A4839F6-001/init-core-data-001/
   [junit4]   2> 35717 INFO  (TEST-AutoCommitTest.testMaxTime-seed#[1CD09CDE4A4839F6]) [    x:collection1] o.a.s.h.l.XMLLoader xsltCacheLifetimeSeconds=60
   [junit4]   2> 35718 INFO  (TEST-AutoCommitTest.testMaxTime-seed#[1CD09CDE4A4839F6]) [    x:collection1] o.a.s.h.l.XMLLoader xsltCacheLifetimeSeconds=60
   [junit4]   2> 35719 INFO  (TEST-AutoCommitTest.testMaxTime-seed#[1CD09CDE4A4839F6]) [    x:collection1] o.a.s.c.PluginBag requestHandler : 'lazy' created with startup=lazy 
   [junit4]   2> 35725 INFO  (TEST-AutoCommitTest.testMaxTime-seed#[1CD09CDE4A4839F6]) [    x:collection1] o.a.s.c.RequestHandlers Registered paths: /admin/mbeans,standard,spellCheckCompRH,lazy,/update/json/docs,/admin/luke,/export,spellCheckWithWordbreak_Direct,tvrh,/get,/admin/properties,/update/json,mltrh,/admin/threads,/search-facet-def,/update/csv,/sql,/search-facet-invariants,/admin/segments,spellCheckCompRH1,/mlt,/admin/system,/replication,dismax,defaults,/config,/stream,/schema,/admin/plugins,/admin/logging,spellCheckWithWordbreak,mock,/admin/ping,/update,/admin/file,/terms,spellCheckCompRH_Direct,/debug/dump
   [junit4]   2> 35725 WARN  (TEST-AutoCommitTest.testMaxTime-seed#[1CD09CDE4A4839F6]) [    x:collection1] o.a.s.c.SolrCore solrconfig.xml uses deprecated <admin/gettableFiles>, Please update your config to use the ShowFileRequestHandler.
   [junit4]   2> 35726 INFO  (TEST-AutoCommitTest.testMaxTime-seed#[1CD09CDE4A4839F6]) [    x:collection1] o.a.s.c.SolrCore Using default statsCache cache: org.apache.solr.search.stats.LocalStatsCache
   [junit4]   2> 35727 INFO  (TEST-AutoCommitTest.testMaxTime-seed#[1CD09CDE4A4839F6]) [    x:collection1] o.a.s.u.CommitTracker Hard AutoCommit: disabled
   [junit4]   2> 35727 INFO  (TEST-AutoCommitTest.testMaxTime-seed#[1CD09CDE4A4839F6]) [    x:collection1] o.a.s.u.CommitTracker Soft AutoCommit: disabled
   [junit4]   2> 35727 INFO  (TEST-AutoCommitTest.testMaxTime-seed#[1CD09CDE4A4839F6]) [    x:collection1] o.a.s.s.SolrIndexSearcher Opening [Searcher@5ca358e[collection1] main]
   [junit4]   2> 35727 INFO  (TEST-AutoCommitTest.testMaxTime-seed#[1CD09CDE4A4839F6]) [    x:collection1] o.a.s.r.RestManager Initializing RestManager with initArgs: {storageIO=org.apache.solr.rest.ManagedResourceStorage$InMemoryStorageIO}
   [junit4]   2> 35727 INFO  (TEST-AutoCommitTest.testMaxTime-seed#[1CD09CDE4A4839F6]) [    x:collection1] o.a.s.r.ManagedResourceStorage Reading _rest_managed.json using InMemoryStorage
   [junit4]   2> 35727 INFO  (TEST-AutoCommitTest.testMaxTime-seed#[1CD09CDE4A4839F6]) [    x:collection1] o.a.s.r.RestManager Initializing 0 registered ManagedResources
   [junit4]   2> 35727 INFO  (TEST-AutoCommitTest.testMaxTime-seed#[1CD09CDE4A4839F6]) [    x:collection1] o.a.s.h.c.SpellCheckComponent Initializing spell checkers
   [junit4]   2> 35729 INFO  (TEST-AutoCommitTest.testMaxTime-seed#[1CD09CDE4A4839F6]) [    x:collection1] o.a.s.s.DirectSolrSpellChecker init: {name=direct,classname=DirectSolrSpellChecker,field=lowerfilt,minQueryLength=3}
   [junit4]   2> 35735 INFO  (TEST-AutoCommitTest.testMaxTime-seed#[1CD09CDE4A4839F6]) [    x:collection1] o.a.s.h.ReplicationHandler Commits will be reserved for  10000
   [junit4]   2> 35736 INFO  (TEST-AutoCommitTest.testMaxTime-seed#[1CD09CDE4A4839F6]) [    x:collection1] o.a.s.u.UpdateLog Looking up max value of version field to seed version buckets
   [junit4]   2> 35736 INFO  (TEST-AutoCommitTest.testMaxTime-seed#[1CD09CDE4A4839F6]) [    x:collection1] o.a.s.u.VersionInfo Refreshing highest value of _version_ for 65536 version buckets from index
   [junit4]   2> 35736 INFO  (TEST-AutoCommitTest.testMaxTime-seed#[1CD09CDE4A4839F6]) [    x:collection1] o.a.s.u.VersionInfo No terms found for _version_, cannot seed version bucket highest value from index
   [junit4]   2> 35738 INFO  (TEST-AutoCommitTest.testMaxTime-seed#[1CD09CDE4A4839F6]) [    x:collection1] o.a.s.u.UpdateLog Took 2.0ms to seed version buckets with highest version 1526250648220205056
   [junit4]   2> 35738 INFO  (TEST-AutoCommitTest.testMaxTime-seed#[1CD09CDE4A4839F6]) [    x:collection1] o.a.s.u.DefaultSolrCoreState Closing old IndexWriter... core=collection1
   [junit4]   2> 35739 INFO  (searcherExecutor-304-thread-1-processing-x:collection1) [    x:collection1] o.a.s.h.c.SpellCheckComponent Loading spell index for spellchecker: default
   [junit4]   2> 35739 INFO  (searcherExecutor-304-thread-1-processing-x:collection1) [    x:collection1] o.a.s.h.c.SpellCheckComponent Loading spell index for spellchecker: direct
   [junit4]   2> 35739 INFO  (searcherExecutor-304-thread-1-processing-x:collection1) [    x:collection1] o.a.s.h.c.SpellCheckComponent Loading spell index for spellchecker: wordbreak
   [junit4]   2> 35740 INFO  (searcherExecutor-304-thread-1-processing-x:collection1) [    x:collection1] o.a.s.h.c.SpellCheckComponent Loading spell index for spellchecker: multipleFields
   [junit4]   2> 35740 INFO  (searcherExecutor-304-thread-1-processing-x:collection1) [    x:collection1] o.a.s.h.c.SpellCheckComponent Loading spell index for spellchecker: jarowinkler
   [junit4]   2> 35740 INFO  (searcherExecutor-304-thread-1-processing-x:collection1) [    x:collection1] o.a.s.h.c.SpellCheckComponent Loading spell index for spellchecker: external
   [junit4]   2> 35740 INFO  (searcherExecutor-304-thread-1-processing-x:collection1) [    x:collection1] o.a.s.h.c.SpellCheckComponent Loading spell index for spellchecker: freq
   [junit4]   2> 35741 INFO  (searcherExecutor-304-thread-1-processing-x:collection1) [    x:collection1] o.a.s.h.c.SpellCheckComponent Loading spell index for spellchecker: fqcn
   [junit4]   2> 35742 INFO  (searcherExecutor-304-thread-1-processing-x:collection1) [    x:collection1] o.a.s.h.c.SpellCheckComponent Loading spell index for spellchecker: perDict
   [junit4]   2> 35742 INFO  (searcherExecutor-304-thread-1-processing-x:collection1) [    x:collection1] o.a.s.c.SolrCore [collection1] Registered new searcher Searcher@5ca358e[collection1] main{ExitableDirectoryReader(UninvertingDirectoryReader())}
   [junit4]   2> 35749 INFO  (TEST-AutoCommitTest.testMaxTime-seed#[1CD09CDE4A4839F6]) [    x:collection1] o.a.s.u.RandomMergePolicy RandomMergePolicy wrapping class org.apache.lucene.index.TieredMergePolicy: [TieredMergePolicy: maxMergeAtOnce=17, maxMergeAtOnceExplicit=22, maxMergedSegmentMB=24.654296875, floorSegmentMB=1.4931640625, forceMergeDeletesPctAllowed=15.116481042180697, segmentsPerTier=20.0, maxCFSSegmentSizeMB=0.509765625, noCFSRatio=0.0
   [junit4]   2> 35753 INFO  (TEST-AutoCommitTest.testMaxTime-seed#[1CD09CDE4A4839F6]) [    x:collection1] o.a.s.c.SolrDeletionPolicy SolrDeletionPolicy.onInit: commits: num=1
   [junit4]   2> 	commit{dir=MockDirectoryWrapper(RAMDirectory@47450fc4 lockFactory=org.apache.lucene.store.SingleInstanceLockFactory@587f23ce),segFN=segments_1,generation=1}
   [junit4]   2> 35753 INFO  (TEST-AutoCommitTest.testMaxTime-seed#[1CD09CDE4A4839F6]) [    x:collection1] o.a.s.c.SolrDeletionPolicy newest commit generation = 1
   [junit4]   2> 35753 INFO  (TEST-AutoCommitTest.testMaxTime-seed#[1CD09CDE4A4839F6]) [    x:collection1] o.a.s.u.DefaultSolrCoreState New IndexWriter is ready to be used.
   [junit4]   2> 35754 INFO  (TEST-AutoCommitTest.testMaxTime-seed#[1CD09CDE4A4839F6]) [    x:collection1] o.a.s.s.SolrIndexSearcher Opening [Searcher@201aa232[collection1] main]
   [junit4]   2> 35754 INFO  (TEST-AutoCommitTest.testMaxTime-seed#[1CD09CDE4A4839F6]) [    x:collection1] o.a.s.c.CoreContainer replacing core: collection1
   [junit4]   2> 35754 INFO  (TEST-AutoCommitTest.testMaxTime-seed#[1CD09CDE4A4839F6]) [    x:collection1] o.a.s.c.SolrCore [collection1]  CLOSING SolrCore org.apache.solr.core.SolrCore@62dd04a8
   [junit4]   2> 35754 INFO  (TEST-AutoCommitTest.testMaxTime-seed#[1CD09CDE4A4839F6]) [    x:collection1] o.a.s.u.DirectUpdateHandler2 closing DirectUpdateHandler2{commits=0,autocommits=0,soft autocommits=0,optimizes=0,rollbacks=0,expungeDeletes=0,docsPending=0,adds=0,deletesById=0,deletesByQuery=1,errors=0,cumulative_adds=0,cumulative_deletesById=0,cumulative_deletesByQuery=1,cumulative_errors=0,transaction_logs_total_size=0,transaction_logs_total_number=0}
   [junit4]   2> 35754 INFO  (TEST-AutoCommitTest.testMaxTime-seed#[1CD09CDE4A4839F6]) [    x:collection1] o.a.s.c.SolrCore [collection1] Closing main searcher on request.
   [junit4]   2> 35757 INFO  (searcherExecutor-304-thread-1-processing-x:collection1) [    x:collection1] o.a.s.c.SolrCore [collection1] Registered new searcher Searcher@201aa232[collection1] main{ExitableDirectoryReader(UninvertingDirectoryReader())}
   [junit4]   2> 35807 INFO  (TEST-AutoCommitTest.testMaxTime-seed#[1CD09CDE4A4839F6]) [    x:collection1] o.a.s.u.p.LogUpdateProcessorFactory [collection1] {add=[529 (1526250648589303808)]} 0 50
   [junit4]   2> 35808 INFO  (TEST-AutoCommitTest.testMaxTime-seed#[1CD09CDE4A4839F6]) [    x:collection1] o.a.s.c.S.Request [collection1]  webapp=null path=null params={q=id:529&qt=standard&start=0&rows=20&version=2.2} hits=0 status=0 QTime=0
   [junit4]   2> 36807 INFO  (commitScheduler-307-thread-1) [    x:collection1] o.a.s.u.DirectUpdateHandler2 start commit{,optimize=false,openSearcher=true,waitSearcher=true,expungeDeletes=false,softCommit=true,prepareCommit=false}
   [junit4]   2> 36942 INFO  (commitScheduler-307-thread-1) [    x:collection1] o.a.s.s.SolrIndexSearcher Opening [Searcher@431066d4[collection1] main]
   [junit4]   2> 36943 INFO  (commitScheduler-307-thread-1) [    x:collection1] o.a.s.u.DirectUpdateHandler2 end_commit_flush
   [junit4]   2> 36946 INFO  (searcherExecutor-304-thread-1-processing-x:collection1) [    x:collection1] o.a.s.c.SolrCore [collection1] Registered new searcher Searcher@431066d4[collection1] main{ExitableDirectoryReader(UninvertingDirectoryReader(Uninverting(_0(6.0.0):c1)))}
   [junit4]   2> 37065 INFO  (TEST-AutoCommitTest.testMaxTime-seed#[1CD09CDE4A4839F6]) [    x:collection1] o.a.s.u.p.LogUpdateProcessorFactory [collection1] {add=[530 (1526250649956646912)]} 0 1307
   [junit4]   2> 37078 INFO  (TEST-AutoCommitTest.testMaxTime-seed#[1CD09CDE4A4839F6]) [    x:collection1] o.a.s.c.S.Request [collection1]  webapp=null path=null params={q=id:529&qt=standard&start=0&rows=20&version=2.2} hits=1 status=0 QTime=12
   [junit4]   2> 37081 INFO  (TEST-AutoCommitTest.testMaxTime-seed#[1CD09CDE4A4839F6]) [    x:collection1] o.a.s.c.S.Request [collection1]  webapp=null path=null params={q=id:530&qt=standard&start=0&rows=20&version=2.2} hits=0 status=0 QTime=0
   [junit4]   2> 37082 INFO  (TEST-AutoCommitTest.testMaxTime-seed#[1CD09CDE4A4839F6]) [    x:collection1] o.a.s.u.p.LogUpdateProcessorFactory [collection1]  webapp=null path=null params={}{delete=[529 (-1526250649977618432)]} 0 0
   [junit4]   2> 37083 INFO  (TEST-AutoCommitTest.testMaxTime-seed#[1CD09CDE4A4839F6]) [    x:collection1] o.a.s.c.S.Request [collection1]  webapp=null path=null params={q=id:529&qt=standard&start=0&rows=20&version=2.2} hits=1 status=0 QTime=0
   [junit4]   2> 38065 INFO  (commitScheduler-307-thread-1) [    x:collection1] o.a.s.u.DirectUpdateHandler2 start commit{,optimize=false,openSearcher=true,waitSearcher=true,expungeDeletes=false,softCommit=true,prepareCommit=false}
   [junit4]   2> 38106 INFO  (commitScheduler-307-thread-1) [    x:collection1] o.a.s.s.SolrIndexSearcher Opening [Searcher@3b82016b[collection1] main]
   [junit4]   2> 38106 INFO  (commitScheduler-307-thread-1) [    x:collection1] o.a.s.u.DirectUpdateHandler2 end_commit_flush
   [junit4]   2> 38107 INFO  (searcherExecutor-304-thread-1-processing-x:collection1) [    x:collection1] o.a.s.c.SolrCore [collection1] Registered new searcher Searcher@3b82016b[collection1] main{ExitableDirectoryReader(UninvertingDirectoryReader(Uninverting(_1(6.0.0):c1)))}
   [junit4]   2> 38343 INFO  (TEST-AutoCommitTest.testMaxTime-seed#[1CD09CDE4A4839F6]) [    x:collection1] o.a.s.u.p.LogUpdateProcessorFactory [collection1] {add=[550 (1526250651295678464)]} 0 2585
   [junit4]   2> 38349 INFO  (TEST-AutoCommitTest.testMaxTime-seed#[1CD09CDE4A4839F6]) [    x:collection1] o.a.s.c.S.Request [collection1]  webapp=null path=null params={q=id:529&qt=standard&start=0&rows=20&version=2.2} hits=0 status=0 QTime=5
   [junit4]   2> 38351 INFO  (TEST-AutoCommitTest.testMaxTime-seed#[1CD09CDE4A4839F6]) [    x:collection1] o.a.s.u.p.LogUpdateProcessorFactory [collection1] {add=[500 (1526250651307212800)]} 0 2593
   [junit4]   2> 38351 INFO  (TEST-AutoCommitTest.testMaxTime-seed#[1CD09CDE4A4839F6]) [    x:collection1] o.a.s.u.p.LogUpdateProcessorFactory [collection1] {add=[500 (1526250651308261376)]} 0 2593
   [junit4]   2> 38352 INFO  (TEST-AutoCommitTest.testMaxTime-seed#[1CD09CDE4A4839F6]) [    x:collection1] o.a.s.u.p.LogUpdateProcessorFactory [collection1] {add=[500 (1526250651308261377)]} 0 2594
   [junit4]   2> 38352 INFO  (TEST-AutoCommitTest.testMaxTime-seed#[1CD09CDE4A4839F6]) [    x:collection1] o.a.s.u.p.LogUpdateProcessorFactory [collection1] {add=[500 (1526250651309309952)]} 0 2595
   [junit4]   2> 38353 INFO  (TEST-AutoCommitTest.testMaxTime-seed#[1CD09CDE4A4839F6]) [    x:collection1] o.a.s.u.p.LogUpdateProcessorFactory [collection1] {add=[500 (1526250651309309953)]} 0 2595
   [junit4]   2> 38353 INFO  (TEST-AutoCommitTest.testMaxTime-seed#[1CD09CDE4A4839F6]) [    x:collection1] o.a.s.u.p.LogUpdateProcessorFactory [collection1] {add=[500 (1526250651310358528)]} 0 2596
   [junit4]   2> 38354 INFO  (TEST-AutoCommitTest.testMaxTime-seed#[1CD09CDE4A4839F6]) [    x:collection1] o.a.s.u.p.LogUpdateProcessorFactory [collection1] {add=[500 (1526250651310358529)]} 0 2596
   [junit4]   2> 38354 INFO  (TEST-AutoCommitTest.testMaxTime-seed#[1CD09CDE4A4839F6]) [    x:collection1] o.a.s.u.p.LogUpdateProcessorFactory [collection1] {add=[500 (1526250651311407104)]} 0 2597
   [junit4]   2> 38355 INFO  (TEST-AutoCommitTest.testMaxTime-seed#[1CD09CDE4A4839F6]) [    x:collection1] o.a.s.u.p.LogUpdateProcessorFactory [collection1] {add=[500 (1526250651311407105)]} 0 2597
   [junit4]   2> 38355 INFO  (TEST-AutoCommitTest.testMaxTime-seed#[1CD09CDE4A4839F6]) [    x:collection1] o.a.s.u.p.LogUpdateProcessorFactory [collection1] {add=[500 (1526250651312455680)]} 0 2598
   [junit4]   2> 38366 INFO  (TEST-AutoCommitTest.testMaxTime-seed#[1CD09CDE4A4839F6]) [    x:collection1] o.a.s.c.S.Request [collection1]  webapp=null path=null params={q=id:500&qt=standard&start=0&rows=20&version=2.2} hits=0 status=0 QTime=0
   [junit4]   2> 39343 INFO  (commitScheduler-307-thread-1) [    x:collection1] o.a.s.u.DirectUpdateHandler2 start commit{,optimize=false,openSearcher=true,waitSearcher=true,expungeDeletes=false,softCommit=true,prepareCommit=false}
   [junit4]   2> 39377 INFO  (commitScheduler-307-thread-1) [    x:collection1] o.a.s.s.SolrIndexSearcher Opening [Searcher@f7560d4[collection1] main]
   [junit4]   2> 39377 INFO  (commitScheduler-307-thread-1) [    x:collection1] o.a.s.u.DirectUpdateHandler2 end_commit_flush
   [junit4]   2> 39378 INFO  (searcherExecutor-304-thread-1-processing-x:collection1) [    x:collection1] o.a.s.c.SolrCore [collection1] Registered new searcher Searcher@f7560d4[collection1] main{ExitableDirectoryReader(UninvertingDirectoryReader(Uninverting(_1(6.0.0):c1) Uninverting(_2(6.0.0):c11/9:delGen=1)))}
   [junit4]   2> 39619 INFO  (TEST-AutoCommitTest.testMaxTime-seed#[1CD09CDE4A4839F6]) [    x:collection1] o.a.s.u.p.LogUpdateProcessorFactory [collection1] {add=[531 (1526250652636807168)]} 0 3862
   [junit4]   2> 39620 INFO  (TEST-AutoCommitTest.testMaxTime-seed#[1CD09CDE4A4839F6]) [    x:collection1] o.a.s.c.S.Request [collection1]  webapp=null path=null params={q=id:500&qt=standard&start=0&rows=20&version=2.2} hits=1 status=0 QTime=0
   [junit4]   2> 39622 INFO  (TEST-AutoCommitTest.testMaxTime-seed#[1CD09CDE4A4839F6]) [    x:collection1] o.a.s.SolrTestCaseJ4 ###Ending testMaxTime
   [junit4]   2> 39626 INFO  (TEST-AutoCommitTest.testMaxDocs-seed#[1CD09CDE4A4839F6]) [    x:collection1] o.a.s.SolrTestCaseJ4 ###Starting testMaxDocs
   [junit4]   2> 39672 INFO  (TEST-AutoCommitTest.testMaxDocs-seed#[1CD09CDE4A4839F6]) [    x:collection1] o.a.s.s.SolrIndexSearcher Opening [Searcher@3b7df6a0[collection1] realtime]
   [junit4]   2> 39672 INFO  (TEST-AutoCommitTest.testMaxDocs-seed#[1CD09CDE4A4839F6]) [    x:collection1] o.a.s.u.p.LogUpdateProcessorFactory [collection1]  webapp=null path=null params={}{deleteByQuery=*:* (-1526250652645195776)} 0 46
   [junit4]   2> 39674 INFO  (TEST-AutoCommitTest.testMaxDocs-seed#[1CD09CDE4A4839F6]) [    x:collection1] o.a.s.c.SolrResourceLoader new SolrResourceLoader for directory: '/x1/jenkins/jenkins-slave/workspace/Lucene-Solr-Tests-trunk-Java8/solr/core/src/test-files/solr/collection1'
   [junit4]   2> 39674 INFO  (TEST-AutoCommitTest.testMaxDocs-seed#[1CD09CDE4A4839F6]) [    x:collection1] o.a.s.c.SolrResourceLoader JNDI not configured for solr (NoInitialContextEx)
   [junit4]   2> 39674 INFO  (TEST-AutoCommitTest.testMaxDocs-seed#[1CD09CDE4A4839F6]) [    x:collection1] o.a.s.c.SolrResourceLoader using system property solr.solr.home: /x1/jenkins/jenkins-slave/workspace/Lucene-Solr-Tests-trunk-Java8/solr/core/src/test-files/solr
   [junit4]   2> 39674 INFO  (TEST-AutoCommitTest.testMaxDocs-seed#[1CD09CDE4A4839F6]) [    x:collection1] o.a.s.c.SolrResourceLoader Adding 'file:/x1/jenkins/jenkins-slave/workspace/Lucene-Solr-Tests-trunk-Java8/solr/core/src/test-files/solr/collection1/lib/classes/' to classloader
   [junit4]   2> 39674 INFO  (TEST-AutoCommitTest.testMaxDocs-seed#[1CD09CDE4A4839F6]) [    x:collection1] o.a.s.c.SolrResourceLoader Adding 'file:/x1/jenkins/jenkins-slave/workspace/Lucene-Solr-Tests-trunk-Java8/solr/core/src/test-files/solr/collection1/lib/README' to classloader
   [junit4]   2> 39718 INFO  (TEST-AutoCommitTest.testMaxDocs-seed#[1CD09CDE4A4839F6]) [    x:collection1] o.a.s.c.SolrConfig current version of requestparams : -1
   [junit4]   2> 39727 INFO  (TEST-AutoCommitTest.testMaxDocs-seed#[1CD09CDE4A4839F6]) [    x:collection1] o.a.s.c.SolrConfig Using Lucene MatchVersion: 6.0.0
   [junit4]   2> 39752 INFO  (TEST-AutoCommitTest.testMaxDocs-seed#[1CD09CDE4A4839F6]) [    x:collection1] o.a.s.c.SolrConfig Loaded SolrConfig: solrconfig.xml
   [junit4]   2> 39757 INFO  (TEST-AutoCommitTest.testMaxDocs-seed#[1CD09CDE4A4839F6]) [    x:collection1] o.a.s.s.IndexSchema [collection1] Schema name=test
   [junit4]   2> 39858 INFO  (TEST-AutoCommitTest.testMaxDocs-seed#[1CD09CDE4A4839F6]) [    x:collection1] o.a.s.s.OpenExchangeRatesOrgProvider Initialized with rates=open-exchange-rates.json, refreshInterval=1440.
   [junit4]   2> 39864 INFO  (TEST-AutoCommitTest.testMaxDocs-seed#[1CD09CDE4A4839F6]) [    x:collection1] o.a.s.s.IndexSchema default search field in schema is text
   [junit4]   2> 39865 INFO  (TEST-AutoCommitTest.testMaxDocs-seed#[1CD09CDE4A4839F6]) [    x:collection1] o.a.s.s.IndexSchema unique key field: id
   [junit4]   2> 39897 INFO  (TEST-AutoCommitTest.testMaxDocs-seed#[1CD09CDE4A4839F6]) [    x:collection1] o.a.s.s.FileExchangeRateProvider Reloading exchange rates from file currency.xml
   [junit4]   2> 39900 INFO  (TEST-AutoCommitTest.testMaxDocs-seed#[1CD09CDE4A4839F6]) [    x:collection1] o.a.s.s.FileExchangeRateProvider Reloading exchange rates from file currency.xml
   [junit4]   2> 39906 INFO  (TEST-AutoCommitTest.testMaxDocs-seed#[1CD09CDE4A4839F6]) [    x:collection1] o.a.s.s.OpenExchangeRatesOrgProvider Reloading exchange rates from open-exchange-rates.json
   [junit4]   2> 39906 INFO  (TEST-AutoCommitTest.testMaxDocs-seed#[1CD09CDE4A4839F6]) [    x:collection1] o.a.s.s.OpenExchangeRatesOrgProvider Reloading exchange rates from open-exchange-rates.json
   [junit4]   2> 39908 INFO  (TEST-AutoCommitTest.testMaxDocs-seed#[1CD09CDE4A4839F6]) [    x:collection1] o.a.s.c.ConfigSetProperties Did not find ConfigSet properties, assuming default properties: Can't find resource 'configsetprops.json' in classpath or '/x1/jenkins/jenkins-slave/workspace/Lucene-Solr-Tests-trunk-Java8/solr/core/src/test-files/solr/collection1'
   [junit4]   2> 39908 INFO  (TEST-AutoCommitTest.testMaxDocs-seed#[1CD09CDE4A4839F6]) [    x:collection1] o.a.s.c.CoreContainer Reloading SolrCore 'collection1' using configuration from instancedir /x1/jenkins/jenkins-slave/workspace/Lucene-Solr-Tests-trunk-Java8/solr/core/src/test-files/solr/collection1
   [junit4]   2> 39914 INFO  (TEST-AutoCommitTest.testMaxDocs-seed#[1CD09CDE4A4839F6]) [    x:collection1] o.a.s.c.SolrCore [[collection1] ] Opening new SolrCore at [/x1/jenkins/jenkins-slave/workspace/Lucene-Solr-Tests-trunk-Java8/solr/core/src/test-files/solr/collection1], dataDir=[/x1/jenkins/jenkins-slave/workspace/Lucene-Solr-Tests-trunk-Java8/solr/build/solr-core/test/J2/temp/solr.update.AutoCommitTest_1CD09CDE4A4839F6-001/init-core-data-001/]
   [junit4]   2> 39914 INFO  (TEST-AutoCommitTest.testMaxDocs-seed#[1CD09CDE4A4839F6]) [    x:collection1] o.a.s.c.JmxMonitoredMap No JMX servers found, not exposing Solr information with JMX.
   [junit4]   2> 39914 INFO  (TEST-AutoCommitTest.testMaxDocs-seed#[1CD09CDE4A4839F6]) [    x:collection1] o.a.s.c.SolrCore New index directory detected: old=null new=/x1/jenkins/jenkins-slave/workspace/Lucene-Solr-Tests-trunk-Java8/solr/build/solr-core/test/J2/temp/solr.update.AutoCommitTest_1CD09CDE4A4839F6-001/init-core-data-001/index/
   [junit4]   2> 39921 INFO  (TEST-AutoCommitTest.testMaxDocs-seed#[1CD09CDE4A4839F6]) [    x:collection1] o.a.s.u.p.UpdateRequestProcessorChain creating updateRequestProcessorChain "dedupe"
   [junit4]   2> 39922 INFO  (TEST-AutoCommitTest.testMaxDocs-seed#[1CD09CDE4A4839F6]) [    x:collection1] o.a.s.u.p.UpdateRequestProcessorChain inserting DistributedUpdateProcessorFactory into updateRequestProcessorChain "dedupe"
   [junit4]   2> 39922 INFO  (TEST-AutoCommitTest.testMaxDocs-seed#[1CD09CDE4A4839F6]) [    x:collection1] o.a.s.u.p.UpdateRequestProcessorChain creating updateRequestProcessorChain "dedupe-allfields"
   [junit4]   2> 39922 INFO  (TEST-AutoCommitTest.testMaxDocs-seed#[1CD09CDE4A4839F6]) [    x:collection1] o.a.s.u.p.UpdateRequestProcessorChain inserting DistributedUpdateProcessorFactory into updateRequestProcessorChain "dedupe-allfields"
   [junit4]   2> 39922 INFO  (TEST-AutoCommitTest.testMaxDocs-seed#[1CD09CDE4A4839F6]) [    x:collection1] o.a.s.u.p.UpdateRequestProcessorChain creating updateRequestProcessorChain "stored_sig"
   [junit4]   2> 39922 INFO  (TEST-AutoCommitTest.testMaxDocs-seed#[1CD09CDE4A4839F6]) [    x:collection1] o.a.s.u.p.UpdateRequestProcessorChain inserting DistributedUpdateProcessorFactory into updateRequestProcessorChain "stored_sig"
   [junit4]   2> 39922 INFO  (TEST-AutoCommitTest.testMaxDocs-seed#[1CD09CDE4A4839F6]) [    x:collection1] o.a.s.u.p.UpdateRequestProcessorChain creating updateRequestProcessorChain "uniq-fields"
   [junit4]   2> 39922 INFO  (TEST-AutoCommitTest.testMaxDocs-seed#[1CD09CDE4A4839F6]) [    x:collection1] o.a.s.u.p.UpdateRequestProcessorChain inserting DistributedUpdateProcessorFactory into updateRequestProcessorChain "uniq-fields"
   [junit4]   2> 39922 INFO  (TEST-AutoCommitTest.testMaxDocs-seed#[1CD09CDE4A4839F6]) [    x:collection1] o.a.s.u.p.UpdateRequestProcessorChain creating updateRequestProcessorChain "distrib-dup-test-chain-explicit"
   [junit4]   2> 39923 INFO  (TEST-AutoCommitTest.testMaxDocs-seed#[1CD09CDE4A4839F6]) [    x:collection1] o.a.s.u.p.UpdateRequestProcessorChain creating updateRequestProcessorChain "distrib-dup-test-chain-implicit"
   [junit4]   2> 39923 INFO  (TEST-AutoCommitTest.testMaxDocs-seed#[1CD09CDE4A4839F6]) [    x:collection1] o.a.s.u.p.UpdateRequestProcessorChain inserting DistributedUpdateProcessorFactory into updateRequestProcessorChain "distrib-dup-test-chain-implicit"
   [junit4]   2> 39923 INFO  (TEST-AutoCommitTest.testMaxDocs-seed#[1CD09CDE4A4839F6]) [    x:collection1] o.a.s.c.SolrCore no updateRequestProcessorChain defined as default, creating implicit default
   [junit4]   2> 39925 INFO  (TEST-AutoCommitTest.testMaxDocs-seed#[1CD09CDE4A4839F6]) [    x:collection1] o.a.s.h.l.XMLLoader xsltCacheLifetimeSeconds=60
   [junit4]   2> 39926 INFO  (TEST-AutoCommitTest.testMaxDocs-seed#[1CD09CDE4A4839F6]) [    x:collection1] o.a.s.h.l.XMLLoader xsltCacheLifetimeSeconds=60
   [junit4]   2> 39927 INFO  (TEST-AutoCommitTest.testMaxDocs-seed#[1CD09CDE4A4839F6]) [    x:collection1] o.a.s.h.l.XMLLoader xsltCacheLifetimeSeconds=60
   [junit4]   2> 39929 INFO  (OldIndexDirectoryCleanupThreadForCore-collection1) [    x:collection1] o.a.s.c.SolrCore Looking for old index directories to cleanup for core collection1 in /x1/jenkins/jenkins-slave/workspace/Lucene-Solr-Tests-trunk-Java8/solr/build/solr-core/test/J2/temp/solr.update.AutoCommitTest_1CD09CDE4A4839F6-001/init-core-data-001/
   [junit4]   2> 39933 INFO  (TEST-AutoCommitTest.testMaxDocs-seed#[1CD09CDE4A4839F6]) [    x:collection1] o.a.s.h.l.XMLLoader xsltCacheLifetimeSeconds=60
   [junit4]   2> 39936 INFO  (TEST-AutoCommitTest.testMaxDocs-seed#[1CD09CDE4A4839F6]) [    x:collection1] o.a.s.c.PluginBag requestHandler : 'lazy' created with startup=lazy 
   [junit4]   2> 39936 INFO  (TEST-AutoCommitTest.testMaxDocs-seed#[1CD09CDE4A4839F6]) [    x:collection1] o.a.s.c.RequestHandlers Registered paths: /admin/mbeans,standard,spellCheckCompRH,lazy,/update/json/docs,/admin/luke,/export,spellCheckWithWordbreak_Direct,tvrh,/get,/admin/properties,/update/json,mltrh,/admin/threads,/search-facet-def,/update/csv,/sql,/search-facet-invariants,/admin/segments,spellCheckCompRH1,/mlt,/admin/system,/replication,dismax,defaults,/config,/stream,/schema,/admin/plugins,/admin/logging,spellCheckWithWordbreak,mock,/admin/ping,/update,/admin/file,/terms,spellCheckCompRH_Direct,/debug/dump
   [junit4]   2> 39941 WARN  (TEST-AutoCommitTest.testMaxDocs-seed#[1CD09CDE4A4839F6]) [    x:collection1] o.a.s.c.SolrCore solrconfig.xml uses deprecated <admin/gettableFiles>, Please update your config to use the ShowFileRequestHandler.
   [junit4]   2> 39941 INFO  (TEST-AutoCommitTest.testMaxDocs-seed#[1CD09CDE4A4839F6]) [    x:collection1] o.a.s.c.SolrCore Using default statsCache cache: org.apache.solr.search.stats.LocalStatsCache
   [junit4]   2> 39957 INFO  (TEST-AutoCommitTest.testMaxDocs-seed#[1CD09CDE4A4839F6]) [    x:collection1] o.a.s.u.CommitTracker Hard AutoCommit: disabled
   [junit4]   2> 39957 INFO  (TEST-AutoCommitTest.testMaxDocs-seed#[1CD09CDE4A4839F6]) [    x:collection1] o.a.s.u.CommitTracker Soft AutoCommit: disabled
   [junit4]   2> 39957 INFO  (TEST-AutoCommitTest.testMaxDocs-seed#[1CD09CDE4A4839F6]) [    x:collection1] o.a.s.s.SolrIndexSearcher Opening [Searcher@1d9f6a09[collection1] main]
   [junit4]   2> 39958 INFO  (TEST-AutoCommitTest.testMaxDocs-seed#[1CD09CDE4A4839F6]) [    x:collection1] o.a.s.r.RestManager Initializing RestManager with initArgs: {storageIO=org.apache.solr.rest.ManagedResourceStorage$InMemoryStorageIO}
   [junit4]   2> 39958 INFO  (TEST-AutoCommitTest.testMaxDocs-seed#[1CD09CDE4A4839F6]) [    x:collection1] o.a.s.r.ManagedResourceStorage Reading _rest_managed.json using InMemoryStorage
   [junit4]   2> 39958 INFO  (TEST-AutoCommitTest.testMaxDocs-seed#[1CD09CDE4A4839F6]) [    x:collection1] o.a.s.r.RestManager Initializing 0 registered ManagedResources
   [junit4]   2> 39958 INFO  (TEST-AutoCommitTest.testMaxDocs-seed#[1CD09CDE4A4839F6]) [    x:collection1] o.a.s.h.c.SpellCheckComponent Initializing spell checkers
   [junit4]   2> 39959 INFO  (TEST-AutoCommitTest.testMaxDocs-seed#[1CD09CDE4A4839F6]) [    x:collection1] o.a.s.s.DirectSolrSpellChecker init: {name=direct,classname=DirectSolrSpellChecker,field=lowerfilt,minQueryLength=3}
   [junit4]   2> 39969 INFO  (TEST-AutoCommitTest.testMaxDocs-seed#[1CD09CDE4A4839F6]) [    x:collection1] o.a.s.h.ReplicationHandler Commits will be reserved for  10000
   [junit4]   2> 39970 INFO  (TEST-AutoCommitTest.testMaxDocs-seed#[1CD09CDE4A4839F6]) [    x:collection1] o.a.s.u.UpdateLog Looking up max value of version field to seed version buckets
   [junit4]   2> 39970 INFO  (TEST-AutoCommitTest.testMaxDocs-seed#[1CD09CDE4A4839F6]) [    x:collection1] o.a.s.u.VersionInfo Refreshing highest value of _version_ for 65536 version buckets from index
   [junit4]   2> 39970 INFO  (TEST-AutoCommitTest.testMaxDocs-seed#[1CD09CDE4A4839F6]) [    x:collection1] o.a.s.u.VersionInfo No terms found for _version_, cannot seed version bucket highest value from index
   [junit4]   2> 39972 INFO  (TEST-AutoCommitTest.testMaxDocs-seed#[1CD09CDE4A4839F6]) [    x:collection1] o.a.s.u.UpdateLog Took 2.0ms to seed version buckets with highest version 1526250652645195776
   [junit4]   2> 39972 INFO  (TEST-AutoCommitTest.testMaxDocs-seed#[1CD09CDE4A4839F6]) [    x:collection1] o.a.s.u.DefaultSolrCoreState Closing old IndexWriter... core=collection1
   [junit4]   2> 39975 INFO  (searcherExecutor-308-thread-1-processing-x:collection1) [    x:collection1] o.a.s.h.c.SpellCheckComponent Loading spell index for spellchecker: default
   [junit4]   2> 39976 INFO  (searcherExecutor-308-thread-1-processing-x:collection1) [    x:collection1] o.a.s.h.c.SpellCheckComponent Loading spell index for spellchecker: direct
   [junit4]   2> 39976 INFO  (searcherExecutor-308-thread-1-processing-x:collection1) [    x:collection1] o.a.s.h.c.SpellCheckComponent Loading spell index for spellchecker: wordbreak
   [junit4]   2> 39976 INFO  (searcherExecutor-308-thread-1-processing-x:collection1) [    x:collection1] o.a.s.h.c.SpellCheckComponent Loading spell index for spellchecker: multipleFields
   [junit4]   2> 39976 INFO  (searcherExecutor-308-thread-1-processing-x:collection1) [    x:collection1] o.a.s.h.c.SpellCheckComponent Loading spell index for spellchecker: jarowinkler
   [junit4]   2> 39977 INFO  (searcherExecutor-308-thread-1-processing-x:collection1) [    x:collection1] o.a.s.h.c.SpellCheckComponent Loading spell index for spellchecker: external
   [junit4]   2> 39977 INFO  (searcherExecutor-308-thread-1-processing-x:collection1) [    x:collection1] o.a.s.h.c.SpellCheckComponent Loading spell index for spellchecker: freq
   [junit4]   2> 39978 INFO  (searcherExecutor-308-thread-1-processing-x:collection1) [    x:collection1] o.a.s.h.c.SpellCheckComponent Loading spell index for spellchecker: fqcn
   [junit4]   2> 39978 INFO  (searcherExecutor-308-thread-1-processing-x:collection1) [    x:collection1] o.a.s.h.c.SpellCheckComponent Loading spell index for spellchecker: perDict
   [junit4]   2> 39978 INFO  (searcherExecutor-308-thread-1-processing-x:collection1) [    x:collection1] o.a.s.c.SolrCore [collection1] Registered new searcher Searcher@1d9f6a09[collection1] main{ExitableDirectoryReader(UninvertingDirectoryReader())}
   [junit4]   2> 39981 INFO  (TEST-AutoCommitTest.testMaxDocs-seed#[1CD09CDE4A4839F6]) [    x:collection1] o.a.s.c.SolrDeletionPolicy SolrDeletionPolicy.onCommit: commits: num=2
   [junit4]   2> 	commit{dir=MockDirectoryWrapper(RAMDirectory@47450fc4 lockFactory=org.apache.lucene.store.SingleInstanceLockFactory@587f23ce),segFN=segments_1,generation=1}
   [junit4]   2> 	commit{dir=MockDirectoryWrapper(RAMDirectory@47450fc4 lockFactory=org.apache.lucene.store.SingleInstanceLockFactory@587f23ce),segFN=segments_2,generation=2}
   [junit4]   2> 39981 INFO  (TEST-AutoCommitTest.testMaxDocs-seed#[1CD09CDE4A4839F6]) [    x:collection1] o.a.s.c.SolrDeletionPolicy newest commit generation = 2
   [junit4]   2> 39981 INFO  (TEST-AutoCommitTest.testMaxDocs-seed#[1CD09CDE4A4839F6]) [    x:collection1] o.a.s.u.RandomMergePolicy RandomMergePolicy wrapping class org.apache.lucene.index.TieredMergePolicy: [TieredMergePolicy: maxMergeAtOnce=24, maxMergeAtOnceExplicit=39, maxMergedSegmentMB=18.1962890625, floorSegmentMB=0.248046875, forceMergeDeletesPctAllowed=14.480001651554112, segmentsPerTier=47.0, maxCFSSegmentSizeMB=8.796093022207999E12, noCFSRatio=0.0
   [junit4]   2> 39985 INFO  (TEST-AutoCommitTest.testMaxDocs-seed#[1CD09CDE4A4839F6]) [    x:collection1] o.a.s.c.SolrDeletionPolicy SolrDeletionPolicy.onInit: commits: num=1
   [junit4]   2> 	commit{dir=MockDirectoryWrapper(RAMDirectory@47450fc4 lockFactory=org.apache.lucene.store.SingleInstanceLockFactory@587f23ce),segFN=segments_2,generation=2}
   [junit4]   2> 39985 INFO  (TEST-AutoCommitTest.testMaxDocs-seed#[1CD09CDE4A4839F6]) [    x:collection1] o.a.s.c.SolrDeletionPolicy newest commit generation = 2
   [junit4]   2> 39985 INFO  (TEST-AutoCommitTest.testMaxDocs-seed#[1CD09CDE4A4839F6]) [    x:collection1] o.a.s.u.DefaultSolrCoreState New IndexWriter is ready to be used.
   [junit4]   2> 39985 INFO  (TEST-AutoCommitTest.testMaxDocs-seed#[1CD09CDE4A4839F6]) [    x:collection1] o.a.s.s.SolrIndexSearcher Opening [Searcher@45a94fd1[collection1] main]
   [junit4]   2> 39986 INFO  (TEST-AutoCommitTest.testMaxDocs-seed#[1CD09CDE4A4839F6]) [    x:collection1] o.a.s.c.CoreContainer replacing core: collection1
   [junit4]   2> 39986 INFO  (TEST-AutoCommitTest.testMaxDocs-seed#[1CD09CDE4A4839F6]) [    x:collection1] o.a.s.c.SolrCore [collection1]  CLOSING SolrCore org.apache.solr.core.SolrCore@772e47c5
   [junit4]   2> 39986 INFO  (TEST-AutoCommitTest.testMaxDocs-seed#[1CD09CDE4A4839F6]) [    x:collection1] o.a.s.u.DirectUpdateHandler2 closing DirectUpdateHandler2{commits=3,autocommits=0,soft autocommit maxTime=1000ms,soft autocommits=3,optimizes=0,rollbacks=0,expungeDeletes=0,docsPending=14,adds=1,deletesById=0,deletesByQuery=1,errors=0,cumulative_adds=14,cumulative_deletesById=1,cumulative_deletesByQuery=1,cumulative_errors=0,transaction_logs_total_size=0,transaction_logs_total_number=0}
   [junit4]   2> 39987 INFO  (TEST-AutoCommitTest.testMaxDocs-seed#[1CD09CDE4A4839F6]) [    x:collection1] o.a.s.c.SolrCore [collection1] Closing main searcher on request.
   [junit4]   2> 39988 INFO  (searcherExecutor-308-thread-1-processing-x:collection1) [    x:collection1] o.a.s.c.SolrCore [collection1] Registered new searcher Searcher@45a94fd1[collection1] main{ExitableDirectoryReader(UninvertingDirectoryReader())}
   [junit4]   2> 40002 INFO  (TEST-AutoCommitTest.testMaxDocs-seed#[1CD09CDE4A4839F6]) [    x:collection1] o.a.s.u.p.LogUpdateProcessorFactory [collection1] {add=[0 (1526250653025828864)]} 0 12
   [junit4]   2> 40003 INFO  (TEST-AutoCommitTest.testMaxDocs-seed#[1CD09CDE4A4839F6]) [    x:collection1] o.a.s.u.p.LogUpdateProcessorFactory [collection1] {add=[1 (1526250653040508928)]} 0 13
   [junit4]   2> 40004 INFO  (TEST-AutoCommitTest.testMaxDocs-seed#[1CD09CDE4A4839F6]) [    x:collection1] o.a.s.u.p.LogUpdateProcessorFactory [collection1] {add=[2 (1526250653040508929)]} 0 14
   [junit4]   2> 40005 INFO  (TEST-AutoCommitTest.testMaxDocs-seed#[1CD09CDE4A4839F6]) [    x:collection1] o.a.s.u.p.LogUpdateProcessorFactory [collection1] {add=[3 (1526250653041557504)]} 0 15
   [junit4]   2> 40005 INFO  (TEST-AutoCommitTest.testMaxDocs-seed#[1CD09CDE4A4839F6]) [    x:collection1] o.a.s.u.p.LogUpdateProcessorFactory [collection1] {add=[4 (1526250653042606080)]} 0 16
   [junit4]   2> 40006 INFO  (TEST-AutoCommitTest.testMaxDocs-seed#[1CD09CDE4A4839F6]) [    x:collection1] o.a.s.u.p.LogUpdateProcessorFactory [collection1] {add=[5 (1526250653043654656)]} 0 16
   [junit4]   2> 40007 INFO  (TEST-AutoCommitTest.testMaxDocs-seed#[1CD09CDE4A4839F6]) [    x:collection1] o.a.s.u.p.LogUpdateProcessorFactory [collection1] {add=[6 (1526250653043654657)]} 0 17
   [junit4]   2> 40007 INFO  (TEST-AutoCommitTest.testMaxDocs-seed#[1CD09CDE4A4839F6]) [    x:collection1] o.a.s.u.p.LogUpdateProcessorFactory [collection1] {add=[7 (1526250653044703232)]} 0 18
   [junit4]   2> 40008 INFO  (TEST-AutoCommitTest.testMaxDocs-seed#[1CD09CDE4A4839F6]) [    x:collection1] o.a.s.u.p.LogUpdateProcessorFactory [collection1] {add=[8 (1526250653045751808)]} 0 18
   [junit4]   2> 40009 INFO  (TEST-AutoCommitTest.testMaxDocs-seed#[1CD09CDE4A4839F6]) [    x:collection1] o.a.s.u.p.LogUpdateProcessorFactory [collection1] {add=[9 (1526250653045751809)]} 0 19
   [junit4]   2> 40009 INFO  (TEST-AutoCommitTest.testMaxDocs-seed#[1CD09CDE4A4839F6]) [    x:collection1] o.a.s.u.p.LogUpdateProcessorFactory [collection1] {add=[10 (1526250653046800384)]} 0 20
   [junit4]   2> 40010 INFO  (TEST-AutoCommitTest.testMaxDocs-seed#[1CD09CDE4A4839F6]) [    x:collection1] o.a.s.u.p.LogUpdateProcessorFactory [collection1] {add=[11 (1526250653047848960)]} 0 20
   [junit4]   2> 40011 INFO  (TEST-AutoCommitTest.testMaxDocs-seed#[1CD09CDE4A4839F6]) [    x:collection1] o.a.s.u.p.LogUpdateProcessorFactory [collection1] {add=[12 (1526250653047848961)]} 0 21
   [junit4]   2> 40011 INFO  (TEST-AutoCommitTest.testMaxDocs-seed#[1CD09CDE4A4839F6]) [    x:collection1] o.a.s.u.p.LogUpdateProcessorFactory [collection1] {add=[13 (1526250653048897536)]} 0 22
   [junit4]   2> 40012 INFO  (TEST-AutoCommitTest.testMaxDocs-seed#[1CD09CDE4A4839F6]) [    x:collection1] o.a.s.c.S.Request [collection1]  webapp=null path=null params={q=id:1&qt=standard&start=0&rows=20&version=2.2} hits=0 status=0 QTime=0
   [junit4]   2> 40025 INFO  (TEST-AutoCommitTest.testMaxDocs-seed#[1CD09CDE4A4839F6]) [    x:collection1] o.a.s.u.p.LogUpdateProcessorFactory [collection1] {add=[14 (1526250653050994688)]} 0 35
   [junit4]   2> 40026 INFO  (TEST-AutoCommitTest.testMaxDocs-seed#[1CD09CDE4A4839F6]) [    x:collection1] o.a.s.u.p.LogUpdateProcessorFactory [collection1] {add=[15 (1526250653063577600)]} 0 36
   [junit4]   2> 40027 INFO  (TEST-AutoCommitTest.testMaxDocs-seed#[1CD09CDE4A4839F6]) [    x:collection1] o.a.s.c.S.Request [collection1]  webapp=null path=null params={q=id:14&qt=standard&start=0&rows=20&version=2.2} hits=0 status=0 QTime=0
   [junit4]   2> 40027 ERROR (TEST-AutoCommitTest.testMaxDocs-seed#[1CD09CDE4A4839F6]) [    x:collection1] o.a.s.SolrTestCaseJ4 REQUEST FAILED: xpath=//result[@numFound=1]
   [junit4]   2> 	xml response was: <?xml version="1.0" encoding="UTF-8"?>
   [junit4]   2> <response>
   [junit4]   2> <lst name="responseHeader"><int name="status">0</int><int name="QTime">0</int></lst><result name="response" numFound="0" start="0"></result>
   [junit4]   2> </response>
   [junit4]   2> 
   [junit4]   2> 	request was:q=id:14&qt=standard&start=0&rows=20&version=2.2
   [junit4]   2> 40028 ERROR (TEST-AutoCommitTest.testMaxDocs-seed#[1CD09CDE4A4839F6]) [    x:collection1] o.a.s.SolrTestCaseJ4 REQUEST FAILED: q=id:14&qt=standard&start=0&rows=20&version=2.2:java.lang.RuntimeException: REQUEST FAILED: xpath=//result[@numFound=1]
   [junit4]   2> 	xml response was: <?xml version="1.0" encoding="UTF-8"?>
   [junit4]   2> <response>
   [junit4]   2> <lst name="responseHeader"><int name="status">0</int><int name="QTime">0</int></lst><result name="response" numFound="0" start="0"></result>
   [junit4]   2> </response>
   [junit4]   2> 
   [junit4]   2> 	request was:q=id:14&qt=standard&start=0&rows=20&version=2.2
   [junit4]   2> 	at org.apache.solr.SolrTestCaseJ4.assertQ(SolrTestCaseJ4.java:747)
   [junit4]   2> 	at org.apache.solr.update.AutoCommitTest.testMaxDocs(AutoCommitTest.java:198)
   [junit4]   2> 	at sun.reflect.NativeMethodAccessorImpl.invoke0(Native Method)
   [junit4]   2> 	at sun.reflect.NativeMethodAccessorImpl.invoke(NativeMethodAccessorImpl.java:62)
   [junit4]   2> 	at sun.reflect.DelegatingMethodAccessorImpl.invoke(DelegatingMethodAccessorImpl.java:43)
   [junit4]   2> 	at java.lang.reflect.Method.invoke(Method.java:497)
   [junit4]   2> 	at com.carrotsearch.randomizedtesting.RandomizedRunner.invoke(RandomizedRunner.java:1764)
   [junit4]   2> 	at com.carrotsearch.randomizedtesting.RandomizedRunner$8.evaluate(RandomizedRunner.java:871)
   [junit4]   2> 	at com.carrotsearch.randomizedtesting.RandomizedRunner$9.evaluate(RandomizedRunner.java:907)
   [junit4]   2> 	at com.carrotsearch.randomizedtesting.RandomizedRunner$10.evaluate(RandomizedRunner.java:921)
   [junit4]   2> 	at com.carrotsearch.randomizedtesting.rules.SystemPropertiesRestoreRule$1.evaluate(SystemPropertiesRestoreRule.java:57)
   [junit4]   2> 	at org.apache.lucene.util.TestRuleSetupTeardownChained$1.evaluate(TestRuleSetupTeardownChained.java:49)
   [junit4]   2> 	at org.apache.lucene.util.AbstractBeforeAfterRule$1.evaluate(AbstractBeforeAfterRule.java:45)
   [junit4]   2> 	at org.apache.lucene.util.TestRuleThreadAndTestName$1.evaluate(TestRuleThreadAndTestName.java:48)
   [junit4]   2> 	at org.apache.lucene.util.TestRuleIgnoreAfterMaxFailures$1.evaluate(TestRuleIgnoreAfterMaxFailures.java:64)
   [junit4]   2> 	at org.apache.lucene.util.TestRuleMarkFailure$1.evaluate(TestRuleMarkFailure.java:47)
   [junit4]   2> 	at com.carrotsearch.randomizedtesting.rules.StatementAdapter.evaluate(StatementAdapter.java:36)
   [junit4]   2> 	at com.carrotsearch.randomizedtesting.ThreadLeakControl$StatementRunner.run(ThreadLeakControl.java:367)
   [junit4]   2> 	at com.carrotsearch.randomizedtesting.ThreadLeakControl.forkTimeoutingTask(ThreadLeakControl.java:809)
   [junit4]   2> 	at com.carrotsearch.randomizedtesting.ThreadLeakControl$3.evaluate(ThreadLeakControl.java:460)
   [junit4]   2> 	at com.carrotsearch.randomizedtesting.RandomizedRunner.runSingleTest(RandomizedRunner.java:880)
   [junit4]   2> 	at com.carrotsearch.randomizedtesting.RandomizedRunner$5.evaluate(RandomizedRunner.java:781)
   [junit4]   2> 	at com.carrotsearch.randomizedtesting.RandomizedRunner$6.evaluate(RandomizedRunner.java:816)
   [junit4]   2> 	at com.carrotsearch.randomizedtesting.RandomizedRunner$7.evaluate(RandomizedRunner.java:827)
   [junit4]   2> 	at com.carrotsearch.randomizedtesting.rules.StatementAdapter.evaluate(StatementAdapter.java:36)
   [junit4]   2> 	at com.carrotsearch.randomizedtesting.rules.SystemPropertiesRestoreRule$1.evaluate(SystemPropertiesRestoreRule.java:57)
   [junit4]   2> 	at org.apache.lucene.util.AbstractBeforeAfterRule$1.evaluate(AbstractBeforeAfterRule.java:45)
   [junit4]   2> 	at com.carrotsearch.randomizedtesting.rules.StatementAdapter.evaluate(StatementAdapter.java:36)
   [junit4]   2> 	at org.apache.lucene.util.TestRuleStoreClassName$1.evaluate(TestRuleStoreClassName.java:41)
   [junit4]   2> 	at com.carrotsearch.randomizedtesting.rules.NoShadowingOrOverridesOnMethodsRule$1.evaluate(NoShadowingOrOverridesOnMethodsRule.java:40)
   [junit4]   2> 	at com.carrotsearch.randomizedtesting.rules.NoShadowingOrOverridesOnMethodsRule$1.evaluate(NoShadowingOrOverridesOnMethodsRule.java:40)
   [junit4]   2> 	at com.carrotsearch.randomizedtesting.rules.StatementAdapter.evaluate(StatementAdapter.java:36)
   [junit4]   2> 	at com.carrotsearch.randomizedtesting.rules.StatementAdapter.evaluate(StatementAdapter.java:36)
   [junit4]   2> 	at com.carrotsearch.randomizedtesting.rules.StatementAdapter.evaluate(StatementAdapter.java:36)
   [junit4]   2> 	at org.apache.lucene.util.TestRuleAssertionsRequired$1.evaluate(TestRuleAssertionsRequired.java:53)
   [junit4]   2> 	at org.apache.lucene.util.TestRuleMarkFailure$1.evaluate(TestRuleMarkFailure.java:47)
   [junit4]   2> 	at org.apache.lucene.util.TestRuleIgnoreAfterMaxFailures$1.evaluate(TestRuleIgnoreAfterMaxFailures.java:64)
   [junit4]   2> 	at org.apache.lucene.util.TestRuleIgnoreTestSuites$1.evaluate(TestRuleIgnoreTestSuites.java:54)
   [junit4]   2> 	at com.carrotsearch.randomizedtesting.rules.StatementAdapter.evaluate(StatementAdapter.java:36)
   [junit4]   2> 	at com.carrotsearch.randomizedtesting.ThreadLeakControl$StatementRunner.run(ThreadLeakControl.java:367)
   [junit4]   2> 	at java.lang.Thread.run(Thread.java:745)
   [junit4]   2> 
   [junit4]   2> 40028 INFO  (TEST-AutoCommitTest.testMaxDocs-seed#[1CD09CDE4A4839F6]) [    x:collection1] o.a.s.SolrTestCaseJ4 ###Ending testMaxDocs
   [junit4]   2> NOTE: reproduce with: ant test  -Dtestcase=AutoCommitTest -Dtests.method=testMaxDocs -Dtests.seed=1CD09CDE4A4839F6 -Dtests.multiplier=2 -Dtests.slow=true -Dtests.locale=lv-LV -Dtests.timezone=CET -Dtests.asserts=true -Dtests.file.encoding=UTF-8
   [junit4] ERROR   0.41s J2 | AutoCommitTest.testMaxDocs <<<
   [junit4]    > Throwable #1: java.lang.RuntimeException: Exception during query
   [junit4]    > 	at __randomizedtesting.SeedInfo.seed([1CD09CDE4A4839F6:A5514A0166A23D7C]:0)
   [junit4]    > 	at org.apache.solr.SolrTestCaseJ4.assertQ(SolrTestCaseJ4.java:754)
   [junit4]    > 	at org.apache.solr.update.AutoCommitTest.testMaxDocs(AutoCommitTest.java:198)
   [junit4]    > 	at java.lang.Thread.run(Thread.java:745)
   [junit4]    > Caused by: java.lang.RuntimeException: REQUEST FAILED: xpath=//result[@numFound=1]
   [junit4]    > 	xml response was: <?xml version="1.0" encoding="UTF-8"?>
   [junit4]    > <response>
   [junit4]    > <lst name="responseHeader"><int name="status">0</int><int name="QTime">0</int></lst><result name="response" numFound="0" start="0"></result>
   [junit4]    > </response>
   [junit4]    > 	request was:q=id:14&qt=standard&start=0&rows=20&version=2.2
   [junit4]    > 	at org.apache.solr.SolrTestCaseJ4.assertQ(SolrTestCaseJ4.java:747)
   [junit4]    > 	... 40 more
   [junit4]   2> 40032 INFO  (commitScheduler-311-thread-1) [    x:collection1] o.a.s.u.DirectUpdateHandler2 start commit{,optimize=false,openSearcher=true,waitSearcher=true,expungeDeletes=false,softCommit=true,prepareCommit=false}
   [junit4]   2> 40045 INFO  (TEST-AutoCommitTest.testCommitWithin-seed#[1CD09CDE4A4839F6]) [    x:collection1] o.a.s.SolrTestCaseJ4 ###Starting testCommitWithin
   [junit4]   2> 40073 INFO  (commitScheduler-311-thread-1) [    x:collection1] o.a.s.s.SolrIndexSearcher Opening [Searcher@ec54ed6[collection1] main]
   [junit4]   2> 40074 INFO  (commitScheduler-311-thread-1) [    x:collection1] o.a.s.u.DirectUpdateHandler2 end_commit_flush
   [junit4]   2> 40075 INFO  (searcherExecutor-308-thread-1-processing-x:collection1) [    x:collection1] o.a.s.c.SolrCore [collection1] Registered new searcher Searcher@ec54ed6[collection1] main{ExitableDirectoryReader(UninvertingDirectoryReader(Uninverting(_4(6.0.0):c16)))}
   [junit4]   2> 40077 INFO  (TEST-AutoCommitTest.testCommitWithin-seed#[1CD09CDE4A4839F6]) [    x:collection1] o.a.s.s.SolrIndexSearcher Opening [Searcher@5b9f392b[collection1] realtime]
   [junit4]   2> 40077 INFO  (TEST-AutoCommitTest.testCommitWithin-seed#[1CD09CDE4A4839F6]) [    x:collection1] o.a.s.u.p.LogUpdateProcessorFactory [collection1]  webapp=null path=null params={}{deleteByQuery=*:* (-1526250653084549120)} 0 32
   [junit4]   2> 40078 INFO  (TEST-AutoCommitTest.testCommitWithin-seed#[1CD09CDE4A4839F6]) [    x:collection1] o.a.s.c.SolrResourceLoader new SolrResourceLoader for directory: '/x1/jenkins/jenkins-slave/workspace/Lucene-Solr-Tests-trunk-Java8/solr/core/src/test-files/solr/collection1'
   [junit4]   2> 40078 INFO  (TEST-AutoCommitTest.testCommitWithin-seed#[1CD09CDE4A4839F6]) [    x:collection1] o.a.s.c.SolrResourceLoader JNDI not configured for solr (NoInitialContextEx)
   [junit4]   2> 40078 INFO  (TEST-AutoCommitTest.testCommitWithin-seed#[1CD09CDE4A4839F6]) [    x:collection1] o.a.s.c.SolrResourceLoader using system property solr.solr.home: /x1/jenkins/jenkins-slave/workspace/Lucene-Solr-Tests-trunk-Java8/solr/core/src/test-files/solr
   [junit4]   2> 40079 INFO  (TEST-AutoCommitTest.testCommitWithin-seed#[1CD09CDE4A4839F6]) [    x:collection1] o.a.s.c.SolrResourceLoader Adding 'file:/x1/jenkins/jenkins-slave/workspace/Lucene-Solr-Tests-trunk-Java8/solr/core/src/test-files/solr/collection1/lib/classes/' to classloader
   [junit4]   2> 40079 INFO  (TEST-AutoCommitTest.testCommitWithin-seed#[1CD09CDE4A4839F6]) [    x:collection1] o.a.s.c.SolrResourceLoader Adding 'file:/x1/jenkins/jenkins-slave/workspace/Lucene-Solr-Tests-trunk-Java8/solr/core/src/test-files/solr/collection1/lib/README' to classloader
   [junit4]   2> 40117 INFO  (TEST-AutoCommitTest.testCommitWithin-seed#[1CD09CDE4A4839F6]) [    x:collection1] o.a.s.c.SolrConfig current version of requestparams : -1
   [junit4]   2> 40126 INFO  (TEST-AutoCommitTest.testCommitWithin-seed#[1CD09CDE4A4839F6]) [    x:collection1] o.a.s.c.SolrConfig Using Lucene MatchVersion: 6.0.0
   [junit4]   2> 40145 INFO  (TEST-AutoCommitTest.testCommitWithin-seed#[1CD09CDE4A4839F6]) [    x:collection1] o.a.s.c.SolrConfig Loaded SolrConfig: solrconfig.xml
   [junit4]   2> 40151 INFO  (TEST-AutoCommitTest.testCommitWithin-seed#[1CD09CDE4A4839F6]) [    x:collection1] o.a.s.s.IndexSchema [collection1] Schema name=test
   [junit4]   2> 40277 INFO  (TEST-AutoCommitTest.testCommitWithin-seed#[1CD09CDE4A4839F6]) [    x:collection1] o.a.s.s.OpenExchangeRatesOrgProvider Initialized with rates=open-exchange-rates.json, refreshInterval=1440.
   [junit4]   2> 40283 INFO  (TEST-AutoCommitTest.testCommitWithin-seed#[1CD09CDE4A4839F6]) [    x:collection1] o.a.s.s.IndexSchema default search field in schema is text
   [junit4]   2> 40284 INFO  (TEST-AutoCommitTest.testCommitWithin-seed#[1CD09CDE4A4839F6]) [    x:collection1] o.a.s.s.IndexSchema unique key field: id
   [junit4]   2> 40290 INFO  (TEST-AutoCommitTest.testCommitWithin-seed#[1CD09CDE4A4839F6]) [    x:collection1] o.a.s.s.FileExchangeRateProvider Reloading exchange rates from file currency.xml
   [junit4]   2> 40293 INFO  (TEST-AutoCommitTest.testCommitWithin-seed#[1CD09CDE4A4839F6]) [    x:collection1] o.a.s.s.FileExchangeRateProvider Reloading exchange rates from file currency.xml
   [junit4]   2> 40294 INFO  (TEST-AutoCommitTest.testCommitWithin-seed#[1CD09CDE4A4839F6]) [    x:collection1] o.a.s.s.OpenExchangeRatesOrgProvider Reloading exchange rates from open-exchange-rates.json
   [junit4]   2> 40295 INFO  (TEST-AutoCommitTest.testCommitWithin-seed#[1CD09CDE4A4839F6]) [    x:collection1] o.a.s.s.OpenExchangeRatesOrgProvider Reloading exchange rates from open-exchange-rates.json
   [junit4]   2> 40297 INFO  (TEST-AutoCommitTest.testCommitWithin-seed#[1CD09CDE4A4839F6]) [    x:collection1] o.a.s.c.ConfigSetProperties Did not find ConfigSet properties, assuming default properties: Can't find resource 'configsetprops.json' in classpath or '/x1/jenkins/jenkins-slave/workspace/Lucene-Solr-Tests-trunk-Java8/solr/core/src/test-files/solr/collection1'
   [junit4]   2> 40297 INFO  (TEST-AutoCommitTest.testCommitWithin-seed#[1CD09CDE4A4839F6]) [    x:collection1] o.a.s.c.CoreContainer Reloading SolrCore 'collection1' using configuration from instancedir /x1/jenkins/jenkins-slave/workspace/Lucene-Solr-Tests-trunk-Java8/solr/core/src/test-files/solr/collection1
   [junit4]   2> 40297 INFO  (TEST-AutoCommitTest.testCommitWithin-seed#[1CD09CDE4A4839F6]) [    x:collection1] o.a.s.c.SolrCore [[collection1] ] Opening new SolrCore at [/x1/jenkins/jenkins-slave/workspace/Lucene-Solr-Tests-trunk-Java8/solr/core/src/test-files/solr/collection1], dataDir=[/x1/jenkins/jenkins-slave/workspace/Lucene-Solr-Tests-trunk-Java8/solr/build/solr-core/test/J2/temp/solr.update.AutoCommitTest_1CD09CDE4A4839F6-001/init-core-data-001/]
   [junit4]   2> 40297 INFO  (TEST-AutoCommitTest.testCommitWithin-seed#[1CD09CDE4A4839F6]) [    x:collection1] o.a.s.c.JmxMonitoredMap No JMX servers found, not exposing Solr information with JMX.
   [junit4]   2> 40297 INFO  (TEST-AutoCommitTest.testCommitWithin-seed#[1CD09CDE4A4839F6]) [    x:collection1] o.a.s.c.SolrCore New index directory detected: old=null new=/x1/jenkins/jenkins-slave/workspace/Lucene-Solr-Tests-trunk-Java8/solr/build/solr-core/test/J2/temp/solr.update.AutoCommitTest_1CD09CDE4A4839F6-001/init-core-data-001/index/
   [junit4]   2> 40300 INFO  (TEST-AutoCommitTest.testCommitWithin-seed#[1CD09CDE4A4839F6]) [    x:collection1] o.a.s.u.p.UpdateRequestProcessorChain creating updateRequestProcessorChain "dedupe"
   [junit4]   2> 40300 INFO  (TEST-AutoCommitTest.testCommitWithin-seed#[1CD09CDE4A4839F6]) [    x:collection1] o.a.s.u.p.UpdateRequestProcessorChain inserting DistributedUpdateProcessorFactory into updateRequestProcessorChain "dedupe"
   [junit4]   2> 40300 INFO  (TEST-AutoCommitTest.testCommitWithin-seed#[1CD09CDE4A4839F6]) [    x:collection1] o.a.s.u.p.UpdateRequestProcessorChain creating updateRequestProcessorChain "dedupe-allfields"
   [junit4]   2> 40300 INFO  (TEST-AutoCommitTest.testCommitWithin-seed#[1CD09CDE4A4839F6]) [    x:collection1] o.a.s.u.p.UpdateRequestProcessorChain inserting DistributedUpdateProcessorFactory into updateRequestProcessorChain "dedupe-allfields"
   [junit4]   2> 40300 INFO  (TEST-AutoCommitTest.testCommitWithin-seed#[1CD09CDE4A4839F6]) [    x:collection1] o.a.s.u.p.UpdateRequestProcessorChain creating updateRequestProcessorChain "stored_sig"
   [junit4]   2> 40300 INFO  (TEST-AutoCommitTest.testCommitWithin-seed#[1CD09CDE4A4839F6]) [    x:collection1] o.a.s.u.p.UpdateRequestProcessorChain inserting DistributedUpdateProcessorFactory into updateRequestProcessorChain "stored_sig"
   [junit4]   2> 40301 INFO  (TEST-AutoCommitTest.testCommitWithin-seed#[1CD09CDE4A4839F6]) [    x:collection1] o.a.s.u.p.UpdateRequestProcessorChain creating updateRequestProcessorChain "uniq-fields"
   [junit4]   2> 40301 INFO  (TEST-AutoCommitTest.testCommitWithin-seed#[1CD09CDE4A4839F6]) [    x:collection1] o.a.s.u.p.UpdateRequestProcessorChain inserting DistributedUpdateProcessorFactory into updateRequestProcessorChain "uniq-fields"
   [junit4]   2> 40301 INFO  (TEST-AutoCommitTest.testCommitWithin-seed#[1CD09CDE4A4839F6]) [    x:collection1] o.a.s.u.p.UpdateRequestProcessorChain creating updateRequestProcessorChain "distrib-dup-test-chain-explicit"
   [junit4]   2> 40301 INFO  (TEST-AutoCommitTest.testCommitWithin-seed#[1CD09CDE4A4839F6]) [    x:collection1] o.a.s.u.p.UpdateRequestProcessorChain creating updateRequestProcessorChain "distrib-dup-test-chain-implicit"
   [junit4]   2> 40301 INFO  (TEST-AutoCommitTest.testCommitWithin-seed#[1CD09CDE4A4839F6]) [    x:collection1] o.a.s.u.p.UpdateRequestProcessorChain inserting Dist

[...truncated too long message...]

  [junit4]   2> 45879 INFO  (TEST-AutoCommitTest.testCommitWithin-seed#[1CD09CDE4A4839F6]) [    x:collection1] o.a.s.u.p.LogUpdateProcessorFactory [collection1] {delete=[530 (-1526250659201941506)]} 0 5538
   [junit4]   2> 45879 INFO  (TEST-AutoCommitTest.testCommitWithin-seed#[1CD09CDE4A4839F6]) [    x:collection1] o.a.s.u.p.LogUpdateProcessorFactory [collection1] {delete=[530 (-1526250659201941507)]} 0 5538
   [junit4]   2> 45880 INFO  (TEST-AutoCommitTest.testCommitWithin-seed#[1CD09CDE4A4839F6]) [    x:collection1] o.a.s.u.p.LogUpdateProcessorFactory [collection1] {delete=[530 (-1526250659202990080)]} 0 5538
   [junit4]   2> 45880 INFO  (TEST-AutoCommitTest.testCommitWithin-seed#[1CD09CDE4A4839F6]) [    x:collection1] o.a.s.u.p.LogUpdateProcessorFactory [collection1] {delete=[530 (-1526250659202990081)]} 0 5539
   [junit4]   2> 45880 INFO  (TEST-AutoCommitTest.testCommitWithin-seed#[1CD09CDE4A4839F6]) [    x:collection1] o.a.s.u.p.LogUpdateProcessorFactory [collection1] {delete=[530 (-1526250659202990082)]} 0 5539
   [junit4]   2> 45881 INFO  (TEST-AutoCommitTest.testCommitWithin-seed#[1CD09CDE4A4839F6]) [    x:collection1] o.a.s.c.S.Request [collection1]  webapp=null path=null params={q=id:530&qt=standard&start=0&rows=20&version=2.2} hits=1 status=0 QTime=0
   [junit4]   2> 46875 INFO  (commitScheduler-315-thread-1) [    x:collection1] o.a.s.u.DirectUpdateHandler2 start commit{,optimize=false,openSearcher=true,waitSearcher=true,expungeDeletes=false,softCommit=true,prepareCommit=false}
   [junit4]   2> 46882 INFO  (commitScheduler-315-thread-1) [    x:collection1] o.a.s.s.SolrIndexSearcher Opening [Searcher@b00b623[collection1] main]
   [junit4]   2> 46882 INFO  (commitScheduler-315-thread-1) [    x:collection1] o.a.s.u.DirectUpdateHandler2 end_commit_flush
   [junit4]   2> 46883 INFO  (searcherExecutor-312-thread-1-processing-x:collection1) [    x:collection1] o.a.s.c.SolrCore [collection1] Registered new searcher Searcher@b00b623[collection1] main{ExitableDirectoryReader(UninvertingDirectoryReader(Uninverting(_7(6.0.0):c10/9:delGen=1)))}
   [junit4]   2> 46885 INFO  (TEST-AutoCommitTest.testCommitWithin-seed#[1CD09CDE4A4839F6]) [    x:collection1] o.a.s.c.S.Request [collection1]  webapp=null path=null params={q=id:500&qt=standard&start=0&rows=20&version=2.2} hits=1 status=0 QTime=0
   [junit4]   2> 46887 INFO  (TEST-AutoCommitTest.testCommitWithin-seed#[1CD09CDE4A4839F6]) [    x:collection1] o.a.s.c.S.Request [collection1]  webapp=null path=null params={q=id:530&qt=standard&start=0&rows=20&version=2.2} hits=0 status=0 QTime=0
   [junit4]   2> 46887 INFO  (TEST-AutoCommitTest.testCommitWithin-seed#[1CD09CDE4A4839F6]) [    x:collection1] o.a.s.SolrTestCaseJ4 ###Ending testCommitWithin
   [junit4]   2> 46888 INFO  (SUITE-AutoCommitTest-seed#[1CD09CDE4A4839F6]-worker) [    x:collection1] o.a.s.SolrTestCaseJ4 ###deleteCore
   [junit4]   2> 46888 INFO  (SUITE-AutoCommitTest-seed#[1CD09CDE4A4839F6]-worker) [    x:collection1] o.a.s.c.CoreContainer Shutting down CoreContainer instance=550672865
   [junit4]   2> 46888 INFO  (coreCloseExecutor-316-thread-1-processing-x:collection1) [    x:collection1] o.a.s.c.SolrCore [collection1]  CLOSING SolrCore org.apache.solr.core.SolrCore@2ff25ad2
   [junit4]   2> 46889 INFO  (coreCloseExecutor-316-thread-1-processing-x:collection1) [    x:collection1] o.a.s.u.DirectUpdateHandler2 closing DirectUpdateHandler2{commits=3,autocommits=0,soft autocommits=3,optimizes=0,rollbacks=0,expungeDeletes=0,docsPending=12,adds=0,deletesById=0,deletesByQuery=0,errors=0,cumulative_adds=12,cumulative_deletesById=11,cumulative_deletesByQuery=0,cumulative_errors=0,transaction_logs_total_size=0,transaction_logs_total_number=0}
   [junit4]   2> 46889 INFO  (coreCloseExecutor-316-thread-1-processing-x:collection1) [    x:collection1] o.a.s.u.SolrCoreState Closing SolrCoreState
   [junit4]   2> 46889 INFO  (coreCloseExecutor-316-thread-1-processing-x:collection1) [    x:collection1] o.a.s.u.DefaultSolrCoreState SolrCoreState ref count has reached 0 - closing IndexWriter
   [junit4]   2> 46889 INFO  (coreCloseExecutor-316-thread-1-processing-x:collection1) [    x:collection1] o.a.s.u.DefaultSolrCoreState closing IndexWriter with IndexWriterCloser
   [junit4]   2> 46889 INFO  (coreCloseExecutor-316-thread-1-processing-x:collection1) [    x:collection1] o.a.s.u.DirectUpdateHandler2 Committing on IndexWriter close.
   [junit4]   2> 46890 INFO  (coreCloseExecutor-316-thread-1-processing-x:collection1) [    x:collection1] o.a.s.c.SolrDeletionPolicy SolrDeletionPolicy.onCommit: commits: num=2
   [junit4]   2> 	commit{dir=MockDirectoryWrapper(RAMDirectory@47450fc4 lockFactory=org.apache.lucene.store.SingleInstanceLockFactory@587f23ce),segFN=segments_3,generation=3}
   [junit4]   2> 	commit{dir=MockDirectoryWrapper(RAMDirectory@47450fc4 lockFactory=org.apache.lucene.store.SingleInstanceLockFactory@587f23ce),segFN=segments_4,generation=4}
   [junit4]   2> 46890 INFO  (coreCloseExecutor-316-thread-1-processing-x:collection1) [    x:collection1] o.a.s.c.SolrDeletionPolicy newest commit generation = 4
   [junit4]   2> 46891 INFO  (coreCloseExecutor-316-thread-1-processing-x:collection1) [    x:collection1] o.a.s.c.SolrCore [collection1] Closing main searcher on request.
   [junit4]   2> 46891 INFO  (coreCloseExecutor-316-thread-1-processing-x:collection1) [    x:collection1] o.a.s.c.CachingDirectoryFactory Closing MockDirectoryFactory - 2 directories currently being tracked
   [junit4]   2> 46891 INFO  (coreCloseExecutor-316-thread-1-processing-x:collection1) [    x:collection1] o.a.s.c.CachingDirectoryFactory looking to close /x1/jenkins/jenkins-slave/workspace/Lucene-Solr-Tests-trunk-Java8/solr/build/solr-core/test/J2/temp/solr.update.AutoCommitTest_1CD09CDE4A4839F6-001/init-core-data-001 [CachedDir<<refCount=0;path=/x1/jenkins/jenkins-slave/workspace/Lucene-Solr-Tests-trunk-Java8/solr/build/solr-core/test/J2/temp/solr.update.AutoCommitTest_1CD09CDE4A4839F6-001/init-core-data-001;done=false>>]
   [junit4]   2> 46891 INFO  (coreCloseExecutor-316-thread-1-processing-x:collection1) [    x:collection1] o.a.s.c.CachingDirectoryFactory Closing directory: /x1/jenkins/jenkins-slave/workspace/Lucene-Solr-Tests-trunk-Java8/solr/build/solr-core/test/J2/temp/solr.update.AutoCommitTest_1CD09CDE4A4839F6-001/init-core-data-001
   [junit4]   2> 46891 INFO  (coreCloseExecutor-316-thread-1-processing-x:collection1) [    x:collection1] o.a.s.c.CachingDirectoryFactory looking to close /x1/jenkins/jenkins-slave/workspace/Lucene-Solr-Tests-trunk-Java8/solr/build/solr-core/test/J2/temp/solr.update.AutoCommitTest_1CD09CDE4A4839F6-001/init-core-data-001/index [CachedDir<<refCount=0;path=/x1/jenkins/jenkins-slave/workspace/Lucene-Solr-Tests-trunk-Java8/solr/build/solr-core/test/J2/temp/solr.update.AutoCommitTest_1CD09CDE4A4839F6-001/init-core-data-001/index;done=false>>]
   [junit4]   2> 46891 INFO  (coreCloseExecutor-316-thread-1-processing-x:collection1) [    x:collection1] o.a.s.c.CachingDirectoryFactory Closing directory: /x1/jenkins/jenkins-slave/workspace/Lucene-Solr-Tests-trunk-Java8/solr/build/solr-core/test/J2/temp/solr.update.AutoCommitTest_1CD09CDE4A4839F6-001/init-core-data-001/index
   [junit4]   2> NOTE: leaving temporary files on disk at: /x1/jenkins/jenkins-slave/workspace/Lucene-Solr-Tests-trunk-Java8/solr/build/solr-core/test/J2/temp/solr.update.AutoCommitTest_1CD09CDE4A4839F6-001
   [junit4]   2> NOTE: test params are: codec=Asserting(Lucene60): {range_facet_l_dv=PostingsFormat(name=Memory doPackFST= true), _version_=Lucene50(blocksize=128), field_t=PostingsFormat(name=Memory doPackFST= true), multiDefault=PostingsFormat(name=Memory doPackFST= false), subject=PostingsFormat(name=Memory doPackFST= false), intDefault=Lucene50(blocksize=128), id=PostingsFormat(name=Memory doPackFST= true), range_facet_i_dv=PostingsFormat(name=Memory doPackFST= false), text=BlockTreeOrds(blocksize=128), range_facet_l=PostingsFormat(name=Memory doPackFST= false), timestamp=PostingsFormat(name=Memory doPackFST= false)}, docValues:{range_facet_l_dv=DocValuesFormat(name=Memory), range_facet_i_dv=DocValuesFormat(name=Asserting), timestamp=DocValuesFormat(name=Asserting)}, sim=ClassicSimilarity, locale=lv-LV, timezone=CET
   [junit4]   2> NOTE: Linux 3.13.0-52-generic amd64/Oracle Corporation 1.8.0_66 (64-bit)/cpus=4,threads=1,free=155761712,total=346030080
   [junit4]   2> NOTE: All tests run in this JVM: [TestSearchPerf, TestRecovery, TestSuggestSpellingConverter, CachingDirectoryFactoryTest, HdfsTlogReplayBufferedWhileIndexingTest, TestReload, AutoCommitTest]
   [junit4] Completed [19/579 (1!)] on J2 in 12.89s, 3 tests, 1 error <<< FAILURES!

[...truncated 1816 lines...]
BUILD FAILED
/x1/jenkins/jenkins-slave/workspace/Lucene-Solr-Tests-trunk-Java8/build.xml:740: The following error occurred while executing this line:
/x1/jenkins/jenkins-slave/workspace/Lucene-Solr-Tests-trunk-Java8/build.xml:684: The following error occurred while executing this line:
/x1/jenkins/jenkins-slave/workspace/Lucene-Solr-Tests-trunk-Java8/build.xml:59: The following error occurred while executing this line:
/x1/jenkins/jenkins-slave/workspace/Lucene-Solr-Tests-trunk-Java8/solr/build.xml:233: The following error occurred while executing this line:
/x1/jenkins/jenkins-slave/workspace/Lucene-Solr-Tests-trunk-Java8/solr/common-build.xml:524: The following error occurred while executing this line:
/x1/jenkins/jenkins-slave/workspace/Lucene-Solr-Tests-trunk-Java8/lucene/common-build.xml:1457: The following error occurred while executing this line:
/x1/jenkins/jenkins-slave/workspace/Lucene-Solr-Tests-trunk-Java8/lucene/common-build.xml:1014: There were test failures: 579 suites (8 ignored), 2331 tests, 1 error, 88 ignored (72 assumptions) [seed: 1CD09CDE4A4839F6]

Total time: 58 minutes 5 seconds
Build step 'Invoke Ant' marked build as failure
Archiving artifacts
Recording test results
Email was triggered for: Failure - Any
Sending email for trigger: Failure - Any



Mime
View raw message