lucene-dev mailing list archives

Site index · List index
Message view « Date » · « Thread »
Top « Date » · « Thread »
From Policeman Jenkins Server <jenk...@thetaphi.de>
Subject [JENKINS-EA] Lucene-Solr-trunk-Linux (64bit/jdk-9-ea+105) - Build # 15946 - Still Failing!
Date Sun, 21 Feb 2016 16:03:24 GMT
Build: http://jenkins.thetaphi.de/job/Lucene-Solr-trunk-Linux/15946/
Java: 64bit/jdk-9-ea+105 -XX:+UseCompressedOops -XX:+UseG1GC -XX:-UseSuperWord

1 tests failed.
FAILED:  org.apache.solr.update.DirectUpdateHandlerTest.testExpungeDeletes

Error Message:
expected:<5> but was:<4>

Stack Trace:
java.lang.AssertionError: expected:<5> but was:<4>
	at __randomizedtesting.SeedInfo.seed([B129E373C1AF221A:9D50A7F6B416EABF]:0)
	at org.junit.Assert.fail(Assert.java:93)
	at org.junit.Assert.failNotEquals(Assert.java:647)
	at org.junit.Assert.assertEquals(Assert.java:128)
	at org.junit.Assert.assertEquals(Assert.java:472)
	at org.junit.Assert.assertEquals(Assert.java:456)
	at org.apache.solr.update.DirectUpdateHandlerTest.testExpungeDeletes(DirectUpdateHandlerTest.java:299)
	at sun.reflect.NativeMethodAccessorImpl.invoke0(Native Method)
	at sun.reflect.NativeMethodAccessorImpl.invoke(NativeMethodAccessorImpl.java:62)
	at sun.reflect.DelegatingMethodAccessorImpl.invoke(DelegatingMethodAccessorImpl.java:43)
	at java.lang.reflect.Method.invoke(Method.java:520)
	at com.carrotsearch.randomizedtesting.RandomizedRunner.invoke(RandomizedRunner.java:1764)
	at com.carrotsearch.randomizedtesting.RandomizedRunner$8.evaluate(RandomizedRunner.java:871)
	at com.carrotsearch.randomizedtesting.RandomizedRunner$9.evaluate(RandomizedRunner.java:907)
	at com.carrotsearch.randomizedtesting.RandomizedRunner$10.evaluate(RandomizedRunner.java:921)
	at com.carrotsearch.randomizedtesting.rules.SystemPropertiesRestoreRule$1.evaluate(SystemPropertiesRestoreRule.java:57)
	at org.apache.lucene.util.TestRuleSetupTeardownChained$1.evaluate(TestRuleSetupTeardownChained.java:49)
	at org.apache.lucene.util.AbstractBeforeAfterRule$1.evaluate(AbstractBeforeAfterRule.java:45)
	at org.apache.lucene.util.TestRuleThreadAndTestName$1.evaluate(TestRuleThreadAndTestName.java:48)
	at org.apache.lucene.util.TestRuleIgnoreAfterMaxFailures$1.evaluate(TestRuleIgnoreAfterMaxFailures.java:64)
	at org.apache.lucene.util.TestRuleMarkFailure$1.evaluate(TestRuleMarkFailure.java:47)
	at com.carrotsearch.randomizedtesting.rules.StatementAdapter.evaluate(StatementAdapter.java:36)
	at com.carrotsearch.randomizedtesting.ThreadLeakControl$StatementRunner.run(ThreadLeakControl.java:367)
	at com.carrotsearch.randomizedtesting.ThreadLeakControl.forkTimeoutingTask(ThreadLeakControl.java:809)
	at com.carrotsearch.randomizedtesting.ThreadLeakControl$3.evaluate(ThreadLeakControl.java:460)
	at com.carrotsearch.randomizedtesting.RandomizedRunner.runSingleTest(RandomizedRunner.java:880)
	at com.carrotsearch.randomizedtesting.RandomizedRunner$5.evaluate(RandomizedRunner.java:781)
	at com.carrotsearch.randomizedtesting.RandomizedRunner$6.evaluate(RandomizedRunner.java:816)
	at com.carrotsearch.randomizedtesting.RandomizedRunner$7.evaluate(RandomizedRunner.java:827)
	at com.carrotsearch.randomizedtesting.rules.StatementAdapter.evaluate(StatementAdapter.java:36)
	at com.carrotsearch.randomizedtesting.rules.SystemPropertiesRestoreRule$1.evaluate(SystemPropertiesRestoreRule.java:57)
	at org.apache.lucene.util.AbstractBeforeAfterRule$1.evaluate(AbstractBeforeAfterRule.java:45)
	at com.carrotsearch.randomizedtesting.rules.StatementAdapter.evaluate(StatementAdapter.java:36)
	at org.apache.lucene.util.TestRuleStoreClassName$1.evaluate(TestRuleStoreClassName.java:41)
	at com.carrotsearch.randomizedtesting.rules.NoShadowingOrOverridesOnMethodsRule$1.evaluate(NoShadowingOrOverridesOnMethodsRule.java:40)
	at com.carrotsearch.randomizedtesting.rules.NoShadowingOrOverridesOnMethodsRule$1.evaluate(NoShadowingOrOverridesOnMethodsRule.java:40)
	at com.carrotsearch.randomizedtesting.rules.StatementAdapter.evaluate(StatementAdapter.java:36)
	at com.carrotsearch.randomizedtesting.rules.StatementAdapter.evaluate(StatementAdapter.java:36)
	at com.carrotsearch.randomizedtesting.rules.StatementAdapter.evaluate(StatementAdapter.java:36)
	at org.apache.lucene.util.TestRuleAssertionsRequired$1.evaluate(TestRuleAssertionsRequired.java:53)
	at org.apache.lucene.util.TestRuleMarkFailure$1.evaluate(TestRuleMarkFailure.java:47)
	at org.apache.lucene.util.TestRuleIgnoreAfterMaxFailures$1.evaluate(TestRuleIgnoreAfterMaxFailures.java:64)
	at org.apache.lucene.util.TestRuleIgnoreTestSuites$1.evaluate(TestRuleIgnoreTestSuites.java:54)
	at com.carrotsearch.randomizedtesting.rules.StatementAdapter.evaluate(StatementAdapter.java:36)
	at com.carrotsearch.randomizedtesting.ThreadLeakControl$StatementRunner.run(ThreadLeakControl.java:367)
	at java.lang.Thread.run(Thread.java:804)




Build Log:
[...truncated 10981 lines...]
   [junit4] Suite: org.apache.solr.update.DirectUpdateHandlerTest
   [junit4]   2> Creating dataDir: /home/jenkins/workspace/Lucene-Solr-trunk-Linux/solr/build/solr-core/test/J2/temp/solr.update.DirectUpdateHandlerTest_B129E373C1AF221A-001/init-core-data-001
   [junit4]   2> 614611 INFO  (SUITE-DirectUpdateHandlerTest-seed#[B129E373C1AF221A]-worker) [    ] o.a.s.SolrTestCaseJ4 Randomized ssl (false) and clientAuth (false)
   [junit4]   2> 614612 INFO  (SUITE-DirectUpdateHandlerTest-seed#[B129E373C1AF221A]-worker) [    ] o.a.s.SolrTestCaseJ4 ####initCore
   [junit4]   2> 614612 INFO  (SUITE-DirectUpdateHandlerTest-seed#[B129E373C1AF221A]-worker) [    ] o.a.s.c.SolrResourceLoader new SolrResourceLoader for directory: '/home/jenkins/workspace/Lucene-Solr-trunk-Linux/solr/core/src/test-files/solr/collection1'
   [junit4]   2> 614612 INFO  (SUITE-DirectUpdateHandlerTest-seed#[B129E373C1AF221A]-worker) [    ] o.a.s.c.SolrResourceLoader JNDI not configured for solr (NoInitialContextEx)
   [junit4]   2> 614612 INFO  (SUITE-DirectUpdateHandlerTest-seed#[B129E373C1AF221A]-worker) [    ] o.a.s.c.SolrResourceLoader using system property solr.solr.home: /home/jenkins/workspace/Lucene-Solr-trunk-Linux/solr/core/src/test-files/solr
   [junit4]   2> 614612 INFO  (SUITE-DirectUpdateHandlerTest-seed#[B129E373C1AF221A]-worker) [    ] o.a.s.c.SolrResourceLoader Adding 'file:/home/jenkins/workspace/Lucene-Solr-trunk-Linux/solr/core/src/test-files/solr/collection1/lib/classes/' to classloader
   [junit4]   2> 614612 INFO  (SUITE-DirectUpdateHandlerTest-seed#[B129E373C1AF221A]-worker) [    ] o.a.s.c.SolrResourceLoader Adding 'file:/home/jenkins/workspace/Lucene-Solr-trunk-Linux/solr/core/src/test-files/solr/collection1/lib/README' to classloader
   [junit4]   2> 614627 INFO  (SUITE-DirectUpdateHandlerTest-seed#[B129E373C1AF221A]-worker) [    ] o.a.s.c.SolrConfig current version of requestparams : -1
   [junit4]   2> 614633 INFO  (SUITE-DirectUpdateHandlerTest-seed#[B129E373C1AF221A]-worker) [    ] o.a.s.c.SolrConfig Using Lucene MatchVersion: 6.0.0
   [junit4]   2> 614649 INFO  (SUITE-DirectUpdateHandlerTest-seed#[B129E373C1AF221A]-worker) [    ] o.a.s.c.SolrConfig Loaded SolrConfig: solrconfig.xml
   [junit4]   2> 614653 INFO  (SUITE-DirectUpdateHandlerTest-seed#[B129E373C1AF221A]-worker) [    ] o.a.s.s.IndexSchema [null] Schema name=test
   [junit4]   2> 614769 INFO  (SUITE-DirectUpdateHandlerTest-seed#[B129E373C1AF221A]-worker) [    ] o.a.s.s.IndexSchema default search field in schema is text
   [junit4]   2> 614770 INFO  (SUITE-DirectUpdateHandlerTest-seed#[B129E373C1AF221A]-worker) [    ] o.a.s.s.IndexSchema unique key field: id
   [junit4]   2> 614770 WARN  (SUITE-DirectUpdateHandlerTest-seed#[B129E373C1AF221A]-worker) [    ] o.a.s.s.IndexSchema Field text is not multivalued and destination for multiple copyFields (2)
   [junit4]   2> 614773 INFO  (SUITE-DirectUpdateHandlerTest-seed#[B129E373C1AF221A]-worker) [    ] o.a.s.s.FileExchangeRateProvider Reloading exchange rates from file currency.xml
   [junit4]   2> 614774 INFO  (SUITE-DirectUpdateHandlerTest-seed#[B129E373C1AF221A]-worker) [    ] o.a.s.s.FileExchangeRateProvider Reloading exchange rates from file currency.xml
   [junit4]   2> 614775 INFO  (SUITE-DirectUpdateHandlerTest-seed#[B129E373C1AF221A]-worker) [    ] o.a.s.c.SolrResourceLoader JNDI not configured for solr (NoInitialContextEx)
   [junit4]   2> 614775 INFO  (SUITE-DirectUpdateHandlerTest-seed#[B129E373C1AF221A]-worker) [    ] o.a.s.c.SolrResourceLoader using system property solr.solr.home: /home/jenkins/workspace/Lucene-Solr-trunk-Linux/solr/core/src/test-files/solr
   [junit4]   2> 614775 INFO  (SUITE-DirectUpdateHandlerTest-seed#[B129E373C1AF221A]-worker) [    ] o.a.s.c.SolrResourceLoader new SolrResourceLoader for directory: '/home/jenkins/workspace/Lucene-Solr-trunk-Linux/solr/core/src/test-files/solr'
   [junit4]   2> 614775 INFO  (SUITE-DirectUpdateHandlerTest-seed#[B129E373C1AF221A]-worker) [    ] o.a.s.c.SolrResourceLoader JNDI not configured for solr (NoInitialContextEx)
   [junit4]   2> 614775 INFO  (SUITE-DirectUpdateHandlerTest-seed#[B129E373C1AF221A]-worker) [    ] o.a.s.c.SolrResourceLoader using system property solr.solr.home: /home/jenkins/workspace/Lucene-Solr-trunk-Linux/solr/core/src/test-files/solr
   [junit4]   2> 614775 INFO  (SUITE-DirectUpdateHandlerTest-seed#[B129E373C1AF221A]-worker) [    ] o.a.s.c.CoreContainer New CoreContainer 1574769133
   [junit4]   2> 614775 INFO  (SUITE-DirectUpdateHandlerTest-seed#[B129E373C1AF221A]-worker) [    ] o.a.s.c.CoreContainer Loading cores into CoreContainer [instanceDir=/home/jenkins/workspace/Lucene-Solr-trunk-Linux/solr/core/src/test-files/solr]
   [junit4]   2> 614775 WARN  (SUITE-DirectUpdateHandlerTest-seed#[B129E373C1AF221A]-worker) [    ] o.a.s.c.CoreContainer Couldn't add files from /home/jenkins/workspace/Lucene-Solr-trunk-Linux/solr/core/src/test-files/solr/lib to classpath: /home/jenkins/workspace/Lucene-Solr-trunk-Linux/solr/core/src/test-files/solr/lib
   [junit4]   2> 614775 INFO  (SUITE-DirectUpdateHandlerTest-seed#[B129E373C1AF221A]-worker) [    ] o.a.s.h.c.HttpShardHandlerFactory created with socketTimeout : 600000,connTimeout : 60000,maxConnectionsPerHost : 20,maxConnections : 10000,corePoolSize : 0,maximumPoolSize : 2147483647,maxThreadIdleTime : 5,sizeOfQueue : -1,fairnessPolicy : false,useRetries : false,
   [junit4]   2> 614777 INFO  (SUITE-DirectUpdateHandlerTest-seed#[B129E373C1AF221A]-worker) [    ] o.a.s.u.UpdateShardHandler Creating UpdateShardHandler HTTP client with params: socketTimeout=30000&connTimeout=30000&retry=true
   [junit4]   2> 614777 INFO  (SUITE-DirectUpdateHandlerTest-seed#[B129E373C1AF221A]-worker) [    ] o.a.s.l.LogWatcher SLF4J impl is org.slf4j.impl.Log4jLoggerFactory
   [junit4]   2> 614777 INFO  (SUITE-DirectUpdateHandlerTest-seed#[B129E373C1AF221A]-worker) [    ] o.a.s.l.LogWatcher Registering Log Listener [Log4j (org.slf4j.impl.Log4jLoggerFactory)]
   [junit4]   2> 614777 INFO  (SUITE-DirectUpdateHandlerTest-seed#[B129E373C1AF221A]-worker) [    ] o.a.s.c.CoreContainer Security conf doesn't exist. Skipping setup for authorization module.
   [junit4]   2> 614777 INFO  (SUITE-DirectUpdateHandlerTest-seed#[B129E373C1AF221A]-worker) [    ] o.a.s.c.CoreContainer No authentication plugin used.
   [junit4]   2> 614778 INFO  (SUITE-DirectUpdateHandlerTest-seed#[B129E373C1AF221A]-worker) [    ] o.a.s.c.CoreDescriptor Created CoreDescriptor: {name=collection1, config=solrconfig.xml, transient=false, schema=schema12.xml, loadOnStartup=true, configSetProperties=configsetprops.json, collection=collection1, dataDir=/home/jenkins/workspace/Lucene-Solr-trunk-Linux/solr/build/solr-core/test/J2/temp/solr.update.DirectUpdateHandlerTest_B129E373C1AF221A-001/init-core-data-001, shard=shard1}
   [junit4]   2> 614778 INFO  (coreLoadExecutor-2476-thread-1) [    ] o.a.s.c.SolrResourceLoader new SolrResourceLoader for directory: '/home/jenkins/workspace/Lucene-Solr-trunk-Linux/solr/core/src/test-files/solr/collection1'
   [junit4]   2> 614778 INFO  (coreLoadExecutor-2476-thread-1) [    ] o.a.s.c.SolrResourceLoader JNDI not configured for solr (NoInitialContextEx)
   [junit4]   2> 614778 INFO  (coreLoadExecutor-2476-thread-1) [    ] o.a.s.c.SolrResourceLoader using system property solr.solr.home: /home/jenkins/workspace/Lucene-Solr-trunk-Linux/solr/core/src/test-files/solr
   [junit4]   2> 614778 INFO  (coreLoadExecutor-2476-thread-1) [    ] o.a.s.c.SolrResourceLoader Adding 'file:/home/jenkins/workspace/Lucene-Solr-trunk-Linux/solr/core/src/test-files/solr/collection1/lib/classes/' to classloader
   [junit4]   2> 614778 INFO  (coreLoadExecutor-2476-thread-1) [    ] o.a.s.c.SolrResourceLoader Adding 'file:/home/jenkins/workspace/Lucene-Solr-trunk-Linux/solr/core/src/test-files/solr/collection1/lib/README' to classloader
   [junit4]   2> 614789 INFO  (coreLoadExecutor-2476-thread-1) [    ] o.a.s.c.SolrConfig current version of requestparams : -1
   [junit4]   2> 614795 INFO  (coreLoadExecutor-2476-thread-1) [    ] o.a.s.c.SolrConfig Using Lucene MatchVersion: 6.0.0
   [junit4]   2> 614810 INFO  (coreLoadExecutor-2476-thread-1) [    ] o.a.s.c.SolrConfig Loaded SolrConfig: solrconfig.xml
   [junit4]   2> 614813 INFO  (coreLoadExecutor-2476-thread-1) [    ] o.a.s.s.IndexSchema [collection1] Schema name=test
   [junit4]   2> 614869 INFO  (coreLoadExecutor-2476-thread-1) [    ] o.a.s.s.IndexSchema default search field in schema is text
   [junit4]   2> 614870 INFO  (coreLoadExecutor-2476-thread-1) [    ] o.a.s.s.IndexSchema unique key field: id
   [junit4]   2> 614870 WARN  (coreLoadExecutor-2476-thread-1) [    ] o.a.s.s.IndexSchema Field text is not multivalued and destination for multiple copyFields (2)
   [junit4]   2> 614873 INFO  (coreLoadExecutor-2476-thread-1) [    ] o.a.s.s.FileExchangeRateProvider Reloading exchange rates from file currency.xml
   [junit4]   2> 614874 INFO  (coreLoadExecutor-2476-thread-1) [    ] o.a.s.s.FileExchangeRateProvider Reloading exchange rates from file currency.xml
   [junit4]   2> 614876 INFO  (coreLoadExecutor-2476-thread-1) [    ] o.a.s.c.ConfigSetProperties Did not find ConfigSet properties, assuming default properties: Can't find resource 'configsetprops.json' in classpath or '/home/jenkins/workspace/Lucene-Solr-trunk-Linux/solr/core/src/test-files/solr/collection1'
   [junit4]   2> 614876 INFO  (coreLoadExecutor-2476-thread-1) [    ] o.a.s.c.CoreContainer Creating SolrCore 'collection1' using configuration from instancedir /home/jenkins/workspace/Lucene-Solr-trunk-Linux/solr/core/src/test-files/solr/collection1
   [junit4]   2> 614876 INFO  (coreLoadExecutor-2476-thread-1) [    ] o.a.s.c.SolrCore org.apache.solr.core.MockFSDirectoryFactory
   [junit4]   2> 614876 INFO  (coreLoadExecutor-2476-thread-1) [    ] o.a.s.c.SolrCore [[collection1] ] Opening new SolrCore at [/home/jenkins/workspace/Lucene-Solr-trunk-Linux/solr/core/src/test-files/solr/collection1], dataDir=[/home/jenkins/workspace/Lucene-Solr-trunk-Linux/solr/build/solr-core/test/J2/temp/solr.update.DirectUpdateHandlerTest_B129E373C1AF221A-001/init-core-data-001/]
   [junit4]   2> 614876 INFO  (coreLoadExecutor-2476-thread-1) [    ] o.a.s.c.JmxMonitoredMap JMX monitoring is enabled. Adding Solr mbeans to JMX Server: com.sun.jmx.mbeanserver.JmxMBeanServer@325f8049
   [junit4]   2> 614876 INFO  (coreLoadExecutor-2476-thread-1) [    ] o.a.s.c.CachingDirectoryFactory return new directory for /home/jenkins/workspace/Lucene-Solr-trunk-Linux/solr/build/solr-core/test/J2/temp/solr.update.DirectUpdateHandlerTest_B129E373C1AF221A-001/init-core-data-001
   [junit4]   2> 614877 INFO  (coreLoadExecutor-2476-thread-1) [    ] o.a.s.c.SolrCore New index directory detected: old=null new=/home/jenkins/workspace/Lucene-Solr-trunk-Linux/solr/build/solr-core/test/J2/temp/solr.update.DirectUpdateHandlerTest_B129E373C1AF221A-001/init-core-data-001/index/
   [junit4]   2> 614877 WARN  (coreLoadExecutor-2476-thread-1) [    ] o.a.s.c.SolrCore [collection1] Solr index directory '/home/jenkins/workspace/Lucene-Solr-trunk-Linux/solr/build/solr-core/test/J2/temp/solr.update.DirectUpdateHandlerTest_B129E373C1AF221A-001/init-core-data-001/index' doesn't exist. Creating new index...
   [junit4]   2> 614877 INFO  (coreLoadExecutor-2476-thread-1) [    ] o.a.s.c.CachingDirectoryFactory return new directory for /home/jenkins/workspace/Lucene-Solr-trunk-Linux/solr/build/solr-core/test/J2/temp/solr.update.DirectUpdateHandlerTest_B129E373C1AF221A-001/init-core-data-001/index
   [junit4]   2> 614877 INFO  (coreLoadExecutor-2476-thread-1) [    ] o.a.s.u.RandomMergePolicy RandomMergePolicy wrapping class org.apache.lucene.index.TieredMergePolicy: [TieredMergePolicy: maxMergeAtOnce=14, maxMergeAtOnceExplicit=10, maxMergedSegmentMB=49.8564453125, floorSegmentMB=2.0732421875, forceMergeDeletesPctAllowed=23.023044011900655, segmentsPerTier=20.0, maxCFSSegmentSizeMB=8.796093022207999E12, noCFSRatio=1.0
   [junit4]   2> 614942 INFO  (coreLoadExecutor-2476-thread-1) [    ] o.a.s.c.SolrDeletionPolicy SolrDeletionPolicy.onCommit: commits: num=1
   [junit4]   2> 	commit{dir=MockDirectoryWrapper(MMapDirectory@/home/jenkins/workspace/Lucene-Solr-trunk-Linux/solr/build/solr-core/test/J2/temp/solr.update.DirectUpdateHandlerTest_B129E373C1AF221A-001/init-core-data-001/index lockFactory=org.apache.lucene.store.SingleInstanceLockFactory@1324519d),segFN=segments_1,generation=1}
   [junit4]   2> 614942 INFO  (coreLoadExecutor-2476-thread-1) [    ] o.a.s.c.SolrDeletionPolicy newest commit generation = 1
   [junit4]   2> 614943 INFO  (OldIndexDirectoryCleanupThreadForCore-collection1) [    ] o.a.s.c.SolrCore Looking for old index directories to cleanup for core collection1 in /home/jenkins/workspace/Lucene-Solr-trunk-Linux/solr/build/solr-core/test/J2/temp/solr.update.DirectUpdateHandlerTest_B129E373C1AF221A-001/init-core-data-001/
   [junit4]   2> 614945 INFO  (coreLoadExecutor-2476-thread-1) [    ] o.a.s.u.p.UpdateRequestProcessorChain creating updateRequestProcessorChain "dedupe"
   [junit4]   2> 614945 INFO  (coreLoadExecutor-2476-thread-1) [    ] o.a.s.u.p.UpdateRequestProcessorChain inserting DistributedUpdateProcessorFactory into updateRequestProcessorChain "dedupe"
   [junit4]   2> 614945 INFO  (coreLoadExecutor-2476-thread-1) [    ] o.a.s.u.p.UpdateRequestProcessorChain creating updateRequestProcessorChain "dedupe-allfields"
   [junit4]   2> 614945 INFO  (coreLoadExecutor-2476-thread-1) [    ] o.a.s.u.p.UpdateRequestProcessorChain inserting DistributedUpdateProcessorFactory into updateRequestProcessorChain "dedupe-allfields"
   [junit4]   2> 614945 INFO  (coreLoadExecutor-2476-thread-1) [    ] o.a.s.u.p.UpdateRequestProcessorChain creating updateRequestProcessorChain "stored_sig"
   [junit4]   2> 614945 INFO  (coreLoadExecutor-2476-thread-1) [    ] o.a.s.u.p.UpdateRequestProcessorChain inserting DistributedUpdateProcessorFactory into updateRequestProcessorChain "stored_sig"
   [junit4]   2> 614945 INFO  (coreLoadExecutor-2476-thread-1) [    ] o.a.s.u.p.UpdateRequestProcessorChain creating updateRequestProcessorChain "uniq-fields"
   [junit4]   2> 614945 INFO  (coreLoadExecutor-2476-thread-1) [    ] o.a.s.u.p.UpdateRequestProcessorChain inserting DistributedUpdateProcessorFactory into updateRequestProcessorChain "uniq-fields"
   [junit4]   2> 614945 INFO  (coreLoadExecutor-2476-thread-1) [    ] o.a.s.u.p.UpdateRequestProcessorChain creating updateRequestProcessorChain "distrib-dup-test-chain-explicit"
   [junit4]   2> 614945 INFO  (coreLoadExecutor-2476-thread-1) [    ] o.a.s.u.p.UpdateRequestProcessorChain creating updateRequestProcessorChain "distrib-dup-test-chain-implicit"
   [junit4]   2> 614945 INFO  (coreLoadExecutor-2476-thread-1) [    ] o.a.s.u.p.UpdateRequestProcessorChain inserting DistributedUpdateProcessorFactory into updateRequestProcessorChain "distrib-dup-test-chain-implicit"
   [junit4]   2> 614945 INFO  (coreLoadExecutor-2476-thread-1) [    ] o.a.s.c.SolrCore no updateRequestProcessorChain defined as default, creating implicit default
   [junit4]   2> 614947 INFO  (coreLoadExecutor-2476-thread-1) [    ] o.a.s.h.l.XMLLoader xsltCacheLifetimeSeconds=60
   [junit4]   2> 614947 INFO  (coreLoadExecutor-2476-thread-1) [    ] o.a.s.h.l.XMLLoader xsltCacheLifetimeSeconds=60
   [junit4]   2> 614948 INFO  (coreLoadExecutor-2476-thread-1) [    ] o.a.s.h.l.XMLLoader xsltCacheLifetimeSeconds=60
   [junit4]   2> 614948 INFO  (coreLoadExecutor-2476-thread-1) [    ] o.a.s.h.l.XMLLoader xsltCacheLifetimeSeconds=60
   [junit4]   2> 614960 INFO  (coreLoadExecutor-2476-thread-1) [    ] o.a.s.c.PluginBag requestHandler : 'lazy' created with startup=lazy 
   [junit4]   2> 614960 INFO  (coreLoadExecutor-2476-thread-1) [    ] o.a.s.c.RequestHandlers Registered paths: /admin/mbeans,standard,spellCheckCompRH,lazy,/update/json/docs,/admin/luke,/export,spellCheckWithWordbreak_Direct,tvrh,/get,/admin/properties,/update/json,mltrh,/admin/threads,/search-facet-def,/update/csv,/sql,/search-facet-invariants,/admin/segments,spellCheckCompRH1,/mlt,/admin/system,/replication,dismax,defaults,/config,/stream,/schema,/admin/plugins,/admin/logging,spellCheckWithWordbreak,mock,/admin/ping,/update,/admin/file,/terms,spellCheckCompRH_Direct,/debug/dump
   [junit4]   2> 614961 WARN  (coreLoadExecutor-2476-thread-1) [    ] o.a.s.c.SolrCore solrconfig.xml uses deprecated <admin/gettableFiles>, Please update your config to use the ShowFileRequestHandler.
   [junit4]   2> 614961 INFO  (coreLoadExecutor-2476-thread-1) [    ] o.a.s.c.SolrCore Using default statsCache cache: org.apache.solr.search.stats.LocalStatsCache
   [junit4]   2> 614961 INFO  (coreLoadExecutor-2476-thread-1) [    ] o.a.s.u.CommitTracker Hard AutoCommit: disabled
   [junit4]   2> 614961 INFO  (coreLoadExecutor-2476-thread-1) [    ] o.a.s.u.CommitTracker Soft AutoCommit: disabled
   [junit4]   2> 614961 INFO  (coreLoadExecutor-2476-thread-1) [    ] o.a.s.u.RandomMergePolicy RandomMergePolicy wrapping class org.apache.lucene.index.LogDocMergePolicy: [LogDocMergePolicy: minMergeSize=1000, mergeFactor=25, maxMergeSize=9223372036854775807, maxMergeSizeForForcedMerge=9223372036854775807, calibrateSizeByDeletes=false, maxMergeDocs=2147483647, maxCFSSegmentSizeMB=8.796093022207999E12, noCFSRatio=0.0]
   [junit4]   2> 614962 INFO  (coreLoadExecutor-2476-thread-1) [    ] o.a.s.c.SolrDeletionPolicy SolrDeletionPolicy.onInit: commits: num=1
   [junit4]   2> 	commit{dir=MockDirectoryWrapper(MMapDirectory@/home/jenkins/workspace/Lucene-Solr-trunk-Linux/solr/build/solr-core/test/J2/temp/solr.update.DirectUpdateHandlerTest_B129E373C1AF221A-001/init-core-data-001/index lockFactory=org.apache.lucene.store.SingleInstanceLockFactory@1324519d),segFN=segments_1,generation=1}
   [junit4]   2> 614962 INFO  (coreLoadExecutor-2476-thread-1) [    ] o.a.s.c.SolrDeletionPolicy newest commit generation = 1
   [junit4]   2> 614962 INFO  (coreLoadExecutor-2476-thread-1) [    ] o.a.s.s.SolrIndexSearcher Opening [Searcher@50afc0bb[collection1] main]
   [junit4]   2> 614962 INFO  (coreLoadExecutor-2476-thread-1) [    ] o.a.s.r.RestManager Initializing RestManager with initArgs: {storageIO=org.apache.solr.rest.ManagedResourceStorage$InMemoryStorageIO}
   [junit4]   2> 614962 INFO  (coreLoadExecutor-2476-thread-1) [    ] o.a.s.r.ManagedResourceStorage Reading _rest_managed.json using InMemoryStorage
   [junit4]   2> 614962 INFO  (coreLoadExecutor-2476-thread-1) [    ] o.a.s.r.RestManager Initializing 0 registered ManagedResources
   [junit4]   2> 614962 INFO  (coreLoadExecutor-2476-thread-1) [    ] o.a.s.h.c.SpellCheckComponent Initializing spell checkers
   [junit4]   2> 615018 INFO  (coreLoadExecutor-2476-thread-1) [    ] o.a.s.s.DirectSolrSpellChecker init: {name=direct,classname=DirectSolrSpellChecker,field=lowerfilt,minQueryLength=3}
   [junit4]   2> 615163 INFO  (coreLoadExecutor-2476-thread-1) [    ] o.a.s.h.ReplicationHandler Commits will be reserved for  10000
   [junit4]   2> 615164 INFO  (searcherExecutor-2477-thread-1) [    ] o.a.s.h.c.SpellCheckComponent Loading spell index for spellchecker: default
   [junit4]   2> 615164 INFO  (searcherExecutor-2477-thread-1) [    ] o.a.s.h.c.SpellCheckComponent Loading spell index for spellchecker: direct
   [junit4]   2> 615164 INFO  (searcherExecutor-2477-thread-1) [    ] o.a.s.h.c.SpellCheckComponent Loading spell index for spellchecker: wordbreak
   [junit4]   2> 615164 INFO  (searcherExecutor-2477-thread-1) [    ] o.a.s.h.c.SpellCheckComponent Loading spell index for spellchecker: multipleFields
   [junit4]   2> 615164 INFO  (searcherExecutor-2477-thread-1) [    ] o.a.s.h.c.SpellCheckComponent Loading spell index for spellchecker: jarowinkler
   [junit4]   2> 615164 INFO  (searcherExecutor-2477-thread-1) [    ] o.a.s.h.c.SpellCheckComponent Loading spell index for spellchecker: external
   [junit4]   2> 615164 INFO  (coreLoadExecutor-2476-thread-1) [    ] o.a.s.c.CoreContainer registering core: collection1
   [junit4]   2> 615164 INFO  (searcherExecutor-2477-thread-1) [    ] o.a.s.h.c.SpellCheckComponent Loading spell index for spellchecker: freq
   [junit4]   2> 615164 INFO  (searcherExecutor-2477-thread-1) [    ] o.a.s.h.c.SpellCheckComponent Loading spell index for spellchecker: fqcn
   [junit4]   2> 615164 INFO  (searcherExecutor-2477-thread-1) [    ] o.a.s.h.c.SpellCheckComponent Loading spell index for spellchecker: perDict
   [junit4]   2> 615165 INFO  (searcherExecutor-2477-thread-1) [    ] o.a.s.c.SolrCore [collection1] Registered new searcher Searcher@50afc0bb[collection1] main{ExitableDirectoryReader(UninvertingDirectoryReader())}
   [junit4]   2> 615165 INFO  (SUITE-DirectUpdateHandlerTest-seed#[B129E373C1AF221A]-worker) [    ] o.a.s.SolrTestCaseJ4 ####initCore end
   [junit4]   2> 615167 INFO  (TEST-DirectUpdateHandlerTest.testRequireUniqueKey-seed#[B129E373C1AF221A]) [    ] o.a.s.SolrTestCaseJ4 ###Starting testRequireUniqueKey
   [junit4]   2> 615167 INFO  (TEST-DirectUpdateHandlerTest.testRequireUniqueKey-seed#[B129E373C1AF221A]) [    ] o.a.s.u.DirectUpdateHandler2 [collection1] REMOVING ALL DOCUMENTS FROM INDEX
   [junit4]   2> 615167 INFO  (TEST-DirectUpdateHandlerTest.testRequireUniqueKey-seed#[B129E373C1AF221A]) [    ] o.a.s.u.p.LogUpdateProcessorFactory [collection1]  webapp=null path=null params={}{deleteByQuery=*:*} 0 0
   [junit4]   2> 615168 INFO  (TEST-DirectUpdateHandlerTest.testRequireUniqueKey-seed#[B129E373C1AF221A]) [    ] o.a.s.u.DirectUpdateHandler2 start commit{,optimize=false,openSearcher=true,waitSearcher=true,expungeDeletes=false,softCommit=false,prepareCommit=false}
   [junit4]   2> 615201 INFO  (TEST-DirectUpdateHandlerTest.testRequireUniqueKey-seed#[B129E373C1AF221A]) [    ] o.a.s.c.SolrDeletionPolicy SolrDeletionPolicy.onCommit: commits: num=2
   [junit4]   2> 	commit{dir=MockDirectoryWrapper(MMapDirectory@/home/jenkins/workspace/Lucene-Solr-trunk-Linux/solr/build/solr-core/test/J2/temp/solr.update.DirectUpdateHandlerTest_B129E373C1AF221A-001/init-core-data-001/index lockFactory=org.apache.lucene.store.SingleInstanceLockFactory@1324519d),segFN=segments_1,generation=1}
   [junit4]   2> 	commit{dir=MockDirectoryWrapper(MMapDirectory@/home/jenkins/workspace/Lucene-Solr-trunk-Linux/solr/build/solr-core/test/J2/temp/solr.update.DirectUpdateHandlerTest_B129E373C1AF221A-001/init-core-data-001/index lockFactory=org.apache.lucene.store.SingleInstanceLockFactory@1324519d),segFN=segments_2,generation=2}
   [junit4]   2> 615201 INFO  (TEST-DirectUpdateHandlerTest.testRequireUniqueKey-seed#[B129E373C1AF221A]) [    ] o.a.s.c.SolrDeletionPolicy newest commit generation = 2
   [junit4]   2> 615202 INFO  (TEST-DirectUpdateHandlerTest.testRequireUniqueKey-seed#[B129E373C1AF221A]) [    ] o.a.s.s.SolrIndexSearcher Opening [Searcher@260fcffb[collection1] main]
   [junit4]   2> 615202 INFO  (TEST-DirectUpdateHandlerTest.testRequireUniqueKey-seed#[B129E373C1AF221A]) [    ] o.a.s.u.DirectUpdateHandler2 end_commit_flush
   [junit4]   2> 615202 INFO  (searcherExecutor-2477-thread-1) [    ] o.a.s.c.SolrCore [collection1] Registered new searcher Searcher@260fcffb[collection1] main{ExitableDirectoryReader(UninvertingDirectoryReader())}
   [junit4]   2> 615202 INFO  (TEST-DirectUpdateHandlerTest.testRequireUniqueKey-seed#[B129E373C1AF221A]) [    ] o.a.s.u.p.LogUpdateProcessorFactory [collection1]  webapp=null path=null params={}{commit=} 0 34
   [junit4]   2> 615204 INFO  (TEST-DirectUpdateHandlerTest.testRequireUniqueKey-seed#[B129E373C1AF221A]) [    ] o.a.s.u.p.LogUpdateProcessorFactory [collection1]  webapp=null path=null params={}{add=[1]} 0 0
   [junit4]   2> 615204 INFO  (TEST-DirectUpdateHandlerTest.testRequireUniqueKey-seed#[B129E373C1AF221A]) [    ] o.a.s.u.p.LogUpdateProcessorFactory [collection1]  webapp=null path=null params={}{} 0 0
   [junit4]   2> 615204 INFO  (TEST-DirectUpdateHandlerTest.testRequireUniqueKey-seed#[B129E373C1AF221A]) [    ] o.a.s.h.RequestHandlerBase Ignoring exception matching ignore_exception
   [junit4]   2> 615204 INFO  (TEST-DirectUpdateHandlerTest.testRequireUniqueKey-seed#[B129E373C1AF221A]) [    ] o.a.s.u.p.LogUpdateProcessorFactory [collection1]  webapp=null path=null params={}{} 0 0
   [junit4]   2> 615204 INFO  (TEST-DirectUpdateHandlerTest.testRequireUniqueKey-seed#[B129E373C1AF221A]) [    ] o.a.s.h.RequestHandlerBase Ignoring exception matching id
   [junit4]   2> 615204 INFO  (TEST-DirectUpdateHandlerTest.testRequireUniqueKey-seed#[B129E373C1AF221A]) [    ] o.a.s.SolrTestCaseJ4 ###Ending testRequireUniqueKey
   [junit4]   2> 615206 INFO  (TEST-DirectUpdateHandlerTest.testBasics-seed#[B129E373C1AF221A]) [    ] o.a.s.SolrTestCaseJ4 ###Starting testBasics
   [junit4]   2> 615206 INFO  (TEST-DirectUpdateHandlerTest.testBasics-seed#[B129E373C1AF221A]) [    ] o.a.s.u.DirectUpdateHandler2 [collection1] REMOVING ALL DOCUMENTS FROM INDEX
   [junit4]   2> 615206 INFO  (TEST-DirectUpdateHandlerTest.testBasics-seed#[B129E373C1AF221A]) [    ] o.a.s.u.p.LogUpdateProcessorFactory [collection1]  webapp=null path=null params={}{deleteByQuery=*:*} 0 0
   [junit4]   2> 615207 INFO  (TEST-DirectUpdateHandlerTest.testBasics-seed#[B129E373C1AF221A]) [    ] o.a.s.u.DirectUpdateHandler2 start commit{,optimize=false,openSearcher=true,waitSearcher=true,expungeDeletes=false,softCommit=false,prepareCommit=false}
   [junit4]   2> 615254 INFO  (TEST-DirectUpdateHandlerTest.testBasics-seed#[B129E373C1AF221A]) [    ] o.a.s.c.SolrDeletionPolicy SolrDeletionPolicy.onCommit: commits: num=2
   [junit4]   2> 	commit{dir=MockDirectoryWrapper(MMapDirectory@/home/jenkins/workspace/Lucene-Solr-trunk-Linux/solr/build/solr-core/test/J2/temp/solr.update.DirectUpdateHandlerTest_B129E373C1AF221A-001/init-core-data-001/index lockFactory=org.apache.lucene.store.SingleInstanceLockFactory@1324519d),segFN=segments_2,generation=2}
   [junit4]   2> 	commit{dir=MockDirectoryWrapper(MMapDirectory@/home/jenkins/workspace/Lucene-Solr-trunk-Linux/solr/build/solr-core/test/J2/temp/solr.update.DirectUpdateHandlerTest_B129E373C1AF221A-001/init-core-data-001/index lockFactory=org.apache.lucene.store.SingleInstanceLockFactory@1324519d),segFN=segments_3,generation=3}
   [junit4]   2> 615254 INFO  (TEST-DirectUpdateHandlerTest.testBasics-seed#[B129E373C1AF221A]) [    ] o.a.s.c.SolrDeletionPolicy newest commit generation = 3
   [junit4]   2> 615254 INFO  (TEST-DirectUpdateHandlerTest.testBasics-seed#[B129E373C1AF221A]) [    ] o.a.s.s.SolrIndexSearcher Opening [Searcher@32b88727[collection1] main]
   [junit4]   2> 615254 INFO  (TEST-DirectUpdateHandlerTest.testBasics-seed#[B129E373C1AF221A]) [    ] o.a.s.u.DirectUpdateHandler2 end_commit_flush
   [junit4]   2> 615255 INFO  (searcherExecutor-2477-thread-1) [    ] o.a.s.c.SolrCore [collection1] Registered new searcher Searcher@32b88727[collection1] main{ExitableDirectoryReader(UninvertingDirectoryReader())}
   [junit4]   2> 615255 INFO  (TEST-DirectUpdateHandlerTest.testBasics-seed#[B129E373C1AF221A]) [    ] o.a.s.u.p.LogUpdateProcessorFactory [collection1]  webapp=null path=null params={}{commit=} 0 48
   [junit4]   2> 615256 INFO  (TEST-DirectUpdateHandlerTest.testBasics-seed#[B129E373C1AF221A]) [    ] o.a.s.u.p.LogUpdateProcessorFactory [collection1]  webapp=null path=null params={}{add=[5]} 0 0
   [junit4]   2> 615256 INFO  (TEST-DirectUpdateHandlerTest.testBasics-seed#[B129E373C1AF221A]) [    ] o.a.s.u.p.LogUpdateProcessorFactory [collection1]  webapp=null path=null params={}{add=[6]} 0 0
   [junit4]   2> 615257 INFO  (TEST-DirectUpdateHandlerTest.testBasics-seed#[B129E373C1AF221A]) [    ] o.a.s.c.S.Request [collection1]  webapp=null path=null params={q=id:5&wt=xml} hits=0 status=0 QTime=0
   [junit4]   2> 615257 INFO  (TEST-DirectUpdateHandlerTest.testBasics-seed#[B129E373C1AF221A]) [    ] o.a.s.c.S.Request [collection1]  webapp=null path=null params={q=id:6&wt=xml} hits=0 status=0 QTime=0
   [junit4]   2> 615257 INFO  (TEST-DirectUpdateHandlerTest.testBasics-seed#[B129E373C1AF221A]) [    ] o.a.s.u.DirectUpdateHandler2 start commit{,optimize=false,openSearcher=true,waitSearcher=true,expungeDeletes=false,softCommit=false,prepareCommit=false}
   [junit4]   2> 615389 INFO  (TEST-DirectUpdateHandlerTest.testBasics-seed#[B129E373C1AF221A]) [    ] o.a.s.c.SolrDeletionPolicy SolrDeletionPolicy.onCommit: commits: num=2
   [junit4]   2> 	commit{dir=MockDirectoryWrapper(MMapDirectory@/home/jenkins/workspace/Lucene-Solr-trunk-Linux/solr/build/solr-core/test/J2/temp/solr.update.DirectUpdateHandlerTest_B129E373C1AF221A-001/init-core-data-001/index lockFactory=org.apache.lucene.store.SingleInstanceLockFactory@1324519d),segFN=segments_3,generation=3}
   [junit4]   2> 	commit{dir=MockDirectoryWrapper(MMapDirectory@/home/jenkins/workspace/Lucene-Solr-trunk-Linux/solr/build/solr-core/test/J2/temp/solr.update.DirectUpdateHandlerTest_B129E373C1AF221A-001/init-core-data-001/index lockFactory=org.apache.lucene.store.SingleInstanceLockFactory@1324519d),segFN=segments_4,generation=4}
   [junit4]   2> 615389 INFO  (TEST-DirectUpdateHandlerTest.testBasics-seed#[B129E373C1AF221A]) [    ] o.a.s.c.SolrDeletionPolicy newest commit generation = 4
   [junit4]   2> 615391 INFO  (TEST-DirectUpdateHandlerTest.testBasics-seed#[B129E373C1AF221A]) [    ] o.a.s.s.SolrIndexSearcher Opening [Searcher@171cf5bd[collection1] main]
   [junit4]   2> 615391 INFO  (TEST-DirectUpdateHandlerTest.testBasics-seed#[B129E373C1AF221A]) [    ] o.a.s.u.DirectUpdateHandler2 end_commit_flush
   [junit4]   2> 615392 INFO  (searcherExecutor-2477-thread-1) [    ] o.a.s.c.SolrCore [collection1] Registered new searcher Searcher@171cf5bd[collection1] main{ExitableDirectoryReader(UninvertingDirectoryReader(Uninverting(_1(6.0.0):c2)))}
   [junit4]   2> 615392 INFO  (TEST-DirectUpdateHandlerTest.testBasics-seed#[B129E373C1AF221A]) [    ] o.a.s.u.p.LogUpdateProcessorFactory [collection1]  webapp=null path=null params={}{commit=} 0 134
   [junit4]   2> 615393 INFO  (TEST-DirectUpdateHandlerTest.testBasics-seed#[B129E373C1AF221A]) [    ] o.a.s.c.S.Request [collection1]  webapp=null path=null params={q=id:5&wt=xml} hits=1 status=0 QTime=0
   [junit4]   2> 615393 INFO  (TEST-DirectUpdateHandlerTest.testBasics-seed#[B129E373C1AF221A]) [    ] o.a.s.c.S.Request [collection1]  webapp=null path=null params={q=id:6&wt=xml} hits=1 status=0 QTime=0
   [junit4]   2> 615393 INFO  (TEST-DirectUpdateHandlerTest.testBasics-seed#[B129E373C1AF221A]) [    ] o.a.s.u.p.LogUpdateProcessorFactory [collection1]  webapp=null path=null params={}{delete=[5]} 0 0
   [junit4]   2> 615394 INFO  (TEST-DirectUpdateHandlerTest.testBasics-seed#[B129E373C1AF221A]) [    ] o.a.s.c.S.Request [collection1]  webapp=null path=null params={q=id:5&wt=xml} hits=1 status=0 QTime=0
   [junit4]   2> 615394 INFO  (TEST-DirectUpdateHandlerTest.testBasics-seed#[B129E373C1AF221A]) [    ] o.a.s.u.DirectUpdateHandler2 start commit{,optimize=false,openSearcher=true,waitSearcher=true,expungeDeletes=false,softCommit=false,prepareCommit=false}
   [junit4]   2> 615440 INFO  (TEST-DirectUpdateHandlerTest.testBasics-seed#[B129E373C1AF221A]) [    ] o.a.s.c.SolrDeletionPolicy SolrDeletionPolicy.onCommit: commits: num=2
   [junit4]   2> 	commit{dir=MockDirectoryWrapper(MMapDirectory@/home/jenkins/workspace/Lucene-Solr-trunk-Linux/solr/build/solr-core/test/J2/temp/solr.update.DirectUpdateHandlerTest_B129E373C1AF221A-001/init-core-data-001/index lockFactory=org.apache.lucene.store.SingleInstanceLockFactory@1324519d),segFN=segments_4,generation=4}
   [junit4]   2> 	commit{dir=MockDirectoryWrapper(MMapDirectory@/home/jenkins/workspace/Lucene-Solr-trunk-Linux/solr/build/solr-core/test/J2/temp/solr.update.DirectUpdateHandlerTest_B129E373C1AF221A-001/init-core-data-001/index lockFactory=org.apache.lucene.store.SingleInstanceLockFactory@1324519d),segFN=segments_5,generation=5}
   [junit4]   2> 615440 INFO  (TEST-DirectUpdateHandlerTest.testBasics-seed#[B129E373C1AF221A]) [    ] o.a.s.c.SolrDeletionPolicy newest commit generation = 5
   [junit4]   2> 615441 INFO  (TEST-DirectUpdateHandlerTest.testBasics-seed#[B129E373C1AF221A]) [    ] o.a.s.s.SolrIndexSearcher Opening [Searcher@770e16ab[collection1] main]
   [junit4]   2> 615441 INFO  (TEST-DirectUpdateHandlerTest.testBasics-seed#[B129E373C1AF221A]) [    ] o.a.s.u.DirectUpdateHandler2 end_commit_flush
   [junit4]   2> 615442 INFO  (searcherExecutor-2477-thread-1) [    ] o.a.s.c.SolrCore [collection1] Registered new searcher Searcher@770e16ab[collection1] main{ExitableDirectoryReader(UninvertingDirectoryReader(Uninverting(_1(6.0.0):c2/1:delGen=1)))}
   [junit4]   2> 615442 INFO  (TEST-DirectUpdateHandlerTest.testBasics-seed#[B129E373C1AF221A]) [    ] o.a.s.u.p.LogUpdateProcessorFactory [collection1]  webapp=null path=null params={}{commit=} 0 48
   [junit4]   2> 615443 INFO  (TEST-DirectUpdateHandlerTest.testBasics-seed#[B129E373C1AF221A]) [    ] o.a.s.c.S.Request [collection1]  webapp=null path=null params={q=id:5&wt=xml} hits=0 status=0 QTime=0
   [junit4]   2> 615443 INFO  (TEST-DirectUpdateHandlerTest.testBasics-seed#[B129E373C1AF221A]) [    ] o.a.s.c.S.Request [collection1]  webapp=null path=null params={q=id:6&wt=xml} hits=1 status=0 QTime=0
   [junit4]   2> 615443 INFO  (TEST-DirectUpdateHandlerTest.testBasics-seed#[B129E373C1AF221A]) [    ] o.a.s.u.DirectUpdateHandler2 [collection1] REMOVING ALL DOCUMENTS FROM INDEX
   [junit4]   2> 615443 INFO  (TEST-DirectUpdateHandlerTest.testBasics-seed#[B129E373C1AF221A]) [    ] o.a.s.u.p.LogUpdateProcessorFactory [collection1]  webapp=null path=null params={}{deleteByQuery=*:*} 0 0
   [junit4]   2> 615444 INFO  (TEST-DirectUpdateHandlerTest.testBasics-seed#[B129E373C1AF221A]) [    ] o.a.s.c.S.Request [collection1]  webapp=null path=null params={q=id:6&wt=xml} hits=1 status=0 QTime=0
   [junit4]   2> 615444 INFO  (TEST-DirectUpdateHandlerTest.testBasics-seed#[B129E373C1AF221A]) [    ] o.a.s.u.DirectUpdateHandler2 start commit{,optimize=false,openSearcher=true,waitSearcher=true,expungeDeletes=false,softCommit=false,prepareCommit=false}
   [junit4]   2> 615488 INFO  (TEST-DirectUpdateHandlerTest.testBasics-seed#[B129E373C1AF221A]) [    ] o.a.s.c.SolrDeletionPolicy SolrDeletionPolicy.onCommit: commits: num=2
   [junit4]   2> 	commit{dir=MockDirectoryWrapper(MMapDirectory@/home/jenkins/workspace/Lucene-Solr-trunk-Linux/solr/build/solr-core/test/J2/temp/solr.update.DirectUpdateHandlerTest_B129E373C1AF221A-001/init-core-data-001/index lockFactory=org.apache.lucene.store.SingleInstanceLockFactory@1324519d),segFN=segments_5,generation=5}
   [junit4]   2> 	commit{dir=MockDirectoryWrapper(MMapDirectory@/home/jenkins/workspace/Lucene-Solr-trunk-Linux/solr/build/solr-core/test/J2/temp/solr.update.DirectUpdateHandlerTest_B129E373C1AF221A-001/init-core-data-001/index lockFactory=org.apache.lucene.store.SingleInstanceLockFactory@1324519d),segFN=segments_6,generation=6}
   [junit4]   2> 615488 INFO  (TEST-DirectUpdateHandlerTest.testBasics-seed#[B129E373C1AF221A]) [    ] o.a.s.c.SolrDeletionPolicy newest commit generation = 6
   [junit4]   2> 615488 INFO  (TEST-DirectUpdateHandlerTest.testBasics-seed#[B129E373C1AF221A]) [    ] o.a.s.s.SolrIndexSearcher Opening [Searcher@77830056[collection1] main]
   [junit4]   2> 615489 INFO  (TEST-DirectUpdateHandlerTest.testBasics-seed#[B129E373C1AF221A]) [    ] o.a.s.u.DirectUpdateHandler2 end_commit_flush
   [junit4]   2> 615489 INFO  (searcherExecutor-2477-thread-1) [    ] o.a.s.c.SolrCore [collection1] Registered new searcher Searcher@77830056[collection1] main{ExitableDirectoryReader(UninvertingDirectoryReader())}
   [junit4]   2> 615505 INFO  (TEST-DirectUpdateHandlerTest.testBasics-seed#[B129E373C1AF221A]) [    ] o.a.s.u.p.LogUpdateProcessorFactory [collection1]  webapp=null path=null params={}{commit=} 0 61
   [junit4]   2> 615506 INFO  (TEST-DirectUpdateHandlerTest.testBasics-seed#[B129E373C1AF221A]) [    ] o.a.s.c.S.Request [collection1]  webapp=null path=null params={q=id:6&wt=xml} hits=0 status=0 QTime=0
   [junit4]   2> 615506 INFO  (TEST-DirectUpdateHandlerTest.testBasics-seed#[B129E373C1AF221A]) [    ] o.a.s.SolrTestCaseJ4 ###Ending testBasics
   [junit4]   2> 615508 INFO  (TEST-DirectUpdateHandlerTest.testAddRollback-seed#[B129E373C1AF221A]) [    ] o.a.s.SolrTestCaseJ4 ###Starting testAddRollback
   [junit4]   2> 615508 INFO  (TEST-DirectUpdateHandlerTest.testAddRollback-seed#[B129E373C1AF221A]) [    ] o.a.s.u.DirectUpdateHandler2 [collection1] REMOVING ALL DOCUMENTS FROM INDEX
   [junit4]   2> 615508 INFO  (TEST-DirectUpdateHandlerTest.testAddRollback-seed#[B129E373C1AF221A]) [    ] o.a.s.u.p.LogUpdateProcessorFactory [collection1]  webapp=null path=null params={}{deleteByQuery=*:*} 0 0
   [junit4]   2> 615508 INFO  (TEST-DirectUpdateHandlerTest.testAddRollback-seed#[B129E373C1AF221A]) [    ] o.a.s.u.DirectUpdateHandler2 start commit{,optimize=false,openSearcher=true,waitSearcher=true,expungeDeletes=false,softCommit=false,prepareCommit=false}
   [junit4]   2> 615554 INFO  (TEST-DirectUpdateHandlerTest.testAddRollback-seed#[B129E373C1AF221A]) [    ] o.a.s.c.SolrDeletionPolicy SolrDeletionPolicy.onCommit: commits: num=2
   [junit4]   2> 	commit{dir=MockDirectoryWrapper(MMapDirectory@/home/jenkins/workspace/Lucene-Solr-trunk-Linux/solr/build/solr-core/test/J2/temp/solr.update.DirectUpdateHandlerTest_B129E373C1AF221A-001/init-core-data-001/index lockFactory=org.apache.lucene.store.SingleInstanceLockFactory@1324519d),segFN=segments_6,generation=6}
   [junit4]   2> 	commit{dir=MockDirectoryWrapper(MMapDirectory@/home/jenkins/workspace/Lucene-Solr-trunk-Linux/solr/build/solr-core/test/J2/temp/solr.update.DirectUpdateHandlerTest_B129E373C1AF221A-001/init-core-data-001/index lockFactory=org.apache.lucene.store.SingleInstanceLockFactory@1324519d),segFN=segments_7,generation=7}
   [junit4]   2> 615554 INFO  (TEST-DirectUpdateHandlerTest.testAddRollback-seed#[B129E373C1AF221A]) [    ] o.a.s.c.SolrDeletionPolicy newest commit generation = 7
   [junit4]   2> 615554 INFO  (TEST-DirectUpdateHandlerTest.testAddRollback-seed#[B129E373C1AF221A]) [    ] o.a.s.s.SolrIndexSearcher Opening [Searcher@6990d340[collection1] main]
   [junit4]   2> 615554 INFO  (TEST-DirectUpdateHandlerTest.testAddRollback-seed#[B129E373C1AF221A]) [    ] o.a.s.u.DirectUpdateHandler2 end_commit_flush
   [junit4]   2> 615555 INFO  (searcherExecutor-2477-thread-1) [    ] o.a.s.c.SolrCore [collection1] Registered new searcher Searcher@6990d340[collection1] main{ExitableDirectoryReader(UninvertingDirectoryReader())}
   [junit4]   2> 615555 INFO  (TEST-DirectUpdateHandlerTest.testAddRollback-seed#[B129E373C1AF221A]) [    ] o.a.s.u.p.LogUpdateProcessorFactory [collection1]  webapp=null path=null params={}{commit=} 0 46
   [junit4]   2> 615555 INFO  (TEST-DirectUpdateHandlerTest.testAddRollback-seed#[B129E373C1AF221A]) [    ] o.a.s.SolrTestCaseJ4 ###deleteCore
   [junit4]   2> 615555 INFO  (TEST-DirectUpdateHandlerTest.testAddRollback-seed#[B129E373C1AF221A]) [    ] o.a.s.c.CoreContainer Shutting down CoreContainer instance=1574769133
   [junit4]   2> 615556 INFO  (coreCloseExecutor-2481-thread-1) [    ] o.a.s.c.SolrCore [collection1]  CLOSING SolrCore org.apache.solr.core.SolrCore@135aea79
   [junit4]   2> 615556 INFO  (coreCloseExecutor-2481-thread-1) [    ] o.a.s.u.DirectUpdateHandler2 closing DirectUpdateHandler2{commits=6,autocommits=0,soft autocommits=0,optimizes=0,rollbacks=0,expungeDeletes=0,docsPending=0,adds=0,deletesById=0,deletesByQuery=0,errors=0,cumulative_adds=3,cumulative_deletesById=1,cumulative_deletesByQuery=4,cumulative_errors=0}
   [junit4]   2> 615556 INFO  (coreCloseExecutor-2481-thread-1) [    ] o.a.s.u.SolrCoreState Closing SolrCoreState
   [junit4]   2> 615556 INFO  (coreCloseExecutor-2481-thread-1) [    ] o.a.s.u.DefaultSolrCoreState SolrCoreState ref count has reached 0 - closing IndexWriter
   [junit4]   2> 615556 INFO  (coreCloseExecutor-2481-thread-1) [    ] o.a.s.u.DefaultSolrCoreState closing IndexWriter with IndexWriterCloser
   [junit4]   2> 615557 INFO  (coreCloseExecutor-2481-thread-1) [    ] o.a.s.c.SolrCore [collection1] Closing main searcher on request.
   [junit4]   2> 615562 INFO  (coreCloseExecutor-2481-thread-1) [    ] o.a.s.c.CachingDirectoryFactory Closing MockFSDirectoryFactory - 2 directories currently being tracked
   [junit4]   2> 615562 INFO  (coreCloseExecutor-2481-thread-1) [    ] o.a.s.c.CachingDirectoryFactory looking to close /home/jenkins/workspace/Lucene-Solr-trunk-Linux/solr/build/solr-core/test/J2/temp/solr.update.DirectUpdateHandlerTest_B129E373C1AF221A-001/init-core-data-001/index [CachedDir<<refCount=0;path=/home/jenkins/workspace/Lucene-Solr-trunk-Linux/solr/build/solr-core/test/J2/temp/solr.update.DirectUpdateHandlerTest_B129E373C1AF221A-001/init-core-data-001/index;done=false>>]
   [junit4]   2> 615562 INFO  (coreCloseExecutor-2481-thread-1) [    ] o.a.s.c.CachingDirectoryFactory Closing directory: /home/jenkins/workspace/Lucene-Solr-trunk-Linux/solr/build/solr-core/test/J2/temp/solr.update.DirectUpdateHandlerTest_B129E373C1AF221A-001/init-core-data-001/index
   [junit4]   2> 615563 INFO  (coreCloseExecutor-2481-thread-1) [    ] o.a.s.c.CachingDirectoryFactory looking to close /home/jenkins/workspace/Lucene-Solr-trunk-Linux/solr/build/solr-core/test/J2/temp/solr.update.DirectUpdateHandlerTest_B129E373C1AF221A-001/init-core-data-001 [CachedDir<<refCount=0;path=/home/jenkins/workspace/Lucene-Solr-trunk-Linux/solr/build/solr-core/test/J2/temp/solr.update.DirectUpdateHandlerTest_B129E373C1AF221A-001/init-core-data-001;done=false>>]
   [junit4]   2> 615563 INFO  (coreCloseExecutor-2481-thread-1) [    ] o.a.s.c.CachingDirectoryFactory Closing directory: /home/jenkins/workspace/Lucene-Solr-trunk-Linux/solr/build/solr-core/test/J2/temp/solr.update.DirectUpdateHandlerTest_B129E373C1AF221A-001/init-core-data-001
   [junit4]   2> 615569 INFO  (TEST-DirectUpdateHandlerTest.testAddRollback-seed#[B129E373C1AF221A]) [    ] o.a.s.SolrTestCaseJ4 ####initCore
   [junit4]   2> 615569 INFO  (TEST-DirectUpdateHandlerTest.testAddRollback-seed#[B129E373C1AF221A]) [    ] o.a.s.c.SolrResourceLoader new SolrResourceLoader for directory: '/home/jenkins/workspace/Lucene-Solr-trunk-Linux/solr/core/src/test-files/solr/collection1'
   [junit4]   2> 615570 INFO  (TEST-DirectUpdateHandlerTest.testAddRollback-seed#[B129E373C1AF221A]) [    ] o.a.s.c.SolrResourceLoader JNDI not configured for solr (NoInitialContextEx)
   [junit4]   2> 615570 INFO  (TEST-DirectUpdateHandlerTest.testAddRollback-seed#[B129E373C1AF221A]) [    ] o.a.s.c.SolrResourceLoader using system property solr.solr.home: /home/jenkins/workspace/Lucene-Solr-trunk-Linux/solr/core/src/test-files/solr
   [junit4]   2> 615570 INFO  (TEST-DirectUpdateHandlerTest.testAddRollback-seed#[B129E373C1AF221A]) [    ] o.a.s.c.SolrResourceLoader Adding 'file:/home/jenkins/workspace/Lucene-Solr-trunk-Linux/solr/core/src/test-files/solr/collection1/lib/classes/' to classloader
   [junit4]   2> 615570 INFO  (TEST-DirectUpdateHandlerTest.testAddRollback-seed#[B129E373C1AF221A]) [    ] o.a.s.c.SolrResourceLoader Adding 'file:/home/jenkins/workspace/Lucene-Solr-trunk-Linux/solr/core/src/test-files/solr/collection1/lib/README' to classloader
   [junit4]   2> 615584 INFO  (TEST-DirectUpdateHandlerTest.testAddRollback-seed#[B129E373C1AF221A]) [    ] o.a.s.c.SolrConfig current version of requestparams : -1
   [junit4]   2> 615591 INFO  (TEST-DirectUpdateHandlerTest.testAddRollback-seed#[B129E373C1AF221A]) [    ] o.a.s.c.SolrConfig Using Lucene MatchVersion: 6.0.0
   [junit4]   2> 615606 INFO  (TEST-DirectUpdateHandlerTest.testAddRollback-seed#[B129E373C1AF221A]) [    ] o.a.s.c.SolrConfig Loaded SolrConfig: solrconfig.xml
   [junit4]   2> 615610 INFO  (TEST-DirectUpdateHandlerTest.testAddRollback-seed#[B129E373C1AF221A]) [    ] o.a.s.s.IndexSchema [null] Schema name=test
   [junit4]   2> 615667 INFO  (TEST-DirectUpdateHandlerTest.testAddRollback-seed#[B129E373C1AF221A]) [    ] o.a.s.s.IndexSchema default search field in schema is text
   [junit4]   2> 615667 INFO  (TEST-DirectUpdateHandlerTest.testAddRollback-seed#[B129E373C1AF221A]) [    ] o.a.s.s.IndexSchema unique key field: id
   [junit4]   2> 615668 WARN  (TEST-DirectUpdateHandlerTest.testAddRollback-seed#[B129E373C1AF221A]) [    ] o.a.s.s.IndexSchema Field text is not multivalued and destination for multiple copyFields (2)
   [junit4]   2> 615672 INFO  (TEST-DirectUpdateHandlerTest.testAddRollback-seed#[B129E373C1AF221A]) [    ] o.a.s.s.FileExchangeRateProvider Reloading exchange rates from file currency.xml
   [junit4]   2> 615674 INFO  (TEST-DirectUpdateHandlerTest.testAddRollback-seed#[B129E373C1AF221A]) [    ] o.a.s.s.FileExchangeRateProvider Reloading exchange rates from file currency.xml
   [junit4]   2> 615676 INFO  (TEST-DirectUpdateHandlerTest.testAddRollback-seed#[B129E373C1AF221A]) [    ] o.a.s.c.SolrResourceLoader JNDI not configured for solr (NoInitialContextEx)
   [junit4]   2> 615676 INFO  (TEST-DirectUpdateHandlerTest.testAddRollback-seed#[B129E373C1AF221A]) [    ] o.a.s.c.SolrResourceLoader using system property solr.solr.home: /home/jenkins/workspace/Lucene-Solr-trunk-Linux/solr/core/src/test-files/solr
   [junit4]   2> 615676 INFO  (TEST-DirectUpdateHandlerTest.testAddRollback-seed#[B129E373C1AF221A]) [    ] o.a.s.c.SolrResourceLoader new SolrResourceLoader for directory: '/home/jenkins/workspace/Lucene-Solr-trunk-Linux/solr/core/src/test-files/solr'
   [junit4]   2> 615676 INFO  (TEST-DirectUpdateHandlerTest.testAddRollback-seed#[B129E373C1AF221A]) [    ] o.a.s.c.SolrResourceLoader JNDI not configured for solr (NoInitialContextEx)
   [junit4]   2> 615676 INFO  (TEST-DirectUpdateHandlerTest.testAddRollback-seed#[B129E373C1AF221A]) [    ] o.a.s.c.SolrResourceLoader using system property solr.solr.home: /home/jenkins/workspace/Lucene-Solr-trunk-Linux/solr/core/src/test-files/solr
   [junit4]   2> 615676 INFO  (TEST-DirectUpdateHandlerTest.testAddRollback-seed#[B129E373C1AF221A]) [    ] o.a.s.c.CoreContainer New CoreContainer 1323630341
   [junit4]   2> 615676 INFO  (TEST-DirectUpdateHandlerTest.testAddRollback-seed#[B129E373C1AF221A]) [    ] o.a.s.c.CoreContainer Loading cores into CoreContainer [instanceDir=/home/jenkins/workspace/Lucene-Solr-trunk-Linux/solr/core/src/test-files/solr]
   [junit4]   2> 615676 WARN  (TEST-DirectUpdateHandlerTest.testAddRollback-seed#[B129E373C1AF221A]) [    ] o.a.s.c.CoreContainer Couldn't add files from /home/jenkins/workspace/Lucene-Solr-trunk-Linux/solr/core/src/test-files/solr/lib to classpath: /home/jenkins/workspace/Lucene-Solr-trunk-Linux/solr/core/src/test-files/solr/lib
   [junit4]   2> 615677 INFO  (TEST-DirectUpdateHandlerTest.testAddRollback-seed#[B129E373C1AF221A]) [    ] o.a.s.h.c.HttpShardHandlerFactory created with socketTimeout : 600000,connTimeout : 60000,maxConnectionsPerHost : 20,maxConnections : 10000,corePoolSize : 0,maximumPoolSize : 2147483647,maxThreadIdleTime : 5,sizeOfQueue : -1,fairnessPolicy : false,useRetries : false,
   [junit4]   2> 615678 INFO  (TEST-DirectUpdateHandlerTest.testAddRollback-seed#[B129E373C1AF221A]) [    ] o.a.s.u.UpdateShardHandler Creating UpdateShardHandler HTTP client with params: socketTimeout=30000&connTimeout=30000&retry=true
   [junit4]   2> 615678 INFO  (TEST-DirectUpdateHandlerTest.testAddRollback-seed#[B129E373C1AF221A]) [    ] o.a.s.l.LogWatcher SLF4J impl is org.slf4j.impl.Log4jLoggerFactory
   [junit4]   2> 615678 INFO  (TEST-DirectUpdateHandlerTest.testAddRollback-seed#[B129E373C1AF221A]) [    ] o.a.s.l.LogWatcher Registering Log Listener [Log4j (org.slf4j.impl.Log4jLoggerFactory)]
   [junit4]   2> 615678 INFO  (TEST-DirectUpdateHandlerTest.testAddRollback-seed#[B129E373C1AF221A]) [    ] o.a.s.c.CoreContainer Security conf doesn't exist. Skipping setup for authorization module.
   [junit4]   2> 615678 INFO  (TEST-DirectUpdateHandlerTest.testAddRollback-seed#[B129E373C1AF221A]) [    ] o.a.s.c.CoreContainer No authentication plugin used.
   [junit4]   2> 615679 INFO  (TEST-DirectUpdateHandlerTest.testAddRollback-seed#[B129E373C1AF221A]) [    ] o.a.s.c.CoreDescriptor Created CoreDescriptor: {name=collection1, config=solrconfig.xml, transient=false, schema=schema12.xml, loadOnStartup=true, configSetProperties=configsetprops.json, collection=collection1, dataDir=/home/jenkins/workspace/Lucene-Solr-trunk-Linux/solr/build/solr-core/test/J2/temp/solr.update.DirectUpdateHandlerTest_B129E373C1AF221A-001/init-core-data-001, shard=shard1}
   [junit4]   2> 615680 INFO  (coreLoadExecutor-2487-thread-1) [    ] o.a.s.c.SolrResourceLoader new SolrResourceLoader for directory: '/home/jenkins/workspace/Lucene-Solr-trunk-Linux/solr/core/src/test-files/solr/collection1'
   [junit4]   2> 615680 INFO  (coreLoadExecutor-2487-thread-1) [    ] o.a.s.c.SolrResourceLoader JNDI not configured for solr (NoInitialContextEx)
   [junit4]   2> 615680 INFO  (coreLoadExecutor-2487-thread-1) [    ] o.a.s.c.SolrResourceLoader using system property solr.solr.home: /home/jenkins/workspace/Lucene-Solr-trunk-Linux/solr/core/src/test-files/solr
   [junit4]   2> 615680 INFO  (coreLoadExecutor-2487-thread-1) [    ] o.a.s.c.SolrResourceLoader Adding 'file:/home/jenkins/workspace/Lucene-Solr-trunk-Linux/solr/core/src/test-files/solr/collection1/lib/classes/' to classloader
   [junit4]   2> 615680 INFO  (coreLoadExecutor-2487-thread-1) [    ] o.a.s.c.SolrResourceLoader Adding 'file:/home/jenkins/workspace/Lucene-Solr-trunk-Linux/solr/core/src/test-files/solr/collection1/lib/README' to classloader
   [junit4]   2> 615692 INFO  (coreLoadExecutor-2487-thread-1) [    ] o.a.s.c.SolrConfig current version of requestparams : -1
   [junit4]   2> 615698 INFO  (coreLoadExecutor-2487-thread-1) [    ] o.a.s.c.SolrConfig Using Lucene MatchVersion: 6.0.0
   [junit4]   2> 615714 INFO  (coreLoadExecutor-2487-thread-1) [    ] o.a.s.c.SolrConfig Loaded SolrConfig: solrconfig.xml
   [junit4]   2> 615718 INFO  (coreLoadExecutor-2487-thread-1) [    ] o.a.s.s.IndexSchema [collection1] Schema name=test
   [junit4]   2> 615786 INFO  (coreLoadExecutor-2487-thread-1) [    ] o.a.s.s.IndexSchema default search field in schema is text
   [junit4]   2> 615787 INFO  (coreLoadExecutor-2487-thread-1) [    ] o.a.s.s.IndexSchema unique key field: id
   [junit4]   2> 615787 WARN  (coreLoadExecutor-2487-thread-1) [    ] o.a.s.s.IndexSchema Field text is not multivalued and destination for multiple copyFields (2)
   [junit4]   2> 615790 INFO  (coreLoadExecutor-2487-thread-1) [    ] o.a.s.s.FileExchangeRateProvider Reloading exchange rates from file currency.xml
   [junit4]   2> 615791 INFO  (coreLoadExecutor-2487-thread-1) [    ] o.a.s.s.FileExchangeRateProvider Reloading exchange rates from file currency.xml
   [junit4]   2> 615793 INFO  (coreLoadExecutor-2487-thread-1) [    ] o.a.s.c.ConfigSetProperties Did not find ConfigSet properties, assuming default properties: Can't find resource 'configsetprops.json' in classpath or '/home/jenkins/workspace/Lucene-Solr-trunk-Linux/solr/core/src/test-files/solr/collection1'
   [junit4]   2> 615793 INFO  (coreLoadExecutor-2487-thread-1) [    ] o.a.s.c.CoreContainer Creating SolrCore 'collection1' using configuration from instancedir /home/jenkins/workspace/Lucene-Solr-trunk-Linux/solr/core/src/test-files/solr/collection1
   [junit4]   2> 615793 INFO  (coreLoadExecutor-2487-thread-1) [    ] o.a.s.c.SolrCore org.apache.solr.core.MockFSDirectoryFactory
   [junit4]   2> 615793 INFO  (coreLoadExecutor-2487-thread-1) [    ] o.a.s.c.SolrCore [[collection1] ] Opening new SolrCore at [/home/jenkins/workspace/Lucene-Solr-trunk-Linux/solr/core/src/test-files/solr/collection1], dataDir=[/home/jenkins/workspace/Lucene-Solr-trunk-Linux/solr/build/solr-core/test/J2/temp/solr.update.DirectUpdateHandlerTest_B129E373C1AF221A-001/init-core-data-001/]
   [junit4]   2> 615793 INFO  (coreLoadExecutor-2487-thread-1) [    ] o.a.s.c.JmxMonitoredMap JMX monitoring is enabled. Adding Solr mbeans to JMX Server: com.sun.jmx.mbeanserver.JmxMBeanServer@325f8049
   [junit4]   2> 615794 INFO  (coreLoadExecutor-2487-thread-1) [    ] o.a.s.c.CachingDirectoryFactory return new directory for /home/jenkins/workspace/Lucene-Solr-trunk-Linux/solr/build/solr-core/test/J2/temp/solr.update.DirectUpdateHandlerTest_B129E373C1AF221A-001/init-core-data-001
   [junit4]   2> 615794 INFO  (coreLoadExecutor-2487-thread-1) [    ] o.a.s.c.SolrCore New index directory detected: old=null new=/home/jenkins/workspace/Lucene-Solr-trunk-Linux/solr/build/solr-core/test/J2/temp/solr.update.DirectUpdateHandlerTest_B129E373C1AF221A-001/init-core-data-001/index/
   [junit4]   2> 615794 INFO  (OldIndexDirectoryCleanupThreadForCore-collection1) [    ] o.a.s.c.SolrCore Looking for old index directories to cleanup for core collection1 in /home/jenkins/workspace/Lucene-Solr-trunk-Linux/solr/build/solr-core/test/J2/temp/solr.update.DirectUpdateHandlerTest_B129E373C1AF221A-001/init-core-data-001/
   [junit4]   2> 615796 INFO  (coreLoadExecutor-2487-thread-1) [    ] o.a.s.u.p.UpdateRequestProcessorChain creating updateRequestProcessorChain "dedupe"
   [junit4]   2> 615796 INFO  (coreLoadExecutor-2487-thread-1) [    ] o.a.s.u.p.UpdateRequestProcessorChain inserting DistributedUpdateProcessorFactory into updateRequestProcessorChain "dedupe"
   [junit4]   2> 615796 INFO  (coreLoadExecutor-2487-thread-1) [    ] o.a.s.u.p.UpdateRequestProcessorChain creating updateRequestProcessorChain "dedupe-allfields"
   [junit4]   2> 615796 INFO  (coreLoadExecutor-2487-thread-1) [    ] o.a.s.u.p.UpdateRequestProcessorChain inserting DistributedUpdateProcessorFactory into updateRequestProcessorChain "dedupe-allfields"
   [junit4]   2> 615796 INFO  (coreLoadExecutor-2487-thread-1) [    ] o.a.s.u.p.UpdateRequestProcessorChain creating updateRequestProcessorChain "stored_sig"
   [junit4]   2> 615796 INFO  (coreLoadExecutor-2487-thread-1) [    ] o.a.s.u.p.UpdateRequestProcessorChain inserting DistributedUpdateProcessorFactory into updateRequestProcessorChain "stored_sig"
   [junit4]   2> 615796 INFO  (coreLoadExecutor-2487-thread-1) [    ] o.a.s.u.p.UpdateRequestProcessorChain creating updateRequestProcessorChain "uniq-fields"
   [junit4]   2> 615796 INFO  (coreLoadExecutor-2487-thread-1) [    ] o.a.s.u.p.UpdateRequestProcessorChain inserting DistributedUpdateProcessorFactory into updateRequestProcessorChain "uniq-fields"
   [junit4]   2> 615796 INFO  (coreLoadExecutor-2487-thread-1) [    ] o.a.s.u.p.UpdateRequestProcessorChain creating updateRequestProcessorChain "distrib-dup-test-chain-explicit"
   [junit4]   2> 615796 INFO  (coreLoadExecutor-2487-thread-1) [    ] o.a.s.u.p.UpdateRequestProcessorChain creating updateRequestProcessorChain "distrib-dup-test-chain-implicit"
   [junit4]   2> 615797 INFO  (coreLoadExecutor-2487-thread-1) [    ] o.a.s.u.p.UpdateRequestProcessorChain inserting DistributedUpdateProcessorFactory into updateRequestProcessorChain "distrib-dup-test-chain-implicit"
   [junit4]   2> 615797 INFO  (coreLoadExecutor-2487-thread-1) [    ] o.a.s.c.SolrCore no updateRequestProcessorChain defined as default, creating implicit default
   [junit4]   2> 615798 INFO  (coreLoadExecutor-2487-thread-1) [    ] o.a.s.h.l.XMLLoader xsltCacheLifetimeSeconds=60
   [junit4]   2> 615798 INFO  (coreLoadExecutor-2487-thread-1) [    ] o.a.s.h.l.XMLLoader xsltCacheLifetimeSeconds=60
   [junit4]   2> 615799 INFO  (coreLoadExecutor-2487-thread-1) [    ] o.a.s.h.l.XMLLoader xsltCacheLifetimeSeconds=60
   [junit4]   2> 615799 INFO  (coreLoadExecutor-2487-thread-1) [    ] o.a.s.h.l.XMLLoader xsltCacheLifetimeSeconds=60
   [junit4]   2> 615801 INFO  (coreLoadExecutor-2487-thread-1) [    ] o.a.s.c.PluginBag requestHandler : 'lazy' created with startup=lazy 
   [junit4]   2> 615801 INFO  (coreLoadExecutor-2487-thread-1) [    ] o.a.s.c.RequestHandlers Registered paths: /admin/mbeans,standard,spellCheckCompRH,lazy,/update/json/docs,/admin/luke,/export,spellCheckWithWordbreak_Direct,tvrh,/get,/admin/properties,/update/json,mltrh,/admin/threads,/search-facet-def,/update/csv,/sql,/search-facet-invariants,/admin/segments,spellCheckCompRH1,/mlt,/admin/system,/replication,dismax,defaults,/config,/stream,/schema,/admin/plugins,/admin/logging,spellCheckWithWordbreak,mock,/admin/ping,/update,/admin/file,/terms,spellCheckCompRH_Direct,/debug/dump
   [junit4]   2> 615802 WARN  (coreLoadExecutor-2487-thread-1) [    ] o.a.s.c.SolrCore solrconfig.xml uses deprecated <admin/gettableFiles>, Please update your config to use the ShowFileRequestHandler.
   [junit4]   2> 615802 INFO  (coreLoadExecutor-2487-thread-1) [    ] o.a.s.c.SolrCore Using default statsCache cache: org.apache.solr.search.stats.LocalStatsCache
   [junit4]   2> 615802 INFO  (coreLoadExecutor-2487-thread-1) [    ] o.a.s.u.CommitTracker Hard AutoCommit: disabled
   [junit4]   2> 615802 INFO  (coreLoadExecutor-2487-thread-1) [    ] o.a.s.u.CommitTracker Soft AutoCommit: disabled
   [junit4]   2> 615803 INFO  (coreLoadExecutor-2487-thread-1) [    ] o.a.s.c.CachingDirectoryFactory return new directory for /home/jenkins/workspace/Lucene-Solr-trunk-Linux/solr/build/solr-core/test/J2/temp/solr.update.DirectUpdateHandlerTest_B129E373C1AF221A-001/init-core-data-001/index
   [junit4]   2> 615803 INFO  (coreLoadExecutor-2487-thread-1) [    ] o.a.s.u.RandomMergePolicy RandomMergePolicy wrapping class org.apache.lucene.index.TieredMergePolicy: [TieredMergePolicy: maxMergeAtOnce=14, maxMergeAtOnceExplicit=10, maxMergedSegmentMB=49.8564453125, floorSegmentMB=2.0732421875, forceMergeDeletesPctAllowed=23.023044011900655, segmentsPerTier=20.0, maxCFSSegmentSizeMB=8.796093022207999E12, noCFSRatio=1.0
   [junit4]   2> 615804 INFO  (coreLoadExecutor-2487-thread-1) [    ] o.a.s.c.SolrDeletionPolicy SolrDeletionPolicy.onInit: commits: num=1
   [junit4]   2> 	commit{dir=MockDirectoryWrapper(MMapDirectory@/home/jenkins/workspace/Lucene-Solr-trunk-Linux/solr/build/solr-core/test/J2/temp/solr.update.DirectUpdateHandlerTest_B129E373C1AF221A-001/init-core-data-001/index lockFactory=org.apache.lucene.store.SingleInstanceLockFactory@15ff20f9),segFN=segments_7,generation=7}
   [junit4]   2> 615805 INFO  (coreLoadExecutor-2487-thread-1) [    ] o.a.s.c.SolrDeletionPolicy newest commit generation = 7
   [junit4]   2> 615805 INFO  (coreLoadExecutor-2487-thread-1) [    ] o.a.s.s.SolrIndexSearcher Opening [Searcher@44b04687[collection1] main]
   [junit4]   2> 615805 INFO  (coreLoadExecutor-2487-thread-1) [    ] o.a.s.r.RestManager Initializing RestManager with initArgs: {storageIO=org.apache.solr.rest.ManagedResourceStorage$InMemoryStorageIO}
   [junit4]   2> 615805 INFO  (coreLoadExecutor-2487-thread-1) [    ] o.a.s.r.ManagedResourceStorage Reading _rest_managed.json using InMemoryStorage
   [junit4]   2> 615805 INFO  (coreLoadExecutor-2487-thread-1) [    ] o.a.s.r.RestManager Initializing 0 registered ManagedResources
   [junit4]   2> 615805 INFO  (coreLoadExecutor-2487-thread-1) [    ] o.a.s.h.c.SpellCheckComponent Initializing spell checkers
   [junit4]   2> 615806 INFO  (coreLoadExecutor-2487-thread-1) [    ] o.a.s.s.DirectSolrSpellChecker init: {name=direct,classname=DirectSolrSpellChecker,field=lowerfilt,minQueryLength=3}
   [junit4]   2> 615808 INFO  (coreLoadExecutor-2487-thread-1) [    ] o.a.s.h.ReplicationHandler Commits will be reserved for  10000
   [junit4]   2> 615808 INFO  (searcherExecutor-2488-thread-1) [    ] o.a.s.h.c.SpellCheckComponent Loading spell index for spellchecker: default
   [junit4]   2> 615808 INFO  (searcherExecutor-2488-thread-1) [    ] o.a.s.h.c.SpellCheckComponent Loading spell index for spellchecker: direct
   [junit4]   2> 615808 INFO  (searcherExecutor-2488-thread-1) [    ] o.a.s.h.c.SpellCheckComponent Loading spell index for spellchecker: wordbreak
   [junit4]   2> 615808 INFO  (searcherExecutor-2488-thread-1) [    ] o.a.s.h.c.SpellCheckComponent Loading spell index for spellchecker: multipleFields
   [junit4]   2> 615809 INFO  (searcherExecutor-2488-thread-1) [    ] o.a.s.h.c.SpellCheckComponent Loading spell index for spellchecker: jarowinkler
   [junit4]   2> 615809 INFO  (searcherExecutor-2488-thread-1) [    ] o.a.s.h.c.SpellCheckComponent Loading spell index for spellchecker: external
   [junit4]   2> 615809 INFO  (searcherExecutor-2488-thread-1) [    ] o.a.s.h.c.SpellCheckComponent Loading spell index for spellchecker: freq
   [junit4]   2> 615809 INFO  (searcherExecutor-2488-thread-1) [    ] o.a.s.h.c.SpellCheckComponent Loading spell index for spellchecker: fqcn
   [junit4]   2> 615809 INFO  (coreLoadExecutor-2487-thread-1) [    ] o.a.s.c.CoreContainer registering core: collection1
   [junit4]   2> 615809 INFO  (searcherExecutor-2488-thread-1) [    ] o.a.s.h.c.SpellCheckComponent Loading spell index for spellchecker: perDict
   [junit4]   2> 615809 INFO  (searcherExecutor-2488-thread-1) [    ] o.a.s.c.SolrCore [collection1] Registered new searcher Searcher@44b04687[collection1] main{ExitableDirectoryReader(UninvertingDirectoryReader())}
   [junit4]   2> 615810 INFO  (TEST-DirectUpdateHandlerTest.testAddRollback-seed#[B129E373C1AF221A]) [    ] o.a.s.SolrTestCaseJ4 ####initCore end
   [junit4]   2> 615810 INFO  (TEST-DirectUpdateHandlerTest.testAddRollback-seed#[B129E373C1AF221A]) [    ] o.a.s.u.p.LogUpdateProcessorFactory [collection1]  webapp=null path=null params={}{add=[A]} 0 0
   [junit4]   2> 615811 INFO  (TEST-DirectUpdateHandlerTest.testAddRollback-seed#[B129E373C1AF221A]) [    ] o.a.s.u.DirectUpdateHandler2 start commit{,optimize=false,openSearcher=true,waitSearcher=true,expungeDeletes=false,softCommit=false,prepareCommit=false}
   [junit4]   2> 615936 INFO  (TEST-DirectUpdateHandlerTest.testAddRollback-seed#[B129E373C1AF221A]) [    ] o.a.s.c.SolrDeletionPolicy SolrDeletionPolicy.onCommit: commits: num=2
   [junit4]   2> 	commit{dir=MockDirectoryWrapper(MMapDirectory@/home/jenkins/workspace/Lucene-Solr-trunk-Linux/solr/build/solr-core/test/J2/temp/solr.update.DirectUpdateHandlerTest_B129E373C1AF221A-001/init-core-data-001/index lockFactory=org.apache.lucene.store.SingleInstanceLockFactory@15ff20f9),segFN=segments_7,generation=7}
   [junit4]   2> 	commit{dir=MockDirectoryWrapper(MMapDirectory@/home/jenkins/workspace/Lucene-Solr-trunk-Linux/solr/build/solr-core/test/J2/temp/solr.update.DirectUpdateHandlerTest_B129E373C1AF221A-001/init-core-data-001/index lockFactory=org.apache.lucene.store.SingleInstanceLockFactory@15ff20f9),segFN=segments_8,generation=8}
   [junit4]   2> 615937 INFO  (TEST-DirectUpdateHandlerTest.testAddRollback-seed#[B129E373C1AF221A]) [    ] o.a.s.c.SolrDeletionPolicy newest commit generation = 8
   [junit4]   2> 615938 INFO  (TEST-DirectUpdateHandlerTest.testAddRollback-seed#[B129E373C1AF221A]) [    ] o.a.s.s.SolrIndexSearcher Opening [Searcher@1d702541[collection1] main]
   [junit4]   2> 615938 INFO  (TEST-DirectUpdateHandlerTest.testAddRollback-seed#[B129E373C1AF221A]) [    ] o.a.s.u.DirectUpdateHandler2 end_commit_flush
   [junit4]   2> 615938 INFO  (searcherExecutor-2488-thread-1) [    ] o.a.s.c.SolrCore [collection1] Registered new searcher Searcher@1d702541[collection1] main{ExitableDirectoryReader(UninvertingDirectoryReader(Uninverting(_2(6.0.0):c1)))}
   [junit4]   2> 615939 INFO  (TEST-DirectUpdateHandlerTest.testAddRollback-seed#[B129E373C1AF221A]) [    ] o.a.s.u.p.LogUpdateProcessorFactory [collection1]  webapp=null path=null params={}{add=[B]} 0 0
   [junit4]   2> 615940 INFO  (TEST-DirectUpdateHandlerTest.testAddRollback-seed#[B129E373C1AF221A]) [    ] o.a.s.u.DirectUpdateHandler2 start rollback{}
   [junit4]   2> 615940 INFO  (TEST-DirectUpdateHandlerTest.testAddRollback-seed#[B129E373C1AF221A]) [    ] o.a.s.u.DefaultSolrCoreState Rollback old IndexWriter... core=collection1
   [junit4]   2> 615941 INFO  (TEST-DirectUpdateHandlerTest.testAddRollback-seed#[B129E373C1AF221A]) [    ] o.a.s.u.RandomMergePolicy RandomMergePolicy wrapping class org.apache.lucene.index.LogDocMergePolicy: [LogDocMergePolicy: minMergeSize=1000, mergeFactor=23, maxMergeSize=9223372036854775807, maxMergeSizeForForcedMerge=9223372036854775807, calibrateSizeByDeletes=true, maxMergeDocs=2147483647, maxCFSSegmentSizeMB=8.796093022207999E12, noCFSRatio=0.0]
   [junit4]   2> 615942 INFO  (TEST-DirectUpdateHandlerTest.testAddRollback-seed#[B129E373C1AF221A]) [    ] o.a.s.c.SolrDeletionPolicy SolrDeletionPolicy.onInit: commits: num=1
   [junit4]   2> 	commit{dir=MockDirectoryWrapper(MMapDirectory@/home/jenkins/workspace/Lucene-Solr-trunk-Linux/solr/build/solr-core/test/J2/temp/solr.update.DirectUpdateHandlerTest_B129E373C1AF221A-001/init-core-data-001/index lockFactory=org.apache.lucene.store.SingleInstanceLockFactory@15ff20f9),segFN=segments_8,generation=8}
   [junit4]   2> 615942 INFO  (TEST-DirectUpdateHandlerTest.testAddRollback-seed#[B129E373C1AF221A]) [    ] o.a.s.c.SolrDeletionPolicy newest commit generation = 8
   [junit4]   2> 615942 INFO  (TEST-DirectUpdateHandlerTest.testAddRollback-seed#[B129E373C1AF221A]) [    ] o.a.s.u.DefaultSolrCoreState New IndexWriter is ready to be used.
   [junit4]   2> 615942 INFO  (TEST-DirectUpdateHandlerTest.testAddRollback-seed#[B129E373C1AF221A]) [    ] o.a.s.u.DirectUpdateHandler2 end_rollback
   [junit4]   2> 615943 INFO  (TEST-DirectUpdateHandlerTest.testAddRollback-seed#[B129E373C1AF221A]) [    ] o.a.s.c.S.Request [collection1]  webapp=null path=null params={q=id:A+OR+id:B&indent=true} hits=1 status=0 QTime=0
   [junit4]   2> 615944 INFO  (TEST-DirectUpdateHandlerTest.testAddRollback-seed#[B129E373C1AF221A]) [    ] o.a.s.u.p.LogUpdateProcessorFactory [collection1]  webapp=null path=null params={}{add=[ZZZ]} 0 0
   [junit4]   2> 615944 INFO  (TEST-DirectUpdateHandlerTest.testAddRollback-seed#[B129E373C1AF221A]) [    ] o.a.s.u.DirectUpdateHandler2 start commit{,optimize=false,openSearcher=true,waitSearcher=true,expungeDeletes=false,softCommit=false,prepareCommit=false}
   [junit4]   2> 616095 INFO  (TEST-DirectUpdateHandlerTest.testAddRollback-seed#[B129E373C1AF221A]) [    ] o.a.s.c.SolrDeletionPolicy SolrDeletionPolicy.onCommit: commits: num=2
   [junit4]   2> 	commit{dir=MockDirectoryWrapper(MMapDirectory@/home/jenkins/workspace/Lucene-Solr-trunk-Linux/solr/build/solr-core/test/J2/temp/solr.update.DirectUpdateHandlerTest_B129E373C1AF221A-001/init-core-data-001/index lockFactory=org.apache.lucene.store.SingleInstanceLockFactory@15ff20f9),segFN=segments_8,generation=8}
   [junit4]   2> 	commit{dir=MockDirectoryWrapper(MMapDirectory@/home/jenkins/workspace/Lucene-Solr-trunk-Linux/solr/build/solr-core/test/J2/temp/solr.update.DirectUpdateHandlerTest_B129E373C1AF221A-001/init-core-data-001/index lockFactory=org.apache.lucene.store.SingleInstanceLockFactory@15ff20f9),segFN=segments_9,generation=9}
   [junit4]   2> 616095 INFO  (TEST-DirectUpdateHandlerTest.testAddRollback-seed#[B129E373C1AF221A]) [    ] o.a.s.c.SolrDeletionPolicy newest commit generation = 9
   [junit4]   2> 616097 INFO  (TEST-DirectUpdateHandlerTest.testAddRollback-seed#[B129E373C1AF221A]) [    ] o.a.s.s.SolrIndexSearcher Opening [Searcher@60db75ec[collection1] main]
   [junit4]   2> 616097 INFO  (TEST-DirectUpdateHandlerTest.testAddRollback-seed#[B129E373C1AF221A]) [    ] o.a.s.u.DirectUpdateHandler2 end_commit_flush
   [junit4]   2> 616098 INFO  (searcherExecutor-2488-thread-1) [    ] o.a.s.c.SolrCore [collection1] Registered new searcher Searcher@60db75ec[collection1] main{ExitableDirectoryReader(UninvertingDirectoryReader(Uninverting(_2(6.0.0):c1) Uninverting(_3(6.0.0):c1)))}
   [junit4]   2> 616098 INFO  (TEST-DirectUpdateHandlerTest.testAddRollback-seed#[B129E373C1AF221A]) [    ] o.a.s.u.p.LogUpdateProcessorFactory [collection1]  webapp=null path=null params={}{commit=} 0 154
   [junit4]   2> 616099 INFO  (TEST-DirectUpdateHandlerTest.testAddRollback-seed#[B129E373C1AF221A]) [    ] o.a.s.c.S.Request [collection1]  webapp=null path=null params={q=id:ZZZ&wt=xml} hits=1 status=0 QTime=0
   [junit4]   2> 616099 INFO  (TEST-DirectUpdateHandlerTest.testAddRollback-seed#[B129E373C1AF221A]) [    ] o.a.s.SolrTestCaseJ4 ###Ending testAddRollback
   [junit4]   2> 616101 INFO  (TEST-DirectUpdateHandlerTest.testDeleteRollback-seed#[B129E373C1AF221A]) [    ] o.a.s.SolrTestCaseJ4 ###Starting testDeleteRollback
   [junit4]   2> 616102 INFO  (TEST-DirectUpdateHandlerTest.testDeleteRollback-seed#[B129E373C1AF221A]) [    ] o.a.s.u.DirectUpdateHandler2 [collection1] REMOVING ALL DOCUMENTS FROM INDEX
   [junit4]   2> 616102 INFO  (TEST-DirectUpdateHandlerTest.testDeleteRollback-seed#[B129E373C1AF221A]) [    ] o.a.s.u.p.LogUpdateProcessorFactory [collection1]  webapp=null path=null params={}{deleteByQuery=*:*} 0 0
   [junit4]   2> 616102 INFO  (TEST-DirectUpdateHandlerTest.testDeleteRollback-seed#[B129E373C1AF221A]) [    ] o.a.s.u.DirectUpdateHandler2 start commit{,optimize=false,openSearcher=true,waitSearcher=true,expungeDeletes=false,softCommit=false,prepareCommit=false}
   [junit4]   2> 616160 INFO  (TEST-DirectUpdateHandlerTest.testDeleteRollback-seed#[B129E373C1AF221A]) [    ] o.a.s.c.SolrDeletionPolicy SolrDeletionPolicy.onCommit: commits: num=2
   [junit4]   2> 	commit{dir=MockDirectoryWrapper(MMapDirectory@/home/jenkins/workspace/Lucene-Solr-trunk-Linux/solr/build/solr-core/test/J2/temp/solr.update.DirectUpdateHandlerTest_B129E373C1AF221A-001/init-core-data-001/index lockFactory=org.apache.lucene.store.SingleInstanceLockFactory@15ff20f9),segFN=segments_9,generation=9}
   [junit4]   2> 	commit{dir=MockDirectoryWrapper(MMapDirectory@/home/jenkins/workspace/Lucene-Solr-trunk-Linux/solr/build/solr-core/test/J2/temp/solr.update.DirectUpdateHandlerTest_B129E373C1AF221A-001/init-core-data-001/index lockFactory=org.apache.lucene.store.SingleInstanceLockFactory@15ff20f9),segFN=segments_a,generation=10}
   [junit4]   2> 616160 INFO  (TEST-DirectUpdateHandlerTest.testDeleteRollback-seed#[B129E373C1AF221A]) [    ] o.a.s.c.SolrDeletionPolicy newest commit generation = 10
   [junit4]   2> 616161 INFO  (TEST-DirectUpdateHandlerTest.testDeleteRollback-seed#[B129E373C1AF221A]) [    ] o.a.s.s.SolrIndexSearcher Opening [Searcher@51cac05a[collection1] main]
   [junit4]   2> 616161 INFO  (TEST-DirectUpdateHandlerTest.testDeleteRollback-seed#[B129E373C1AF221A]) [    ] o.a.s.u.DirectUpdateHandler2 end_commit_flush
   [junit4]   2> 616161 INFO  (searcherExecutor-2488-thread-1) [    ] o.a.s.c.SolrCore [collection1] Registered new searcher Searcher@51cac05a[collection1] main{ExitableDirectoryReader(UninvertingDirectoryReader())}
   [junit4]   2> 616170 INFO  (TEST-DirectUpdateHandlerTest.testDeleteRollback-seed#[B129E373C1AF221A]) [    ] o.a.s.u.p.LogUpdateProcessorFactory [collection1]  webapp=null path=null params={}{commit=} 0 68
   [junit4]   2> 616170 INFO  (TEST-DirectUpdateHandlerTest.testDeleteRollback-seed#[B129E373C1AF221A]) [    ] o.a.s.SolrTestCaseJ4 ###deleteCore
   [junit4]   2> 616171 INFO  (TEST-DirectUpdateHandlerTest.testDeleteRollback-seed#[B129E373C1AF221A]) [    ] o.a.s.c.CoreContainer Shutting down CoreContainer instance=1323630341
   [junit4]   2> 616171 INFO  (coreCloseExecutor-2492-thread-1) [    ] o.a.s.c.SolrCore [collection1]  CLOSING SolrCore org.apache.solr.core.SolrCore@3fb6f6da
   [junit4]   2> 616171 INFO  (coreCloseExecutor-2492-thread-1) [    ] o.a.s.u.DirectUpdateHandler2 closing DirectUpdateHandler2{commits=3,autocommits=0,soft autocommits=0,optimizes=0,rollbacks=1,expungeDeletes=0,docsPending=0,adds=0,deletesById=0,deletesByQuery=0,errors=0,cumulative_adds=2,cumulative_deletesById=0,cumulative_deletesByQuery=1,cumulative_errors=0}
   [junit4]   2> 616171 INFO  (coreCloseExecutor-2492-thread-1) [    ] o.a.s.u.SolrCoreState Closing SolrCoreState
   [junit4]   2> 616171 INFO  (coreCloseExecutor-2492-thread-1) [    ] o.a.s.u.DefaultSolrCoreState SolrCoreState ref count has reached 0 - closing IndexWriter
   [junit4]   2> 616171 INFO  (coreCloseExecutor-2492-thread-1) [    ] o.a.s.u.DefaultSolrCoreState closing IndexWriter with IndexWriterCloser
   [junit4]   2> 616172 INFO  (coreCloseExecutor-2492-thread-1) [    ] o.a.s.c.SolrCore [collection1] Closing main searcher on request.
   [junit4]   2> 616177 INFO  (coreCloseExecutor-2492-thread-1) [    ] o.a.s.c.CachingDirectoryFactory Closing MockFSDirectoryFactory - 2 directories currently being tracked
   [junit4]   2> 616177 INFO  (coreCloseExecutor-2492-thread-1) [    ] o.a.s.c.CachingDirectoryFactory looking to close /home/jenkins/workspace/Lucene-Solr-trunk-Linux/solr/build/solr-core/test/J2/temp/solr.update.DirectUpdateHandlerTest_B129E373C1AF221A-001/init-core-data-001/index [CachedDir<<refCount=0;path=/home/jenkins/workspace/Lucene-Solr-trunk-Linux/solr/build/solr-core/test/J2/temp/solr.update.DirectUpdateHandlerTest_B129E373C1AF221A-001/init-core-data-001/index;done=false>>]
   [junit4]   2> 616177 INFO  (coreCloseExecutor-2492-thread-1) [    ] o.a.s.c.CachingDirectoryFactory Closing directory: /home/jenkins/workspace/Lucene-Solr-trunk-Linux/solr/build/solr-core/test/J2/temp/solr.update.DirectUpdateHandlerTest_B129E373C1AF221A-001/init-core-data-001/index
   [junit4]   2> 616178 INFO  (coreCloseExecutor-2492-thread-1) [    ] o.a.s.c.CachingDirectoryFactory looking to close /home/jenkins/workspace/Lucene-Solr-trunk-Linux/solr/build/solr-core/test/J2/temp/solr.update.DirectUpdateHandlerTest_B129E373C1AF221A-001/init-core-data-001 [CachedDir<<refCount=0;path=/home/jenkins/workspace/Lucene-Solr-trunk-Linux/solr/build/solr-core/test/J2/temp/solr.update.DirectUpdateHandlerTest_B129E373C1AF221A-001/init-core-data-001;done=false>>]
   [junit4]   2> 616178 INFO  (coreCloseExecutor-2492-thread-1) [    ] o.a.s.c.CachingDirectoryFactory Closing directory: /home/jenkins/workspace/Lucene-Solr-trunk-Linux/solr/build/solr-core/test/J2/temp/solr.update.DirectUpdateHandlerTest_B129E373C1AF221A-001/init-core-data-001
   [junit4]   2> 616178 INFO  (TEST-DirectUpdateHandlerTest.testDeleteRollback-seed#[B129E373C1AF221A]) [    ] o.a.s.SolrTestCaseJ4 ####initCore
   [junit4]   2> 616178 INFO  (TEST-DirectUpdateHandlerTest.testDeleteRollback-seed#[B129E373C1AF221A]) [    ] o.a.s.c.SolrResourceLoader new SolrResourceLoader for directory: '/home/jenkins/workspace/Lucene-Solr-trunk-Linux/solr/core/src/test-files/solr/collection1'
   [junit4]   2> 616178 INFO  (TEST-DirectUpdateHandlerTest.testDeleteRollback-seed#[B129E373C1AF221A]) [    ] o.a.s.c.SolrResourceLoader JNDI not configured for solr (NoInitialContextEx)
   [junit4]   2> 616178 INFO  (TEST-DirectUpdateHandlerTest.testDeleteRollback-seed#[B129E373C1AF221A]) [    ] o.a.s.c.SolrResourceLoader using system property solr.solr.home: /home/jenkins/workspace/Lucene-Solr-trunk-Linux/solr/core/src/test-files/solr
   [junit4]   2> 616178 INFO  (TEST-DirectUpdateHandlerTest.testDeleteRollback-seed#[B129E373C1AF221A]) [    ] o.a.s.c.SolrResourceLoader Adding 'file:/home/jenkins/workspace/Lucene-Solr-trunk-Linux/solr/core/src/test-files/solr/collection1/lib/classes/' to classloader
   [junit4]   2> 616178 INFO  (TEST-DirectUpdateHandlerTest.testDeleteRollback-seed#[B129E373C1AF221A]) [    ] o.a.s.c.SolrResourceLoader Adding 'file:/home/jenkins/workspace/Lucene-Solr-trunk-Linux/solr/core/src/test-files/solr/collection1/lib/README' to classloader
   [junit4]   2> 616191 INFO  (TEST-DirectUpdateHandlerTest.testDeleteRollback-seed#[B129E373C1AF221A]) [    ] o.a.s.c.SolrConfig current version of requestparams : -1
   [junit4]   2> 616198 INFO  (TEST-DirectUpdateHandlerTest.testDeleteRollback-seed#[B129E373C1AF221A]) [    ] o.a.s.c.SolrConfig Using Lucene MatchVersion: 6.0.0
   [junit4]   2> 616213 INFO  (TEST-DirectUpdateHandlerTest.testDeleteRollback-seed#[B129E373C1AF221A]) [    ] o.a.s.c.SolrConfig Loaded SolrConfig: solrconfig.xml
   [junit4]   2> 616216 INFO  (TEST-DirectUpdateHandlerTest.testDeleteRollback-seed#[B129E373C1AF221A]) [    ] o.a.s.s.IndexSchema [null] Schema name=test
   [junit4]   2> 616274 INFO  (TEST-DirectUpdateHandlerTest.testDeleteRollback-seed#[B129E373C1AF221A]) [    ] o.a.s.s.IndexSchema default search field in schema is text
   [junit4]   2> 616275 INFO  (TEST-DirectUpdateHandlerTest.testDeleteRollback-seed#[B129E373C1AF221A]) [    ] o.a.s.s.IndexSchema unique key field: id
   [junit4]   2> 616276 WARN  (TEST-DirectUpdateHandlerTest.testDeleteRollback-seed#[B129E373C1AF221A]) [    ] o.a.s.s.IndexSchema Field text is not multivalued and destination for multiple copyFields (2)
   [junit4]   2> 616278 INFO  (TEST-DirectUpdateHandlerTest.testDeleteRollback-seed#[B129E373C1AF221A]) [    ] o.a.s.s.FileExchangeRateProvider Reloading exchange rates from file currency.xml
   [junit4]   2> 616280 INFO  (TEST-DirectUpdateHandlerTest.testDeleteRollback-seed#[B129E373C1AF221A]) [    ] o.a.s.s.FileExchangeRateProvider Reloading exchange rates from file currency.xml
   [junit4]   2> 616280 INFO  (TEST-DirectUpdateHandlerTest.testDeleteRollback-seed#[B129E373C1AF221A]) [    ] o.a.s.c.SolrResourceLoader JNDI not configured for solr (NoInitialContextEx)
   [junit4]   2> 616280 INFO  (TEST-DirectUpdateHandlerTest.testDeleteRollback-seed#[B129E373C1AF221A]) [    ] o.a.s.c.SolrResourceLoader using system property solr.solr.home: /home/jenkins/workspace/Lucene-Solr-trunk-Linux/solr/core/src/test-files/solr
   [junit4]   2> 616280 INFO  (TEST-DirectUpdateHandlerTest.testDeleteRollback-seed#[B129E373C1AF221A]) [    ] o.a.s.c.SolrResourceLoader new SolrResourceLoader for directory: '/home/jenkins/workspace/Lucene-Solr-trunk-Linux/solr/core/src/test-files/solr'
   [junit4]   2> 616281 INFO  (TEST-DirectUpdateHandlerTest.testDeleteRollback-seed#[B129E373C1AF221A]) [    ] o.a.s.c.SolrResourceLoader JNDI not configured for solr (NoInitialContextEx)
   [junit4]   2> 616281 INFO  (TEST-DirectUpdateHandlerTest.testDeleteRollback-seed#[B129E373C1AF221A]) [    ] o.a.s.c.SolrResourceLoader using system property solr.solr.home: /home/jenkins/workspace/Lucene-Solr-trunk-Linux/solr/core/src/test-files/solr
   [junit4]   2> 616281 INFO  (TEST-DirectUpdateHandlerTest.testDeleteRollback-seed#[B129E373C1AF221A]) [    ] o.a.s.c.CoreContainer New CoreContainer 1034952011
   [junit4]   2> 616281 INFO  (TEST-DirectUpdateHandlerTest.testDeleteRollback-seed#[B129E373C1AF221A]) [    ] o.a.s.c.CoreContainer Loading cores into CoreContainer [instanceDir=/home/jenkins/workspace/Lucene-Solr-trunk-Linux/solr/core/src/test-files/solr]
   [junit4]   2> 616281 WARN  (TEST-DirectUpdateHandlerTest.testDeleteRollback-seed#[B129E373C1AF221A]) [    ] o.a.s.c.CoreContainer Couldn't add files from /home/jenkins/workspace/Lucene-Solr-trunk-Linux/solr/core/src/test-files/solr/lib to classpath: /home/jenkins/workspace/Lucene-Solr-trunk-Linux/solr/core/src/test-files/solr/lib
   [junit4]   2> 616281 INFO  (TEST-DirectUpdateHandlerTest.testDeleteRollback-seed#[B129E373C1AF221A]) [    ] o.a.s.h.c.HttpShardHandlerFactory created with socketTimeout : 600000,connTimeout : 60000,maxConnectionsPerHost : 20,maxConnections : 10000,corePoolSize : 0,maximumPoolSize : 2147483647,maxThreadIdleTime : 5,sizeOfQueue : -1,fairnessPolicy : false,useRetries : false,
   [junit4]   2> 616282 INFO  (TEST-DirectUpdateHandlerTest.testDeleteRollback-seed#[B129E373C1AF221A]) [    ] o.a.s.u.UpdateShardHandler Creating UpdateShardHandler HTTP client with params: socketTimeout=30000&connTimeout=30000&retry=true
   [junit4]   2> 616282 INFO  (TEST-DirectUpdateHandlerTest.testDeleteRollback-seed#[B129E373C1AF221A]) [    ] o.a.s.l.LogWatcher SLF4J impl is org.slf4j.impl.Log4jLoggerFactory
   [junit4]   2> 616282 INFO  (TEST-DirectUpdateHandlerTest.testDeleteRollback-seed#[B129E373C1AF221A]) [    ] o.a.s.l.LogWatcher Registering Log Listener [Log4j (org.slf4j.impl.Log4jLoggerFactory)]
   [junit4]   2> 616282 INFO  (TEST-DirectUpdateHandlerTest.testDeleteRollback-seed#[B129E373C1AF221A]) [    ] o.a.s.c.CoreContainer Security conf doesn't exist. Skipping setup for authorization module.
   [junit4]   2> 616282 INFO  (TEST-DirectUpdateHandlerTest.testDeleteRollback-seed#[B129E373C1AF221A]) [    ] o.a.s.c.CoreContainer No authentication plugin used.
   [junit4]   2> 616283 INFO  (TEST-DirectUpdateHandlerTest.testDeleteRollback-seed#[B129E373C1AF221A]) [    ] o.a.s.c.CoreDescriptor Created CoreDescriptor: {name=collection1, config=solrconfig.xml, transient=false, schema=schema12.xml, loadOnStartup=true, configSetProperties=configsetprops.json, collection=collection1, dataDir=/home/jenkins/workspace/Lucene-Solr-trunk-Linux/solr/build/solr-core/test/J2/temp/solr.update.DirectUpdateHandlerTest_B129E373C1AF221A-001/init-core-data-001, shard=shard1}
   [junit4]   2> 616283 INFO  (coreLoadExecutor-2498-thread-1) [    ] o.a.s.c.SolrResourceLoader new SolrResourceLoader for directory: '/home/jenkins/workspace/Lucene-Solr-trunk-Linux/solr/core/src/test-files/solr/collection1'
   [junit4]   2> 616283 INFO  (coreLoadExecutor-2498-thread-1) [    ] o.a.s.c.SolrResourceLoader JNDI not configured for solr (NoInitialContextEx)
   [junit4]   2> 616283 INFO  (coreLoadExecutor-2498-thread-1) [    ] o.a.s.c.SolrResourceLoader using system property solr.solr.home: /home/jenkins/workspace/Lucene-Solr-trunk-Linux/solr/core/src/test-files/solr
   [junit4]   2> 616283 INFO  (coreLoadExecutor-2498-thread-1) [    ] o.a.s.c.SolrResourceLoader Adding 'file:/home/jenkins/workspace/Lucene-Solr-trunk-Linux/solr/core/src/test-files/solr/collection1/lib/classes/' to classloader
   [junit4]   2> 616283 INFO  (coreLoadExecutor-2498-thread-1) [    ] o.a.s.c.SolrResourceLoader Adding 'file:/home/jenkins/workspace/Lucene-Solr-trunk-Linux/solr/core/src/test-files/solr/collection1/lib/README' to classloader
   [junit4]   2> 616322 INFO  (coreLoadExecutor-2498-thread-1) [    ] o.a.s.c.SolrConfig current version of requestparams : -1
   [junit4]   2> 616329 INFO  (coreLoadExecutor-2498-thread-1) [    ] o.a.s.c.SolrConfig Using Lucene MatchVersion: 6.0.0
   [junit4]   2> 616344 INFO  (coreLoadExecutor-2498-thread-1) [    ] o.a.s.c.SolrConfig Loaded SolrConfig: solrconfig.xml
   [junit4]   2> 616347 INFO  (coreLoadExecutor-2498-thread-1) [    ] o.a.s.s.IndexSchema [collection1] Schema name=test
   [junit4]   2> 616401 INFO  (coreLoadExecutor-2498-thread-1) [    ] o.a.s.s.IndexSchema default search field in schema is text
   [junit4]   2> 616402 INFO  (coreLoadExecutor-2498-thread-1) [    ] o.a.s.s.IndexSchema unique key field: id
   [junit4]   2> 616402 WARN  (coreLoadExecutor-2498-thread-1) [    ] o.a.s.s.IndexSchema Field text is not multivalued and destination for multiple copyFields (2)
   [junit4]   2> 616405 INFO  (coreLoadExecutor-2498-thread-1) [    ] o.a.s.s.FileExchangeRateProvider Reloading exchange rates from file currency.xml
   [junit4]   2> 616406 INFO  (coreLoadExecutor-2498-thread-1) [    ] o.a.s.s.FileExchangeRateProvider Reloading exchange rates from file currency.xml
   [junit4]   2> 616414 INFO  (coreLoadExecutor-2498-thread-1) [    ] o.a.s.c.ConfigSetProperties Did not find ConfigSet properties, assuming default properties: Can't find resource 'configsetprops.json' in classpath or '/home/jenkins/workspace/Lucene-Solr-trunk-Linux/solr/core/src/test-files/solr/collection1'
   [junit4]   2> 616414 INFO  (coreLoadExecutor-2498-thread-1) [    ] o.a.s.c.CoreContainer Creating SolrCore 'collection1' using configuration from instancedir /home/jenkins/workspace/Lucene-Solr-trunk-Linux/solr/core/src/test-files/solr/collection1
   [junit4]   2> 616414 INFO  (coreLoadExecutor-2498-thread-1) [    ] o.a.s.c.SolrCore org.apache.solr.core.MockFSDirectoryFactory
   [junit4]   2> 616414 INFO  (coreLoadExecutor-2498-thread-1) [    ] o.a.s.c.SolrCore [[collection1] ] Opening new SolrCore at [/home/jenkins/workspace/Lucene-Solr-trunk-Linux/solr/core/src/test-files/solr/collection1], dataDir=[/home/jenkins/workspace/Lucene-Solr-trunk-Linux/solr/build/solr-core/test/J2/temp/solr.update.DirectUpdateHandlerTest_B129E373C1AF221A-001/init-core-data-001/]
   [junit4]   2> 616414 INFO  (coreLoadExecutor-2498-thread-1) [    ] o.a.s.c.JmxMonitoredMap JMX monitoring is enabled. Adding Solr mbeans to JMX Server: com.sun.jmx.mbeanserver.JmxMBeanServer@325f8049
   [junit4]   2> 616415 INFO  (coreLoadExecutor-2498-thread-1) [    ] o.a.s.c.CachingDirectoryFactory return new directory for /home/jenkins/workspace/Lucene-Solr-trunk-Linux/solr/build/solr-core/test/J2/temp/solr.update.DirectUpdateHandlerTest_B129E373C1AF221A-001/init-core-data-001
   [junit4]   2> 616415 INFO  (coreLoadExecutor-2498-thread-1) [    ] o.a.s.c.SolrCore New index directory detected: old=null new=/home/jenkins/workspace/Lucene-Solr-trunk-Linux/solr/build/solr-core/test/J2/temp/solr.update.DirectUpdateHandlerTest_B129E373C1AF221A-001/init-core-data-001/index/
   [junit4]   2> 616416 INFO  (OldIndexDirectoryCleanupThreadForCore-collection1) [    ] o.a.s.c.SolrCore Looking for old index directories to cleanup for core collection1 in /home/jenkins/workspace/Lucene-Solr-trunk-Linux/solr/build/solr-core/test/J2/temp/solr.update.DirectUpdateHandlerTest_B129E373C1AF221A-001/init-core-data-001/
   [junit4]   2> 616417 INFO  (coreLoadExecutor-2498-thread-1) [    ] o.a.s.u.p.UpdateRequestProcessorChain creating updateRequestProcessorChain "dedupe"
   [junit4]   2> 616417 INFO  (coreLoadExecutor-2498-thread-1) [    ] o.a.s.u.p.UpdateRequestProcessorChain inserting DistributedUpdateProcessorFactory into updateRequestProcessorChain "dedupe"
   [junit4]   2> 616418 INFO  (coreLoadExecutor-2498-thread-1) [    ] o.a.s.u.p.UpdateRequestProcessorChain creating updateRequestProcessorChain "dedupe-allfields"
   [junit4]   2> 616418 INFO  (coreLoadExecutor-2498-thread-1) [    ] o.a.s.u.p.UpdateRequestProcessorChain inserting Di

[...truncated too long message...]

tor-2503-thread-1) [    ] o.a.s.u.DirectUpdateHandler2 closing DirectUpdateHandler2{commits=12,autocommits=0,soft autocommits=0,optimizes=1,rollbacks=2,expungeDeletes=1,docsPending=0,adds=0,deletesById=0,deletesByQuery=0,errors=0,cumulative_adds=11,cumulative_deletesById=0,cumulative_deletesByQuery=3,cumulative_errors=0}
   [junit4]   2> 617309 INFO  (coreCloseExecutor-2503-thread-1) [    ] o.a.s.u.SolrCoreState Closing SolrCoreState
   [junit4]   2> 617309 INFO  (coreCloseExecutor-2503-thread-1) [    ] o.a.s.u.DefaultSolrCoreState SolrCoreState ref count has reached 0 - closing IndexWriter
   [junit4]   2> 617309 INFO  (coreCloseExecutor-2503-thread-1) [    ] o.a.s.u.DefaultSolrCoreState closing IndexWriter with IndexWriterCloser
   [junit4]   2> 617327 INFO  (coreCloseExecutor-2503-thread-1) [    ] o.a.s.c.SolrDeletionPolicy SolrDeletionPolicy.onCommit: commits: num=2
   [junit4]   2> 	commit{dir=MockDirectoryWrapper(MMapDirectory@/home/jenkins/workspace/Lucene-Solr-trunk-Linux/solr/build/solr-core/test/J2/temp/solr.update.DirectUpdateHandlerTest_B129E373C1AF221A-001/init-core-data-001/index lockFactory=org.apache.lucene.store.SingleInstanceLockFactory@1745147),segFN=segments_j,generation=19}
   [junit4]   2> 	commit{dir=MockDirectoryWrapper(MMapDirectory@/home/jenkins/workspace/Lucene-Solr-trunk-Linux/solr/build/solr-core/test/J2/temp/solr.update.DirectUpdateHandlerTest_B129E373C1AF221A-001/init-core-data-001/index lockFactory=org.apache.lucene.store.SingleInstanceLockFactory@1745147),segFN=segments_k,generation=20}
   [junit4]   2> 617327 INFO  (coreCloseExecutor-2503-thread-1) [    ] o.a.s.c.SolrDeletionPolicy newest commit generation = 20
   [junit4]   2> 617327 INFO  (coreCloseExecutor-2503-thread-1) [    ] o.a.s.c.SolrCore [collection1] Closing main searcher on request.
   [junit4]   2> 617333 INFO  (coreCloseExecutor-2503-thread-1) [    ] o.a.s.c.CachingDirectoryFactory Closing MockFSDirectoryFactory - 2 directories currently being tracked
   [junit4]   2> 629443 ERROR (coreCloseExecutor-2503-thread-1) [    ] o.a.s.c.CachingDirectoryFactory Timeout waiting for all directory ref counts to be released - gave up waiting on CachedDir<<refCount=1;path=/home/jenkins/workspace/Lucene-Solr-trunk-Linux/solr/build/solr-core/test/J2/temp/solr.update.DirectUpdateHandlerTest_B129E373C1AF221A-001/init-core-data-001/index;done=false>>
   [junit4]   2> 629443 ERROR (coreCloseExecutor-2503-thread-1) [    ] o.a.s.c.CachingDirectoryFactory Error closing directory:org.apache.solr.common.SolrException: Timeout waiting for all directory ref counts to be released - gave up waiting on CachedDir<<refCount=1;path=/home/jenkins/workspace/Lucene-Solr-trunk-Linux/solr/build/solr-core/test/J2/temp/solr.update.DirectUpdateHandlerTest_B129E373C1AF221A-001/init-core-data-001/index;done=false>>
   [junit4]   2> 	at org.apache.solr.core.CachingDirectoryFactory.close(CachingDirectoryFactory.java:187)
   [junit4]   2> 	at org.apache.solr.core.SolrCore.close(SolrCore.java:1275)
   [junit4]   2> 	at org.apache.solr.core.SolrCores$2.call(SolrCores.java:135)
   [junit4]   2> 	at org.apache.solr.core.SolrCores$2.call(SolrCores.java:130)
   [junit4]   2> 	at java.util.concurrent.FutureTask.run(FutureTask.java:266)
   [junit4]   2> 	at org.apache.solr.common.util.ExecutorUtil$MDCAwareThreadPoolExecutor$1.run(ExecutorUtil.java:231)
   [junit4]   2> 	at java.util.concurrent.ThreadPoolExecutor.runWorker(ThreadPoolExecutor.java:1158)
   [junit4]   2> 	at java.util.concurrent.ThreadPoolExecutor$Worker.run(ThreadPoolExecutor.java:632)
   [junit4]   2> 	at java.lang.Thread.run(Thread.java:804)
   [junit4]   2> 
   [junit4]   2> 629444 INFO  (coreCloseExecutor-2503-thread-1) [    ] o.a.s.c.CachingDirectoryFactory looking to close /home/jenkins/workspace/Lucene-Solr-trunk-Linux/solr/build/solr-core/test/J2/temp/solr.update.DirectUpdateHandlerTest_B129E373C1AF221A-001/init-core-data-001 [CachedDir<<refCount=0;path=/home/jenkins/workspace/Lucene-Solr-trunk-Linux/solr/build/solr-core/test/J2/temp/solr.update.DirectUpdateHandlerTest_B129E373C1AF221A-001/init-core-data-001;done=false>>]
   [junit4]   2> 629444 INFO  (coreCloseExecutor-2503-thread-1) [    ] o.a.s.c.CachingDirectoryFactory Closing directory: /home/jenkins/workspace/Lucene-Solr-trunk-Linux/solr/build/solr-core/test/J2/temp/solr.update.DirectUpdateHandlerTest_B129E373C1AF221A-001/init-core-data-001
   [junit4]   2> 629444 ERROR (coreCloseExecutor-2503-thread-1) [    ] o.a.s.c.SolrCore java.lang.AssertionError: 1
   [junit4]   2> 	at org.apache.solr.core.CachingDirectoryFactory.close(CachingDirectoryFactory.java:201)
   [junit4]   2> 	at org.apache.solr.core.SolrCore.close(SolrCore.java:1275)
   [junit4]   2> 	at org.apache.solr.core.SolrCores$2.call(SolrCores.java:135)
   [junit4]   2> 	at org.apache.solr.core.SolrCores$2.call(SolrCores.java:130)
   [junit4]   2> 	at java.util.concurrent.FutureTask.run(FutureTask.java:266)
   [junit4]   2> 	at org.apache.solr.common.util.ExecutorUtil$MDCAwareThreadPoolExecutor$1.run(ExecutorUtil.java:231)
   [junit4]   2> 	at java.util.concurrent.ThreadPoolExecutor.runWorker(ThreadPoolExecutor.java:1158)
   [junit4]   2> 	at java.util.concurrent.ThreadPoolExecutor$Worker.run(ThreadPoolExecutor.java:632)
   [junit4]   2> 	at java.lang.Thread.run(Thread.java:804)
   [junit4]   2> 
   [junit4]   2> 629444 ERROR (coreCloseExecutor-2503-thread-1) [    ] o.a.s.c.SolrCores Error shutting down core:java.lang.AssertionError: 1
   [junit4]   2> 	at org.apache.solr.core.CachingDirectoryFactory.close(CachingDirectoryFactory.java:201)
   [junit4]   2> 	at org.apache.solr.core.SolrCore.close(SolrCore.java:1275)
   [junit4]   2> 	at org.apache.solr.core.SolrCores$2.call(SolrCores.java:135)
   [junit4]   2> 	at org.apache.solr.core.SolrCores$2.call(SolrCores.java:130)
   [junit4]   2> 	at java.util.concurrent.FutureTask.run(FutureTask.java:266)
   [junit4]   2> 	at org.apache.solr.common.util.ExecutorUtil$MDCAwareThreadPoolExecutor$1.run(ExecutorUtil.java:231)
   [junit4]   2> 	at java.util.concurrent.ThreadPoolExecutor.runWorker(ThreadPoolExecutor.java:1158)
   [junit4]   2> 	at java.util.concurrent.ThreadPoolExecutor$Worker.run(ThreadPoolExecutor.java:632)
   [junit4]   2> 	at java.lang.Thread.run(Thread.java:804)
   [junit4]   2> 
   [junit4]   2> NOTE: leaving temporary files on disk at: /home/jenkins/workspace/Lucene-Solr-trunk-Linux/solr/build/solr-core/test/J2/temp/solr.update.DirectUpdateHandlerTest_B129E373C1AF221A-001
   [junit4]   2> NOTE: test params are: codec=Asserting(Lucene60): {id=BlockTreeOrds(blocksize=128)}, docValues:{}, sim=ClassicSimilarity, locale=sr-BA, timezone=America/Metlakatla
   [junit4]   2> NOTE: Linux 3.19.0-47-generic amd64/Oracle Corporation 9-ea (64-bit)/cpus=12,threads=1,free=136626616,total=536870912
   [junit4]   2> NOTE: All tests run in this JVM: [TestGroupingSearch, OverseerTest, TestSweetSpotSimilarityFactory, StatsComponentTest, DocValuesMultiTest, SampleTest, ScriptEngineTest, SearchHandlerTest, HdfsTlogReplayBufferedWhileIndexingTest, DistributedFacetPivotLargeTest, NoCacheHeaderTest, TestFieldCollectionResource, TestRecovery, SpatialHeatmapFacetsTest, CachingDirectoryFactoryTest, SolrCoreCheckLockOnStartupTest, SmileWriterTest, SliceStateTest, RecoveryZkTest, SolrTestCaseJ4Test, DirectSolrConnectionTest, BigEndianAscendingWordSerializerTest, TestSortByMinMaxFunction, DebugComponentTest, TestUniqueKeyFieldResource, DistributedQueueTest, CoreMergeIndexesAdminHandlerTest, SharedFSAutoReplicaFailoverUtilsTest, FieldMutatingUpdateProcessorTest, DirectUpdateHandlerOptimizeTest, TestOverriddenPrefixQueryForCustomFieldType, TestRandomRequestDistribution, HdfsChaosMonkeyNothingIsSafeTest, TestSolrCloudWithKerberosAlt, TestFuzzyAnalyzedSuggestions, TestExceedMaxTermLength, AutoCommitTest, WrapperMergePolicyFactoryTest, TermVectorComponentDistributedTest, TestComplexPhraseQParserPlugin, TestSchemaManager, DistribCursorPagingTest, CloudMLTQParserTest, TestAddFieldRealTimeGet, TestIndexSearcher, FullSolrCloudDistribCmdsTest, TestManagedResource, TestDistribDocBasedVersion, TestInitParams, FullHLLTest, TestLRUStatsCache, ClusterStateTest, TestRequestForwarding, BinaryUpdateRequestHandlerTest, FieldAnalysisRequestHandlerTest, LeaderElectionTest, AnalyticsMergeStrategyTest, TestSolrIndexConfig, TestAuthorizationFramework, TestLeaderElectionZkExpiry, HdfsRestartWhileUpdatingTest, QueryParsingTest, TestConfigSetsAPIExclusivity, TestDistributedMissingSort, TestBulkSchemaConcurrent, TestShardHandlerFactory, HdfsNNFailoverTest, TestJmxMonitoredMap, SparseHLLTest, RegexBoostProcessorTest, DeleteReplicaTest, DirectUpdateHandlerTest]
   [junit4] Completed [189/579 (1!)] on J2 in 14.85s, 7 tests, 1 failure <<< FAILURES!

[...truncated 1255 lines...]
BUILD FAILED
/home/jenkins/workspace/Lucene-Solr-trunk-Linux/build.xml:740: The following error occurred while executing this line:
/home/jenkins/workspace/Lucene-Solr-trunk-Linux/build.xml:684: The following error occurred while executing this line:
/home/jenkins/workspace/Lucene-Solr-trunk-Linux/build.xml:59: The following error occurred while executing this line:
/home/jenkins/workspace/Lucene-Solr-trunk-Linux/solr/build.xml:233: The following error occurred while executing this line:
/home/jenkins/workspace/Lucene-Solr-trunk-Linux/solr/common-build.xml:524: The following error occurred while executing this line:
/home/jenkins/workspace/Lucene-Solr-trunk-Linux/lucene/common-build.xml:1457: The following error occurred while executing this line:
/home/jenkins/workspace/Lucene-Solr-trunk-Linux/lucene/common-build.xml:1014: There were test failures: 579 suites (8 ignored), 2331 tests, 1 failure, 118 ignored (72 assumptions) [seed: B129E373C1AF221A]

Total time: 51 minutes 2 seconds
Build step 'Invoke Ant' marked build as failure
Archiving artifacts
[WARNINGS] Skipping publisher since build result is FAILURE
Recording test results
Email was triggered for: Failure - Any
Sending email for trigger: Failure - Any



Mime
View raw message