lucene-dev mailing list archives

Site index · List index
Message view « Date » · « Thread »
Top « Date » · « Thread »
From Policeman Jenkins Server <jenk...@thetaphi.de>
Subject [JENKINS] Lucene-Solr-5.x-Windows (64bit/jdk1.8.0_72) - Build # 5471 - Failure!
Date Sun, 07 Feb 2016 19:32:39 GMT
Build: http://jenkins.thetaphi.de/job/Lucene-Solr-5.x-Windows/5471/
Java: 64bit/jdk1.8.0_72 -XX:+UseCompressedOops -XX:+UseSerialGC

4 tests failed.
FAILED:  org.apache.solr.cloud.DistribDocExpirationUpdateProcessorTest.test

Error Message:
There are still nodes recoverying - waited for 45 seconds

Stack Trace:
java.lang.AssertionError: There are still nodes recoverying - waited for 45 seconds
	at __randomizedtesting.SeedInfo.seed([FA5843C9B6C99326:720C7C131835FEDE]:0)
	at org.junit.Assert.fail(Assert.java:93)
	at org.apache.solr.cloud.AbstractDistribZkTestBase.waitForRecoveriesToFinish(AbstractDistribZkTestBase.java:174)
	at org.apache.solr.cloud.AbstractFullDistribZkTestBase.waitForRecoveriesToFinish(AbstractFullDistribZkTestBase.java:836)
	at org.apache.solr.cloud.DistribDocExpirationUpdateProcessorTest.test(DistribDocExpirationUpdateProcessorTest.java:73)
	at sun.reflect.NativeMethodAccessorImpl.invoke0(Native Method)
	at sun.reflect.NativeMethodAccessorImpl.invoke(NativeMethodAccessorImpl.java:62)
	at sun.reflect.DelegatingMethodAccessorImpl.invoke(DelegatingMethodAccessorImpl.java:43)
	at java.lang.reflect.Method.invoke(Method.java:498)
	at com.carrotsearch.randomizedtesting.RandomizedRunner.invoke(RandomizedRunner.java:1764)
	at com.carrotsearch.randomizedtesting.RandomizedRunner$8.evaluate(RandomizedRunner.java:871)
	at com.carrotsearch.randomizedtesting.RandomizedRunner$9.evaluate(RandomizedRunner.java:907)
	at com.carrotsearch.randomizedtesting.RandomizedRunner$10.evaluate(RandomizedRunner.java:921)
	at org.apache.solr.BaseDistributedSearchTestCase$ShardsRepeatRule$ShardsFixedStatement.callStatement(BaseDistributedSearchTestCase.java:964)
	at org.apache.solr.BaseDistributedSearchTestCase$ShardsRepeatRule$ShardsStatement.evaluate(BaseDistributedSearchTestCase.java:939)
	at com.carrotsearch.randomizedtesting.rules.SystemPropertiesRestoreRule$1.evaluate(SystemPropertiesRestoreRule.java:57)
	at org.apache.lucene.util.TestRuleSetupTeardownChained$1.evaluate(TestRuleSetupTeardownChained.java:49)
	at org.apache.lucene.util.AbstractBeforeAfterRule$1.evaluate(AbstractBeforeAfterRule.java:45)
	at org.apache.lucene.util.TestRuleThreadAndTestName$1.evaluate(TestRuleThreadAndTestName.java:48)
	at org.apache.lucene.util.TestRuleIgnoreAfterMaxFailures$1.evaluate(TestRuleIgnoreAfterMaxFailures.java:64)
	at org.apache.lucene.util.TestRuleMarkFailure$1.evaluate(TestRuleMarkFailure.java:47)
	at com.carrotsearch.randomizedtesting.rules.StatementAdapter.evaluate(StatementAdapter.java:36)
	at com.carrotsearch.randomizedtesting.ThreadLeakControl$StatementRunner.run(ThreadLeakControl.java:367)
	at com.carrotsearch.randomizedtesting.ThreadLeakControl.forkTimeoutingTask(ThreadLeakControl.java:809)
	at com.carrotsearch.randomizedtesting.ThreadLeakControl$3.evaluate(ThreadLeakControl.java:460)
	at com.carrotsearch.randomizedtesting.RandomizedRunner.runSingleTest(RandomizedRunner.java:880)
	at com.carrotsearch.randomizedtesting.RandomizedRunner$5.evaluate(RandomizedRunner.java:781)
	at com.carrotsearch.randomizedtesting.RandomizedRunner$6.evaluate(RandomizedRunner.java:816)
	at com.carrotsearch.randomizedtesting.RandomizedRunner$7.evaluate(RandomizedRunner.java:827)
	at com.carrotsearch.randomizedtesting.rules.StatementAdapter.evaluate(StatementAdapter.java:36)
	at com.carrotsearch.randomizedtesting.rules.SystemPropertiesRestoreRule$1.evaluate(SystemPropertiesRestoreRule.java:57)
	at org.apache.lucene.util.AbstractBeforeAfterRule$1.evaluate(AbstractBeforeAfterRule.java:45)
	at com.carrotsearch.randomizedtesting.rules.StatementAdapter.evaluate(StatementAdapter.java:36)
	at org.apache.lucene.util.TestRuleStoreClassName$1.evaluate(TestRuleStoreClassName.java:41)
	at com.carrotsearch.randomizedtesting.rules.NoShadowingOrOverridesOnMethodsRule$1.evaluate(NoShadowingOrOverridesOnMethodsRule.java:40)
	at com.carrotsearch.randomizedtesting.rules.NoShadowingOrOverridesOnMethodsRule$1.evaluate(NoShadowingOrOverridesOnMethodsRule.java:40)
	at com.carrotsearch.randomizedtesting.rules.StatementAdapter.evaluate(StatementAdapter.java:36)
	at com.carrotsearch.randomizedtesting.rules.StatementAdapter.evaluate(StatementAdapter.java:36)
	at com.carrotsearch.randomizedtesting.rules.StatementAdapter.evaluate(StatementAdapter.java:36)
	at org.apache.lucene.util.TestRuleAssertionsRequired$1.evaluate(TestRuleAssertionsRequired.java:53)
	at org.apache.lucene.util.TestRuleMarkFailure$1.evaluate(TestRuleMarkFailure.java:47)
	at org.apache.lucene.util.TestRuleIgnoreAfterMaxFailures$1.evaluate(TestRuleIgnoreAfterMaxFailures.java:64)
	at org.apache.lucene.util.TestRuleIgnoreTestSuites$1.evaluate(TestRuleIgnoreTestSuites.java:54)
	at com.carrotsearch.randomizedtesting.rules.StatementAdapter.evaluate(StatementAdapter.java:36)
	at com.carrotsearch.randomizedtesting.ThreadLeakControl$StatementRunner.run(ThreadLeakControl.java:367)
	at java.lang.Thread.run(Thread.java:745)


FAILED:  junit.framework.TestSuite.org.apache.solr.cloud.HttpPartitionTest

Error Message:
ObjectTracker found 1 object(s) that were not released!!! [RawDirectoryWrapper]

Stack Trace:
java.lang.AssertionError: ObjectTracker found 1 object(s) that were not released!!! [RawDirectoryWrapper]
	at __randomizedtesting.SeedInfo.seed([FA5843C9B6C99326]:0)
	at org.junit.Assert.fail(Assert.java:93)
	at org.junit.Assert.assertTrue(Assert.java:43)
	at org.junit.Assert.assertNull(Assert.java:551)
	at org.apache.solr.SolrTestCaseJ4.afterClass(SolrTestCaseJ4.java:228)
	at sun.reflect.GeneratedMethodAccessor22.invoke(Unknown Source)
	at sun.reflect.DelegatingMethodAccessorImpl.invoke(DelegatingMethodAccessorImpl.java:43)
	at java.lang.reflect.Method.invoke(Method.java:498)
	at com.carrotsearch.randomizedtesting.RandomizedRunner.invoke(RandomizedRunner.java:1764)
	at com.carrotsearch.randomizedtesting.RandomizedRunner$7.evaluate(RandomizedRunner.java:834)
	at com.carrotsearch.randomizedtesting.rules.StatementAdapter.evaluate(StatementAdapter.java:36)
	at com.carrotsearch.randomizedtesting.rules.SystemPropertiesRestoreRule$1.evaluate(SystemPropertiesRestoreRule.java:57)
	at org.apache.lucene.util.AbstractBeforeAfterRule$1.evaluate(AbstractBeforeAfterRule.java:45)
	at com.carrotsearch.randomizedtesting.rules.StatementAdapter.evaluate(StatementAdapter.java:36)
	at org.apache.lucene.util.TestRuleStoreClassName$1.evaluate(TestRuleStoreClassName.java:41)
	at com.carrotsearch.randomizedtesting.rules.NoShadowingOrOverridesOnMethodsRule$1.evaluate(NoShadowingOrOverridesOnMethodsRule.java:40)
	at com.carrotsearch.randomizedtesting.rules.NoShadowingOrOverridesOnMethodsRule$1.evaluate(NoShadowingOrOverridesOnMethodsRule.java:40)
	at com.carrotsearch.randomizedtesting.rules.StatementAdapter.evaluate(StatementAdapter.java:36)
	at com.carrotsearch.randomizedtesting.rules.StatementAdapter.evaluate(StatementAdapter.java:36)
	at com.carrotsearch.randomizedtesting.rules.StatementAdapter.evaluate(StatementAdapter.java:36)
	at org.apache.lucene.util.TestRuleAssertionsRequired$1.evaluate(TestRuleAssertionsRequired.java:53)
	at org.apache.lucene.util.TestRuleMarkFailure$1.evaluate(TestRuleMarkFailure.java:47)
	at org.apache.lucene.util.TestRuleIgnoreAfterMaxFailures$1.evaluate(TestRuleIgnoreAfterMaxFailures.java:64)
	at org.apache.lucene.util.TestRuleIgnoreTestSuites$1.evaluate(TestRuleIgnoreTestSuites.java:54)
	at com.carrotsearch.randomizedtesting.rules.StatementAdapter.evaluate(StatementAdapter.java:36)
	at com.carrotsearch.randomizedtesting.ThreadLeakControl$StatementRunner.run(ThreadLeakControl.java:367)
	at java.lang.Thread.run(Thread.java:745)


FAILED:  org.apache.solr.core.TestLazyCores.testLazyLoad

Error Message:
Test abandoned because suite timeout was reached.

Stack Trace:
java.lang.Exception: Test abandoned because suite timeout was reached.
	at __randomizedtesting.SeedInfo.seed([FA5843C9B6C99326]:0)


FAILED:  junit.framework.TestSuite.org.apache.solr.core.TestLazyCores

Error Message:
Suite timeout exceeded (>= 7200000 msec).

Stack Trace:
java.lang.Exception: Suite timeout exceeded (>= 7200000 msec).
	at __randomizedtesting.SeedInfo.seed([FA5843C9B6C99326]:0)




Build Log:
[...truncated 11226 lines...]
   [junit4] Suite: org.apache.solr.cloud.DistribDocExpirationUpdateProcessorTest
   [junit4]   2> Creating dataDir: C:\Users\JenkinsSlave\workspace\Lucene-Solr-5.x-Windows\solr\build\solr-core\test\J1\temp\solr.cloud.DistribDocExpirationUpdateProcessorTest_FA5843C9B6C99326-001\init-core-data-001
   [junit4]   2> 854214 INFO  (SUITE-DistribDocExpirationUpdateProcessorTest-seed#[FA5843C9B6C99326]-worker) [    ] o.a.s.SolrTestCaseJ4 Randomized ssl (true) and clientAuth (false)
   [junit4]   2> 854214 INFO  (SUITE-DistribDocExpirationUpdateProcessorTest-seed#[FA5843C9B6C99326]-worker) [    ] o.a.s.BaseDistributedSearchTestCase Setting hostContext system property: /
   [junit4]   2> 854216 INFO  (TEST-DistribDocExpirationUpdateProcessorTest.test-seed#[FA5843C9B6C99326]) [    ] o.a.s.c.ZkTestServer STARTING ZK TEST SERVER
   [junit4]   2> 854217 INFO  (Thread-3041) [    ] o.a.s.c.ZkTestServer client port:0.0.0.0/0.0.0.0:0
   [junit4]   2> 854217 INFO  (Thread-3041) [    ] o.a.s.c.ZkTestServer Starting server
   [junit4]   2> 854317 INFO  (TEST-DistribDocExpirationUpdateProcessorTest.test-seed#[FA5843C9B6C99326]) [    ] o.a.s.c.ZkTestServer start zk server on port:64079
   [junit4]   2> 854317 INFO  (TEST-DistribDocExpirationUpdateProcessorTest.test-seed#[FA5843C9B6C99326]) [    ] o.a.s.c.c.SolrZkClient Using default ZkCredentialsProvider
   [junit4]   2> 854318 INFO  (TEST-DistribDocExpirationUpdateProcessorTest.test-seed#[FA5843C9B6C99326]) [    ] o.a.s.c.c.ConnectionManager Waiting for client to connect to ZooKeeper
   [junit4]   2> 854323 INFO  (zkCallback-1388-thread-1) [    ] o.a.s.c.c.ConnectionManager Watcher org.apache.solr.common.cloud.ConnectionManager@8f15a40 name:ZooKeeperConnection Watcher:127.0.0.1:64079 got event WatchedEvent state:SyncConnected type:None path:null path:null type:None
   [junit4]   2> 854324 INFO  (TEST-DistribDocExpirationUpdateProcessorTest.test-seed#[FA5843C9B6C99326]) [    ] o.a.s.c.c.ConnectionManager Client is connected to ZooKeeper
   [junit4]   2> 854324 INFO  (TEST-DistribDocExpirationUpdateProcessorTest.test-seed#[FA5843C9B6C99326]) [    ] o.a.s.c.c.SolrZkClient Using default ZkACLProvider
   [junit4]   2> 854324 INFO  (TEST-DistribDocExpirationUpdateProcessorTest.test-seed#[FA5843C9B6C99326]) [    ] o.a.s.c.c.SolrZkClient makePath: /solr
   [junit4]   2> 854330 INFO  (TEST-DistribDocExpirationUpdateProcessorTest.test-seed#[FA5843C9B6C99326]) [    ] o.a.s.c.c.SolrZkClient Using default ZkCredentialsProvider
   [junit4]   2> 854331 INFO  (TEST-DistribDocExpirationUpdateProcessorTest.test-seed#[FA5843C9B6C99326]) [    ] o.a.s.c.c.ConnectionManager Waiting for client to connect to ZooKeeper
   [junit4]   2> 854333 INFO  (zkCallback-1389-thread-1) [    ] o.a.s.c.c.ConnectionManager Watcher org.apache.solr.common.cloud.ConnectionManager@45c08ed5 name:ZooKeeperConnection Watcher:127.0.0.1:64079/solr got event WatchedEvent state:SyncConnected type:None path:null path:null type:None
   [junit4]   2> 854333 INFO  (TEST-DistribDocExpirationUpdateProcessorTest.test-seed#[FA5843C9B6C99326]) [    ] o.a.s.c.c.ConnectionManager Client is connected to ZooKeeper
   [junit4]   2> 854333 INFO  (TEST-DistribDocExpirationUpdateProcessorTest.test-seed#[FA5843C9B6C99326]) [    ] o.a.s.c.c.SolrZkClient Using default ZkACLProvider
   [junit4]   2> 854333 INFO  (TEST-DistribDocExpirationUpdateProcessorTest.test-seed#[FA5843C9B6C99326]) [    ] o.a.s.c.c.SolrZkClient makePath: /collections/collection1
   [junit4]   2> 854335 INFO  (TEST-DistribDocExpirationUpdateProcessorTest.test-seed#[FA5843C9B6C99326]) [    ] o.a.s.c.c.SolrZkClient makePath: /collections/collection1/shards
   [junit4]   2> 854336 INFO  (TEST-DistribDocExpirationUpdateProcessorTest.test-seed#[FA5843C9B6C99326]) [    ] o.a.s.c.c.SolrZkClient makePath: /collections/control_collection
   [junit4]   2> 854337 INFO  (TEST-DistribDocExpirationUpdateProcessorTest.test-seed#[FA5843C9B6C99326]) [    ] o.a.s.c.c.SolrZkClient makePath: /collections/control_collection/shards
   [junit4]   2> 854339 INFO  (TEST-DistribDocExpirationUpdateProcessorTest.test-seed#[FA5843C9B6C99326]) [    ] o.a.s.c.AbstractZkTestCase put C:\Users\JenkinsSlave\workspace\Lucene-Solr-5.x-Windows\solr\core\src\test-files\solr\collection1\conf\solrconfig-doc-expire-update-processor.xml to /configs/conf1/solrconfig.xml
   [junit4]   2> 854339 INFO  (TEST-DistribDocExpirationUpdateProcessorTest.test-seed#[FA5843C9B6C99326]) [    ] o.a.s.c.c.SolrZkClient makePath: /configs/conf1/solrconfig.xml
   [junit4]   2> 854341 INFO  (TEST-DistribDocExpirationUpdateProcessorTest.test-seed#[FA5843C9B6C99326]) [    ] o.a.s.c.AbstractZkTestCase put C:\Users\JenkinsSlave\workspace\Lucene-Solr-5.x-Windows\solr\core\src\test-files\solr\collection1\conf\schema15.xml to /configs/conf1/schema.xml
   [junit4]   2> 854341 INFO  (TEST-DistribDocExpirationUpdateProcessorTest.test-seed#[FA5843C9B6C99326]) [    ] o.a.s.c.c.SolrZkClient makePath: /configs/conf1/schema.xml
   [junit4]   2> 854343 INFO  (TEST-DistribDocExpirationUpdateProcessorTest.test-seed#[FA5843C9B6C99326]) [    ] o.a.s.c.AbstractZkTestCase put C:\Users\JenkinsSlave\workspace\Lucene-Solr-5.x-Windows\solr\core\src\test-files\solr\collection1\conf\solrconfig.snippet.randomindexconfig.xml to /configs/conf1/solrconfig.snippet.randomindexconfig.xml
   [junit4]   2> 854343 INFO  (TEST-DistribDocExpirationUpdateProcessorTest.test-seed#[FA5843C9B6C99326]) [    ] o.a.s.c.c.SolrZkClient makePath: /configs/conf1/solrconfig.snippet.randomindexconfig.xml
   [junit4]   2> 854345 INFO  (TEST-DistribDocExpirationUpdateProcessorTest.test-seed#[FA5843C9B6C99326]) [    ] o.a.s.c.AbstractZkTestCase put C:\Users\JenkinsSlave\workspace\Lucene-Solr-5.x-Windows\solr\core\src\test-files\solr\collection1\conf\stopwords.txt to /configs/conf1/stopwords.txt
   [junit4]   2> 854345 INFO  (TEST-DistribDocExpirationUpdateProcessorTest.test-seed#[FA5843C9B6C99326]) [    ] o.a.s.c.c.SolrZkClient makePath: /configs/conf1/stopwords.txt
   [junit4]   2> 854346 INFO  (TEST-DistribDocExpirationUpdateProcessorTest.test-seed#[FA5843C9B6C99326]) [    ] o.a.s.c.AbstractZkTestCase put C:\Users\JenkinsSlave\workspace\Lucene-Solr-5.x-Windows\solr\core\src\test-files\solr\collection1\conf\protwords.txt to /configs/conf1/protwords.txt
   [junit4]   2> 854346 INFO  (TEST-DistribDocExpirationUpdateProcessorTest.test-seed#[FA5843C9B6C99326]) [    ] o.a.s.c.c.SolrZkClient makePath: /configs/conf1/protwords.txt
   [junit4]   2> 854348 INFO  (TEST-DistribDocExpirationUpdateProcessorTest.test-seed#[FA5843C9B6C99326]) [    ] o.a.s.c.AbstractZkTestCase put C:\Users\JenkinsSlave\workspace\Lucene-Solr-5.x-Windows\solr\core\src\test-files\solr\collection1\conf\currency.xml to /configs/conf1/currency.xml
   [junit4]   2> 854348 INFO  (TEST-DistribDocExpirationUpdateProcessorTest.test-seed#[FA5843C9B6C99326]) [    ] o.a.s.c.c.SolrZkClient makePath: /configs/conf1/currency.xml
   [junit4]   2> 854350 INFO  (TEST-DistribDocExpirationUpdateProcessorTest.test-seed#[FA5843C9B6C99326]) [    ] o.a.s.c.AbstractZkTestCase put C:\Users\JenkinsSlave\workspace\Lucene-Solr-5.x-Windows\solr\core\src\test-files\solr\collection1\conf\enumsConfig.xml to /configs/conf1/enumsConfig.xml
   [junit4]   2> 854350 INFO  (TEST-DistribDocExpirationUpdateProcessorTest.test-seed#[FA5843C9B6C99326]) [    ] o.a.s.c.c.SolrZkClient makePath: /configs/conf1/enumsConfig.xml
   [junit4]   2> 854351 INFO  (TEST-DistribDocExpirationUpdateProcessorTest.test-seed#[FA5843C9B6C99326]) [    ] o.a.s.c.AbstractZkTestCase put C:\Users\JenkinsSlave\workspace\Lucene-Solr-5.x-Windows\solr\core\src\test-files\solr\collection1\conf\open-exchange-rates.json to /configs/conf1/open-exchange-rates.json
   [junit4]   2> 854352 INFO  (TEST-DistribDocExpirationUpdateProcessorTest.test-seed#[FA5843C9B6C99326]) [    ] o.a.s.c.c.SolrZkClient makePath: /configs/conf1/open-exchange-rates.json
   [junit4]   2> 854353 INFO  (TEST-DistribDocExpirationUpdateProcessorTest.test-seed#[FA5843C9B6C99326]) [    ] o.a.s.c.AbstractZkTestCase put C:\Users\JenkinsSlave\workspace\Lucene-Solr-5.x-Windows\solr\core\src\test-files\solr\collection1\conf\mapping-ISOLatin1Accent.txt to /configs/conf1/mapping-ISOLatin1Accent.txt
   [junit4]   2> 854353 INFO  (TEST-DistribDocExpirationUpdateProcessorTest.test-seed#[FA5843C9B6C99326]) [    ] o.a.s.c.c.SolrZkClient makePath: /configs/conf1/mapping-ISOLatin1Accent.txt
   [junit4]   2> 854355 INFO  (TEST-DistribDocExpirationUpdateProcessorTest.test-seed#[FA5843C9B6C99326]) [    ] o.a.s.c.AbstractZkTestCase put C:\Users\JenkinsSlave\workspace\Lucene-Solr-5.x-Windows\solr\core\src\test-files\solr\collection1\conf\old_synonyms.txt to /configs/conf1/old_synonyms.txt
   [junit4]   2> 854355 INFO  (TEST-DistribDocExpirationUpdateProcessorTest.test-seed#[FA5843C9B6C99326]) [    ] o.a.s.c.c.SolrZkClient makePath: /configs/conf1/old_synonyms.txt
   [junit4]   2> 854356 INFO  (TEST-DistribDocExpirationUpdateProcessorTest.test-seed#[FA5843C9B6C99326]) [    ] o.a.s.c.AbstractZkTestCase put C:\Users\JenkinsSlave\workspace\Lucene-Solr-5.x-Windows\solr\core\src\test-files\solr\collection1\conf\synonyms.txt to /configs/conf1/synonyms.txt
   [junit4]   2> 854356 INFO  (TEST-DistribDocExpirationUpdateProcessorTest.test-seed#[FA5843C9B6C99326]) [    ] o.a.s.c.c.SolrZkClient makePath: /configs/conf1/synonyms.txt
   [junit4]   2> 854358 INFO  (TEST-DistribDocExpirationUpdateProcessorTest.test-seed#[FA5843C9B6C99326]) [    ] o.a.s.c.c.SolrZkClient Using default ZkCredentialsProvider
   [junit4]   2> 854359 INFO  (TEST-DistribDocExpirationUpdateProcessorTest.test-seed#[FA5843C9B6C99326]) [    ] o.a.s.c.c.ConnectionManager Waiting for client to connect to ZooKeeper
   [junit4]   2> 854361 INFO  (zkCallback-1390-thread-1) [    ] o.a.s.c.c.ConnectionManager Watcher org.apache.solr.common.cloud.ConnectionManager@156bff16 name:ZooKeeperConnection Watcher:127.0.0.1:64079/solr got event WatchedEvent state:SyncConnected type:None path:null path:null type:None
   [junit4]   2> 854361 INFO  (TEST-DistribDocExpirationUpdateProcessorTest.test-seed#[FA5843C9B6C99326]) [    ] o.a.s.c.c.ConnectionManager Client is connected to ZooKeeper
   [junit4]   2> 854361 INFO  (TEST-DistribDocExpirationUpdateProcessorTest.test-seed#[FA5843C9B6C99326]) [    ] o.a.s.c.c.SolrZkClient Using default ZkACLProvider
   [junit4]   2> 854693 INFO  (TEST-DistribDocExpirationUpdateProcessorTest.test-seed#[FA5843C9B6C99326]) [    ] o.a.s.SolrTestCaseJ4 Writing core.properties file to C:\Users\JenkinsSlave\workspace\Lucene-Solr-5.x-Windows\solr\build\solr-core\test\J1\temp\solr.cloud.DistribDocExpirationUpdateProcessorTest_FA5843C9B6C99326-001\control-001\cores\collection1
   [junit4]   2> 854695 INFO  (TEST-DistribDocExpirationUpdateProcessorTest.test-seed#[FA5843C9B6C99326]) [    ] o.e.j.s.Server jetty-9.2.13.v20150730
   [junit4]   2> 854702 INFO  (TEST-DistribDocExpirationUpdateProcessorTest.test-seed#[FA5843C9B6C99326]) [    ] o.e.j.s.h.ContextHandler Started o.e.j.s.ServletContextHandler@2b57f2fa{/,null,AVAILABLE}
   [junit4]   2> 854710 INFO  (TEST-DistribDocExpirationUpdateProcessorTest.test-seed#[FA5843C9B6C99326]) [    ] o.e.j.s.ServerConnector Started ServerConnector@219b6a35{SSL-http/1.1}{127.0.0.1:64089}
   [junit4]   2> 854711 INFO  (TEST-DistribDocExpirationUpdateProcessorTest.test-seed#[FA5843C9B6C99326]) [    ] o.e.j.s.Server Started @858317ms
   [junit4]   2> 854711 INFO  (TEST-DistribDocExpirationUpdateProcessorTest.test-seed#[FA5843C9B6C99326]) [    ] o.a.s.c.s.e.JettySolrRunner Jetty properties: {solr.data.dir=C:\Users\JenkinsSlave\workspace\Lucene-Solr-5.x-Windows\solr\build\solr-core\test\J1\temp\solr.cloud.DistribDocExpirationUpdateProcessorTest_FA5843C9B6C99326-001\tempDir-001/control/data, hostContext=/, hostPort=64089, coreRootDirectory=C:\Users\JenkinsSlave\workspace\Lucene-Solr-5.x-Windows\solr\build\solr-core\test\J1\temp\solr.cloud.DistribDocExpirationUpdateProcessorTest_FA5843C9B6C99326-001\control-001\cores}
   [junit4]   2> 854711 INFO  (TEST-DistribDocExpirationUpdateProcessorTest.test-seed#[FA5843C9B6C99326]) [    ] o.a.s.s.SolrDispatchFilter SolrDispatchFilter.init(): sun.misc.Launcher$AppClassLoader@73d16e93
   [junit4]   2> 854711 INFO  (TEST-DistribDocExpirationUpdateProcessorTest.test-seed#[FA5843C9B6C99326]) [    ] o.a.s.c.SolrResourceLoader new SolrResourceLoader for directory: 'C:\Users\JenkinsSlave\workspace\Lucene-Solr-5.x-Windows\solr\build\solr-core\test\J1\temp\solr.cloud.DistribDocExpirationUpdateProcessorTest_FA5843C9B6C99326-001\control-001'
   [junit4]   2> 854711 INFO  (TEST-DistribDocExpirationUpdateProcessorTest.test-seed#[FA5843C9B6C99326]) [    ] o.a.s.c.SolrResourceLoader JNDI not configured for solr (NoInitialContextEx)
   [junit4]   2> 854711 INFO  (TEST-DistribDocExpirationUpdateProcessorTest.test-seed#[FA5843C9B6C99326]) [    ] o.a.s.c.SolrResourceLoader solr home defaulted to 'solr/' (could not find system property or JNDI)
   [junit4]   2> 854711 INFO  (TEST-DistribDocExpirationUpdateProcessorTest.test-seed#[FA5843C9B6C99326]) [    ] o.a.s.c.c.SolrZkClient Using default ZkCredentialsProvider
   [junit4]   2> 854712 INFO  (TEST-DistribDocExpirationUpdateProcessorTest.test-seed#[FA5843C9B6C99326]) [    ] o.a.s.c.c.ConnectionManager Waiting for client to connect to ZooKeeper
   [junit4]   2> 854714 INFO  (zkCallback-1391-thread-1) [    ] o.a.s.c.c.ConnectionManager Watcher org.apache.solr.common.cloud.ConnectionManager@71af583c name:ZooKeeperConnection Watcher:127.0.0.1:64079/solr got event WatchedEvent state:SyncConnected type:None path:null path:null type:None
   [junit4]   2> 854714 INFO  (TEST-DistribDocExpirationUpdateProcessorTest.test-seed#[FA5843C9B6C99326]) [    ] o.a.s.c.c.ConnectionManager Client is connected to ZooKeeper
   [junit4]   2> 854714 INFO  (TEST-DistribDocExpirationUpdateProcessorTest.test-seed#[FA5843C9B6C99326]) [    ] o.a.s.c.c.SolrZkClient Using default ZkACLProvider
   [junit4]   2> 854715 INFO  (TEST-DistribDocExpirationUpdateProcessorTest.test-seed#[FA5843C9B6C99326]) [    ] o.a.s.s.SolrDispatchFilter Loading solr.xml from SolrHome (not found in ZooKeeper)
   [junit4]   2> 854716 INFO  (TEST-DistribDocExpirationUpdateProcessorTest.test-seed#[FA5843C9B6C99326]) [    ] o.a.s.c.SolrXmlConfig Loading container configuration from C:\Users\JenkinsSlave\workspace\Lucene-Solr-5.x-Windows\solr\build\solr-core\test\J1\temp\solr.cloud.DistribDocExpirationUpdateProcessorTest_FA5843C9B6C99326-001\control-001\solr.xml
   [junit4]   2> 854725 INFO  (TEST-DistribDocExpirationUpdateProcessorTest.test-seed#[FA5843C9B6C99326]) [    ] o.a.s.c.CorePropertiesLocator Config-defined core root directory: C:\Users\JenkinsSlave\workspace\Lucene-Solr-5.x-Windows\solr\build\solr-core\test\J1\temp\solr.cloud.DistribDocExpirationUpdateProcessorTest_FA5843C9B6C99326-001\control-001\cores
   [junit4]   2> 854725 INFO  (TEST-DistribDocExpirationUpdateProcessorTest.test-seed#[FA5843C9B6C99326]) [    ] o.a.s.c.CoreContainer New CoreContainer 199032039
   [junit4]   2> 854725 INFO  (TEST-DistribDocExpirationUpdateProcessorTest.test-seed#[FA5843C9B6C99326]) [    ] o.a.s.c.CoreContainer Loading cores into CoreContainer [instanceDir=C:\Users\JenkinsSlave\workspace\Lucene-Solr-5.x-Windows\solr\build\solr-core\test\J1\temp\solr.cloud.DistribDocExpirationUpdateProcessorTest_FA5843C9B6C99326-001\control-001]
   [junit4]   2> 854725 WARN  (TEST-DistribDocExpirationUpdateProcessorTest.test-seed#[FA5843C9B6C99326]) [    ] o.a.s.c.CoreContainer Couldn't add files from C:\Users\JenkinsSlave\workspace\Lucene-Solr-5.x-Windows\solr\build\solr-core\test\J1\temp\solr.cloud.DistribDocExpirationUpdateProcessorTest_FA5843C9B6C99326-001\control-001\lib to classpath: C:\Users\JenkinsSlave\workspace\Lucene-Solr-5.x-Windows\solr\build\solr-core\test\J1\temp\solr.cloud.DistribDocExpirationUpdateProcessorTest_FA5843C9B6C99326-001\control-001\lib
   [junit4]   2> 854725 INFO  (TEST-DistribDocExpirationUpdateProcessorTest.test-seed#[FA5843C9B6C99326]) [    ] o.a.s.h.c.HttpShardHandlerFactory created with socketTimeout : 90000,urlScheme : ,connTimeout : 15000,maxConnectionsPerHost : 20,maxConnections : 10000,corePoolSize : 0,maximumPoolSize : 2147483647,maxThreadIdleTime : 5,sizeOfQueue : -1,fairnessPolicy : false,useRetries : false,
   [junit4]   2> 854729 INFO  (TEST-DistribDocExpirationUpdateProcessorTest.test-seed#[FA5843C9B6C99326]) [    ] o.a.s.u.UpdateShardHandler Creating UpdateShardHandler HTTP client with params: socketTimeout=340000&connTimeout=45000&retry=true
   [junit4]   2> 854732 INFO  (TEST-DistribDocExpirationUpdateProcessorTest.test-seed#[FA5843C9B6C99326]) [    ] o.a.s.l.LogWatcher SLF4J impl is org.slf4j.impl.Log4jLoggerFactory
   [junit4]   2> 854732 INFO  (TEST-DistribDocExpirationUpdateProcessorTest.test-seed#[FA5843C9B6C99326]) [    ] o.a.s.l.LogWatcher Registering Log Listener [Log4j (org.slf4j.impl.Log4jLoggerFactory)]
   [junit4]   2> 854732 INFO  (TEST-DistribDocExpirationUpdateProcessorTest.test-seed#[FA5843C9B6C99326]) [    ] o.a.s.c.ZkContainer Zookeeper client=127.0.0.1:64079/solr
   [junit4]   2> 854732 INFO  (TEST-DistribDocExpirationUpdateProcessorTest.test-seed#[FA5843C9B6C99326]) [    ] o.a.s.c.ZkController zkHost includes chroot
   [junit4]   2> 854732 INFO  (TEST-DistribDocExpirationUpdateProcessorTest.test-seed#[FA5843C9B6C99326]) [    ] o.a.s.c.c.SolrZkClient Using default ZkCredentialsProvider
   [junit4]   2> 854733 INFO  (TEST-DistribDocExpirationUpdateProcessorTest.test-seed#[FA5843C9B6C99326]) [    ] o.a.s.c.c.ConnectionManager Waiting for client to connect to ZooKeeper
   [junit4]   2> 854734 INFO  (zkCallback-1394-thread-1) [    ] o.a.s.c.c.ConnectionManager Watcher org.apache.solr.common.cloud.ConnectionManager@4a19e298 name:ZooKeeperConnection Watcher:127.0.0.1:64079 got event WatchedEvent state:SyncConnected type:None path:null path:null type:None
   [junit4]   2> 854735 INFO  (TEST-DistribDocExpirationUpdateProcessorTest.test-seed#[FA5843C9B6C99326]) [    ] o.a.s.c.c.ConnectionManager Client is connected to ZooKeeper
   [junit4]   2> 854735 INFO  (TEST-DistribDocExpirationUpdateProcessorTest.test-seed#[FA5843C9B6C99326]) [    ] o.a.s.c.c.SolrZkClient Using default ZkACLProvider
   [junit4]   2> 854738 INFO  (TEST-DistribDocExpirationUpdateProcessorTest.test-seed#[FA5843C9B6C99326]) [n:127.0.0.1:64089_    ] o.a.s.c.c.ConnectionManager Waiting for client to connect to ZooKeeper
   [junit4]   2> 854740 INFO  (zkCallback-1395-thread-1-processing-n:127.0.0.1:64089_) [n:127.0.0.1:64089_    ] o.a.s.c.c.ConnectionManager Watcher org.apache.solr.common.cloud.ConnectionManager@917bccb name:ZooKeeperConnection Watcher:127.0.0.1:64079/solr got event WatchedEvent state:SyncConnected type:None path:null path:null type:None
   [junit4]   2> 854740 INFO  (TEST-DistribDocExpirationUpdateProcessorTest.test-seed#[FA5843C9B6C99326]) [n:127.0.0.1:64089_    ] o.a.s.c.c.ConnectionManager Client is connected to ZooKeeper
   [junit4]   2> 854741 INFO  (TEST-DistribDocExpirationUpdateProcessorTest.test-seed#[FA5843C9B6C99326]) [n:127.0.0.1:64089_    ] o.a.s.c.c.SolrZkClient makePath: /overseer/queue
   [junit4]   2> 854744 INFO  (TEST-DistribDocExpirationUpdateProcessorTest.test-seed#[FA5843C9B6C99326]) [n:127.0.0.1:64089_    ] o.a.s.c.c.SolrZkClient makePath: /overseer/collection-queue-work
   [junit4]   2> 854746 INFO  (TEST-DistribDocExpirationUpdateProcessorTest.test-seed#[FA5843C9B6C99326]) [n:127.0.0.1:64089_    ] o.a.s.c.c.SolrZkClient makePath: /overseer/collection-map-running
   [junit4]   2> 854748 INFO  (TEST-DistribDocExpirationUpdateProcessorTest.test-seed#[FA5843C9B6C99326]) [n:127.0.0.1:64089_    ] o.a.s.c.c.SolrZkClient makePath: /overseer/collection-map-completed
   [junit4]   2> 854749 INFO  (TEST-DistribDocExpirationUpdateProcessorTest.test-seed#[FA5843C9B6C99326]) [n:127.0.0.1:64089_    ] o.a.s.c.c.SolrZkClient makePath: /overseer/collection-map-failure
   [junit4]   2> 854751 INFO  (TEST-DistribDocExpirationUpdateProcessorTest.test-seed#[FA5843C9B6C99326]) [n:127.0.0.1:64089_    ] o.a.s.c.c.SolrZkClient makePath: /live_nodes
   [junit4]   2> 854753 INFO  (TEST-DistribDocExpirationUpdateProcessorTest.test-seed#[FA5843C9B6C99326]) [n:127.0.0.1:64089_    ] o.a.s.c.c.SolrZkClient makePath: /aliases.json
   [junit4]   2> 854753 INFO  (TEST-DistribDocExpirationUpdateProcessorTest.test-seed#[FA5843C9B6C99326]) [n:127.0.0.1:64089_    ] o.a.s.c.c.SolrZkClient makePath: /clusterstate.json
   [junit4]   2> 854754 INFO  (TEST-DistribDocExpirationUpdateProcessorTest.test-seed#[FA5843C9B6C99326]) [n:127.0.0.1:64089_    ] o.a.s.c.c.SolrZkClient makePath: /security.json
   [junit4]   2> 854755 INFO  (TEST-DistribDocExpirationUpdateProcessorTest.test-seed#[FA5843C9B6C99326]) [n:127.0.0.1:64089_    ] o.a.s.c.ZkController Register node as live in ZooKeeper:/live_nodes/127.0.0.1:64089_
   [junit4]   2> 854755 INFO  (TEST-DistribDocExpirationUpdateProcessorTest.test-seed#[FA5843C9B6C99326]) [n:127.0.0.1:64089_    ] o.a.s.c.c.SolrZkClient makePath: /live_nodes/127.0.0.1:64089_
   [junit4]   2> 854757 INFO  (TEST-DistribDocExpirationUpdateProcessorTest.test-seed#[FA5843C9B6C99326]) [n:127.0.0.1:64089_    ] o.a.s.c.c.SolrZkClient makePath: /overseer_elect
   [junit4]   2> 854758 INFO  (TEST-DistribDocExpirationUpdateProcessorTest.test-seed#[FA5843C9B6C99326]) [n:127.0.0.1:64089_    ] o.a.s.c.c.SolrZkClient makePath: /overseer_elect/election
   [junit4]   2> 854759 INFO  (TEST-DistribDocExpirationUpdateProcessorTest.test-seed#[FA5843C9B6C99326]) [n:127.0.0.1:64089_    ] o.a.s.c.Overseer Overseer (id=null) closing
   [junit4]   2> 854760 INFO  (TEST-DistribDocExpirationUpdateProcessorTest.test-seed#[FA5843C9B6C99326]) [n:127.0.0.1:64089_    ] o.a.s.c.LeaderElector Joined leadership election with path: /overseer_elect/election/95346062328791045-127.0.0.1:64089_-n_0000000000
   [junit4]   2> 854760 INFO  (TEST-DistribDocExpirationUpdateProcessorTest.test-seed#[FA5843C9B6C99326]) [n:127.0.0.1:64089_    ] o.a.s.c.OverseerElectionContext I am going to be the leader 127.0.0.1:64089_
   [junit4]   2> 854760 INFO  (TEST-DistribDocExpirationUpdateProcessorTest.test-seed#[FA5843C9B6C99326]) [n:127.0.0.1:64089_    ] o.a.s.c.c.SolrZkClient makePath: /overseer_elect/leader
   [junit4]   2> 854761 INFO  (TEST-DistribDocExpirationUpdateProcessorTest.test-seed#[FA5843C9B6C99326]) [n:127.0.0.1:64089_    ] o.a.s.c.Overseer Overseer (id=95346062328791045-127.0.0.1:64089_-n_0000000000) starting
   [junit4]   2> 854763 INFO  (TEST-DistribDocExpirationUpdateProcessorTest.test-seed#[FA5843C9B6C99326]) [n:127.0.0.1:64089_    ] o.a.s.c.c.SolrZkClient makePath: /overseer/queue-work
   [junit4]   2> 854768 INFO  (TEST-DistribDocExpirationUpdateProcessorTest.test-seed#[FA5843C9B6C99326]) [n:127.0.0.1:64089_    ] o.a.s.c.OverseerAutoReplicaFailoverThread Starting OverseerAutoReplicaFailoverThread autoReplicaFailoverWorkLoopDelay=10000 autoReplicaFailoverWaitAfterExpiration=30000 autoReplicaFailoverBadNodeExpiration=60000
   [junit4]   2> 854769 INFO  (TEST-DistribDocExpirationUpdateProcessorTest.test-seed#[FA5843C9B6C99326]) [n:127.0.0.1:64089_    ] o.a.s.c.c.ZkStateReader Updating cluster state from ZooKeeper... 
   [junit4]   2> 854769 INFO  (OverseerCollectionConfigSetProcessor-95346062328791045-127.0.0.1:64089_-n_0000000000) [n:127.0.0.1:64089_    ] o.a.s.c.OverseerTaskProcessor Process current queue of overseer operations
   [junit4]   2> 854769 INFO  (OverseerStateUpdate-95346062328791045-127.0.0.1:64089_-n_0000000000) [n:127.0.0.1:64089_    ] o.a.s.c.Overseer Starting to work on the main queue
   [junit4]   2> 854778 INFO  (TEST-DistribDocExpirationUpdateProcessorTest.test-seed#[FA5843C9B6C99326]) [n:127.0.0.1:64089_    ] o.a.s.c.CoreContainer Security conf doesn't exist. Skipping setup for authorization module.
   [junit4]   2> 854778 INFO  (TEST-DistribDocExpirationUpdateProcessorTest.test-seed#[FA5843C9B6C99326]) [n:127.0.0.1:64089_    ] o.a.s.c.CoreContainer No authentication plugin used.
   [junit4]   2> 854778 INFO  (TEST-DistribDocExpirationUpdateProcessorTest.test-seed#[FA5843C9B6C99326]) [n:127.0.0.1:64089_    ] o.a.s.c.CorePropertiesLocator Looking for core definitions underneath C:\Users\JenkinsSlave\workspace\Lucene-Solr-5.x-Windows\solr\build\solr-core\test\J1\temp\solr.cloud.DistribDocExpirationUpdateProcessorTest_FA5843C9B6C99326-001\control-001\cores
   [junit4]   2> 854780 INFO  (TEST-DistribDocExpirationUpdateProcessorTest.test-seed#[FA5843C9B6C99326]) [n:127.0.0.1:64089_    ] o.a.s.c.CoreDescriptor Created CoreDescriptor: {name=collection1, config=solrconfig.xml, transient=false, schema=schema.xml, loadOnStartup=true, configSetProperties=configsetprops.json, collection=control_collection, coreNodeName=, dataDir=data\, shard=}
   [junit4]   2> 854780 INFO  (TEST-DistribDocExpirationUpdateProcessorTest.test-seed#[FA5843C9B6C99326]) [n:127.0.0.1:64089_    ] o.a.s.c.CorePropertiesLocator Found core collection1 in C:\Users\JenkinsSlave\workspace\Lucene-Solr-5.x-Windows\solr\build\solr-core\test\J1\temp\solr.cloud.DistribDocExpirationUpdateProcessorTest_FA5843C9B6C99326-001\control-001\cores\collection1
   [junit4]   2> 854780 INFO  (TEST-DistribDocExpirationUpdateProcessorTest.test-seed#[FA5843C9B6C99326]) [n:127.0.0.1:64089_    ] o.a.s.c.CorePropertiesLocator Found 1 core definitions
   [junit4]   2> 854781 INFO  (TEST-DistribDocExpirationUpdateProcessorTest.test-seed#[FA5843C9B6C99326]) [n:127.0.0.1:64089_    ] o.a.s.s.SolrDispatchFilter user.dir=C:\Users\JenkinsSlave\workspace\Lucene-Solr-5.x-Windows\solr\build\solr-core\test\J1
   [junit4]   2> 854781 INFO  (TEST-DistribDocExpirationUpdateProcessorTest.test-seed#[FA5843C9B6C99326]) [n:127.0.0.1:64089_    ] o.a.s.s.SolrDispatchFilter SolrDispatchFilter.init() done
   [junit4]   2> 854781 INFO  (coreLoadExecutor-3956-thread-1-processing-n:127.0.0.1:64089_) [n:127.0.0.1:64089_ c:control_collection   x:collection1] o.a.s.c.ZkController publishing state=down
   [junit4]   2> 854781 INFO  (coreLoadExecutor-3956-thread-1-processing-n:127.0.0.1:64089_) [n:127.0.0.1:64089_ c:control_collection   x:collection1] o.a.s.c.ZkController numShards not found on descriptor - reading it from system property
   [junit4]   2> 854783 INFO  (OverseerStateUpdate-95346062328791045-127.0.0.1:64089_-n_0000000000) [n:127.0.0.1:64089_    ] o.a.s.c.Overseer processMessage: queueSize: 1, message = {
   [junit4]   2>   "core":"collection1",
   [junit4]   2>   "roles":null,
   [junit4]   2>   "base_url":"https://127.0.0.1:64089",
   [junit4]   2>   "node_name":"127.0.0.1:64089_",
   [junit4]   2>   "numShards":"1",
   [junit4]   2>   "state":"down",
   [junit4]   2>   "shard":null,
   [junit4]   2>   "collection":"control_collection",
   [junit4]   2>   "operation":"state"} current state version: 0
   [junit4]   2> 854783 INFO  (coreLoadExecutor-3956-thread-1-processing-n:127.0.0.1:64089_) [n:127.0.0.1:64089_ c:control_collection   x:collection1] o.a.s.c.ZkController look for our core node name
   [junit4]   2> 854783 INFO  (OverseerStateUpdate-95346062328791045-127.0.0.1:64089_-n_0000000000) [n:127.0.0.1:64089_    ] o.a.s.c.o.ReplicaMutator Update state numShards=1 message={
   [junit4]   2>   "core":"collection1",
   [junit4]   2>   "roles":null,
   [junit4]   2>   "base_url":"https://127.0.0.1:64089",
   [junit4]   2>   "node_name":"127.0.0.1:64089_",
   [junit4]   2>   "numShards":"1",
   [junit4]   2>   "state":"down",
   [junit4]   2>   "shard":null,
   [junit4]   2>   "collection":"control_collection",
   [junit4]   2>   "operation":"state"}
   [junit4]   2> 854784 INFO  (OverseerStateUpdate-95346062328791045-127.0.0.1:64089_-n_0000000000) [n:127.0.0.1:64089_    ] o.a.s.c.o.ClusterStateMutator building a new cName: control_collection
   [junit4]   2> 854784 INFO  (OverseerStateUpdate-95346062328791045-127.0.0.1:64089_-n_0000000000) [n:127.0.0.1:64089_    ] o.a.s.c.o.ReplicaMutator Assigning new node to shard shard=shard1
   [junit4]   2> 854785 INFO  (zkCallback-1395-thread-1-processing-n:127.0.0.1:64089_) [n:127.0.0.1:64089_    ] o.a.s.c.c.ZkStateReader A cluster state change: [WatchedEvent state:SyncConnected type:NodeDataChanged path:/clusterstate.json], has occurred - updating... (live nodes size: [1])
   [junit4]   2> 855783 INFO  (coreLoadExecutor-3956-thread-1-processing-n:127.0.0.1:64089_) [n:127.0.0.1:64089_ c:control_collection   x:collection1] o.a.s.c.ZkController waiting to find shard id in clusterstate for collection1
   [junit4]   2> 855783 INFO  (coreLoadExecutor-3956-thread-1-processing-n:127.0.0.1:64089_) [n:127.0.0.1:64089_ c:control_collection   x:collection1] o.a.s.c.ZkController Check for collection zkNode:control_collection
   [junit4]   2> 855783 INFO  (coreLoadExecutor-3956-thread-1-processing-n:127.0.0.1:64089_) [n:127.0.0.1:64089_ c:control_collection   x:collection1] o.a.s.c.ZkController Collection zkNode exists
   [junit4]   2> 855783 INFO  (coreLoadExecutor-3956-thread-1-processing-n:127.0.0.1:64089_) [n:127.0.0.1:64089_ c:control_collection   x:collection1] o.a.s.c.c.ZkStateReader Load collection config from: [/collections/control_collection]
   [junit4]   2> 855784 INFO  (coreLoadExecutor-3956-thread-1-processing-n:127.0.0.1:64089_) [n:127.0.0.1:64089_ c:control_collection   x:collection1] o.a.s.c.c.ZkStateReader path=[/collections/control_collection] [configName]=[conf1] specified config exists in ZooKeeper
   [junit4]   2> 855784 INFO  (coreLoadExecutor-3956-thread-1-processing-n:127.0.0.1:64089_) [n:127.0.0.1:64089_ c:control_collection   x:collection1] o.a.s.c.SolrResourceLoader new SolrResourceLoader for directory: 'C:\Users\JenkinsSlave\workspace\Lucene-Solr-5.x-Windows\solr\build\solr-core\test\J1\temp\solr.cloud.DistribDocExpirationUpdateProcessorTest_FA5843C9B6C99326-001\control-001\cores\collection1'
   [junit4]   2> 855784 INFO  (coreLoadExecutor-3956-thread-1-processing-n:127.0.0.1:64089_) [n:127.0.0.1:64089_ c:control_collection   x:collection1] o.a.s.c.SolrResourceLoader JNDI not configured for solr (NoInitialContextEx)
   [junit4]   2> 855784 INFO  (coreLoadExecutor-3956-thread-1-processing-n:127.0.0.1:64089_) [n:127.0.0.1:64089_ c:control_collection   x:collection1] o.a.s.c.SolrResourceLoader solr home defaulted to 'solr/' (could not find system property or JNDI)
   [junit4]   2> 855786 INFO  (coreLoadExecutor-3956-thread-1-processing-n:127.0.0.1:64089_) [n:127.0.0.1:64089_ c:control_collection   x:collection1] o.a.s.c.Config loaded config solrconfig.xml with version 0 
   [junit4]   2> 855793 INFO  (coreLoadExecutor-3956-thread-1-processing-n:127.0.0.1:64089_) [n:127.0.0.1:64089_ c:control_collection   x:collection1] o.a.s.c.SolrConfig current version of requestparams : -1
   [junit4]   2> 855795 INFO  (coreLoadExecutor-3956-thread-1-processing-n:127.0.0.1:64089_) [n:127.0.0.1:64089_ c:control_collection   x:collection1] o.a.s.c.SolrConfig Using Lucene MatchVersion: 5.5.0
   [junit4]   2> 855797 INFO  (coreLoadExecutor-3956-thread-1-processing-n:127.0.0.1:64089_) [n:127.0.0.1:64089_ c:control_collection   x:collection1] o.a.s.c.SolrConfig Loaded SolrConfig: solrconfig.xml
   [junit4]   2> 855803 INFO  (coreLoadExecutor-3956-thread-1-processing-n:127.0.0.1:64089_) [n:127.0.0.1:64089_ c:control_collection   x:collection1] o.a.s.s.IndexSchema [collection1] Schema name=test
   [junit4]   2> 855873 INFO  (coreLoadExecutor-3956-thread-1-processing-n:127.0.0.1:64089_) [n:127.0.0.1:64089_ c:control_collection   x:collection1] o.a.s.s.IndexSchema default search field in schema is text
   [junit4]   2> 855874 INFO  (coreLoadExecutor-3956-thread-1-processing-n:127.0.0.1:64089_) [n:127.0.0.1:64089_ c:control_collection   x:collection1] o.a.s.s.IndexSchema unique key field: id
   [junit4]   2> 855874 INFO  (coreLoadExecutor-3956-thread-1-processing-n:127.0.0.1:64089_) [n:127.0.0.1:64089_ c:control_collection   x:collection1] o.a.s.s.FileExchangeRateProvider Reloading exchange rates from file currency.xml
   [junit4]   2> 855877 INFO  (coreLoadExecutor-3956-thread-1-processing-n:127.0.0.1:64089_) [n:127.0.0.1:64089_ c:control_collection   x:collection1] o.a.s.s.FileExchangeRateProvider Reloading exchange rates from file currency.xml
   [junit4]   2> 855896 INFO  (coreLoadExecutor-3956-thread-1-processing-n:127.0.0.1:64089_) [n:127.0.0.1:64089_ c:control_collection   x:collection1] o.a.s.c.ConfigSetProperties Did not find ConfigSet properties, assuming default properties: Can't find resource 'configsetprops.json' in classpath or '/configs/conf1', cwd=C:\Users\JenkinsSlave\workspace\Lucene-Solr-5.x-Windows\solr\build\solr-core\test\J1
   [junit4]   2> 855896 INFO  (coreLoadExecutor-3956-thread-1-processing-n:127.0.0.1:64089_) [n:127.0.0.1:64089_ c:control_collection   x:collection1] o.a.s.c.CoreContainer Creating SolrCore 'collection1' using configuration from collection control_collection
   [junit4]   2> 855897 INFO  (coreLoadExecutor-3956-thread-1-processing-n:127.0.0.1:64089_) [n:127.0.0.1:64089_ c:control_collection s:shard1 r:core_node1 x:collection1] o.a.s.c.SolrCore org.apache.solr.core.MockDirectoryFactory
   [junit4]   2> 855897 INFO  (coreLoadExecutor-3956-thread-1-processing-n:127.0.0.1:64089_) [n:127.0.0.1:64089_ c:control_collection s:shard1 r:core_node1 x:collection1] o.a.s.c.SolrCore [[collection1] ] Opening new SolrCore at [C:\Users\JenkinsSlave\workspace\Lucene-Solr-5.x-Windows\solr\build\solr-core\test\J1\temp\solr.cloud.DistribDocExpirationUpdateProcessorTest_FA5843C9B6C99326-001\control-001\cores\collection1], dataDir=[C:\Users\JenkinsSlave\workspace\Lucene-Solr-5.x-Windows\solr\build\solr-core\test\J1\temp\solr.cloud.DistribDocExpirationUpdateProcessorTest_FA5843C9B6C99326-001\control-001\cores\collection1\data\]
   [junit4]   2> 855897 INFO  (coreLoadExecutor-3956-thread-1-processing-n:127.0.0.1:64089_) [n:127.0.0.1:64089_ c:control_collection s:shard1 r:core_node1 x:collection1] o.a.s.c.SolrCore JMX monitoring not detected for core: collection1
   [junit4]   2> 855897 INFO  (coreLoadExecutor-3956-thread-1-processing-n:127.0.0.1:64089_) [n:127.0.0.1:64089_ c:control_collection s:shard1 r:core_node1 x:collection1] o.a.s.c.CachingDirectoryFactory return new directory for C:\Users\JenkinsSlave\workspace\Lucene-Solr-5.x-Windows\solr\build\solr-core\test\J1\temp\solr.cloud.DistribDocExpirationUpdateProcessorTest_FA5843C9B6C99326-001\control-001\cores\collection1\data\
   [junit4]   2> 855897 INFO  (coreLoadExecutor-3956-thread-1-processing-n:127.0.0.1:64089_) [n:127.0.0.1:64089_ c:control_collection s:shard1 r:core_node1 x:collection1] o.a.s.c.SolrCore New index directory detected: old=null new=C:\Users\JenkinsSlave\workspace\Lucene-Solr-5.x-Windows\solr\build\solr-core\test\J1\temp\solr.cloud.DistribDocExpirationUpdateProcessorTest_FA5843C9B6C99326-001\control-001\cores\collection1\data\index/
   [junit4]   2> 855897 WARN  (coreLoadExecutor-3956-thread-1-processing-n:127.0.0.1:64089_) [n:127.0.0.1:64089_ c:control_collection s:shard1 r:core_node1 x:collection1] o.a.s.c.SolrCore [collection1] Solr index directory 'C:\Users\JenkinsSlave\workspace\Lucene-Solr-5.x-Windows\solr\build\solr-core\test\J1\temp\solr.cloud.DistribDocExpirationUpdateProcessorTest_FA5843C9B6C99326-001\control-001\cores\collection1\data\index' doesn't exist. Creating new index...
   [junit4]   2> 855897 INFO  (coreLoadExecutor-3956-thread-1-processing-n:127.0.0.1:64089_) [n:127.0.0.1:64089_ c:control_collection s:shard1 r:core_node1 x:collection1] o.a.s.c.CachingDirectoryFactory return new directory for C:\Users\JenkinsSlave\workspace\Lucene-Solr-5.x-Windows\solr\build\solr-core\test\J1\temp\solr.cloud.DistribDocExpirationUpdateProcessorTest_FA5843C9B6C99326-001\control-001\cores\collection1\data\index
   [junit4]   2> 855897 INFO  (coreLoadExecutor-3956-thread-1-processing-n:127.0.0.1:64089_) [n:127.0.0.1:64089_ c:control_collection s:shard1 r:core_node1 x:collection1] o.a.s.u.RandomMergePolicy RandomMergePolicy wrapping class org.apache.lucene.index.TieredMergePolicy: [TieredMergePolicy: maxMergeAtOnce=50, maxMergeAtOnceExplicit=15, maxMergedSegmentMB=46.46484375, floorSegmentMB=0.3291015625, forceMergeDeletesPctAllowed=16.430319167075645, segmentsPerTier=18.0, maxCFSSegmentSizeMB=8.796093022207999E12, noCFSRatio=1.0
   [junit4]   2> 855898 INFO  (coreLoadExecutor-3956-thread-1-processing-n:127.0.0.1:64089_) [n:127.0.0.1:64089_ c:control_collection s:shard1 r:core_node1 x:collection1] o.a.s.c.SolrDeletionPolicy SolrDeletionPolicy.onCommit: commits: num=1
   [junit4]   2> 	commit{dir=MockDirectoryWrapper(RAMDirectory@847a321 lockFactory=org.apache.lucene.store.SingleInstanceLockFactory@556fbcae),segFN=segments_1,generation=1}
   [junit4]   2> 855898 INFO  (coreLoadExecutor-3956-thread-1-processing-n:127.0.0.1:64089_) [n:127.0.0.1:64089_ c:control_collection s:shard1 r:core_node1 x:collection1] o.a.s.c.SolrDeletionPolicy newest commit generation = 1
   [junit4]   2> 855898 INFO  (OldIndexDirectoryCleanupThreadForCore-collection1) [n:127.0.0.1:64089_ c:control_collection s:shard1 r:core_node1 x:collection1] o.a.s.c.SolrCore Looking for old index directories to cleanup for core collection1 in C:\Users\JenkinsSlave\workspace\Lucene-Solr-5.x-Windows\solr\build\solr-core\test\J1\temp\solr.cloud.DistribDocExpirationUpdateProcessorTest_FA5843C9B6C99326-001\control-001\cores\collection1\data\
   [junit4]   2> 855899 WARN  (OldIndexDirectoryCleanupThreadForCore-collection1) [n:127.0.0.1:64089_ c:control_collection s:shard1 r:core_node1 x:collection1] o.a.s.c.DirectoryFactory C:\Users\JenkinsSlave\workspace\Lucene-Solr-5.x-Windows\solr\build\solr-core\test\J1\temp\solr.cloud.DistribDocExpirationUpdateProcessorTest_FA5843C9B6C99326-001\control-001\cores\collection1\data\ does not point to a valid data directory; skipping clean-up of old index directories.
   [junit4]   2> 855899 INFO  (coreLoadExecutor-3956-thread-1-processing-n:127.0.0.1:64089_) [n:127.0.0.1:64089_ c:control_collection s:shard1 r:core_node1 x:collection1] o.a.s.u.p.UpdateRequestProcessorChain creating updateRequestProcessorChain "convert-ttl-defaults"
   [junit4]   2> 855924 INFO  (coreLoadExecutor-3956-thread-1-processing-n:127.0.0.1:64089_) [n:127.0.0.1:64089_ c:control_collection s:shard1 r:core_node1 x:collection1] o.a.s.u.p.UpdateRequestProcessorChain creating updateRequestProcessorChain "convert-ttl-field"
   [junit4]   2> 855924 INFO  (coreLoadExecutor-3956-thread-1-processing-n:127.0.0.1:64089_) [n:127.0.0.1:64089_ c:control_collection s:shard1 r:core_node1 x:collection1] o.a.s.u.p.UpdateRequestProcessorChain creating updateRequestProcessorChain "convert-ttl-param"
   [junit4]   2> 855924 INFO  (coreLoadExecutor-3956-thread-1-processing-n:127.0.0.1:64089_) [n:127.0.0.1:64089_ c:control_collection s:shard1 r:core_node1 x:collection1] o.a.s.u.p.UpdateRequestProcessorChain creating updateRequestProcessorChain "convert-ttl-field-with-param-default"
   [junit4]   2> 855924 INFO  (coreLoadExecutor-3956-thread-1-processing-n:127.0.0.1:64089_) [n:127.0.0.1:64089_ c:control_collection s:shard1 r:core_node1 x:collection1] o.a.s.u.p.UpdateRequestProcessorChain creating updateRequestProcessorChain "scheduled-delete" (default)
   [junit4]   2> 855978 INFO  (coreLoadExecutor-3956-thread-1-processing-n:127.0.0.1:64089_) [n:127.0.0.1:64089_ c:control_collection s:shard1 r:core_node1 x:collection1] o.a.s.u.p.UpdateRequestProcessorChain inserting DistributedUpdateProcessorFactory into updateRequestProcessorChain "scheduled-delete" (default)
   [junit4]   2> 855981 INFO  (coreLoadExecutor-3956-thread-1-processing-n:127.0.0.1:64089_) [n:127.0.0.1:64089_ c:control_collection s:shard1 r:core_node1 x:collection1] o.a.s.h.l.XMLLoader xsltCacheLifetimeSeconds=60
   [junit4]   2> 855982 INFO  (coreLoadExecutor-3956-thread-1-processing-n:127.0.0.1:64089_) [n:127.0.0.1:64089_ c:control_collection s:shard1 r:core_node1 x:collection1] o.a.s.h.l.XMLLoader xsltCacheLifetimeSeconds=60
   [junit4]   2> 855983 INFO  (coreLoadExecutor-3956-thread-1-processing-n:127.0.0.1:64089_) [n:127.0.0.1:64089_ c:control_collection s:shard1 r:core_node1 x:collection1] o.a.s.h.l.XMLLoader xsltCacheLifetimeSeconds=60
   [junit4]   2> 855983 INFO  (coreLoadExecutor-3956-thread-1-processing-n:127.0.0.1:64089_) [n:127.0.0.1:64089_ c:control_collection s:shard1 r:core_node1 x:collection1] o.a.s.h.l.XMLLoader xsltCacheLifetimeSeconds=60
   [junit4]   2> 855985 INFO  (coreLoadExecutor-3956-thread-1-processing-n:127.0.0.1:64089_) [n:127.0.0.1:64089_ c:control_collection s:shard1 r:core_node1 x:collection1] o.a.s.c.RequestHandlers Registered paths: /admin/mbeans,,/update/csv,/update/json/docs,/admin/luke,/select,/admin/segments,/get,/admin/system,/replication,/admin/properties,/config,/schema,/admin/plugins,/admin/logging,/update/json,/admin/threads,/admin/ping,/update,/admin/file
   [junit4]   2> 855985 INFO  (coreLoadExecutor-3956-thread-1-processing-n:127.0.0.1:64089_) [n:127.0.0.1:64089_ c:control_collection s:shard1 r:core_node1 x:collection1] o.a.s.c.SolrCore Using default statsCache cache: org.apache.solr.search.stats.LocalStatsCache
   [junit4]   2> 855986 INFO  (coreLoadExecutor-3956-thread-1-processing-n:127.0.0.1:64089_) [n:127.0.0.1:64089_ c:control_collection s:shard1 r:core_node1 x:collection1] o.a.s.u.UpdateHandler Using UpdateLog implementation: org.apache.solr.update.UpdateLog
   [junit4]   2> 855986 INFO  (coreLoadExecutor-3956-thread-1-processing-n:127.0.0.1:64089_) [n:127.0.0.1:64089_ c:control_collection s:shard1 r:core_node1 x:collection1] o.a.s.u.UpdateLog Initializing UpdateLog: dataDir= defaultSyncLevel=FLUSH numRecordsToKeep=100 maxNumLogsToKeep=10 numVersionBuckets=65536
   [junit4]   2> 855987 INFO  (coreLoadExecutor-3956-thread-1-processing-n:127.0.0.1:64089_) [n:127.0.0.1:64089_ c:control_collection s:shard1 r:core_node1 x:collection1] o.a.s.u.CommitTracker Hard AutoCommit: disabled
   [junit4]   2> 855987 INFO  (coreLoadExecutor-3956-thread-1-processing-n:127.0.0.1:64089_) [n:127.0.0.1:64089_ c:control_collection s:shard1 r:core_node1 x:collection1] o.a.s.u.CommitTracker Soft AutoCommit: disabled
   [junit4]   2> 855987 INFO  (coreLoadExecutor-3956-thread-1-processing-n:127.0.0.1:64089_) [n:127.0.0.1:64089_ c:control_collection s:shard1 r:core_node1 x:collection1] o.a.s.u.RandomMergePolicy RandomMergePolicy wrapping class org.apache.lucene.index.TieredMergePolicy: [TieredMergePolicy: maxMergeAtOnce=28, maxMergeAtOnceExplicit=11, maxMergedSegmentMB=4.6279296875, floorSegmentMB=1.3994140625, forceMergeDeletesPctAllowed=18.032485912657574, segmentsPerTier=27.0, maxCFSSegmentSizeMB=8.796093022207999E12, noCFSRatio=0.6492815567338535
   [junit4]   2> 855987 INFO  (coreLoadExecutor-3956-thread-1-processing-n:127.0.0.1:64089_) [n:127.0.0.1:64089_ c:control_collection s:shard1 r:core_node1 x:collection1] o.a.s.c.SolrDeletionPolicy SolrDeletionPolicy.onInit: commits: num=1
   [junit4]   2> 	commit{dir=MockDirectoryWrapper(RAMDirectory@847a321 lockFactory=org.apache.lucene.store.SingleInstanceLockFactory@556fbcae),segFN=segments_1,generation=1}
   [junit4]   2> 855987 INFO  (coreLoadExecutor-3956-thread-1-processing-n:127.0.0.1:64089_) [n:127.0.0.1:64089_ c:control_collection s:shard1 r:core_node1 x:collection1] o.a.s.c.SolrDeletionPolicy newest commit generation = 1
   [junit4]   2> 855987 INFO  (coreLoadExecutor-3956-thread-1-processing-n:127.0.0.1:64089_) [n:127.0.0.1:64089_ c:control_collection s:shard1 r:core_node1 x:collection1] o.a.s.s.SolrIndexSearcher Opening Searcher@4b2a97b6[collection1] main
   [junit4]   2> 855988 INFO  (coreLoadExecutor-3956-thread-1-processing-n:127.0.0.1:64089_) [n:127.0.0.1:64089_ c:control_collection s:shard1 r:core_node1 x:collection1] o.a.s.c.c.ZkStateReader Load collection config from: [/collections/control_collection]
   [junit4]   2> 855988 INFO  (coreLoadExecutor-3956-thread-1-processing-n:127.0.0.1:64089_) [n:127.0.0.1:64089_ c:control_collection s:shard1 r:core_node1 x:collection1] o.a.s.c.c.ZkStateReader path=[/collections/control_collection] [configName]=[conf1] specified config exists in ZooKeeper
   [junit4]   2> 855988 INFO  (coreLoadExecutor-3956-thread-1-processing-n:127.0.0.1:64089_) [n:127.0.0.1:64089_ c:control_collection s:shard1 r:core_node1 x:collection1] o.a.s.r.ManagedResourceStorage Setting up ZooKeeper-based storage for the RestManager with znodeBase: /configs/conf1
   [junit4]   2> 855990 INFO  (coreLoadExecutor-3956-thread-1-processing-n:127.0.0.1:64089_) [n:127.0.0.1:64089_ c:control_collection s:shard1 r:core_node1 x:collection1] o.a.s.r.ManagedResourceStorage Configured ZooKeeperStorageIO with znodeBase: /configs/conf1
   [junit4]   2> 855990 INFO  (coreLoadExecutor-3956-thread-1-processing-n:127.0.0.1:64089_) [n:127.0.0.1:64089_ c:control_collection s:shard1 r:core_node1 x:collection1] o.a.s.r.RestManager Initializing RestManager with initArgs: {}
   [junit4]   2> 855990 INFO  (coreLoadExecutor-3956-thread-1-processing-n:127.0.0.1:64089_) [n:127.0.0.1:64089_ c:control_collection s:shard1 r:core_node1 x:collection1] o.a.s.r.ManagedResourceStorage Reading _rest_managed.json using ZooKeeperStorageIO:path=/configs/conf1
   [junit4]   2> 855990 INFO  (coreLoadExecutor-3956-thread-1-processing-n:127.0.0.1:64089_) [n:127.0.0.1:64089_ c:control_collection s:shard1 r:core_node1 x:collection1] o.a.s.r.ManagedResourceStorage No data found for znode /configs/conf1/_rest_managed.json
   [junit4]   2> 855990 INFO  (coreLoadExecutor-3956-thread-1-processing-n:127.0.0.1:64089_) [n:127.0.0.1:64089_ c:control_collection s:shard1 r:core_node1 x:collection1] o.a.s.r.ManagedResourceStorage Loaded null at path _rest_managed.json using ZooKeeperStorageIO:path=/configs/conf1
   [junit4]   2> 855990 INFO  (coreLoadExecutor-3956-thread-1-processing-n:127.0.0.1:64089_) [n:127.0.0.1:64089_ c:control_collection s:shard1 r:core_node1 x:collection1] o.a.s.r.RestManager Initializing 0 registered ManagedResources
   [junit4]   2> 855998 INFO  (coreLoadExecutor-3956-thread-1-processing-n:127.0.0.1:64089_) [n:127.0.0.1:64089_ c:control_collection s:shard1 r:core_node1 x:collection1] o.a.s.h.ReplicationHandler Commits will be reserved for  10000
   [junit4]   2> 855998 INFO  (coreLoadExecutor-3956-thread-1-processing-n:127.0.0.1:64089_) [n:127.0.0.1:64089_ c:control_collection s:shard1 r:core_node1 x:collection1] o.a.s.u.UpdateLog Looking up max value of version field to seed version buckets
   [junit4]   2> 855998 INFO  (searcherExecutor-3957-thread-1-processing-n:127.0.0.1:64089_ x:collection1 s:shard1 c:control_collection r:core_node1) [n:127.0.0.1:64089_ c:control_collection s:shard1 r:core_node1 x:collection1] o.a.s.c.SolrCore [collection1] Registered new searcher Searcher@4b2a97b6[collection1] main{ExitableDirectoryReader(UninvertingDirectoryReader())}
   [junit4]   2> 855998 INFO  (coreLoadExecutor-3956-thread-1-processing-n:127.0.0.1:64089_) [n:127.0.0.1:64089_ c:control_collection s:shard1 r:core_node1 x:collection1] o.a.s.u.VersionInfo Refreshing highest value of _version_ for 65536 version buckets from index
   [junit4]   2> 855998 INFO  (coreLoadExecutor-3956-thread-1-processing-n:127.0.0.1:64089_) [n:127.0.0.1:64089_ c:control_collection s:shard1 r:core_node1 x:collection1] o.a.s.u.VersionInfo No terms found for _version_, cannot seed version bucket highest value from index
   [junit4]   2> 855998 INFO  (coreLoadExecutor-3956-thread-1-processing-n:127.0.0.1:64089_) [n:127.0.0.1:64089_ c:control_collection s:shard1 r:core_node1 x:collection1] o.a.s.u.UpdateLog Could not find max version in index or recent updates, using new clock 1525536999122927616
   [junit4]   2> 856000 INFO  (coreLoadExecutor-3956-thread-1-processing-n:127.0.0.1:64089_) [n:127.0.0.1:64089_ c:control_collection s:shard1 r:core_node1 x:collection1] o.a.s.u.UpdateLog Took 1.0ms to seed version buckets with highest version 1525536999122927616
   [junit4]   2> 856000 INFO  (coreLoadExecutor-3956-thread-1-processing-n:127.0.0.1:64089_) [n:127.0.0.1:64089_ c:control_collection s:shard1 r:core_node1 x:collection1] o.a.s.c.ZkController watch zkdir /configs/conf1
   [junit4]   2> 856000 INFO  (coreLoadExecutor-3956-thread-1-processing-n:127.0.0.1:64089_) [n:127.0.0.1:64089_ c:control_collection s:shard1 r:core_node1 x:collection1] o.a.s.c.CoreContainer registering core: collection1
   [junit4]   2> 856001 INFO  (coreZkRegister-3950-thread-1-processing-n:127.0.0.1:64089_ x:collection1 s:shard1 c:control_collection r:core_node1) [n:127.0.0.1:64089_ c:control_collection s:shard1 r:core_node1 x:collection1] o.a.s.c.ZkController Register replica - core:collection1 address:https://127.0.0.1:64089 collection:control_collection shard:shard1
   [junit4]   2> 856002 INFO  (coreZkRegister-3950-thread-1-processing-n:127.0.0.1:64089_ x:collection1 s:shard1 c:control_collection r:core_node1) [n:127.0.0.1:64089_ c:control_collection s:shard1 r:core_node1 x:collection1] o.a.s.c.c.SolrZkClient makePath: /collections/control_collection/leader_elect/shard1/election
   [junit4]   2> 856005 INFO  (coreZkRegister-3950-thread-1-processing-n:127.0.0.1:64089_ x:collection1 s:shard1 c:control_collection r:core_node1) [n:127.0.0.1:64089_ c:control_collection s:shard1 r:core_node1 x:collection1] o.a.s.c.LeaderElector Joined leadership election with path: /collections/control_collection/leader_elect/shard1/election/95346062328791045-core_node1-n_0000000000
   [junit4]   2> 856006 INFO  (coreZkRegister-3950-thread-1-processing-n:127.0.0.1:64089_ x:collection1 s:shard1 c:control_collection r:core_node1) [n:127.0.0.1:64089_ c:control_collection s:shard1 r:core_node1 x:collection1] o.a.s.c.ShardLeaderElectionContext Running the leader process for shard=shard1 and weAreReplacement=false and leaderVoteWait=10000
   [junit4]   2> 856007 INFO  (coreZkRegister-3950-thread-1-processing-n:127.0.0.1:64089_ x:collection1 s:shard1 c:control_collection r:core_node1) [n:127.0.0.1:64089_ c:control_collection s:shard1 r:core_node1 x:collection1] o.a.s.c.ShardLeaderElectionContext Enough replicas found to continue.
   [junit4]   2> 856007 INFO  (coreZkRegister-3950-thread-1-processing-n:127.0.0.1:64089_ x:collection1 s:shard1 c:control_collection r:core_node1) [n:127.0.0.1:64089_ c:control_collection s:shard1 r:core_node1 x:collection1] o.a.s.c.ShardLeaderElectionContext I may be the new leader - try and sync
   [junit4]   2> 856007 INFO  (coreZkRegister-3950-thread-1-processing-n:127.0.0.1:64089_ x:collection1 s:shard1 c:control_collection r:core_node1) [n:127.0.0.1:64089_ c:control_collection s:shard1 r:core_node1 x:collection1] o.a.s.c.SyncStrategy Sync replicas to https://127.0.0.1:64089/collection1/
   [junit4]   2> 856008 INFO  (coreZkRegister-3950-thread-1-processing-n:127.0.0.1:64089_ x:collection1 s:shard1 c:control_collection r:core_node1) [n:127.0.0.1:64089_ c:control_collection s:shard1 r:core_node1 x:collection1] o.a.s.c.SyncStrategy Sync Success - now sync replicas to me
   [junit4]   2> 856008 INFO  (coreZkRegister-3950-thread-1-processing-n:127.0.0.1:64089_ x:collection1 s:shard1 c:control_collection r:core_node1) [n:127.0.0.1:64089_ c:control_collection s:shard1 r:core_node1 x:collection1] o.a.s.c.SyncStrategy https://127.0.0.1:64089/collection1/ has no replicas
   [junit4]   2> 856008 INFO  (OverseerStateUpdate-95346062328791045-127.0.0.1:64089_-n_0000000000) [n:127.0.0.1:64089_    ] o.a.s.c.Overseer processMessage: queueSize: 1, message = {
   [junit4]   2>   "operation":"leader",
   [junit4]   2>   "shard":"shard1",
   [junit4]   2>   "collection":"control_collection"} current state version: 1
   [junit4]   2> 856008 INFO  (coreZkRegister-3950-thread-1-processing-n:127.0.0.1:64089_ x:collection1 s:shard1 c:control_collection r:core_node1) [n:127.0.0.1:64089_ c:control_collection s:shard1 r:core_node1 x:collection1] o.a.s.c.c.SolrZkClient makePath: /collections/control_collection/leaders/shard1
   [junit4]   2> 856011 INFO  (coreZkRegister-3950-thread-1-processing-n:127.0.0.1:64089_ x:collection1 s:shard1 c:control_collection r:core_node1) [n:127.0.0.1:64089_ c:control_collection s:shard1 r:core_node1 x:collection1] o.a.s.c.ShardLeaderElectionContextBase Creating leader registration node
   [junit4]   2> 856012 INFO  (coreZkRegister-3950-thread-1-processing-n:127.0.0.1:64089_ x:collection1 s:shard1 c:control_collection r:core_node1) [n:127.0.0.1:64089_ c:control_collection s:shard1 r:core_node1 x:collection1] o.a.s.c.ShardLeaderElectionContext I am the new leader: https://127.0.0.1:64089/collection1/ shard1
   [junit4]   2> 856013 INFO  (OverseerStateUpdate-95346062328791045-127.0.0.1:64089_-n_0000000000) [n:127.0.0.1:64089_    ] o.a.s.c.Overseer processMessage: queueSize: 1, message = {
   [junit4]   2>   "operation":"leader",
   [junit4]   2>   "shard":"shard1",
   [junit4]   2>   "collection":"control_collection",
   [junit4]   2>   "base_url":"https://127.0.0.1:64089",
   [junit4]   2>   "core":"collection1",
   [junit4]   2>   "state":"active"} current state version: 1
   [junit4]   2> 856116 INFO  (zkCallback-1395-thread-1-processing-n:127.0.0.1:64089_) [n:127.0.0.1:64089_    ] o.a.s.c.c.ZkStateReader A cluster state change: [WatchedEvent state:SyncConnected type:NodeDataChanged path:/clusterstate.json], has occurred - updating... (live nodes size: [1])
   [junit4]   2> 856166 INFO  (coreZkRegister-3950-thread-1-processing-n:127.0.0.1:64089_ x:collection1 s:shard1 c:control_collection r:core_node1) [n:127.0.0.1:64089_ c:control_collection s:shard1 r:core_node1 x:collection1] o.a.s.c.ZkController We are https://127.0.0.1:64089/collection1/ and leader is https://127.0.0.1:64089/collection1/
   [junit4]   2> 856166 INFO  (coreZkRegister-3950-thread-1-processing-n:127.0.0.1:64089_ x:collection1 s:shard1 c:control_collection r:core_node1) [n:127.0.0.1:64089_ c:control_collection s:shard1 r:core_node1 x:collection1] o.a.s.c.ZkController No LogReplay needed for core=collection1 baseURL=https://127.0.0.1:64089
   [junit4]   2> 856166 INFO  (coreZkRegister-3950-thread-1-processing-n:127.0.0.1:64089_ x:collection1 s:shard1 c:control_collection r:core_node1) [n:127.0.0.1:64089_ c:control_collection s:shard1 r:core_node1 x:collection1] o.a.s.c.ZkController I am the leader, no recovery necessary
   [junit4]   2> 856166 INFO  (coreZkRegister-3950-thread-1-processing-n:127.0.0.1:64089_ x:collection1 s:shard1 c:control_collection r:core_node1) [n:127.0.0.1:64089_ c:control_collection s:shard1 r:core_node1 x:collection1] o.a.s.c.ZkController publishing state=active
   [junit4]   2> 856166 INFO  (coreZkRegister-3950-thread-1-processing-n:127.0.0.1:64089_ x:collection1 s:shard1 c:control_collection r:core_node1) [n:127.0.0.1:64089_ c:control_collection s:shard1 r:core_node1 x:collection1] o.a.s.c.ZkController numShards not found on descriptor - reading it from system property
   [junit4]   2> 856168 INFO  (OverseerStateUpdate-95346062328791045-127.0.0.1:64089_-n_0000000000) [n:127.0.0.1:64089_    ] o.a.s.c.Overseer processMessage: queueSize: 1, message = {
   [junit4]   2>   "core":"collection1",
   [junit4]   2>   "core_node_name":"core_node1",
   [junit4]   2>   "roles":null,
   [junit4]   2>   "base_url":"https://127.0.0.1:64089",
   [junit4]   2>   "node_name":"127.0.0.1:64089_",
   [junit4]   2>   "numShards":"1",
   [junit4]   2>   "state":"active",
   [junit4]   2>   "shard":"shard1",
   [junit4]   2>   "collection":"control_collection",
   [junit4]   2>   "operation":"state"} current state version: 2
   [junit4]   2> 856168 INFO  (OverseerStateUpdate-95346062328791045-127.0.0.1:64089_-n_0000000000) [n:127.0.0.1:64089_    ] o.a.s.c.o.ReplicaMutator Update state numShards=1 message={
   [junit4]   2>   "core":"collection1",
   [junit4]   2>   "core_node_name":"core_node1",
   [junit4]   2>   "roles":null,
   [junit4]   2>   "base_url":"https://127.0.0.1:64089",
   [junit4]   2>   "node_name":"127.0.0.1:64089_",
   [junit4]   2>   "numShards":"1",
   [junit4]   2>   "state":"active",
   [junit4]   2>   "shard":"shard1",
   [junit4]   2>   "collection":"control_collection",
   [junit4]   2>   "operation":"state"}
   [junit4]   2> 856270 INFO  (zkCallback-1395-thread-1-processing-n:127.0.0.1:64089_) [n:127.0.0.1:64089_    ] o.a.s.c.c.ZkStateReader A cluster state change: [WatchedEvent state:SyncConnected type:NodeDataChanged path:/clusterstate.json], has occurred - updating... (live nodes size: [1])
   [junit4]   2> 856289 INFO  (TEST-DistribDocExpirationUpdateProcessorTest.test-seed#[FA5843C9B6C99326]) [    ] o.a.s.c.c.SolrZkClient Using default ZkCredentialsProvider
   [junit4]   2> 856290 INFO  (TEST-DistribDocExpirationUpdateProcessorTest.test-seed#[FA5843C9B6C99326]) [    ] o.a.s.c.c.ConnectionManager Waiting for client to connect to ZooKeeper
   [junit4]   2> 856292 INFO  (zkCallback-1397-thread-1) [    ] o.a.s.c.c.ConnectionManager Watcher org.apache.solr.common.cloud.ConnectionManager@668298e6 name:ZooKeeperConnection Watcher:127.0.0.1:64079/solr got event WatchedEvent state:SyncConnected type:None path:null path:null type:None
   [junit4]   2> 856292 INFO  (TEST-DistribDocExpirationUpdateProcessorTest.test-seed#[FA5843C9B6C99326]) [    ] o.a.s.c.c.ConnectionManager Client is connected to ZooKeeper
   [junit4]   2> 856292 INFO  (TEST-DistribDocExpirationUpdateProcessorTest.test-seed#[FA5843C9B6C99326]) [    ] o.a.s.c.c.SolrZkClient Using default ZkACLProvider
   [junit4]   2> 856292 INFO  (TEST-DistribDocExpirationUpdateProcessorTest.test-seed#[FA5843C9B6C99326]) [    ] o.a.s.c.c.ZkStateReader Updating cluster state from ZooKeeper... 
   [junit4]   2> 856295 INFO  (TEST-DistribDocExpirationUpdateProcessorTest.test-seed#[FA5843C9B6C99326]) [    ] o.a.s.c.ChaosMonkey monkey: init - expire sessions:false cause connection loss:false
   [junit4]   2> 856637 INFO  (TEST-DistribDocExpirationUpdateProcessorTest.test-seed#[FA5843C9B6C99326]) [    ] o.a.s.SolrTestCaseJ4 Writing core.properties file to C:\Users\JenkinsSlave\workspace\Lucene-Solr-5.x-Windows\solr\build\solr-core\test\J1\temp\solr.cloud.DistribDocExpirationUpdateProcessorTest_FA5843C9B6C99326-001\shard-1-001\cores\collection1
   [junit4]   2> 856639 INFO  (TEST-DistribDocExpirationUpdateProcessorTest.test-seed#[FA5843C9B6C99326]) [    ] o.a.s.c.AbstractFullDistribZkTestBase create jetty 1 in directory C:\Users\JenkinsSlave\workspace\Lucene-Solr-5.x-Windows\solr\build\solr-core\test\J1\temp\solr.cloud.DistribDocExpirationUpdateProcessorTest_FA5843C9B6C99326-001\shard-1-001
   [junit4]   2> 856640 INFO  (TEST-DistribDocExpirationUpdateProcessorTest.test-seed#[FA5843C9B6C99326]) [    ] o.e.j.s.Server jetty-9.2.13.v20150730
   [junit4]   2> 856641 INFO  (TEST-DistribDocExpirationUpdateProcessorTest.test-seed#[FA5843C9B6C99326]) [    ] o.e.j.s.h.ContextHandler Started o.e.j.s.ServletContextHandler@7a1632b1{/,null,AVAILABLE}
   [junit4]   2> 856647 INFO  (TEST-DistribDocExpirationUpdateProcessorTest.test-seed#[FA5843C9B6C99326]) [    ] o.e.j.s.ServerConnector Started ServerConnector@36e11b14{SSL-http/1.1}{127.0.0.1:64116}
   [junit4]   2> 856647 INFO  (TEST-DistribDocExpirationUpdateProcessorTest.test-seed#[FA5843C9B6C99326]) [    ] o.e.j.s.Server Started @860255ms
   [junit4]   2> 856648 INFO  (TEST-DistribDocExpirationUpdateProcessorTest.test-seed#[FA5843C9B6C99326]) [    ] o.a.s.c.s.e.JettySolrRunner Jetty properties: {solr.data.dir=C:\Users\JenkinsSlave\workspace\Lucene-Solr-5.x-Windows\solr\build\solr-core\test\J1\temp\solr.cloud.DistribDocExpirationUpdateProcessorTest_FA5843C9B6C99326-001\tempDir-001/jetty1, solrconfig=solrconfig.xml, hostContext=/, hostPort=64116, coreRootDirectory=C:\Users\JenkinsSlave\workspace\Lucene-Solr-5.x-Windows\solr\build\solr-core\test\J1\..\..\..\..\..\..\..\..\..\Users\JenkinsSlave\workspace\Lucene-Solr-5.x-Windows\solr\build\solr-core\test\J1\temp\solr.cloud.DistribDocExpirationUpdateProcessorTest_FA5843C9B6C99326-001\shard-1-001\cores}
   [junit4]   2> 856648 INFO  (TEST-DistribDocExpirationUpdateProcessorTest.test-seed#[FA5843C9B6C99326]) [    ] o.a.s.s.SolrDispatchFilter SolrDispatchFilter.init(): sun.misc.Launcher$AppClassLoader@73d16e93
   [junit4]   2> 856648 INFO  (TEST-DistribDocExpirationUpdateProcessorTest.test-seed#[FA5843C9B6C99326]) [    ] o.a.s.c.SolrResourceLoader new SolrResourceLoader for directory: 'C:\Users\JenkinsSlave\workspace\Lucene-Solr-5.x-Windows\solr\build\solr-core\test\J1\temp\solr.cloud.DistribDocExpirationUpdateProcessorTest_FA5843C9B6C99326-001\shard-1-001'
   [junit4]   2> 856648 INFO  (TEST-DistribDocExpirationUpdateProcessorTest.test-seed#[FA5843C9B6C99326]) [    ] o.a.s.c.SolrResourceLoader JNDI not configured for solr (NoInitialContextEx)
   [junit4]   2> 856648 INFO  (TEST-DistribDocExpirationUpdateProcessorTest.test-seed#[FA5843C9B6C99326]) [    ] o.a.s.c.SolrResourceLoader solr home defaulted to 'solr/' (could not find system property or JNDI)
   [junit4]   2> 856648 INFO  (TEST-DistribDocExpirationUpdateProcessorTest.test-seed#[FA5843C9B6C99326]) [    ] o.a.s.c.c.SolrZkClient Using default ZkCredentialsProvider
   [junit4]   2> 856649 INFO  (TEST-DistribDocExpirationUpdateProcessorTest.test-seed#[FA5843C9B6C99326]) [    ] o.a.s.c.c.ConnectionManager Waiting for client to connect to ZooKeeper
   [junit4]   2> 856651 INFO  (zkCallback-1398-thread-1) [    ] o.a.s.c.c.ConnectionManager Watcher org.apache.solr.common.cloud.ConnectionManager@1b1530ff name:ZooKeeperConnection Watcher:127.0.0.1:64079/solr got event WatchedEvent state:SyncConnected type:None path:null path:null type:None
   [junit4]   2> 856651 INFO  (TEST-DistribDocExpirationUpdateProcessorTest.test-seed#[FA5843C9B6C99326]) [    ] o.a.s.c.c.ConnectionManager Client is connected to ZooKeeper
   [junit4]   2> 856651 INFO  (TEST-DistribDocExpirationUpdateProcessorTest.test-seed#[FA5843C9B6C99326]) [    ] o.a.s.c.c.SolrZkClient Using default ZkACLProvider
   [junit4]   2> 856653 INFO  (TEST-DistribDocExpirationUpdateProcessorTest.test-seed#[FA5843C9B6C99326]) [    ] o.a.s.s.SolrDispatchFilter Loading solr.xml from SolrHome (not found in ZooKeeper)
   [junit4]   2> 856653 INFO  (TEST-DistribDocExpirationUpdateProcessorTest.test-seed#[FA5843C9B6C99326]) [    ] o.a.s.c.SolrXmlConfig Loading container configuration from C:\Users\JenkinsSlave\workspace\Lucene-Solr-5.x-Windows\solr\build\solr-core\test\J1\temp\solr.cloud.DistribDocExpirationUpdateProcessorTest_FA5843C9B6C99326-001\shard-1-001\solr.xml
   [junit4]   2> 856659 INFO  (TEST-DistribDocExpirationUpdateProcessorTest.test-seed#[FA5843C9B6C99326]) [    ] o.a.s.c.CorePropertiesLocator Config-defined core root directory: C:\Users\JenkinsSlave\workspace\Lucene-Solr-5.x-Windows\solr\build\solr-core\test\J1\..\..\..\..\..\..\..\..\..\Users\JenkinsSlave\workspace\Lucene-Solr-5.x-Windows\solr\build\solr-core\test\J1\temp\solr.cloud.DistribDocExpirationUpdateProcessorTest_FA5843C9B6C99326-001\shard-1-001\cores
   [junit4]   2> 856659 INFO  (TEST-DistribDocExpirationUpdateProcessorTest.test-seed#[FA5843C9B6C99326]) [    ] o.a.s.c.CoreContainer New CoreContainer 868479552
   [junit4]   2> 856659 INFO  (TEST-DistribDocExpirationUpdateProcessorTest.test-seed#[FA5843C9B6C99326]) [    ] o.a.s.c.CoreContainer Loading cores into CoreContainer [instanceDir=C:\Users\JenkinsSlave\workspace\Lucene-Solr-5.x-Windows\solr\build\solr-core\test\J1\temp\solr.cloud.DistribDocExpirationUpdateProcessorTest_FA5843C9B6C99326-001\shard-1-001]
   [junit4]   2> 856659 WARN  (TEST-DistribDocExpirationUpdateProcessorTest.test-seed#[FA5843C9B6C99326]) [    ] o.a.s.c.CoreContainer Couldn't add files from C:\Users\JenkinsSlave\workspace\Lucene-Solr-5.x-Windows\solr\build\solr-core\test\J1\temp\solr.cloud.DistribDocExpirationUpdateProcessorTest_FA5843C9B6C99326-001\shard-1-001\lib to classpath: C:\Users\JenkinsSlave\workspace\Lucene-Solr-5.x-Windows\solr\build\solr-core\test\J1\temp\solr.cloud.DistribDocExpirationUpdateProcessorTest_FA5843C9B6C99326-001\shard-1-001\lib
   [junit4]   2> 856660 INFO  (TEST-DistribDocExpirationUpdateProcessorTest.test-seed#[FA5843C9B6C99326]) [    ] o.a.s.h.c.HttpShardHandlerFactory created with socketTimeout : 90000,urlScheme : ,connTimeout : 15000,maxConnectionsPerHost : 20,maxConnections : 10000,corePoolSize : 0,maximumPoolSize : 2147483647,maxThreadIdleTime : 5,sizeOfQueue : -1,fairnessPolicy : false,useRetries : false,
   [junit4]   2> 856664 INFO  (TEST-DistribDocExpirationUpdateProcessorTest.test-seed#[FA5843C9B6C99326]) [    ] o.a.s.u.UpdateShardHandler Creating UpdateShardHandler HTTP client with params: socketTimeout=340000&connTimeout=45000&retry=true
   [junit4]   2> 856666 INFO  (TEST-DistribDocExpirationUpdateProcessorTest.test-seed#[FA5843C9B6C99326]) [    ] o.a.s.l.LogWatcher SLF4J impl is org.slf4j.impl.Log4jLoggerFactory
   [junit4]   2> 856666 INFO  (TEST-DistribDocExpirationUpdateProcessorTest.test-seed#[FA5843C9B6C99326]) [    ] o.a.s.l.LogWatcher Registering Log Listener [Log4j (org.slf4j.impl.Log4jLoggerFactory)]
   [junit4]   2> 856666 INFO  (TEST-DistribDocExpirationUpdateProcessorTest.test-seed#[FA5843C9B6C99326]) [    ] o.a.s.c.ZkContainer Zookeeper client=127.0.0.1:64079/solr
   [junit4]   2> 856666 INFO  (TEST-DistribDocExpirationUpdateProcessorTest.test-seed#[FA5843C9B6C99326]) [    ] o.a.s.c.ZkController zkHost includes chroot
   [junit4]   2> 856666 INFO  (TEST-DistribDocExpirationUpdateProcessorTest.test-seed#[FA5843C9B6C99326]) [    ] o.a.s.c.c.SolrZkClient Using default ZkCredentialsProvider
   [junit4]   2> 856669 INFO  (TEST-DistribDocExpirationUpdateProcessorTest.test-seed#[FA5843C9B6C99326]) [    ] o.a.s.c.c.ConnectionManager Waiting for client to connect to ZooKeeper
   [junit4]   2> 856684 INFO  (zkCallback-1401-thread-1) [    ] o.a.s.c.c.ConnectionManager Watcher org.apache.solr.common.cloud.ConnectionManager@5fd75dc6 name:ZooKeeperConnection Watcher:127.0.0.1:64079 got event WatchedEvent state:SyncConnected type:None path:null path:null type:None
   [junit4]   2> 856685 INFO  (TEST-DistribDocExpirationUpdateProcessorTest.test-seed#[FA5843C9B6C99326]) [    ] o.a.s.c.c.ConnectionManager Client is connected to ZooKeeper
   [junit4]   2> 856685 INFO  (TEST-DistribDocExpirationUpdateProcessorTest.test-seed#[FA5843C9B6C99326]) [    ] o.a.s.c.c.SolrZkClient Using default ZkACLProvider
   [junit4]   2> 856686 WARN  (NIOServerCxn.Factory:0.0.0.0/0.0.0.0:0) [    ] o.a.z.s.NIOServerCnxn caught end of stream exception
   [junit4]   2> EndOfStreamException: Unable to read additional data from client sessionid 0x152bcbd0fd70008, likely client has closed socket
   [junit4]   2> 	at org.apache.zookeeper.server.NIOServerCnxn.doIO(NIOServerCnxn.java:228)
   [junit4]   2> 	at org.apache.zookeeper.server.NIOServerCnxnFactory.run(NIOServerCnxnFactory.java:208)
   [junit4]   2> 	at java.lang.Thread.run(Thread.java:745)
   [junit4]   2> 856688 INFO  (TEST-DistribDocExpirationUpdateProcessorTest.test-seed#[FA5843C9B6C99326]) [n:127.0.0.1:64116_    ] o.a.s.c.c.ConnectionManager Waiting for client to connect to ZooKeeper
   [junit4]   2> 856689 INFO  (zkCallback-1402-thread-1-processing-n:127.0.0.1:64116_) [n:127.0.0.1:64116_    ] o.a.s.c.c.ConnectionManager Watcher org.apache.solr.common.cloud.ConnectionManager@5a5a155a name:ZooKeeperConnection Watcher:127.0.0.1:64079/solr got event WatchedEvent state:SyncConnected type:None path:null path:null type:None
   [junit4]   2> 856689 INFO  (TEST-DistribDocExpirationUpdateProcessorTest.test-seed#[FA5843C9B6C99326]) [n:127.0.0.1:64116_    ] o.a.s.c.c.ConnectionManager Client is connected to ZooKeeper
   [junit4]   2> 856694 INFO  (TEST-DistribDocExpirationUpdateProcessorTest.test-seed#[FA5843C9B6C99326]) [n:127.0.0.1:64116_    ] o.a.s.c.c.ZkStateReader Updating cluster state from ZooKeeper... 
   [junit4]   2> 857699 INFO  (TEST-DistribDocExpirationUpdateProcessorTest.test-seed#[FA5843C9B6C99326]) [n:127.0.0.1:64116_    ] o.a.s.c.ZkController Register node as live in ZooKeeper:/live_nodes/127.0.0.1:64116_
   [junit4]   2> 857700 INFO  (TEST-DistribDocExpirationUpdateProcessorTest.test-seed#[FA5843C9B6C99326]) [n:127.0.0.1:64116_    ] o.a.s.c.c.SolrZkClient makePath: /live_nodes/127.0.0.1:64116_
   [junit4]   2> 857700 INFO  (zkCallback-1395-thread-1-processing-n:127.0.0.1:64089_) [n:127.0.0.1:64089_    ] o.a.s.c.c.ZkStateReader A live node change: [WatchedEvent state:SyncConnected type:NodeChildrenChanged path:/live_nodes], has occurred - updating... (live nodes size: [1])
   [junit4]   2> 857700 INFO  (zkCallback-1402-thread-1-processing-n:127.0.0.1:64116_) [n:127.0.0.1:64116_    ] o.a.s.c.c.ZkStateReader A live node change: [WatchedEvent state:SyncConnected type:NodeChildrenChanged path:/live_nodes], has occurred - updating... (live nodes size: [1])
   [junit4]   2> 857700 INFO  (zkCallback-1397-thread-1) [    ] o.a.s.c.c.ZkStateReader A live node change: [WatchedEvent state:SyncConnected type:NodeChildrenChanged path:/live_nodes], has occurred - updating... (live nodes size: [1])
   [junit4]   2> 857702 INFO  (TEST-DistribDocExpirationUpdateProcessorTest.test-seed#[FA5843C9B6C99326]) [n:127.0.0.1:64116_    ] o.a.s.c.Overseer Overseer (id=null) closing
   [junit4]   2> 857702 INFO  (TEST-DistribDocExpirationUpdateProcessorTest.test-seed#[FA5843C9B6C99326]) [n:127.0.0.1:64116_    ] o.a.s.c.LeaderElector Joined leadership election with path: /overseer_elect/election/95346062328791049-127.0.0.1:64116_-n_0000000001
   [junit4]   2> 857703 INFO  (TEST-DistribDocExpirationUpdateProcessorTest.test-seed#[FA5843C9B6C99326]) [n:127.0.0.1:64116_    ] o.a.s.c.LeaderElector Watching path /overseer_elect/election/95346062328791045-127.0.0.1:64089_-n_0000000000 to know if I could be the leader
   [junit4]   2> 857711 INFO  (TEST-DistribDocExpirationUpdateProcessorTest.test-seed#[FA5843C9B6C99326]) [n:127.0.0.1:64116_    ] o.a.s.c.CoreContainer Security conf doesn't exist. Skipping setup for authorization module.
   [junit4]   2> 857711 INFO  (TEST-DistribDocExpirationUpdateProcessorTest.test-seed#[FA5843C9B6C99326]) [n:127.0.0.1:64116_    ] o.a.s.c.CoreContainer No authentication plugin used.
   [junit4]   2> 857711 INFO  (TEST-DistribDocExpirationUpdateProcessorTest.test-seed#[FA5843C9B6C99326]) [n:127.0.0.1:64116_    ] o.a.s.c.CorePropertiesLocator Looking for core definitions underneath C:\Users\JenkinsSlave\workspace\Lucene-Solr-5.x-Windows\solr\build\solr-core\test\J1\..\..\..\..\..\..\..\..\..\Users\JenkinsSlave\workspace\Lucene-Solr-5.x-Windows\solr\build\solr-core\test\J1\temp\solr.cloud.DistribDocExpirationUpdateProcessorTest_FA5843C9B6C99326-001\shard-1-001\cores
   [junit4]   2> 857713 INFO  (TEST-DistribDocExpirationUpdateProcessorTest.test-seed#[FA5843C9B6C99326]) [n:127.0.0.1:64116_    ] o.a.s.c.CoreDescriptor Created CoreDescriptor: {name=collection1, config=solrconfig.xml, transient=false, schema=schema.xml, loadOnStartup=true, configSetProperties=configsetprops.json, collection=collection1, coreNodeName=, dataDir=data\, shard=}
   [junit4]   2> 857713 INFO  (TEST-DistribDocExpirationUpdateProcessorTest.test-seed#[FA5843C9B6C99326]) [n:127.0.0.1:64116_    ] o.a.s.c.CorePropertiesLocator Found core collection1 in C:\Users\JenkinsSlave\workspace\Lucene-Solr-5.x-Windows\solr\build\solr-core\test\J1\..\..\..\..\..\..\..\..\..\Users\JenkinsSlave\workspace\Lucene-Solr-5.x-Windows\solr\build\solr-core\test\J1\temp\solr.cloud.DistribDocExpirationUpdateProcessorTest_FA5843C9B6C99326-001\shard-1-001\cores\collection1
   [junit4]   2> 857713 INFO  (TEST-DistribDocExpirationUpdateProcessorTest.test-seed#[FA5843C9B6C99326]) [n:127.0.0.1:64116_    ] o.a.s.c.CorePropertiesLocator Found 1 core definitions
   [junit4]   2> 857714 INFO  (TEST-DistribDocExpirationUpdateProcessorTest.test-seed#[FA5843C9B6C99326]) [n:127.0.0.1:64116_    ] o.a.s.s.SolrDispatchFilter user.dir=C:\Users\JenkinsSlave\workspace\Lucene-Solr-5.x-Windows\solr\build\solr-core\test\J1
   [junit4]   2> 857714 INFO  (TEST-DistribDocExpirationUpdateProcessorTest.test-seed#[FA5843C9B6C99326]) [n:127.0.0.1:64116_    ] o.a.s.s.SolrDispatchFilter SolrDispatchFilter.init() done
   [junit4]   2> 857714 INFO  (coreLoadExecutor-3968-thread-1-processing-n:127.0.0.1:64116_) [n:127.0.0.1:64116_ c:collection1   x:collection1] o.a.s.c.ZkController publishing state=down
   [junit4]   2> 857714 INFO  (coreLoadExecutor-3968-thread-1-processing-n:127.0.0.1:64116_) [n:127.0.0.1:64116_ c:collection1   x:collection1] o.a.s.c.ZkController numShards not found on descriptor - reading it from system property
   [junit4]   2> 857715 INFO  (coreLoadExecutor-3968-thread-1-processing-n:127.0.0.1:64116_) [n:127.0.0.1:64116_ c:collection1   x:collection1] o.a.s.c.ZkController look for our core node name
   [junit4]   2> 857715 INFO  (OverseerStateUpdate-95346062328791045-127.0.0.1:64089_-n_0000000000) [n:127.0.0.1:64089_    ] o.a.s.c.Overseer processMessage: queueSize: 1, message = {
   [junit4]   2>   "core":"collection1",
   [junit4]   2>   "roles":null,
   [junit4]   2>   "base_url":"https://127.0.0.1:64116",
   [junit4]   2>   "node_name":"127.0.0.1:64116_",
   [junit4]   2>   "numShards":"2",
   [junit4]   2>   "state":"down",
   [junit4]   2>   "shard":null,
   [junit4]   2>   "collection":"collection1",
   [junit4]   2>   "operation":"state"} current state version: 3
   [junit4]   2> 857716 INFO  (OverseerStateUpdate-95346062328791045-127.0.0.1:64089_-n_0000000000) [n:127.0.0.1:64089_    ] o.a.s.c.o.ReplicaMutator Update state numShards=2 message={
   [junit4]   2>   "core":"collection1",
   [junit4]   2>   "roles":null,
   [junit4]   2>   "base_url":"https://127.0.0.1:64116",
   [junit4]   2>   "node_name":"127.0.0.1:64116_",
   [junit4]   2>   "numShards":"2",
   [junit4]   2>   "state":"down",
   [junit4]   2>   "shard":null,
   [junit4]   2>   "collection":"collection1",
   [junit4]   2>   "operation":"state"}
   [junit4]   2> 857716 INFO  (OverseerStateUpdate-95346062328791045-127.0.0.1:64089_-n_0000000000) [n:127.0.0.1:64089_    ] o.a.s.c.o.ClusterStateMutator building a new cName: collection1
   [junit4]   2> 857716 INFO  (OverseerStateUpdate-95346062328791045-127.0.0.1:64089_-n_0000000000) [n:127.0.0.1:64089_    ] o.a.s.c.o.ReplicaMutator Assigning new node to shard shard=shard2
   [junit4]   2> 857819 INFO  (zkCallback-1397-thread-1) [    ] o.a.s.c.c.ZkStateReader A cluster state change: [WatchedEvent state:SyncConnected type:NodeDataChanged path:/clusterstate.json], has occurred - updating... (live nodes size: [2])
   [junit4]   2> 857819 INFO  (zkCallback-1395-thread-1-processing-n:127.0.0.1:64089_) [n:127.0.0.1:64089_    ] o.a.s.c.c.ZkStateReader A cluster state change: [WatchedEvent state:SyncConnected type:NodeDataChanged path:/clusterstate.json], has occurred - updating... (live nodes size: [2])
   [junit4]   2> 857819 INFO  (zkCallback-1402-thread-1-processing-n:127.0.0.1:64116_) [n:127.0.0.1:64116_    ] o.a.s.c.c.ZkStateReader A cluster state change: [WatchedEvent state:SyncConnected type:NodeDataChanged path:/clusterstate.json], has occurred - updating... (live nodes size: [2])
   [junit4]   2> 858716 INFO  (coreLoadExecutor-3968-thread-1-processing-n:127.0.0.1:64116_) [n:127.0.0.1:64116_ c:collection1   x:collection1] o.a.s.c.ZkController waiting to find shard id in clusterstate for collection1
   [junit4]   2> 858716 INFO  (coreLoadExecutor-3968-thread-1-processing-n:127.0.0.1:64116_) [n:127.0.0.1:64116_ c:collection1   x:collection1] o.a.s.c.ZkController Check for collection zkNode:collection1
   [junit4]   2> 858716 INFO  (coreLoadExecutor-3968-thread-1-processing-n:127.0.0.1:64116_) [n:127.0.0.1:64116_ c:collection1   x:collection1] o.a.s.c.ZkController Collection zkNode exists
   [junit4]   2> 858716 INFO  (coreLoadExecutor-3968-thread-1-processing-n:127.0.0.1:64116_) [n:127.0.0.1:64116_ c:collection1   x:collection1] o.a.s.c.c.ZkStateReader Load collection config from: [/collections/collection1]
   [junit4]   2> 858717 INFO  (coreLoadExecutor-3968-thread-1-processing-n:127.0.0.1:64116_) [n:127.0.0.1:64116_ c:collection1   x:collection1] o.a.s.c.c.ZkStateReader path=[/collections/collection1] [configName]=[conf1] specified config exists in ZooKeeper
   [junit4]   2> 858717 INFO  (coreLoadExecutor-3968-thread-1-processing-n:127.0.0.1:64116_) [n:127.0.0.1:64116_ c:collection1   x:collection1] o.a.s.c.SolrResourceLoader new SolrResourceLoader for directory: 'C:\Users\JenkinsSlave\workspace\Lucene-Solr-5.x-Windows\solr\build\solr-core\test\J1\temp\solr.cloud.DistribDocExpirationUpdateProcessorTest_FA5843C9B6C99326-001\shard-1-001\cores\collection1'
   [junit4]   2> 858717 INFO  (coreLoadExecutor-3968-thread-1-processing-n:127.0.0.1:64116_) [n:127.0.0.1:64116_ c:collection1   x:collection1] o.a.s.c.SolrResourceLoader JNDI not configured for solr (NoInitialContextEx)
   [junit4]   2> 858717 INFO  (coreLoadExecutor-3968-thread-1-processing-n:127.0.0.1:64116_) [n:127.0.0.1:64116_ c:collection1   x:collection1] o.a.s.c.SolrResourceLoader solr home defaulted to 'solr/' (could not find system property or JNDI)
   [junit4]   2> 858719 INFO  (coreLoadExecutor-3968-thread-1-processing-n:127.0.0.1:64116_) [n:127.0.0.1:64116_ c:collection1   x:collection1] o.a.s.c.Config loaded config solrconfig.xml with version 0 
   [junit4]   2> 858725 INFO  (coreLoadExecutor-3968-thread-1-processing-n:127.0.0.1:64116_) [n:127.0.0.1:64116_ c:collection1   x:collection1] o.a.s.c.SolrConfig current version of requestparams : -1
   [junit4]   2> 858727 INFO  (coreLoadExecutor-3968-thread-1-processing-n:127.0.0.1:64116_) [n:127.0.0.1:64116_ c:collection1   x:collection1] o.a.s.c.SolrConfig Using Lucene MatchVersion: 5.5.0
   [junit4]   2> 858731 INFO  (coreLoadExecutor-3968-thread-1-processing-n:127.0.0.1:64116_) [n:127.0.0.1:64116_ c:collection1   x:collection1] o.a.s.c.SolrConfig Loaded SolrConfig: solrconfig.xml
   [junit4]   2> 858735 INFO  (coreLoadExecutor-3968-thread-1-processing-n:127.0.0.1:64116_) [n:127.0.0.1:64116_ c:collection1   x:collection1] o.a.s.s.IndexSchema [collection1] Schema name=test
   [junit4]   2> 858797 INFO  (coreLoadExecutor-3968-thread-1-processing-n:127.0.0.1:64116_) [n:127.0.0.1:64116_ c:collection1   x:collection1] o.a.s.s.IndexSchema default search field in schema is text
   [junit4]   2> 858797 INFO  (coreLoadExecutor-3968-thread-1-processing-n:127.0.0.1:64116_) [n:127.0.0.1:64116_ c:collection1   x:collection1] o.a.s.s.IndexSchema unique key field: id
   [junit4]   2> 858798 INFO  (coreLoadExecutor-3968-thread-1-processing-n:127.0.0.1:64116_) [n:127.0.0.1:64116_ c:collection1   x:collection1] o.a.s.s.FileExchangeRateProvider Reloading exchange rates from file currency.xml
   [junit4]   2> 858800 INFO  (coreLoadExecutor-3968-thread-1-processing-n:127.0.0.1:64116_) [n:127.0.0.1:64116_ c:collection1   x:collection1] o.a.s.s.FileExchangeRateProvider Reloading exchange rates from file currency.xml
   [junit4]   2> 858817 INFO  (coreLoadExecutor-3968-thread-1-processing-n:127.0.0.1:64116_) [n:127.0.0.1:64116_ c:collection1   x:collection1] o.a.s.c.ConfigSetProperties Did not find ConfigSet properties, assuming default properties: Can't find resource 'configsetprops.json' in classpath or '/configs/conf1', cwd=C:\Users\JenkinsSlave\workspace\Lucene-Solr-5.x-Windows\solr\build\solr-core\test\J1
   [junit4]   2> 858817 INFO  (coreLoadExecutor-3968-thread-1-processing-n:127.0.0.1:64116_) [n:127.0.0.1:64116_ c:collection1   x:collection1] o.a.s.c.CoreContainer Creating SolrCore 'collection1' using configuration from collection collection1
   [junit4]   2> 858817 INFO  (coreLoadExecutor-3968-thread-1-processing-n:127.0.0.1:64116_) [n:127.0.0.1:64116_ c:collection1 s:shard2 r:core_node1 x:collection1] o.a.s.c.SolrCore org.apache.solr.core.MockDirectoryFactory
   [junit4]   2> 858817 INFO  (coreLoadExecutor-3968-thread-1-processing-n:127.0.0.1:64116_) [n:127.0.0.1:64116_ c:collection1 s:shard2 r:core_node1 x:collection1] o.a.s.c.SolrCore [[collection1] ] Opening new SolrCore at [C:\Users\JenkinsSlave\workspace\Lucene-Solr-5.x-Windows\solr\build\solr-core\test\J1\temp\solr.cloud.DistribDocExpirationUpdateProcessorTest_FA5843C9B6C99326-001\shard-1-001\cores\collection1], dataDir=[C:\Users\JenkinsSlave\workspace\Lucene-Solr-5.x-Windows\solr\build\solr-core\test\J1\..\..\..\..\..\..\..\..\..\Users\JenkinsSlave\workspace\Lucene-Solr-5.x-Windows\solr\build\solr-core\test\J1\temp\solr.cloud.DistribDocExpirationUpdateProcessorTest_FA5843C9B6C99326-001\shard-1-001\cores\collection1\data\]
   [junit4]   2> 858817 INFO  (coreLoadExecutor-3968-thread-1-processing-n:127.0.0.1:64116_) [n:127.0.0.1:64116_ c:collection1 s:shard2 r:core_node1 x:collection1] o.a.s.c.SolrCore JMX monitoring not detected for core: collection1
   [junit4]   2> 858817 INFO  (coreLoadExecutor-3968-thread-1-processing-n:127.0.0.1:64116_) [n:127.0.0.1:64116_ c:collection1 s:shard2 r:core_node1 x:collection1] o.a.s.c.CachingDirectoryFactory return new directory for C:\Users\JenkinsSlave\workspace\Lucene-Solr-5.x-Windows\solr\build\solr-core\test\J1\..\..\..\..\..\..\..\..\..\Users\JenkinsSlave\workspace\Lucene-Solr-5.x-Windows\solr\build\solr-core\test\J1\temp\solr.cloud.DistribDocExpirationUpdateProcessorTest_FA5843C9B6C99326-001\shard-1-001\cores\collection1\data\
   [junit4]   2> 858817 INFO  (coreLoadExecutor-3968-thread-1-processing-n:127.0.0.1:64116_) [n:127.0.0.1:64116_ c:collection1 s:shard2 r:core_node1 x:collection1] o.a.s.c.SolrCore New index directory detected: old=null new=C:\Users\JenkinsSlave\workspace\Lucene-Solr-5.x-Windows\solr\build\solr-core\test\J1\..\..\..\..\..\..\..\..\..\Users\JenkinsSlave\workspace\Lucene-Solr-5.x-Windows\solr\build\solr-core\test\J1\temp

[...truncated too long message...]

[junit4]   2>         at org.apache.solr.SolrTestCaseJ4.endTrackingSearchers(SolrTestCaseJ4.java:442)
   [junit4]   2>         at org.apache.solr.SolrTestCaseJ4.afterClass(SolrTestCaseJ4.java:226)
   [junit4]   2>         at sun.reflect.GeneratedMethodAccessor20.invoke(Unknown Source)
   [junit4]   2>         at sun.reflect.DelegatingMethodAccessorImpl.invoke(DelegatingMethodAccessorImpl.java:43)
   [junit4]   2>         at java.lang.reflect.Method.invoke(Method.java:498)
   [junit4]   2>         at com.carrotsearch.randomizedtesting.RandomizedRunner.invoke(RandomizedRunner.java:1764)
   [junit4]   2>         at com.carrotsearch.randomizedtesting.RandomizedRunner$7.evaluate(RandomizedRunner.java:834)
   [junit4]   2>         at com.carrotsearch.randomizedtesting.rules.StatementAdapter.evaluate(StatementAdapter.java:36)
   [junit4]   2>         at com.carrotsearch.randomizedtesting.rules.SystemPropertiesRestoreRule$1.evaluate(SystemPropertiesRestoreRule.java:57)
   [junit4]   2>         at org.apache.lucene.util.AbstractBeforeAfterRule$1.evaluate(AbstractBeforeAfterRule.java:45)
   [junit4]   2>         at com.carrotsearch.randomizedtesting.rules.StatementAdapter.evaluate(StatementAdapter.java:36)
   [junit4]   2>         at org.apache.lucene.util.TestRuleStoreClassName$1.evaluate(TestRuleStoreClassName.java:41)
   [junit4]   2>         at com.carrotsearch.randomizedtesting.rules.NoShadowingOrOverridesOnMethodsRule$1.evaluate(NoShadowingOrOverridesOnMethodsRule.java:40)
   [junit4]   2>         at com.carrotsearch.randomizedtesting.rules.NoShadowingOrOverridesOnMethodsRule$1.evaluate(NoShadowingOrOverridesOnMethodsRule.java:40)
   [junit4]   2>         at com.carrotsearch.randomizedtesting.rules.StatementAdapter.evaluate(StatementAdapter.java:36)
   [junit4]   2>         at com.carrotsearch.randomizedtesting.rules.StatementAdapter.evaluate(StatementAdapter.java:36)
   [junit4]   2>         at com.carrotsearch.randomizedtesting.rules.StatementAdapter.evaluate(StatementAdapter.java:36)
   [junit4]   2>         at org.apache.lucene.util.TestRuleAssertionsRequired$1.evaluate(TestRuleAssertionsRequired.java:53)
   [junit4]   2>         at org.apache.lucene.util.TestRuleMarkFailure$1.evaluate(TestRuleMarkFailure.java:47)
   [junit4]   2>         at org.apache.lucene.util.TestRuleIgnoreAfterMaxFailures$1.evaluate(TestRuleIgnoreAfterMaxFailures.java:64)
   [junit4]   2>         at org.apache.lucene.util.TestRuleIgnoreTestSuites$1.evaluate(TestRuleIgnoreTestSuites.java:54)
   [junit4]   2>         at com.carrotsearch.randomizedtesting.rules.StatementAdapter.evaluate(StatementAdapter.java:36)
   [junit4]   2>         at com.carrotsearch.randomizedtesting.ThreadLeakControl$StatementRunner.run(ThreadLeakControl.java:367)
   [junit4]   2>         at java.lang.Thread.run(Thread.java:745)
   [junit4]   2>    2) Thread[id=13005, name=searcherExecutor-6390-thread-1, state=WAITING, group=TGRP-TestLazyCores]
   [junit4]   2>         at sun.misc.Unsafe.park(Native Method)
   [junit4]   2>         at java.util.concurrent.locks.LockSupport.park(LockSupport.java:175)
   [junit4]   2>         at java.util.concurrent.locks.AbstractQueuedSynchronizer$ConditionObject.await(AbstractQueuedSynchronizer.java:2039)
   [junit4]   2>         at java.util.concurrent.LinkedBlockingQueue.take(LinkedBlockingQueue.java:442)
   [junit4]   2>         at java.util.concurrent.ThreadPoolExecutor.getTask(ThreadPoolExecutor.java:1067)
   [junit4]   2>         at java.util.concurrent.ThreadPoolExecutor.runWorker(ThreadPoolExecutor.java:1127)
   [junit4]   2>         at java.util.concurrent.ThreadPoolExecutor$Worker.run(ThreadPoolExecutor.java:617)
   [junit4]   2>         at java.lang.Thread.run(Thread.java:745)
   [junit4]   2> NOTE: test params are: codec=Asserting(Lucene54): {v_t=Lucene50(blocksize=128), id=Lucene50(blocksize=128), v_s=PostingsFormat(name=Memory doPackFST= true), v_f=BlockTreeOrds(blocksize=128)}, docValues:{}, sim=DefaultSimilarity, locale=ko, timezone=Europe/Vienna
   [junit4]   2> NOTE: Windows 7 6.1 amd64/Oracle Corporation 1.8.0_72 (64-bit)/cpus=3,threads=3,free=185341432,total=518979584
   [junit4]   2> NOTE: All tests run in this JVM: [QueryParsingTest, PluginInfoTest, TestRealTimeGet, ConjunctionSolrSpellCheckerTest, CustomCollectionTest, SolrPluginUtilsTest, NotRequiredUniqueKeyTest, TestSchemaSimilarityResource, HighlighterConfigTest, CoreAdminHandlerTest, TestDocBasedVersionConstraints, TestReqParamsAPI, TestRequestForwarding, TestHdfsUpdateLog, TestPerFieldSimilarity, TestSolrJ, TestDynamicFieldCollectionResource, TestSolrIndexConfig, CoreMergeIndexesAdminHandlerTest, TestConfigSetsAPIZkFailure, FileBasedSpellCheckerTest, TestFastOutputStream, DeleteLastCustomShardedReplicaTest, HdfsWriteToMultipleCollectionsTest, SpellCheckCollatorTest, TestSortingResponseWriter, TestSolr4Spatial, FullSolrCloudDistribCmdsTest, TestDistributedGrouping, TestSolrConfigHandlerCloud, TestManagedSchemaFieldTypeResource, ZkSolrClientTest, DirectUpdateHandlerOptimizeTest, TestSerializedLuceneMatchVersion, TestLRUStatsCache, CSVRequestHandlerTest, TestConfigReload, TestDynamicLoading, TestFreeTextSuggestions, ConnectionReuseTest, TestRecovery, PKIAuthenticationIntegrationTest, BigEndianAscendingWordDeserializerTest, DefaultValueUpdateProcessorTest, HdfsChaosMonkeySafeLeaderTest, TestManagedSchemaDynamicFieldResource, TestReversedWildcardFilterFactory, TestCharFilters, SearchHandlerTest, TestCollationFieldDocValues, AutoCommitTest, LoggingHandlerTest, ResponseLogComponentTest, TestDistributedMissingSort, TestTrie, OverseerRolesTest, ConvertedLegacyTest, TestFieldSortValues, TlogReplayBufferedWhileIndexingTest, SolrCmdDistributorTest, TestFastWriter, TestPKIAuthenticationPlugin, TestRecoveryHdfs, TestBinaryResponseWriter, HdfsNNFailoverTest, BlockJoinFacetRandomTest, TestUseDocValuesAsStored2, RemoteQueryErrorTest, WordBreakSolrSpellCheckerTest, DirectSolrConnectionTest, SolrCloudExampleTest, FacetPivotSmallTest, SharedFSAutoReplicaFailoverUtilsTest, BlockCacheTest, SuggesterWFSTTest, AsyncCallRequestStatusResponseTest, TestRebalanceLeaders, BasicDistributedZk2Test, UUIDUpdateProcessorFallbackTest, TestSuggestSpellingConverter, TestZkChroot, TestStandardQParsers, TestValueSourceCache, TestReload, BitVectorTest, HdfsBasicDistributedZkTest, FieldMutatingUpdateProcessorTest, SecurityConfHandlerTest, MergeStrategyTest, BadIndexSchemaTest, SolrInfoMBeanTest, CloudExitableDirectoryReaderTest, UniqFieldsUpdateProcessorFactoryTest, SuggesterTSTTest, TestRTGBase, TestCrossCoreJoin, DistributedQueueTest, LukeRequestHandlerTest, StatsComponentTest, JavabinLoaderTest, TestIndexingPerformance, TestDFISimilarityFactory, TestLeaderInitiatedRecoveryThread, TestSmileRequest, SortByFunctionTest, TestSha256AuthenticationProvider, DistribDocExpirationUpdateProcessorTest, TermVectorComponentTest, DistributedDebugComponentTest, TestBlendedInfixSuggestions, CoreAdminCreateDiscoverTest, ResourceLoaderTest, SignatureUpdateProcessorFactoryTest, CollectionsAPIDistributedZkTest, HdfsSyncSliceTest, MultiTermTest, DateRangeFieldTest, TestSolrCLIRunExample, RestartWhileUpdatingTest, DistributedFacetPivotLargeTest, OverseerTaskQueueTest, ZkStateWriterTest, TestRandomFaceting, SortSpecParsingTest, BasicZkTest, IndexSchemaRuntimeFieldTest, AddSchemaFieldsUpdateProcessorFactoryTest, SuggesterTest, TestOrdValues, CollectionsAPIAsyncDistributedZkTest, TestFieldTypeCollectionResource, EchoParamsTest, TestJettySolrRunner, ZkNodePropsTest, DistanceFunctionTest, TestQueryUtils, TestFiltering, TestSolrDynamicMBean, BasicDistributedZkTest, ChaosMonkeySafeLeaderTest, SyncSliceTest, OpenCloseCoreStressTest, OverseerTest, LeaderElectionIntegrationTest, ShardRoutingTest, ClusterStateUpdateTest, TestRandomDVFaceting, ShardRoutingCustomTest, TestFaceting, TermVectorComponentDistributedTest, TestJoin, TestStressVersions, DistributedTermsComponentTest, TestRangeQuery, SpellCheckComponentTest, QueryElevationComponentTest, PeerSyncTest, TestSort, TestFunctionQuery, BasicFunctionalityTest, TestLazyCores]
   [junit4]   2> NOTE: reproduce with: ant test  -Dtestcase=TestLazyCores -Dtests.seed=FA5843C9B6C99326 -Dtests.slow=true -Dtests.locale=ko -Dtests.timezone=Europe/Vienna -Dtests.asserts=true -Dtests.file.encoding=ISO-8859-1
   [junit4] ERROR   0.00s J1 | TestLazyCores (suite) <<<
   [junit4]    > Throwable #1: java.lang.Exception: Suite timeout exceeded (>= 7200000 msec).
   [junit4]    > 	at __randomizedtesting.SeedInfo.seed([FA5843C9B6C99326]:0)
   [junit4] Completed [566/566 (3!)] on J1 in 7251.35s, 6 tests, 2 errors <<< FAILURES!

[...truncated 13 lines...]
BUILD FAILED
C:\Users\JenkinsSlave\workspace\Lucene-Solr-5.x-Windows\build.xml:750: The following error occurred while executing this line:
C:\Users\JenkinsSlave\workspace\Lucene-Solr-5.x-Windows\build.xml:694: The following error occurred while executing this line:
C:\Users\JenkinsSlave\workspace\Lucene-Solr-5.x-Windows\build.xml:59: The following error occurred while executing this line:
C:\Users\JenkinsSlave\workspace\Lucene-Solr-5.x-Windows\solr\build.xml:233: The following error occurred while executing this line:
C:\Users\JenkinsSlave\workspace\Lucene-Solr-5.x-Windows\solr\common-build.xml:534: The following error occurred while executing this line:
C:\Users\JenkinsSlave\workspace\Lucene-Solr-5.x-Windows\lucene\common-build.xml:1477: The following error occurred while executing this line:
C:\Users\JenkinsSlave\workspace\Lucene-Solr-5.x-Windows\lucene\common-build.xml:1033: There were test failures: 566 suites (7 ignored), 2266 tests, 2 suite-level errors, 1 error, 1 failure, 95 ignored (51 assumptions) [seed: FA5843C9B6C99326]

Total time: 166 minutes 34 seconds
Build step 'Invoke Ant' marked build as failure
Archiving artifacts
[WARNINGS] Skipping publisher since build result is FAILURE
Recording test results
Email was triggered for: Failure - Any
Sending email for trigger: Failure - Any



Mime
View raw message