lucene-dev mailing list archives

Site index · List index
Message view « Date » · « Thread »
Top « Date » · « Thread »
From Policeman Jenkins Server <jenk...@thetaphi.de>
Subject [JENKINS] Lucene-Solr-trunk-Linux (32bit/jdk1.8.0_72) - Build # 15915 - Still Failing!
Date Wed, 17 Feb 2016 22:10:30 GMT
Build: http://jenkins.thetaphi.de/job/Lucene-Solr-trunk-Linux/15915/
Java: 32bit/jdk1.8.0_72 -client -XX:+UseSerialGC

1 tests failed.
FAILED:  org.apache.solr.util.TestSolrCLIRunExample.testInteractiveSolrCloudExample

Error Message:
Could not find a healthy node to handle the request.

Stack Trace:
org.apache.solr.common.SolrException: Could not find a healthy node to handle the request.
	at __randomizedtesting.SeedInfo.seed([513DD2224788F90B:8A4C32E870FD3C6D]:0)
	at org.apache.solr.client.solrj.impl.CloudSolrClient.sendRequest(CloudSolrClient.java:1084)
	at org.apache.solr.client.solrj.impl.CloudSolrClient.requestWithRetryOnStaleState(CloudSolrClient.java:870)
	at org.apache.solr.client.solrj.impl.CloudSolrClient.requestWithRetryOnStaleState(CloudSolrClient.java:953)
	at org.apache.solr.client.solrj.impl.CloudSolrClient.requestWithRetryOnStaleState(CloudSolrClient.java:953)
	at org.apache.solr.client.solrj.impl.CloudSolrClient.requestWithRetryOnStaleState(CloudSolrClient.java:953)
	at org.apache.solr.client.solrj.impl.CloudSolrClient.requestWithRetryOnStaleState(CloudSolrClient.java:953)
	at org.apache.solr.client.solrj.impl.CloudSolrClient.requestWithRetryOnStaleState(CloudSolrClient.java:953)
	at org.apache.solr.client.solrj.impl.CloudSolrClient.request(CloudSolrClient.java:806)
	at org.apache.solr.client.solrj.SolrRequest.process(SolrRequest.java:149)
	at org.apache.solr.client.solrj.SolrClient.commit(SolrClient.java:484)
	at org.apache.solr.client.solrj.SolrClient.commit(SolrClient.java:463)
	at org.apache.solr.util.TestSolrCLIRunExample.testInteractiveSolrCloudExample(TestSolrCLIRunExample.java:446)
	at sun.reflect.NativeMethodAccessorImpl.invoke0(Native Method)
	at sun.reflect.NativeMethodAccessorImpl.invoke(NativeMethodAccessorImpl.java:62)
	at sun.reflect.DelegatingMethodAccessorImpl.invoke(DelegatingMethodAccessorImpl.java:43)
	at java.lang.reflect.Method.invoke(Method.java:498)
	at com.carrotsearch.randomizedtesting.RandomizedRunner.invoke(RandomizedRunner.java:1764)
	at com.carrotsearch.randomizedtesting.RandomizedRunner$8.evaluate(RandomizedRunner.java:871)
	at com.carrotsearch.randomizedtesting.RandomizedRunner$9.evaluate(RandomizedRunner.java:907)
	at com.carrotsearch.randomizedtesting.RandomizedRunner$10.evaluate(RandomizedRunner.java:921)
	at com.carrotsearch.randomizedtesting.rules.SystemPropertiesRestoreRule$1.evaluate(SystemPropertiesRestoreRule.java:57)
	at org.apache.lucene.util.TestRuleSetupTeardownChained$1.evaluate(TestRuleSetupTeardownChained.java:49)
	at org.apache.lucene.util.AbstractBeforeAfterRule$1.evaluate(AbstractBeforeAfterRule.java:45)
	at org.apache.lucene.util.TestRuleThreadAndTestName$1.evaluate(TestRuleThreadAndTestName.java:48)
	at org.apache.lucene.util.TestRuleIgnoreAfterMaxFailures$1.evaluate(TestRuleIgnoreAfterMaxFailures.java:64)
	at org.apache.lucene.util.TestRuleMarkFailure$1.evaluate(TestRuleMarkFailure.java:47)
	at com.carrotsearch.randomizedtesting.rules.StatementAdapter.evaluate(StatementAdapter.java:36)
	at com.carrotsearch.randomizedtesting.ThreadLeakControl$StatementRunner.run(ThreadLeakControl.java:367)
	at com.carrotsearch.randomizedtesting.ThreadLeakControl.forkTimeoutingTask(ThreadLeakControl.java:809)
	at com.carrotsearch.randomizedtesting.ThreadLeakControl$3.evaluate(ThreadLeakControl.java:460)
	at com.carrotsearch.randomizedtesting.RandomizedRunner.runSingleTest(RandomizedRunner.java:880)
	at com.carrotsearch.randomizedtesting.RandomizedRunner$5.evaluate(RandomizedRunner.java:781)
	at com.carrotsearch.randomizedtesting.RandomizedRunner$6.evaluate(RandomizedRunner.java:816)
	at com.carrotsearch.randomizedtesting.RandomizedRunner$7.evaluate(RandomizedRunner.java:827)
	at com.carrotsearch.randomizedtesting.rules.StatementAdapter.evaluate(StatementAdapter.java:36)
	at com.carrotsearch.randomizedtesting.rules.SystemPropertiesRestoreRule$1.evaluate(SystemPropertiesRestoreRule.java:57)
	at org.apache.lucene.util.AbstractBeforeAfterRule$1.evaluate(AbstractBeforeAfterRule.java:45)
	at com.carrotsearch.randomizedtesting.rules.StatementAdapter.evaluate(StatementAdapter.java:36)
	at org.apache.lucene.util.TestRuleStoreClassName$1.evaluate(TestRuleStoreClassName.java:41)
	at com.carrotsearch.randomizedtesting.rules.NoShadowingOrOverridesOnMethodsRule$1.evaluate(NoShadowingOrOverridesOnMethodsRule.java:40)
	at com.carrotsearch.randomizedtesting.rules.NoShadowingOrOverridesOnMethodsRule$1.evaluate(NoShadowingOrOverridesOnMethodsRule.java:40)
	at com.carrotsearch.randomizedtesting.rules.StatementAdapter.evaluate(StatementAdapter.java:36)
	at com.carrotsearch.randomizedtesting.rules.StatementAdapter.evaluate(StatementAdapter.java:36)
	at com.carrotsearch.randomizedtesting.rules.StatementAdapter.evaluate(StatementAdapter.java:36)
	at org.apache.lucene.util.TestRuleAssertionsRequired$1.evaluate(TestRuleAssertionsRequired.java:53)
	at org.apache.lucene.util.TestRuleMarkFailure$1.evaluate(TestRuleMarkFailure.java:47)
	at org.apache.lucene.util.TestRuleIgnoreAfterMaxFailures$1.evaluate(TestRuleIgnoreAfterMaxFailures.java:64)
	at org.apache.lucene.util.TestRuleIgnoreTestSuites$1.evaluate(TestRuleIgnoreTestSuites.java:54)
	at com.carrotsearch.randomizedtesting.rules.StatementAdapter.evaluate(StatementAdapter.java:36)
	at com.carrotsearch.randomizedtesting.ThreadLeakControl$StatementRunner.run(ThreadLeakControl.java:367)
	at java.lang.Thread.run(Thread.java:745)




Build Log:
[...truncated 12238 lines...]
   [junit4] Suite: org.apache.solr.util.TestSolrCLIRunExample
   [junit4]   2> Creating dataDir: /home/jenkins/workspace/Lucene-Solr-trunk-Linux/solr/build/solr-core/test/J0/temp/solr.util.TestSolrCLIRunExample_513DD2224788F90B-001/init-core-data-001
   [junit4]   2> 1952233 INFO  (TEST-TestSolrCLIRunExample.testInteractiveSolrCloudExample-seed#[513DD2224788F90B]) [    ] o.a.s.SolrTestCaseJ4 ###Starting testInteractiveSolrCloudExample
   [junit4]   2> 1952277 INFO  (TEST-TestSolrCLIRunExample.testInteractiveSolrCloudExample-seed#[513DD2224788F90B]) [    ] o.a.s.c.ZkTestServer STARTING ZK TEST SERVER
   [junit4]   2> 1952277 INFO  (Thread-6385) [    ] o.a.s.c.ZkTestServer client port:0.0.0.0/0.0.0.0:0
   [junit4]   2> 1952277 INFO  (Thread-6385) [    ] o.a.s.c.ZkTestServer Starting server
   [junit4]   2> 1952377 INFO  (TEST-TestSolrCLIRunExample.testInteractiveSolrCloudExample-seed#[513DD2224788F90B]) [    ] o.a.s.c.ZkTestServer start zk server on port:37065
   [junit4]   2> 1952378 INFO  (TEST-TestSolrCLIRunExample.testInteractiveSolrCloudExample-seed#[513DD2224788F90B]) [    ] o.a.s.c.c.SolrZkClient Using default ZkCredentialsProvider
   [junit4]   2> 1952386 INFO  (TEST-TestSolrCLIRunExample.testInteractiveSolrCloudExample-seed#[513DD2224788F90B]) [    ] o.a.s.c.c.ConnectionManager Waiting for client to connect to ZooKeeper
   [junit4]   2> 1952388 INFO  (zkCallback-2574-thread-1) [    ] o.a.s.c.c.ConnectionManager Watcher org.apache.solr.common.cloud.ConnectionManager@16a204 name:ZooKeeperConnection Watcher:127.0.0.1:37065 got event WatchedEvent state:SyncConnected type:None path:null path:null type:None
   [junit4]   2> 1952388 INFO  (TEST-TestSolrCLIRunExample.testInteractiveSolrCloudExample-seed#[513DD2224788F90B]) [    ] o.a.s.c.c.ConnectionManager Client is connected to ZooKeeper
   [junit4]   2> 1952388 INFO  (TEST-TestSolrCLIRunExample.testInteractiveSolrCloudExample-seed#[513DD2224788F90B]) [    ] o.a.s.c.c.SolrZkClient Using default ZkACLProvider
   [junit4]   2> 1952388 INFO  (TEST-TestSolrCLIRunExample.testInteractiveSolrCloudExample-seed#[513DD2224788F90B]) [    ] o.a.s.c.c.SolrZkClient makePath: /solr/solr.xml
   [junit4]   2> 1952392 INFO  (jetty-launcher-2573-thread-1) [    ] o.e.j.s.Server jetty-9.3.6.v20151106
   [junit4]   2> 1952394 INFO  (jetty-launcher-2573-thread-1) [    ] o.e.j.s.h.ContextHandler Started o.e.j.s.ServletContextHandler@eca78a{/solr,null,AVAILABLE}
   [junit4]   2> 1952394 INFO  (jetty-launcher-2573-thread-1) [    ] o.e.j.s.ServerConnector Started ServerConnector@190dbf1{HTTP/1.1,[http/1.1]}{127.0.0.1:47056}
   [junit4]   2> 1952394 INFO  (jetty-launcher-2573-thread-1) [    ] o.e.j.s.Server Started @1953562ms
   [junit4]   2> 1952394 INFO  (jetty-launcher-2573-thread-1) [    ] o.a.s.c.s.e.JettySolrRunner Jetty properties: {hostContext=/solr, hostPort=47056}
   [junit4]   2> 1952395 INFO  (jetty-launcher-2573-thread-1) [    ] o.a.s.s.SolrDispatchFilter SolrDispatchFilter.init(): sun.misc.Launcher$AppClassLoader@1d16e93
   [junit4]   2> 1952395 INFO  (jetty-launcher-2573-thread-1) [    ] o.a.s.c.SolrResourceLoader new SolrResourceLoader for directory: '/home/jenkins/workspace/Lucene-Solr-trunk-Linux/solr/build/solr-core/test/J0/temp/solr.util.TestSolrCLIRunExample_513DD2224788F90B-001/tempDir-002/node1'
   [junit4]   2> 1952395 INFO  (jetty-launcher-2573-thread-1) [    ] o.a.s.c.SolrResourceLoader JNDI not configured for solr (NoInitialContextEx)
   [junit4]   2> 1952395 INFO  (jetty-launcher-2573-thread-1) [    ] o.a.s.c.SolrResourceLoader solr home defaulted to 'solr/' (could not find system property or JNDI)
   [junit4]   2> 1952395 INFO  (jetty-launcher-2573-thread-1) [    ] o.a.s.c.c.SolrZkClient Using default ZkCredentialsProvider
   [junit4]   2> 1952396 INFO  (jetty-launcher-2573-thread-1) [    ] o.a.s.c.c.ConnectionManager Waiting for client to connect to ZooKeeper
   [junit4]   2> 1952398 INFO  (zkCallback-2575-thread-1) [    ] o.a.s.c.c.ConnectionManager Watcher org.apache.solr.common.cloud.ConnectionManager@faefaf name:ZooKeeperConnection Watcher:127.0.0.1:37065/solr got event WatchedEvent state:SyncConnected type:None path:null path:null type:None
   [junit4]   2> 1952399 INFO  (jetty-launcher-2573-thread-1) [    ] o.a.s.c.c.ConnectionManager Client is connected to ZooKeeper
   [junit4]   2> 1952399 INFO  (jetty-launcher-2573-thread-1) [    ] o.a.s.c.c.SolrZkClient Using default ZkACLProvider
   [junit4]   2> 1952400 INFO  (jetty-launcher-2573-thread-1) [    ] o.a.s.s.SolrDispatchFilter solr.xml found in ZooKeeper. Loading...
   [junit4]   2> 1952429 INFO  (jetty-launcher-2573-thread-1) [    ] o.a.s.c.CorePropertiesLocator Config-defined core root directory: /home/jenkins/workspace/Lucene-Solr-trunk-Linux/solr/build/solr-core/test/J0/temp/solr.util.TestSolrCLIRunExample_513DD2224788F90B-001/tempDir-002/node1
   [junit4]   2> 1952429 INFO  (jetty-launcher-2573-thread-1) [    ] o.a.s.c.CoreContainer New CoreContainer 11294959
   [junit4]   2> 1952429 INFO  (jetty-launcher-2573-thread-1) [    ] o.a.s.c.CoreContainer Loading cores into CoreContainer [instanceDir=/home/jenkins/workspace/Lucene-Solr-trunk-Linux/solr/build/solr-core/test/J0/temp/solr.util.TestSolrCLIRunExample_513DD2224788F90B-001/tempDir-002/node1]
   [junit4]   2> 1952430 WARN  (jetty-launcher-2573-thread-1) [    ] o.a.s.c.CoreContainer Couldn't add files from /home/jenkins/workspace/Lucene-Solr-trunk-Linux/solr/build/solr-core/test/J0/temp/solr.util.TestSolrCLIRunExample_513DD2224788F90B-001/tempDir-002/node1/lib to classpath: /home/jenkins/workspace/Lucene-Solr-trunk-Linux/solr/build/solr-core/test/J0/temp/solr.util.TestSolrCLIRunExample_513DD2224788F90B-001/tempDir-002/node1/lib
   [junit4]   2> 1952430 INFO  (jetty-launcher-2573-thread-1) [    ] o.a.s.h.c.HttpShardHandlerFactory created with socketTimeout : 600000,connTimeout : 60000,maxConnectionsPerHost : 20,maxConnections : 10000,corePoolSize : 0,maximumPoolSize : 2147483647,maxThreadIdleTime : 5,sizeOfQueue : -1,fairnessPolicy : false,useRetries : false,
   [junit4]   2> 1952431 INFO  (jetty-launcher-2573-thread-1) [    ] o.a.s.u.UpdateShardHandler Creating UpdateShardHandler HTTP client with params: socketTimeout=600000&connTimeout=60000&retry=true
   [junit4]   2> 1952431 INFO  (jetty-launcher-2573-thread-1) [    ] o.a.s.l.LogWatcher SLF4J impl is org.slf4j.impl.Log4jLoggerFactory
   [junit4]   2> 1952431 INFO  (jetty-launcher-2573-thread-1) [    ] o.a.s.l.LogWatcher Registering Log Listener [Log4j (org.slf4j.impl.Log4jLoggerFactory)]
   [junit4]   2> 1952432 INFO  (jetty-launcher-2573-thread-1) [    ] o.a.s.c.ZkContainer Zookeeper client=127.0.0.1:37065/solr
   [junit4]   2> 1952432 INFO  (jetty-launcher-2573-thread-1) [    ] o.a.s.c.ZkController zkHost includes chroot
   [junit4]   2> 1952432 INFO  (jetty-launcher-2573-thread-1) [    ] o.a.s.c.c.SolrZkClient Using default ZkCredentialsProvider
   [junit4]   2> 1952432 INFO  (jetty-launcher-2573-thread-1) [    ] o.a.s.c.c.ConnectionManager Waiting for client to connect to ZooKeeper
   [junit4]   2> 1952433 INFO  (zkCallback-2578-thread-1) [    ] o.a.s.c.c.ConnectionManager Watcher org.apache.solr.common.cloud.ConnectionManager@1d1287b name:ZooKeeperConnection Watcher:127.0.0.1:37065 got event WatchedEvent state:SyncConnected type:None path:null path:null type:None
   [junit4]   2> 1952433 INFO  (jetty-launcher-2573-thread-1) [    ] o.a.s.c.c.ConnectionManager Client is connected to ZooKeeper
   [junit4]   2> 1952433 INFO  (jetty-launcher-2573-thread-1) [    ] o.a.s.c.c.SolrZkClient Using default ZkACLProvider
   [junit4]   2> 1952434 INFO  (jetty-launcher-2573-thread-1) [n:localhost:47056_solr    ] o.a.s.c.c.ConnectionManager Waiting for client to connect to ZooKeeper
   [junit4]   2> 1952435 INFO  (zkCallback-2579-thread-1-processing-n:localhost:47056_solr) [n:localhost:47056_solr    ] o.a.s.c.c.ConnectionManager Watcher org.apache.solr.common.cloud.ConnectionManager@18f3f44 name:ZooKeeperConnection Watcher:127.0.0.1:37065/solr got event WatchedEvent state:SyncConnected type:None path:null path:null type:None
   [junit4]   2> 1952436 INFO  (jetty-launcher-2573-thread-1) [n:localhost:47056_solr    ] o.a.s.c.c.ConnectionManager Client is connected to ZooKeeper
   [junit4]   2> 1952436 INFO  (jetty-launcher-2573-thread-1) [n:localhost:47056_solr    ] o.a.s.c.c.SolrZkClient makePath: /overseer/queue
   [junit4]   2> 1952445 INFO  (jetty-launcher-2573-thread-1) [n:localhost:47056_solr    ] o.a.s.c.c.SolrZkClient makePath: /overseer/collection-queue-work
   [junit4]   2> 1952452 INFO  (jetty-launcher-2573-thread-1) [n:localhost:47056_solr    ] o.a.s.c.c.SolrZkClient makePath: /overseer/collection-map-running
   [junit4]   2> 1952453 INFO  (jetty-launcher-2573-thread-1) [n:localhost:47056_solr    ] o.a.s.c.c.SolrZkClient makePath: /overseer/collection-map-completed
   [junit4]   2> 1952454 INFO  (jetty-launcher-2573-thread-1) [n:localhost:47056_solr    ] o.a.s.c.c.SolrZkClient makePath: /overseer/collection-map-failure
   [junit4]   2> 1952455 INFO  (jetty-launcher-2573-thread-1) [n:localhost:47056_solr    ] o.a.s.c.c.SolrZkClient makePath: /live_nodes
   [junit4]   2> 1952456 INFO  (jetty-launcher-2573-thread-1) [n:localhost:47056_solr    ] o.a.s.c.c.SolrZkClient makePath: /collections
   [junit4]   2> 1952457 INFO  (jetty-launcher-2573-thread-1) [n:localhost:47056_solr    ] o.a.s.c.c.SolrZkClient makePath: /aliases.json
   [junit4]   2> 1952458 INFO  (jetty-launcher-2573-thread-1) [n:localhost:47056_solr    ] o.a.s.c.c.SolrZkClient makePath: /clusterstate.json
   [junit4]   2> 1952469 INFO  (jetty-launcher-2573-thread-1) [n:localhost:47056_solr    ] o.a.s.c.c.SolrZkClient makePath: /security.json
   [junit4]   2> 1952470 INFO  (jetty-launcher-2573-thread-1) [n:localhost:47056_solr    ] o.a.s.c.ZkController Register node as live in ZooKeeper:/live_nodes/localhost:47056_solr
   [junit4]   2> 1952470 INFO  (jetty-launcher-2573-thread-1) [n:localhost:47056_solr    ] o.a.s.c.c.SolrZkClient makePath: /live_nodes/localhost:47056_solr
   [junit4]   2> 1952471 INFO  (jetty-launcher-2573-thread-1) [n:localhost:47056_solr    ] o.a.s.c.c.SolrZkClient makePath: /overseer_elect
   [junit4]   2> 1952472 INFO  (jetty-launcher-2573-thread-1) [n:localhost:47056_solr    ] o.a.s.c.c.SolrZkClient makePath: /overseer_elect/election
   [junit4]   2> 1952473 INFO  (jetty-launcher-2573-thread-1) [n:localhost:47056_solr    ] o.a.s.c.Overseer Overseer (id=null) closing
   [junit4]   2> 1952473 INFO  (jetty-launcher-2573-thread-1) [n:localhost:47056_solr    ] o.a.s.c.LeaderElector Joined leadership election with path: /overseer_elect/election/95403836193112067-localhost:47056_solr-n_0000000000
   [junit4]   2> 1952474 INFO  (jetty-launcher-2573-thread-1) [n:localhost:47056_solr    ] o.a.s.c.OverseerElectionContext I am going to be the leader localhost:47056_solr
   [junit4]   2> 1952474 INFO  (jetty-launcher-2573-thread-1) [n:localhost:47056_solr    ] o.a.s.c.c.SolrZkClient makePath: /overseer_elect/leader
   [junit4]   2> 1952475 INFO  (jetty-launcher-2573-thread-1) [n:localhost:47056_solr    ] o.a.s.c.Overseer Overseer (id=95403836193112067-localhost:47056_solr-n_0000000000) starting
   [junit4]   2> 1952476 INFO  (jetty-launcher-2573-thread-1) [n:localhost:47056_solr    ] o.a.s.c.c.SolrZkClient makePath: /overseer/queue-work
   [junit4]   2> 1952479 INFO  (jetty-launcher-2573-thread-1) [n:localhost:47056_solr    ] o.a.s.c.OverseerAutoReplicaFailoverThread Starting OverseerAutoReplicaFailoverThread autoReplicaFailoverWorkLoopDelay=10000 autoReplicaFailoverWaitAfterExpiration=30000 autoReplicaFailoverBadNodeExpiration=60000
   [junit4]   2> 1952479 INFO  (OverseerCollectionConfigSetProcessor-95403836193112067-localhost:47056_solr-n_0000000000) [n:localhost:47056_solr    ] o.a.s.c.OverseerTaskProcessor Process current queue of overseer operations
   [junit4]   2> 1952479 INFO  (jetty-launcher-2573-thread-1) [n:localhost:47056_solr    ] o.a.s.c.c.ZkStateReader Updating cluster state from ZooKeeper... 
   [junit4]   2> 1952480 INFO  (OverseerStateUpdate-95403836193112067-localhost:47056_solr-n_0000000000) [n:localhost:47056_solr    ] o.a.s.c.Overseer Starting to work on the main queue
   [junit4]   2> 1952554 INFO  (jetty-launcher-2573-thread-1) [n:localhost:47056_solr    ] o.a.s.c.CoreContainer Security conf doesn't exist. Skipping setup for authorization module.
   [junit4]   2> 1952554 INFO  (jetty-launcher-2573-thread-1) [n:localhost:47056_solr    ] o.a.s.c.CoreContainer No authentication plugin used.
   [junit4]   2> 1952555 INFO  (jetty-launcher-2573-thread-1) [n:localhost:47056_solr    ] o.a.s.c.CorePropertiesLocator Looking for core definitions underneath /home/jenkins/workspace/Lucene-Solr-trunk-Linux/solr/build/solr-core/test/J0/temp/solr.util.TestSolrCLIRunExample_513DD2224788F90B-001/tempDir-002/node1
   [junit4]   2> 1952555 INFO  (jetty-launcher-2573-thread-1) [n:localhost:47056_solr    ] o.a.s.c.CorePropertiesLocator Found 0 core definitions
   [junit4]   2> 1952556 INFO  (jetty-launcher-2573-thread-1) [n:localhost:47056_solr    ] o.a.s.s.SolrDispatchFilter user.dir=/home/jenkins/workspace/Lucene-Solr-trunk-Linux/solr/build/solr-core/test/J0
   [junit4]   2> 1952556 INFO  (jetty-launcher-2573-thread-1) [n:localhost:47056_solr    ] o.a.s.s.SolrDispatchFilter SolrDispatchFilter.init() done
   [junit4]   2> 1952556 INFO  (TEST-TestSolrCLIRunExample.testInteractiveSolrCloudExample-seed#[513DD2224788F90B]) [    ] o.a.s.c.c.SolrZkClient Using default ZkCredentialsProvider
   [junit4]   2> 1952557 INFO  (TEST-TestSolrCLIRunExample.testInteractiveSolrCloudExample-seed#[513DD2224788F90B]) [    ] o.a.s.c.c.ConnectionManager Waiting for client to connect to ZooKeeper
   [junit4]   2> 1952558 INFO  (zkCallback-2580-thread-1) [    ] o.a.s.c.c.ConnectionManager Watcher org.apache.solr.common.cloud.ConnectionManager@b6a063 name:ZooKeeperConnection Watcher:127.0.0.1:37065 got event WatchedEvent state:SyncConnected type:None path:null path:null type:None
   [junit4]   2> 1952558 INFO  (TEST-TestSolrCLIRunExample.testInteractiveSolrCloudExample-seed#[513DD2224788F90B]) [    ] o.a.s.c.c.ConnectionManager Client is connected to ZooKeeper
   [junit4]   2> 1952559 INFO  (TEST-TestSolrCLIRunExample.testInteractiveSolrCloudExample-seed#[513DD2224788F90B]) [    ] o.a.s.c.c.SolrZkClient Using default ZkACLProvider
   [junit4]   2> 1952579 INFO  (qtp25598653-16176) [n:localhost:47056_solr    ] o.a.s.s.HttpSolrCall [admin] webapp=null path=/admin/info/system params={wt=json} status=0 QTime=12
   [junit4]   2> 1952588 INFO  (qtp25598653-16177) [n:localhost:47056_solr    ] o.a.s.h.a.CollectionsHandler Invoked Collection Action :clusterstatus with params action=CLUSTERSTATUS&wt=json and sendToOCPQueue=true
   [junit4]   2> 1952589 INFO  (qtp25598653-16177) [n:localhost:47056_solr    ] o.a.s.s.HttpSolrCall [admin] webapp=null path=/admin/collections params={action=CLUSTERSTATUS&wt=json} status=0 QTime=1
   [junit4]   2> 1952590 INFO  (TEST-TestSolrCLIRunExample.testInteractiveSolrCloudExample-seed#[513DD2224788F90B]) [    ] o.a.s.c.c.SolrZkClient Using default ZkCredentialsProvider
   [junit4]   2> 1952590 INFO  (TEST-TestSolrCLIRunExample.testInteractiveSolrCloudExample-seed#[513DD2224788F90B]) [    ] o.a.s.c.c.ConnectionManager Waiting for client to connect to ZooKeeper
   [junit4]   2> 1952591 INFO  (zkCallback-2583-thread-1) [    ] o.a.s.c.c.ConnectionManager Watcher org.apache.solr.common.cloud.ConnectionManager@1aff132 name:ZooKeeperConnection Watcher:127.0.0.1:37065/solr got event WatchedEvent state:SyncConnected type:None path:null path:null type:None
   [junit4]   2> 1952592 INFO  (TEST-TestSolrCLIRunExample.testInteractiveSolrCloudExample-seed#[513DD2224788F90B]) [    ] o.a.s.c.c.ConnectionManager Client is connected to ZooKeeper
   [junit4]   2> 1952592 INFO  (TEST-TestSolrCLIRunExample.testInteractiveSolrCloudExample-seed#[513DD2224788F90B]) [    ] o.a.s.c.c.SolrZkClient Using default ZkACLProvider
   [junit4]   2> 1952592 INFO  (TEST-TestSolrCLIRunExample.testInteractiveSolrCloudExample-seed#[513DD2224788F90B]) [    ] o.a.s.c.c.ZkStateReader Updating cluster state from ZooKeeper... 
   [junit4]   2> 1952595 INFO  (qtp25598653-16177) [n:localhost:47056_solr    ] o.a.s.h.a.CollectionsHandler Invoked Collection Action :list with params action=list&wt=json and sendToOCPQueue=true
   [junit4]   2> 1952596 INFO  (qtp25598653-16177) [n:localhost:47056_solr    ] o.a.s.s.HttpSolrCall [admin] webapp=null path=/admin/collections params={action=list&wt=json} status=0 QTime=0
   [junit4]   2> 1952614 INFO  (qtp25598653-16173) [n:localhost:47056_solr    ] o.a.s.s.HttpSolrCall [admin] webapp=null path=/admin/info/system params={wt=json} status=0 QTime=12
   [junit4]   2> 1952619 INFO  (qtp25598653-16172) [n:localhost:47056_solr    ] o.a.s.h.a.CollectionsHandler Invoked Collection Action :clusterstatus with params action=CLUSTERSTATUS&wt=json and sendToOCPQueue=true
   [junit4]   2> 1952620 INFO  (qtp25598653-16172) [n:localhost:47056_solr    ] o.a.s.s.HttpSolrCall [admin] webapp=null path=/admin/collections params={action=CLUSTERSTATUS&wt=json} status=0 QTime=1
   [junit4]   2> 1952621 INFO  (TEST-TestSolrCLIRunExample.testInteractiveSolrCloudExample-seed#[513DD2224788F90B]) [    ] o.a.s.c.c.SolrZkClient Using default ZkCredentialsProvider
   [junit4]   2> 1952621 INFO  (TEST-TestSolrCLIRunExample.testInteractiveSolrCloudExample-seed#[513DD2224788F90B]) [    ] o.a.s.c.c.ConnectionManager Waiting for client to connect to ZooKeeper
   [junit4]   2> 1952637 INFO  (zkCallback-2585-thread-1) [    ] o.a.s.c.c.ConnectionManager Watcher org.apache.solr.common.cloud.ConnectionManager@1d30602 name:ZooKeeperConnection Watcher:127.0.0.1:37065/solr got event WatchedEvent state:SyncConnected type:None path:null path:null type:None
   [junit4]   2> 1952638 INFO  (TEST-TestSolrCLIRunExample.testInteractiveSolrCloudExample-seed#[513DD2224788F90B]) [    ] o.a.s.c.c.ConnectionManager Client is connected to ZooKeeper
   [junit4]   2> 1952638 INFO  (TEST-TestSolrCLIRunExample.testInteractiveSolrCloudExample-seed#[513DD2224788F90B]) [    ] o.a.s.c.c.SolrZkClient Using default ZkACLProvider
   [junit4]   2> 1952638 INFO  (TEST-TestSolrCLIRunExample.testInteractiveSolrCloudExample-seed#[513DD2224788F90B]) [    ] o.a.s.c.c.ZkStateReader Updating cluster state from ZooKeeper... 
   [junit4]   2> 1952640 INFO  (TEST-TestSolrCLIRunExample.testInteractiveSolrCloudExample-seed#[513DD2224788F90B]) [    ] o.a.s.c.c.SolrZkClient makePath: /configs/testCloudExamplePrompt/protwords.txt
   [junit4]   2> 1952642 INFO  (TEST-TestSolrCLIRunExample.testInteractiveSolrCloudExample-seed#[513DD2224788F90B]) [    ] o.a.s.c.c.SolrZkClient makePath: /configs/testCloudExamplePrompt/solrconfig.xml
   [junit4]   2> 1952643 INFO  (TEST-TestSolrCLIRunExample.testInteractiveSolrCloudExample-seed#[513DD2224788F90B]) [    ] o.a.s.c.c.SolrZkClient makePath: /configs/testCloudExamplePrompt/stopwords.txt
   [junit4]   2> 1952645 INFO  (TEST-TestSolrCLIRunExample.testInteractiveSolrCloudExample-seed#[513DD2224788F90B]) [    ] o.a.s.c.c.SolrZkClient makePath: /configs/testCloudExamplePrompt/lang/stopwords_ar.txt
   [junit4]   2> 1952646 INFO  (TEST-TestSolrCLIRunExample.testInteractiveSolrCloudExample-seed#[513DD2224788F90B]) [    ] o.a.s.c.c.SolrZkClient makePath: /configs/testCloudExamplePrompt/lang/stopwords_el.txt
   [junit4]   2> 1952648 INFO  (TEST-TestSolrCLIRunExample.testInteractiveSolrCloudExample-seed#[513DD2224788F90B]) [    ] o.a.s.c.c.SolrZkClient makePath: /configs/testCloudExamplePrompt/lang/stopwords_ja.txt
   [junit4]   2> 1952650 INFO  (TEST-TestSolrCLIRunExample.testInteractiveSolrCloudExample-seed#[513DD2224788F90B]) [    ] o.a.s.c.c.SolrZkClient makePath: /configs/testCloudExamplePrompt/lang/stopwords_gl.txt
   [junit4]   2> 1952651 INFO  (TEST-TestSolrCLIRunExample.testInteractiveSolrCloudExample-seed#[513DD2224788F90B]) [    ] o.a.s.c.c.SolrZkClient makePath: /configs/testCloudExamplePrompt/lang/contractions_fr.txt
   [junit4]   2> 1952654 INFO  (TEST-TestSolrCLIRunExample.testInteractiveSolrCloudExample-seed#[513DD2224788F90B]) [    ] o.a.s.c.c.SolrZkClient makePath: /configs/testCloudExamplePrompt/lang/stopwords_fr.txt
   [junit4]   2> 1952656 INFO  (TEST-TestSolrCLIRunExample.testInteractiveSolrCloudExample-seed#[513DD2224788F90B]) [    ] o.a.s.c.c.SolrZkClient makePath: /configs/testCloudExamplePrompt/lang/stopwords_nl.txt
   [junit4]   2> 1952661 INFO  (TEST-TestSolrCLIRunExample.testInteractiveSolrCloudExample-seed#[513DD2224788F90B]) [    ] o.a.s.c.c.SolrZkClient makePath: /configs/testCloudExamplePrompt/lang/stopwords_cz.txt
   [junit4]   2> 1952663 INFO  (TEST-TestSolrCLIRunExample.testInteractiveSolrCloudExample-seed#[513DD2224788F90B]) [    ] o.a.s.c.c.SolrZkClient makePath: /configs/testCloudExamplePrompt/lang/stopwords_ca.txt
   [junit4]   2> 1952668 INFO  (TEST-TestSolrCLIRunExample.testInteractiveSolrCloudExample-seed#[513DD2224788F90B]) [    ] o.a.s.c.c.SolrZkClient makePath: /configs/testCloudExamplePrompt/lang/stopwords_de.txt
   [junit4]   2> 1952669 INFO  (TEST-TestSolrCLIRunExample.testInteractiveSolrCloudExample-seed#[513DD2224788F90B]) [    ] o.a.s.c.c.SolrZkClient makePath: /configs/testCloudExamplePrompt/lang/contractions_ga.txt
   [junit4]   2> 1952671 INFO  (TEST-TestSolrCLIRunExample.testInteractiveSolrCloudExample-seed#[513DD2224788F90B]) [    ] o.a.s.c.c.SolrZkClient makePath: /configs/testCloudExamplePrompt/lang/stopwords_da.txt
   [junit4]   2> 1952672 INFO  (TEST-TestSolrCLIRunExample.testInteractiveSolrCloudExample-seed#[513DD2224788F90B]) [    ] o.a.s.c.c.SolrZkClient makePath: /configs/testCloudExamplePrompt/lang/stopwords_no.txt
   [junit4]   2> 1952673 INFO  (TEST-TestSolrCLIRunExample.testInteractiveSolrCloudExample-seed#[513DD2224788F90B]) [    ] o.a.s.c.c.SolrZkClient makePath: /configs/testCloudExamplePrompt/lang/stopwords_es.txt
   [junit4]   2> 1952674 INFO  (TEST-TestSolrCLIRunExample.testInteractiveSolrCloudExample-seed#[513DD2224788F90B]) [    ] o.a.s.c.c.SolrZkClient makePath: /configs/testCloudExamplePrompt/lang/stopwords_sv.txt
   [junit4]   2> 1952675 INFO  (TEST-TestSolrCLIRunExample.testInteractiveSolrCloudExample-seed#[513DD2224788F90B]) [    ] o.a.s.c.c.SolrZkClient makePath: /configs/testCloudExamplePrompt/lang/stopwords_fi.txt
   [junit4]   2> 1952676 INFO  (TEST-TestSolrCLIRunExample.testInteractiveSolrCloudExample-seed#[513DD2224788F90B]) [    ] o.a.s.c.c.SolrZkClient makePath: /configs/testCloudExamplePrompt/lang/stopwords_hu.txt
   [junit4]   2> 1952696 INFO  (TEST-TestSolrCLIRunExample.testInteractiveSolrCloudExample-seed#[513DD2224788F90B]) [    ] o.a.s.c.c.SolrZkClient makePath: /configs/testCloudExamplePrompt/lang/stopwords_bg.txt
   [junit4]   2> 1952697 INFO  (TEST-TestSolrCLIRunExample.testInteractiveSolrCloudExample-seed#[513DD2224788F90B]) [    ] o.a.s.c.c.SolrZkClient makePath: /configs/testCloudExamplePrompt/lang/stopwords_fa.txt
   [junit4]   2> 1952698 INFO  (TEST-TestSolrCLIRunExample.testInteractiveSolrCloudExample-seed#[513DD2224788F90B]) [    ] o.a.s.c.c.SolrZkClient makePath: /configs/testCloudExamplePrompt/lang/contractions_it.txt
   [junit4]   2> 1952699 INFO  (TEST-TestSolrCLIRunExample.testInteractiveSolrCloudExample-seed#[513DD2224788F90B]) [    ] o.a.s.c.c.SolrZkClient makePath: /configs/testCloudExamplePrompt/lang/stopwords_eu.txt
   [junit4]   2> 1952700 INFO  (TEST-TestSolrCLIRunExample.testInteractiveSolrCloudExample-seed#[513DD2224788F90B]) [    ] o.a.s.c.c.SolrZkClient makePath: /configs/testCloudExamplePrompt/lang/stopwords_ro.txt
   [junit4]   2> 1952701 INFO  (TEST-TestSolrCLIRunExample.testInteractiveSolrCloudExample-seed#[513DD2224788F90B]) [    ] o.a.s.c.c.SolrZkClient makePath: /configs/testCloudExamplePrompt/lang/stopwords_ga.txt
   [junit4]   2> 1952702 INFO  (TEST-TestSolrCLIRunExample.testInteractiveSolrCloudExample-seed#[513DD2224788F90B]) [    ] o.a.s.c.c.SolrZkClient makePath: /configs/testCloudExamplePrompt/lang/stemdict_nl.txt
   [junit4]   2> 1952704 INFO  (TEST-TestSolrCLIRunExample.testInteractiveSolrCloudExample-seed#[513DD2224788F90B]) [    ] o.a.s.c.c.SolrZkClient makePath: /configs/testCloudExamplePrompt/lang/stopwords_hy.txt
   [junit4]   2> 1952705 INFO  (TEST-TestSolrCLIRunExample.testInteractiveSolrCloudExample-seed#[513DD2224788F90B]) [    ] o.a.s.c.c.SolrZkClient makePath: /configs/testCloudExamplePrompt/lang/contractions_ca.txt
   [junit4]   2> 1952717 INFO  (TEST-TestSolrCLIRunExample.testInteractiveSolrCloudExample-seed#[513DD2224788F90B]) [    ] o.a.s.c.c.SolrZkClient makePath: /configs/testCloudExamplePrompt/lang/stoptags_ja.txt
   [junit4]   2> 1952726 INFO  (TEST-TestSolrCLIRunExample.testInteractiveSolrCloudExample-seed#[513DD2224788F90B]) [    ] o.a.s.c.c.SolrZkClient makePath: /configs/testCloudExamplePrompt/lang/stopwords_lv.txt
   [junit4]   2> 1952728 INFO  (TEST-TestSolrCLIRunExample.testInteractiveSolrCloudExample-seed#[513DD2224788F90B]) [    ] o.a.s.c.c.SolrZkClient makePath: /configs/testCloudExamplePrompt/lang/userdict_ja.txt
   [junit4]   2> 1952729 INFO  (TEST-TestSolrCLIRunExample.testInteractiveSolrCloudExample-seed#[513DD2224788F90B]) [    ] o.a.s.c.c.SolrZkClient makePath: /configs/testCloudExamplePrompt/lang/stopwords_tr.txt
   [junit4]   2> 1952730 INFO  (TEST-TestSolrCLIRunExample.testInteractiveSolrCloudExample-seed#[513DD2224788F90B]) [    ] o.a.s.c.c.SolrZkClient makePath: /configs/testCloudExamplePrompt/lang/stopwords_it.txt
   [junit4]   2> 1952731 INFO  (TEST-TestSolrCLIRunExample.testInteractiveSolrCloudExample-seed#[513DD2224788F90B]) [    ] o.a.s.c.c.SolrZkClient makePath: /configs/testCloudExamplePrompt/lang/stopwords_ru.txt
   [junit4]   2> 1952732 INFO  (TEST-TestSolrCLIRunExample.testInteractiveSolrCloudExample-seed#[513DD2224788F90B]) [    ] o.a.s.c.c.SolrZkClient makePath: /configs/testCloudExamplePrompt/lang/stopwords_th.txt
   [junit4]   2> 1952733 INFO  (TEST-TestSolrCLIRunExample.testInteractiveSolrCloudExample-seed#[513DD2224788F90B]) [    ] o.a.s.c.c.SolrZkClient makePath: /configs/testCloudExamplePrompt/lang/hyphenations_ga.txt
   [junit4]   2> 1952734 INFO  (TEST-TestSolrCLIRunExample.testInteractiveSolrCloudExample-seed#[513DD2224788F90B]) [    ] o.a.s.c.c.SolrZkClient makePath: /configs/testCloudExamplePrompt/lang/stopwords_en.txt
   [junit4]   2> 1952734 INFO  (TEST-TestSolrCLIRunExample.testInteractiveSolrCloudExample-seed#[513DD2224788F90B]) [    ] o.a.s.c.c.SolrZkClient makePath: /configs/testCloudExamplePrompt/lang/stopwords_hi.txt
   [junit4]   2> 1952735 INFO  (TEST-TestSolrCLIRunExample.testInteractiveSolrCloudExample-seed#[513DD2224788F90B]) [    ] o.a.s.c.c.SolrZkClient makePath: /configs/testCloudExamplePrompt/lang/stopwords_pt.txt
   [junit4]   2> 1952738 INFO  (TEST-TestSolrCLIRunExample.testInteractiveSolrCloudExample-seed#[513DD2224788F90B]) [    ] o.a.s.c.c.SolrZkClient makePath: /configs/testCloudExamplePrompt/lang/stopwords_id.txt
   [junit4]   2> 1952740 INFO  (TEST-TestSolrCLIRunExample.testInteractiveSolrCloudExample-seed#[513DD2224788F90B]) [    ] o.a.s.c.c.SolrZkClient makePath: /configs/testCloudExamplePrompt/synonyms.txt
   [junit4]   2> 1952741 INFO  (TEST-TestSolrCLIRunExample.testInteractiveSolrCloudExample-seed#[513DD2224788F90B]) [    ] o.a.s.c.c.SolrZkClient makePath: /configs/testCloudExamplePrompt/elevate.xml
   [junit4]   2> 1952743 INFO  (TEST-TestSolrCLIRunExample.testInteractiveSolrCloudExample-seed#[513DD2224788F90B]) [    ] o.a.s.c.c.SolrZkClient makePath: /configs/testCloudExamplePrompt/currency.xml
   [junit4]   2> 1952744 INFO  (TEST-TestSolrCLIRunExample.testInteractiveSolrCloudExample-seed#[513DD2224788F90B]) [    ] o.a.s.c.c.SolrZkClient makePath: /configs/testCloudExamplePrompt/params.json
   [junit4]   2> 1952746 INFO  (TEST-TestSolrCLIRunExample.testInteractiveSolrCloudExample-seed#[513DD2224788F90B]) [    ] o.a.s.c.c.SolrZkClient makePath: /configs/testCloudExamplePrompt/managed-schema
   [junit4]   2> 1952751 INFO  (qtp25598653-16174) [n:localhost:47056_solr    ] o.a.s.h.a.CollectionsHandler Invoked Collection Action :list with params action=list&wt=json and sendToOCPQueue=true
   [junit4]   2> 1952751 INFO  (qtp25598653-16174) [n:localhost:47056_solr    ] o.a.s.s.HttpSolrCall [admin] webapp=null path=/admin/collections params={action=list&wt=json} status=0 QTime=0
   [junit4]   2> 1952754 INFO  (qtp25598653-16172) [n:localhost:47056_solr    ] o.a.s.h.a.CollectionsHandler Invoked Collection Action :create with params replicationFactor=2&maxShardsPerNode=4&collection.configName=testCloudExamplePrompt&name=testCloudExamplePrompt&action=CREATE&numShards=2&wt=json and sendToOCPQueue=true
   [junit4]   2> 1952757 INFO  (OverseerCollectionConfigSetProcessor-95403836193112067-localhost:47056_solr-n_0000000000) [n:localhost:47056_solr    ] o.a.s.c.OverseerTaskProcessor Overseer Collection Message Handler: Get the message id:/overseer/collection-queue-work/qn-0000000000 message:{
   [junit4]   2>   "name":"testCloudExamplePrompt",
   [junit4]   2>   "fromApi":"true",
   [junit4]   2>   "replicationFactor":"2",
   [junit4]   2>   "collection.configName":"testCloudExamplePrompt",
   [junit4]   2>   "numShards":"2",
   [junit4]   2>   "maxShardsPerNode":"4",
   [junit4]   2>   "stateFormat":"2",
   [junit4]   2>   "operation":"create"}
   [junit4]   2> 1952761 INFO  (OverseerThreadFactory-8004-thread-1-processing-n:localhost:47056_solr) [n:localhost:47056_solr    ] o.a.s.c.OverseerCollectionMessageHandler OverseerCollectionMessageHandler.processMessage : create , {
   [junit4]   2>   "name":"testCloudExamplePrompt",
   [junit4]   2>   "fromApi":"true",
   [junit4]   2>   "replicationFactor":"2",
   [junit4]   2>   "collection.configName":"testCloudExamplePrompt",
   [junit4]   2>   "numShards":"2",
   [junit4]   2>   "maxShardsPerNode":"4",
   [junit4]   2>   "stateFormat":"2",
   [junit4]   2>   "operation":"create"}
   [junit4]   2> 1952762 INFO  (OverseerThreadFactory-8004-thread-1-processing-n:localhost:47056_solr) [n:localhost:47056_solr    ] o.a.s.c.OverseerCollectionMessageHandler Create collection testCloudExamplePrompt
   [junit4]   2> 1952762 WARN  (OverseerThreadFactory-8004-thread-1-processing-n:localhost:47056_solr) [n:localhost:47056_solr    ] o.a.s.c.OverseerCollectionMessageHandler Specified replicationFactor of 2 on collection testCloudExamplePrompt is higher than or equal to the number of Solr instances currently live or live and part of your createNodeSet(1). It's unusual to run two replica of the same slice on the same Solr-instance.
   [junit4]   2> 1952762 INFO  (OverseerThreadFactory-8004-thread-1-processing-n:localhost:47056_solr) [n:localhost:47056_solr    ] o.a.s.c.OverseerCollectionMessageHandler creating collections conf node /collections/testCloudExamplePrompt 
   [junit4]   2> 1952763 INFO  (OverseerThreadFactory-8004-thread-1-processing-n:localhost:47056_solr) [n:localhost:47056_solr    ] o.a.s.c.c.SolrZkClient makePath: /collections/testCloudExamplePrompt
   [junit4]   2> 1952763 INFO  (zkCallback-2585-thread-1) [    ] o.a.s.c.c.ZkStateReader A collections change: [WatchedEvent state:SyncConnected type:NodeChildrenChanged path:/collections], has occurred - updating...
   [junit4]   2> 1952764 INFO  (zkCallback-2579-thread-1-processing-n:localhost:47056_solr) [n:localhost:47056_solr    ] o.a.s.c.c.ZkStateReader A collections change: [WatchedEvent state:SyncConnected type:NodeChildrenChanged path:/collections], has occurred - updating...
   [junit4]   2> 1952765 INFO  (OverseerStateUpdate-95403836193112067-localhost:47056_solr-n_0000000000) [n:localhost:47056_solr    ] o.a.s.c.Overseer processMessage: queueSize: 1, message = {
   [junit4]   2>   "name":"testCloudExamplePrompt",
   [junit4]   2>   "fromApi":"true",
   [junit4]   2>   "replicationFactor":"2",
   [junit4]   2>   "collection.configName":"testCloudExamplePrompt",
   [junit4]   2>   "numShards":"2",
   [junit4]   2>   "maxShardsPerNode":"4",
   [junit4]   2>   "stateFormat":"2",
   [junit4]   2>   "operation":"create"} current state version: 0
   [junit4]   2> 1952765 INFO  (OverseerStateUpdate-95403836193112067-localhost:47056_solr-n_0000000000) [n:localhost:47056_solr    ] o.a.s.c.o.ClusterStateMutator building a new cName: testCloudExamplePrompt
   [junit4]   2> 1952766 INFO  (OverseerStateUpdate-95403836193112067-localhost:47056_solr-n_0000000000) [n:localhost:47056_solr    ] o.a.s.c.o.ZkStateWriter going to create_collection /collections/testCloudExamplePrompt/state.json
   [junit4]   2> 1952866 INFO  (OverseerThreadFactory-8004-thread-1-processing-n:localhost:47056_solr) [n:localhost:47056_solr    ] o.a.s.c.OverseerCollectionMessageHandler Creating SolrCores for new collection testCloudExamplePrompt, shardNames [shard1, shard2] , replicationFactor : 2
   [junit4]   2> 1952866 INFO  (OverseerThreadFactory-8004-thread-1-processing-n:localhost:47056_solr) [n:localhost:47056_solr    ] o.a.s.c.OverseerCollectionMessageHandler Creating core testCloudExamplePrompt_shard1_replica2 as part of shard shard1 of collection testCloudExamplePrompt on localhost:47056_solr
   [junit4]   2> 1952867 INFO  (OverseerThreadFactory-8004-thread-1-processing-n:localhost:47056_solr) [n:localhost:47056_solr    ] o.a.s.c.OverseerCollectionMessageHandler Creating core testCloudExamplePrompt_shard2_replica1 as part of shard shard2 of collection testCloudExamplePrompt on localhost:47056_solr
   [junit4]   2> 1952867 INFO  (OverseerThreadFactory-8004-thread-1-processing-n:localhost:47056_solr) [n:localhost:47056_solr    ] o.a.s.c.OverseerCollectionMessageHandler Creating core testCloudExamplePrompt_shard2_replica2 as part of shard shard2 of collection testCloudExamplePrompt on localhost:47056_solr
   [junit4]   2> 1952868 INFO  (OverseerThreadFactory-8004-thread-1-processing-n:localhost:47056_solr) [n:localhost:47056_solr    ] o.a.s.c.OverseerCollectionMessageHandler Creating core testCloudExamplePrompt_shard1_replica1 as part of shard shard1 of collection testCloudExamplePrompt on localhost:47056_solr
   [junit4]   2> 1952870 INFO  (qtp25598653-16178) [n:localhost:47056_solr    ] o.a.s.h.a.CoreAdminOperation core create command qt=/admin/cores&collection.configName=testCloudExamplePrompt&name=testCloudExamplePrompt_shard2_replica1&action=CREATE&numShards=2&collection=testCloudExamplePrompt&shard=shard2&wt=javabin&version=2
   [junit4]   2> 1952870 INFO  (qtp25598653-16177) [n:localhost:47056_solr    ] o.a.s.h.a.CoreAdminOperation core create command qt=/admin/cores&collection.configName=testCloudExamplePrompt&name=testCloudExamplePrompt_shard2_replica2&action=CREATE&numShards=2&collection=testCloudExamplePrompt&shard=shard2&wt=javabin&version=2
   [junit4]   2> 1952870 INFO  (qtp25598653-16173) [n:localhost:47056_solr    ] o.a.s.h.a.CoreAdminOperation core create command qt=/admin/cores&collection.configName=testCloudExamplePrompt&name=testCloudExamplePrompt_shard1_replica2&action=CREATE&numShards=2&collection=testCloudExamplePrompt&shard=shard1&wt=javabin&version=2
   [junit4]   2> 1952870 INFO  (qtp25598653-16177) [n:localhost:47056_solr    ] o.a.s.c.CoreDescriptor Created CoreDescriptor: {name=testCloudExamplePrompt_shard2_replica2, collection.configName=testCloudExamplePrompt, config=solrconfig.xml, transient=false, schema=schema.xml, loadOnStartup=true, configSetProperties=configsetprops.json, collection=testCloudExamplePrompt, numShards=2, dataDir=data/, shard=shard2}
   [junit4]   2> 1952870 INFO  (qtp25598653-16178) [n:localhost:47056_solr    ] o.a.s.c.CoreDescriptor Created CoreDescriptor: {name=testCloudExamplePrompt_shard2_replica1, collection.configName=testCloudExamplePrompt, config=solrconfig.xml, transient=false, schema=schema.xml, loadOnStartup=true, configSetProperties=configsetprops.json, collection=testCloudExamplePrompt, numShards=2, dataDir=data/, shard=shard2}
   [junit4]   2> 1952870 INFO  (qtp25598653-16173) [n:localhost:47056_solr    ] o.a.s.c.CoreDescriptor Created CoreDescriptor: {name=testCloudExamplePrompt_shard1_replica2, collection.configName=testCloudExamplePrompt, config=solrconfig.xml, transient=false, schema=schema.xml, loadOnStartup=true, configSetProperties=configsetprops.json, collection=testCloudExamplePrompt, numShards=2, dataDir=data/, shard=shard1}
   [junit4]   2> 1952871 INFO  (qtp25598653-16177) [n:localhost:47056_solr c:testCloudExamplePrompt s:shard2  x:testCloudExamplePrompt_shard2_replica2] o.a.s.c.ZkController publishing state=down
   [junit4]   2> 1952871 INFO  (qtp25598653-16215) [n:localhost:47056_solr    ] o.a.s.h.a.CoreAdminOperation core create command qt=/admin/cores&collection.configName=testCloudExamplePrompt&name=testCloudExamplePrompt_shard1_replica1&action=CREATE&numShards=2&collection=testCloudExamplePrompt&shard=shard1&wt=javabin&version=2
   [junit4]   2> 1952871 INFO  (qtp25598653-16178) [n:localhost:47056_solr c:testCloudExamplePrompt s:shard2  x:testCloudExamplePrompt_shard2_replica1] o.a.s.c.ZkController publishing state=down
   [junit4]   2> 1952871 INFO  (qtp25598653-16173) [n:localhost:47056_solr c:testCloudExamplePrompt s:shard1  x:testCloudExamplePrompt_shard1_replica2] o.a.s.c.ZkController publishing state=down
   [junit4]   2> 1952872 INFO  (qtp25598653-16215) [n:localhost:47056_solr    ] o.a.s.c.CoreDescriptor Created CoreDescriptor: {name=testCloudExamplePrompt_shard1_replica1, collection.configName=testCloudExamplePrompt, config=solrconfig.xml, transient=false, schema=schema.xml, loadOnStartup=true, configSetProperties=configsetprops.json, collection=testCloudExamplePrompt, numShards=2, dataDir=data/, shard=shard1}
   [junit4]   2> 1952872 INFO  (qtp25598653-16177) [n:localhost:47056_solr c:testCloudExamplePrompt s:shard2  x:testCloudExamplePrompt_shard2_replica2] o.a.s.c.ZkController Registering watch for collection testCloudExamplePrompt
   [junit4]   2> 1952872 INFO  (qtp25598653-16177) [n:localhost:47056_solr c:testCloudExamplePrompt s:shard2  x:testCloudExamplePrompt_shard2_replica2] o.a.s.c.c.ZkStateReader addZkWatch [testCloudExamplePrompt]
   [junit4]   2> 1952872 INFO  (qtp25598653-16178) [n:localhost:47056_solr c:testCloudExamplePrompt s:shard2  x:testCloudExamplePrompt_shard2_replica1] o.a.s.c.ZkController Registering watch for collection testCloudExamplePrompt
   [junit4]   2> 1952873 INFO  (qtp25598653-16178) [n:localhost:47056_solr c:testCloudExamplePrompt s:shard2  x:testCloudExamplePrompt_shard2_replica1] o.a.s.c.ZkController look for our core node name
   [junit4]   2> 1952873 INFO  (qtp25598653-16173) [n:localhost:47056_solr c:testCloudExamplePrompt s:shard1  x:testCloudExamplePrompt_shard1_replica2] o.a.s.c.ZkController Registering watch for collection testCloudExamplePrompt
   [junit4]   2> 1952873 INFO  (qtp25598653-16173) [n:localhost:47056_solr c:testCloudExamplePrompt s:shard1  x:testCloudExamplePrompt_shard1_replica2] o.a.s.c.ZkController look for our core node name
   [junit4]   2> 1952873 INFO  (qtp25598653-16177) [n:localhost:47056_solr c:testCloudExamplePrompt s:shard2  x:testCloudExamplePrompt_shard2_replica2] o.a.s.c.c.ZkStateReader Add data for [testCloudExamplePrompt] ver [0]
   [junit4]   2> 1952873 INFO  (OverseerStateUpdate-95403836193112067-localhost:47056_solr-n_0000000000) [n:localhost:47056_solr    ] o.a.s.c.Overseer processMessage: queueSize: 3, message = {
   [junit4]   2>   "core":"testCloudExamplePrompt_shard2_replica2",
   [junit4]   2>   "roles":null,
   [junit4]   2>   "base_url":"http://localhost:47056/solr",
   [junit4]   2>   "node_name":"localhost:47056_solr",
   [junit4]   2>   "numShards":"2",
   [junit4]   2>   "state":"down",
   [junit4]   2>   "shard":"shard2",
   [junit4]   2>   "collection":"testCloudExamplePrompt",
   [junit4]   2>   "operation":"state"} current state version: 0
   [junit4]   2> 1952873 INFO  (qtp25598653-16177) [n:localhost:47056_solr c:testCloudExamplePrompt s:shard2  x:testCloudExamplePrompt_shard2_replica2] o.a.s.c.ZkController look for our core node name
   [junit4]   2> 1952873 INFO  (qtp25598653-16215) [n:localhost:47056_solr c:testCloudExamplePrompt s:shard1  x:testCloudExamplePrompt_shard1_replica1] o.a.s.c.ZkController publishing state=down
   [junit4]   2> 1952873 INFO  (OverseerStateUpdate-95403836193112067-localhost:47056_solr-n_0000000000) [n:localhost:47056_solr    ] o.a.s.c.o.ReplicaMutator Update state numShards=2 message={
   [junit4]   2>   "core":"testCloudExamplePrompt_shard2_replica2",
   [junit4]   2>   "roles":null,
   [junit4]   2>   "base_url":"http://localhost:47056/solr",
   [junit4]   2>   "node_name":"localhost:47056_solr",
   [junit4]   2>   "numShards":"2",
   [junit4]   2>   "state":"down",
   [junit4]   2>   "shard":"shard2",
   [junit4]   2>   "collection":"testCloudExamplePrompt",
   [junit4]   2>   "operation":"state"}
   [junit4]   2> 1952874 INFO  (qtp25598653-16215) [n:localhost:47056_solr c:testCloudExamplePrompt s:shard1  x:testCloudExamplePrompt_shard1_replica1] o.a.s.c.ZkController Registering watch for collection testCloudExamplePrompt
   [junit4]   2> 1952874 INFO  (qtp25598653-16215) [n:localhost:47056_solr c:testCloudExamplePrompt s:shard1  x:testCloudExamplePrompt_shard1_replica1] o.a.s.c.ZkController look for our core node name
   [junit4]   2> 1952874 INFO  (OverseerStateUpdate-95403836193112067-localhost:47056_solr-n_0000000000) [n:localhost:47056_solr    ] o.a.s.c.Overseer processMessage: queueSize: 3, message = {
   [junit4]   2>   "core":"testCloudExamplePrompt_shard2_replica1",
   [junit4]   2>   "roles":null,
   [junit4]   2>   "base_url":"http://localhost:47056/solr",
   [junit4]   2>   "node_name":"localhost:47056_solr",
   [junit4]   2>   "numShards":"2",
   [junit4]   2>   "state":"down",
   [junit4]   2>   "shard":"shard2",
   [junit4]   2>   "collection":"testCloudExamplePrompt",
   [junit4]   2>   "operation":"state"} current state version: 0
   [junit4]   2> 1952875 INFO  (OverseerStateUpdate-95403836193112067-localhost:47056_solr-n_0000000000) [n:localhost:47056_solr    ] o.a.s.c.o.ReplicaMutator Update state numShards=2 message={
   [junit4]   2>   "core":"testCloudExamplePrompt_shard2_replica1",
   [junit4]   2>   "roles":null,
   [junit4]   2>   "base_url":"http://localhost:47056/solr",
   [junit4]   2>   "node_name":"localhost:47056_solr",
   [junit4]   2>   "numShards":"2",
   [junit4]   2>   "state":"down",
   [junit4]   2>   "shard":"shard2",
   [junit4]   2>   "collection":"testCloudExamplePrompt",
   [junit4]   2>   "operation":"state"}
   [junit4]   2> 1952876 INFO  (OverseerStateUpdate-95403836193112067-localhost:47056_solr-n_0000000000) [n:localhost:47056_solr    ] o.a.s.c.Overseer processMessage: queueSize: 3, message = {
   [junit4]   2>   "core":"testCloudExamplePrompt_shard1_replica2",
   [junit4]   2>   "roles":null,
   [junit4]   2>   "base_url":"http://localhost:47056/solr",
   [junit4]   2>   "node_name":"localhost:47056_solr",
   [junit4]   2>   "numShards":"2",
   [junit4]   2>   "state":"down",
   [junit4]   2>   "shard":"shard1",
   [junit4]   2>   "collection":"testCloudExamplePrompt",
   [junit4]   2>   "operation":"state"} current state version: 0
   [junit4]   2> 1952876 INFO  (OverseerStateUpdate-95403836193112067-localhost:47056_solr-n_0000000000) [n:localhost:47056_solr    ] o.a.s.c.o.ReplicaMutator Update state numShards=2 message={
   [junit4]   2>   "core":"testCloudExamplePrompt_shard1_replica2",
   [junit4]   2>   "roles":null,
   [junit4]   2>   "base_url":"http://localhost:47056/solr",
   [junit4]   2>   "node_name":"localhost:47056_solr",
   [junit4]   2>   "numShards":"2",
   [junit4]   2>   "state":"down",
   [junit4]   2>   "shard":"shard1",
   [junit4]   2>   "collection":"testCloudExamplePrompt",
   [junit4]   2>   "operation":"state"}
   [junit4]   2> 1952877 INFO  (OverseerStateUpdate-95403836193112067-localhost:47056_solr-n_0000000000) [n:localhost:47056_solr    ] o.a.s.c.Overseer processMessage: queueSize: 1, message = {
   [junit4]   2>   "core":"testCloudExamplePrompt_shard1_replica1",
   [junit4]   2>   "roles":null,
   [junit4]   2>   "base_url":"http://localhost:47056/solr",
   [junit4]   2>   "node_name":"localhost:47056_solr",
   [junit4]   2>   "numShards":"2",
   [junit4]   2>   "state":"down",
   [junit4]   2>   "shard":"shard1",
   [junit4]   2>   "collection":"testCloudExamplePrompt",
   [junit4]   2>   "operation":"state"} current state version: 0
   [junit4]   2> 1952877 INFO  (OverseerStateUpdate-95403836193112067-localhost:47056_solr-n_0000000000) [n:localhost:47056_solr    ] o.a.s.c.o.ReplicaMutator Update state numShards=2 message={
   [junit4]   2>   "core":"testCloudExamplePrompt_shard1_replica1",
   [junit4]   2>   "roles":null,
   [junit4]   2>   "base_url":"http://localhost:47056/solr",
   [junit4]   2>   "node_name":"localhost:47056_solr",
   [junit4]   2>   "numShards":"2",
   [junit4]   2>   "state":"down",
   [junit4]   2>   "shard":"shard1",
   [junit4]   2>   "collection":"testCloudExamplePrompt",
   [junit4]   2>   "operation":"state"}
   [junit4]   2> 1952979 INFO  (OverseerStateUpdate-95403836193112067-localhost:47056_solr-n_0000000000) [n:localhost:47056_solr    ] o.a.s.c.o.ZkStateWriter going to update_collection /collections/testCloudExamplePrompt/state.json version: 0
   [junit4]   2> 1952979 INFO  (zkCallback-2579-thread-1-processing-n:localhost:47056_solr) [n:localhost:47056_solr    ] o.a.s.c.c.ZkStateReader A cluster state change: [WatchedEvent state:SyncConnected type:NodeDataChanged path:/collections/testCloudExamplePrompt/state.json] for collection [testCloudExamplePrompt] has occurred - updating... (live nodes size: [1])
   [junit4]   2> 1952980 INFO  (zkCallback-2579-thread-1-processing-n:localhost:47056_solr) [n:localhost:47056_solr    ] o.a.s.c.c.ZkStateReader Updating data for [testCloudExamplePrompt] from [0] to [1]
   [junit4]   2> 1953873 INFO  (qtp25598653-16178) [n:localhost:47056_solr c:testCloudExamplePrompt s:shard2  x:testCloudExamplePrompt_shard2_replica1] o.a.s.c.ZkController waiting to find shard id in clusterstate for testCloudExamplePrompt_shard2_replica1
   [junit4]   2> 1953873 INFO  (qtp25598653-16173) [n:localhost:47056_solr c:testCloudExamplePrompt s:shard1  x:testCloudExamplePrompt_shard1_replica2] o.a.s.c.ZkController waiting to find shard id in clusterstate for testCloudExamplePrompt_shard1_replica2
   [junit4]   2> 1953873 INFO  (qtp25598653-16178) [n:localhost:47056_solr c:testCloudExamplePrompt s:shard2  x:testCloudExamplePrompt_shard2_replica1] o.a.s.c.ZkController Check for collection zkNode:testCloudExamplePrompt
   [junit4]   2> 1953873 INFO  (qtp25598653-16177) [n:localhost:47056_solr c:testCloudExamplePrompt s:shard2  x:testCloudExamplePrompt_shard2_replica2] o.a.s.c.ZkController waiting to find shard id in clusterstate for testCloudExamplePrompt_shard2_replica2
   [junit4]   2> 1953873 INFO  (qtp25598653-16177) [n:localhost:47056_solr c:testCloudExamplePrompt s:shard2  x:testCloudExamplePrompt_shard2_replica2] o.a.s.c.ZkController Check for collection zkNode:testCloudExamplePrompt
   [junit4]   2> 1953873 INFO  (qtp25598653-16173) [n:localhost:47056_solr c:testCloudExamplePrompt s:shard1  x:testCloudExamplePrompt_shard1_replica2] o.a.s.c.ZkController Check for collection zkNode:testCloudExamplePrompt
   [junit4]   2> 1953874 INFO  (qtp25598653-16178) [n:localhost:47056_solr c:testCloudExamplePrompt s:shard2  x:testCloudExamplePrompt_shard2_replica1] o.a.s.c.ZkController Collection zkNode exists
   [junit4]   2> 1953874 INFO  (qtp25598653-16177) [n:localhost:47056_solr c:testCloudExamplePrompt s:shard2  x:testCloudExamplePrompt_shard2_replica2] o.a.s.c.ZkController Collection zkNode exists
   [junit4]   2> 1953874 INFO  (qtp25598653-16178) [n:localhost:47056_solr c:testCloudExamplePrompt s:shard2  x:testCloudExamplePrompt_shard2_replica1] o.a.s.c.c.ZkStateReader Load collection config from: [/collections/testCloudExamplePrompt]
   [junit4]   2> 1953874 INFO  (qtp25598653-16215) [n:localhost:47056_solr c:testCloudExamplePrompt s:shard1  x:testCloudExamplePrompt_shard1_replica1] o.a.s.c.ZkController waiting to find shard id in clusterstate for testCloudExamplePrompt_shard1_replica1
   [junit4]   2> 1953874 INFO  (qtp25598653-16173) [n:localhost:47056_solr c:testCloudExamplePrompt s:shard1  x:testCloudExamplePrompt_shard1_replica2] o.a.s.c.ZkController Collection zkNode exists
   [junit4]   2> 1953874 INFO  (qtp25598653-16215) [n:localhost:47056_solr c:testCloudExamplePrompt s:shard1  x:testCloudExamplePrompt_shard1_replica1] o.a.s.c.ZkController Check for collection zkNode:testCloudExamplePrompt
   [junit4]   2> 1953874 INFO  (qtp25598653-16177) [n:localhost:47056_solr c:testCloudExamplePrompt s:shard2  x:testCloudExamplePrompt_shard2_replica2] o.a.s.c.c.ZkStateReader Load collection config from: [/collections/testCloudExamplePrompt]
   [junit4]   2> 1953874 INFO  (qtp25598653-16173) [n:localhost:47056_solr c:testCloudExamplePrompt s:shard1  x:testCloudExamplePrompt_shard1_replica2] o.a.s.c.c.ZkStateReader Load collection config from: [/collections/testCloudExamplePrompt]
   [junit4]   2> 1953874 INFO  (qtp25598653-16215) [n:localhost:47056_solr c:testCloudExamplePrompt s:shard1  x:testCloudExamplePrompt_shard1_replica1] o.a.s.c.ZkController Collection zkNode exists
   [junit4]   2> 1953874 INFO  (qtp25598653-16215) [n:localhost:47056_solr c:testCloudExamplePrompt s:shard1  x:testCloudExamplePrompt_shard1_replica1] o.a.s.c.c.ZkStateReader Load collection config from: [/collections/testCloudExamplePrompt]
   [junit4]   2> 1953874 INFO  (qtp25598653-16178) [n:localhost:47056_solr c:testCloudExamplePrompt s:shard2  x:testCloudExamplePrompt_shard2_replica1] o.a.s.c.c.ZkStateReader path=[/collections/testCloudExamplePrompt] [configName]=[testCloudExamplePrompt] specified config exists in ZooKeeper
   [junit4]   2> 1953875 INFO  (qtp25598653-16178) [n:localhost:47056_solr c:testCloudExamplePrompt s:shard2  x:testCloudExamplePrompt_shard2_replica1] o.a.s.c.SolrResourceLoader new SolrResourceLoader for directory: '/home/jenkins/workspace/Lucene-Solr-trunk-Linux/solr/build/solr-core/test/J0/temp/solr.util.TestSolrCLIRunExample_513DD2224788F90B-001/tempDir-002/node1/testCloudExamplePrompt_shard2_replica1'
   [junit4]   2> 1953875 INFO  (qtp25598653-16178) [n:localhost:47056_solr c:testCloudExamplePrompt s:shard2  x:testCloudExamplePrompt_shard2_replica1] o.a.s.c.SolrResourceLoader JNDI not configured for solr (NoInitialContextEx)
   [junit4]   2> 1953875 INFO  (qtp25598653-16178) [n:localhost:47056_solr c:testCloudExamplePrompt s:shard2  x:testCloudExamplePrompt_shard2_replica1] o.a.s.c.SolrResourceLoader solr home defaulted to 'solr/' (could not find system property or JNDI)
   [junit4]   2> 1953876 INFO  (qtp25598653-16177) [n:localhost:47056_solr c:testCloudExamplePrompt s:shard2  x:testCloudExamplePrompt_shard2_replica2] o.a.s.c.c.ZkStateReader path=[/collections/testCloudExamplePrompt] [configName]=[testCloudExamplePrompt] specified config exists in ZooKeeper
   [junit4]   2> 1953876 INFO  (qtp25598653-16173) [n:localhost:47056_solr c:testCloudExamplePrompt s:shard1  x:testCloudExamplePrompt_shard1_replica2] o.a.s.c.c.ZkStateReader path=[/collections/testCloudExamplePrompt] [configName]=[testCloudExamplePrompt] specified config exists in ZooKeeper
   [junit4]   2> 1953876 INFO  (qtp25598653-16177) [n:localhost:47056_solr c:testCloudExamplePrompt s:shard2  x:testCloudExamplePrompt_shard2_replica2] o.a.s.c.SolrResourceLoader new SolrResourceLoader for directory: '/home/jenkins/workspace/Lucene-Solr-trunk-Linux/solr/build/solr-core/test/J0/temp/solr.util.TestSolrCLIRunExample_513DD2224788F90B-001/tempDir-002/node1/testCloudExamplePrompt_shard2_replica2'
   [junit4]   2> 1953876 INFO  (qtp25598653-16173) [n:localhost:47056_solr c:testCloudExamplePrompt s:shard1  x:testCloudExamplePrompt_shard1_replica2] o.a.s.c.SolrResourceLoader new SolrResourceLoader for directory: '/home/jenkins/workspace/Lucene-Solr-trunk-Linux/solr/build/solr-core/test/J0/temp/solr.util.TestSolrCLIRunExample_513DD2224788F90B-001/tempDir-002/node1/testCloudExamplePrompt_shard1_replica2'
   [junit4]   2> 1953876 INFO  (qtp25598653-16177) [n:localhost:47056_solr c:testCloudExamplePrompt s:shard2  x:testCloudExamplePrompt_shard2_replica2] o.a.s.c.SolrResourceLoader JNDI not configured for solr (NoInitialContextEx)
   [junit4]   2> 1953877 INFO  (qtp25598653-16173) [n:localhost:47056_solr c:testCloudExamplePrompt s:shard1  x:testCloudExamplePrompt_shard1_replica2] o.a.s.c.SolrResourceLoader JNDI not configured for solr (NoInitialContextEx)
   [junit4]   2> 1953877 INFO  (qtp25598653-16177) [n:localhost:47056_solr c:testCloudExamplePrompt s:shard2  x:testCloudExamplePrompt_shard2_replica2] o.a.s.c.SolrResourceLoader solr home defaulted to 'solr/' (could not find system property or JNDI)
   [junit4]   2> 1953877 INFO  (qtp25598653-16173) [n:localhost:47056_solr c:testCloudExamplePrompt s:shard1  x:testCloudExamplePrompt_shard1_replica2] o.a.s.c.SolrResourceLoader solr home defaulted to 'solr/' (could not find system property or JNDI)
   [junit4]   2> 1953877 INFO  (qtp25598653-16215) [n:localhost:47056_solr c:testCloudExamplePrompt s:shard1  x:testCloudExamplePrompt_shard1_replica1] o.a.s.c.c.ZkStateReader path=[/collections/testCloudExamplePrompt] [configName]=[testCloudExamplePrompt] specified config exists in ZooKeeper
   [junit4]   2> 1953877 INFO  (qtp25598653-16215) [n:localhost:47056_solr c:testCloudExamplePrompt s:shard1  x:testCloudExamplePrompt_shard1_replica1] o.a.s.c.SolrResourceLoader new SolrResourceLoader for directory: '/home/jenkins/workspace/Lucene-Solr-trunk-Linux/solr/build/solr-core/test/J0/temp/solr.util.TestSolrCLIRunExample_513DD2224788F90B-001/tempDir-002/node1/testCloudExamplePrompt_shard1_replica1'
   [junit4]   2> 1953878 INFO  (qtp25598653-16215) [n:localhost:47056_solr c:testCloudExamplePrompt s:shard1  x:testCloudExamplePrompt_shard1_replica1] o.a.s.c.SolrResourceLoader JNDI not configured for solr (NoInitialContextEx)
   [junit4]   2> 1953878 INFO  (qtp25598653-16178) [n:localhost:47056_solr c:testCloudExamplePrompt s:shard2  x:testCloudExamplePrompt_shard2_replica1] o.a.s.c.Config loaded config solrconfig.xml with version 0 
   [junit4]   2> 1953878 INFO  (qtp25598653-16215) [n:localhost:47056_solr c:testCloudExamplePrompt s:shard1  x:testCloudExamplePrompt_shard1_replica1] o.a.s.c.SolrResourceLoader solr home defaulted to 'solr/' (could not find system property or JNDI)
   [junit4]   2> 1953881 INFO  (qtp25598653-16177) [n:localhost:47056_solr c:testCloudExamplePrompt s:shard2  x:testCloudExamplePrompt_shard2_replica2] o.a.s.c.Config loaded config solrconfig.xml with version 0 
   [junit4]   2> 1953881 INFO  (qtp25598653-16173) [n:localhost:47056_solr c:testCloudExamplePrompt s:shard1  x:testCloudExamplePrompt_shard1_replica2] o.a.s.c.Config loaded config solrconfig.xml with version 0 
   [junit4]   2> 1953889 INFO  (qtp25598653-16215) [n:localhost:47056_solr c:testCloudExamplePrompt s:shard1  x:testCloudExamplePrompt_shard1_replica1] o.a.s.c.Config loaded config solrconfig.xml with version 0 
   [junit4]   2> 1953891 INFO  (qtp25598653-16177) [n:localhost:47056_solr c:testCloudExamplePrompt s:shard2  x:testCloudExamplePrompt_shard2_replica2] o.a.s.c.RequestParams conf resource params.json loaded . version : 0 
   [junit4]   2> 1953891 INFO  (qtp25598653-16177) [n:localhost:47056_solr c:testCloudExamplePrompt s:shard2  x:testCloudExamplePrompt_shard2_replica2] o.a.s.c.RequestParams request params refreshed to version 0
   [junit4]   2> 1953891 INFO  (qtp25598653-16177) [n:localhost:47056_solr c:testCloudExamplePrompt s:shard2  x:testCloudExamplePrompt_shard2_replica2] o.a.s.c.SolrConfig current version of requestparams : 0
   [junit4]   2> 1953891 INFO  (qtp25598653-16177) [n:localhost:47056_solr c:testCloudExamplePrompt s:shard2  x:testCloudExamplePrompt_shard2_replica2] o.a.s.c.SolrConfig Adding specified lib dirs to ClassLoader
   [junit4]   2> 1953892 WARN  (qtp25598653-16177) [n:localhost:47056_solr c:testCloudExamplePrompt s:shard2  x:testCloudExamplePrompt_shard2_replica2] o.a.s.c.SolrConfig Couldn't add files from /home/jenkins/workspace/Lucene-Solr-trunk-Linux/solr/build/solr-core/test/J0/temp/solr.util.TestSolrCLIRunExample_513DD2224788F90B-001/tempDir-002/node1/testCloudExamplePrompt_shard2_replica2/../../../../contrib/extraction/lib filtered by .*\.jar to classpath: /home/jenkins/workspace/Lucene-Solr-trunk-Linux/solr/build/solr-core/test/J0/temp/solr.util.TestSolrCLIRunExample_513DD2224788F90B-001/tempDir-002/node1/testCloudExamplePrompt_shard2_replica2/../../../../contrib/extraction/lib
   [junit4]   2> 1953892 WARN  (qtp25598653-16177) [n:localhost:47056_solr c:testCloudExamplePrompt s:shard2  x:testCloudExamplePrompt_shard2_replica2] o.a.s.c.SolrConfig Couldn't add files from /home/jenkins/workspace/Lucene-Solr-trunk-Linux/solr/build/solr-core/test/J0/temp/solr.util.TestSolrCLIRunExample_513DD2224788F90B-001/tempDir-002/node1/testCloudExamplePrompt_shard2_replica2/../../../../dist filtered by solr-cell-\d.*\.jar to classpath: /home/jenkins/workspace/Lucene-Solr-trunk-Linux/solr/build/solr-core/test/J0/temp/solr.util.TestSolrCLIRunExample_513DD2224788F90B-001/tempDir-002/node1/testCloudExamplePrompt_shard2_replica2/../../../../dist
   [junit4]   2> 1953908 WARN  (qtp25598653-16177) [n:localhost:47056_solr c:testCloudExamplePrompt s:shard2  x:testCloudExamplePrompt_shard2_replica2] o.a.s.c.SolrConfig Couldn't add files from /home/jenkins/workspace/Lucene-Solr-trunk-Linux/solr/build/solr-core/test/J0/temp/solr.util.TestSolrCLIRunExample_513DD2224788F90B-001/tempDir-002/node1/testCloudExamplePrompt_shard2_replica2/../../../../contrib/clustering/lib filtered by .*\.jar to classpath: /home/jenkins/workspace/Lucene-Solr-trunk-Linux/solr/build/solr-core/test/J0/temp/solr.util.TestSolrCLIRunExample_513DD2224788F90B-001/tempDir-002/node1/testCloudExamplePrompt_shard2_replica2/../../../../contrib/clustering/lib
   [junit4]   2> 1953908 INFO  (qtp25598653-16173) [n:localhost:47056_solr c:testCloudExamplePrompt s:shard1  x:testCloudExamplePrompt_shard1_replica2] o.a.s.c.RequestParams conf resource params.json loaded . version : 0 
   [junit4]   2> 1953908 WARN  (qtp25598653-16177) [n:localhost:47056_solr c:testCloudExamplePrompt s:shard2  x:testCloudExamplePrompt_shard2_replica2] o.a.s.c.SolrConfig Couldn't add files from /home/jenkins/workspace/Lucene-Solr-trunk-Linux/solr/build/solr-core/test/J0/temp/solr.util.TestSolrCLIRunExample_513DD2224788F90B-001/tempDir-002/node1/testCloudExamplePrompt_shard2_replica2/../../../../dist filtered by solr-clustering-\d.*\.jar to classpath: /home/jenkins/workspace/Lucene-Solr-trunk-Linux/solr/build/solr-core/test/J0/temp/solr.util.TestSolrCLIRunExample_513DD2224788F90B-001/tempDir-002/node1/testCloudExamplePrompt_shard2_replica2/../../../../dist
   [junit4]   2> 1953908 INFO  (qtp25598653-16173) [n:localhost:47056_solr c:testCloudExamplePrompt s:shard1  x:testCloudExamplePrompt_shard1_replica2] o.a.s.c.RequestParams request params refreshed to version 0
   [junit4]   2> 1953908 INFO  (qtp25598653-16173) [n:localhost:47056_solr c:testCloudExamplePrompt s:shard1  x:testCloudExamplePrompt_shard1_replica2] o.a.s.c.SolrConfig current version of requestparams : 0
   [junit4]   2> 1953908 WARN  (qtp25598653-16177) [n:localhost:47056_solr c:testCloudExamplePrompt s:shard2  x:testCloudExamplePrompt_shard2_replica2] o.a.s.c.SolrConfig Couldn't add files from /home/jenkins/workspace/Lucene-Solr-trunk-Linux/solr/build/solr-core/test/J0/temp/solr.util.TestSolrCLIRunExample_513DD2224788F90B-001/tempDir-002/node1/testCloudExamplePrompt_shard2_replica2/../../../../contrib/langid/lib filtered by .*\.jar to classpath: /home/jenkins/workspace/Lucene-Solr-trunk-Linux/solr/build/solr-core/test/J0/temp/solr.util.TestSolrCLIRunExample_513DD2224788F90B-001/tempDir-002/node1/testCloudExamplePrompt_shard2_replica2/../../../../contrib/langid/lib
   [junit4]   2> 1953909 WARN  (qtp25598653-16177) [n:localhost:47056_solr c:testCloudExamplePrompt s:shard2  x:testCloudExamplePrompt_shard2_replica2] o.a.s.c.SolrConfig Couldn't add files from /home/jenkins/workspace/Lucene-Solr-trunk-Linux/solr/build/solr-core/test/J0/temp/solr.util.TestSolrCLIRunExample_513DD2224788F90B-001/tempDir-002/node1/testCloudExamplePrompt_shard2_replica2/../../../../dist filtered by solr-langid-\d.*\.jar to classpath: /home/jenkins/workspace/Lucene-Solr-trunk-Linux/solr/build/solr-core/test/J0/temp/solr.util.TestSolrCLIRunExample_513DD2224788F90B-001/tempDir-002/node1/testCloudExamplePrompt_shard2_replica2/../../../../dist
   [junit4]   2> 1953909 WARN  (qtp25598653-16177) [n:localhost:47056_solr c:testCloudExamplePrompt s:shard2  x:testCloudExamplePrompt_shard2_replica2] o.a.s.c.SolrConfig Couldn't add files from /home/jenkins/workspace/Lucene-Solr-trunk-Linux/solr/build/solr-core/test/J0/temp/solr.util.TestSolrCLIRunExample_513DD2224788F90B-001/tempDir-002/node1/testCloudExamplePrompt_shard2_replica2/../../../../contrib/velocity/lib filtered by .*\.jar to classpath: /home/jenkins/workspace/Lucene-Solr-trunk-Linux/solr/build/solr-core/test/J0/temp/solr.util.TestSolrCLIRunExample_513DD2224788F90B-001/tempDir-002/node1/testCloudExamplePrompt_shard2_replica2/../../../../contrib/velocity/lib
   [junit4]   2> 1953909 INFO  (qtp25598653-16178) [n:localhost:47056_solr c:testCloudExamplePrompt s:shard2  x:testCloudExamplePrompt_shard2_replica1] o.a.s.c.RequestParams conf resource params.json loaded . version : 0 
   [junit4]   2> 1953909 INFO  (qtp25598653-16173) [n:localhost:47056_solr c:testCloudExamplePrompt s:shard1  x:testCloudExamplePrompt_shard1_replica2] o.a.s.c.SolrConfig Adding specified lib dirs to ClassLoader
   [junit4]   2> 1953909 INFO  (qtp25598653-16178) [n:localhost:47056_solr c:testCloudExamplePrompt s:shard2  x:testCloudExamplePrompt_shard2_replica1] o.a.s.c.RequestParams request params refreshed to version 0
   [junit4]   2> 1953909 WARN  (qtp25598653-16177) [n:localhost:47056_solr c:testCloudExamplePrompt s:shard2  x:testCloudExamplePrompt_shard2_replica2] o.a.s.c.SolrConfig Couldn't add files from /home/jenkins/workspace/Lucene-Solr-trunk-Linux/solr/build/solr-core/test/J0/temp/solr.util.TestSolrCLIRunExample_513DD2224788F90B-001/tempDir-002/node1/testCloudExamplePrompt_shard2_replica2/../../../../dist filtered by solr-velocity-\d.*\.jar to classpath: /home/jenkins/workspace/Lucene-Solr-trunk-Linux/solr/build/solr-core/test/J0/temp/solr.util.TestSolrCLIRunExample_513DD2224788F90B-001/tempDir-002/node1/testCloudExamplePrompt_shard2_replica2/../../../../dist
   [junit4]   2> 1953909 INFO  (qtp25598653-16178) [n:localhost:47056_solr c:testCloudExamplePrompt s:shard2  x:testCloudExamplePrompt_shard2_replica1] o.a.s.c.SolrConfig current version of requestparams : 0
   [junit4]   2> 1953910 WARN  (qtp25598653-16173) [n:localhost:47056_solr c:testCloudExamplePrompt s:shard1  x:testCloudExamplePrompt_shard1_replica2] o.a.s.c.SolrConfig Couldn't add files from /home/jenkins/workspace/Lucene-Solr-trunk-Linux/solr/build/solr-core/test/J0/temp/solr.util.TestSolrCLIRunExample_513DD2224788F90B-001/tempDir-002/node1/testCloudExamplePrompt_shard1_replica2/../../../../contrib/extraction/lib filtered by .*\.jar to classpath: /home/jenkins/workspace/Lucene-Solr-trunk-Linux/solr/build/solr-core/test/J0/temp/solr.util.TestSolrCLIRunExample_513DD2224788F90B-001/tempDir-002/node1/testCloudExamplePrompt_shard1_replica2/../../../../contrib/extraction/lib
   [junit4]   2> 1953910 WARN  (qtp25598653-16173) [n:localhost:47056_solr c:testCloudExamplePrompt s:shard1  x:testCloudExamplePrompt_shard1_replica2] o.a.s.c.SolrConfig Couldn't add files from /home/jenkins/workspace/Lucene-Solr-trunk-Linux/solr/build/solr-core/test/J0/temp/solr.util.TestSolrCLIRunExample_513DD2224788F90B-001/tempDir-002/node1/testCloudExamplePrompt_shard1_replica2/../../../../dist filtered by solr-cell-\d.*\.jar to classpath: /home/jenkins/workspace/Lucene-Solr-trunk-Linux/solr/build/solr-core/test/J0/temp/solr.util.TestSolrCLIRunExample_513DD2224788F90B-001/tempDir-002/node1/testCloudExamplePrompt_shard1_replica2/../../../../dist
   [junit4]   2> 1953910 INFO  (qtp25598653-16178) [n:localhost:47056_solr c:testCloudExamplePrompt s:shard2  x:testCloudExamplePrompt_shard2_replica1] o.a.s.c.SolrConfig Adding specified lib dirs to ClassLoader
   [junit4]   2> 1953910 WARN  (qtp25598653-16173) [n:localhost:47056_solr c:testCloudExamplePrompt s:shard1  x:testCloudExamplePrompt_shard1_replica2] o.a.s.c.SolrConfig Couldn't add files from /home/jenkins/workspace/Lucene-Solr-trunk-Linux/solr/build/solr-core/test/J0/temp/solr.util.TestSolrCLIRunExample_513DD2224788F90B-001/tempDir-002/node1/testCloudExamplePrompt_shard1_replica2/../../../../contrib/clustering/lib filtered by .*\.jar to classpath: /home/jenkins/workspace/Lucene-Solr-trunk-Linux/solr/build/solr-core/test/J0/temp/solr.util.TestSolrCLIRunExample_513DD2224788F90B-001/tempDir-002/node1/testCloudExamplePrompt_shard1_replica2/../../../../contrib/clustering/lib
   [junit4]   2> 1953911 WARN  (qtp25598653-16178) [n:localhost:47056_solr c:testCloudExamplePrompt s:shard2  x:testCloudExamplePrompt_shard2_replica1] o.a.s.c.SolrConfig Couldn't add files from /home/jenkins/workspace/Lucene-Solr-trunk-Linux/solr/build/solr-core/test/J0/temp/solr.util.TestSolrCLIRunExample_513DD2224788F90B-001/tempDir-002/node1/testCloudExamplePrompt_shard2_replica1/../../../../contrib/extraction/lib filtered by .*\.jar to classpath: /home/jenkins/workspace/Lucene-Solr-trunk-Linux/solr/build/solr-core/test/J0/temp/solr.util.TestSolrCLIRunExample_513DD2224788F90B-001/tempDir-002/node1/testCloudExamplePrompt_shard2_replica1/../../../../contrib/extraction/lib
   [junit4]   2> 1953911 WARN  (qtp25598653-16173) [n:localhost:47056_solr c:testCloudExamplePrompt s:shard1  x:testCloudExamplePrompt_shard1_replica2] o.a.s.c.SolrConfig Couldn't add files from /home/jenkins/workspace/Lucene-Solr-trunk-Linux/solr/build/solr-core/test/J0/temp/solr.util.TestSolrCLIRunExample_513DD2224788F90B-001/tempDir-002/node1/testCloudExamplePrompt_shard1_replica2/../../../../dist filtered by solr-clustering-\d.*\.jar to classpath: /home/jenkins/workspace/Lucene-Solr-trunk-Linux/solr/build/solr-core/test/J0/temp/solr.util.TestSolrCLIRunExample_513DD2224788F90B-001/tempDir-002/node1/testCloudExamplePrompt_shard1_replica2/../../../../dist
   [junit4]   2> 1953911 WARN  (qtp25598653-16178) [n:localhost:47056_solr c:testCloudExamplePrompt s:shard2  x:testCloudExamplePrompt_shard2_replica1] o.a.s.c.SolrConfig Couldn't add files from /home/jenkins/workspace/Lucene-Solr-trunk-Linux/solr/build/solr-core/test/J0/temp/solr.util.TestSolrCLIRunExample_513DD2224788F90B-001/tempDir-002/node1/testCloudExamplePrompt_shard2_replica1/../../../../dist filtered by solr-cell-\d.*\.jar to classpath: /home/jenkins/workspace/Lucene-Solr-trunk-Linux/solr/build/solr-core/test/J0/temp/solr.util.TestSolrCLIRunExample_513DD2224788F90B-001/tempDir-002/node1/testCloudExamplePrompt_shard2_replica1/../../../../dist
   [junit4]   2> 1953911 WARN  (qtp25598653-16173) [n:localhost:47056_solr c:testCloudExamplePrompt s:shard1  x:testCloudExamplePrompt_shard1_replica2] o.a.s.c.SolrConfig Couldn't add files from /home/jenkins/workspace/Lucene-Solr-trunk-Linux/solr/build/solr-core/test/J0/temp/solr.util.TestSolrCLIRunExample_513DD2224788F90B-001/tempDir-002/node1/testCloudExamplePrompt_shard1_replica2/../../../../contrib/langid/lib filtered by .*\.jar to classpath: /home/jenkins/workspace/Lucene-Solr-trunk-Linux/solr/build/solr-core/test/J0/temp/solr.util.TestSolrCLIRunExample_513DD2224788F90B-001/tempDir-002/node1/testCloudExamplePrompt_shard1_replica2/../../../../contrib/langid/lib
   [junit4]   2> 1953911 WARN  (qtp25598653-16178) [n:localhost:47056_solr c:testCloudExamplePrompt s:shard2  x:testCloudExamplePrompt_shard2_replica1] o.a.s.c.SolrConfig Couldn't add files from /home/jenkins/workspace/Lucene-Solr-trunk-Linux/solr/build/solr-core/test/J0/temp/solr.util.TestSolrCLIRunExample_513DD2224788F90B-001/tempDir-002/node1/testCloudExamplePrompt_shard2_replica1/../../../../contrib/clustering/lib filtered by .*\.jar to classpath: /home/jenkins/workspace/Lucene-Solr-trunk-Linux/solr/build/solr-core/test/J0/temp/solr.util.TestSolrCLIRunExample_513DD2224788F90B-001/tempDir-002/node1/testCloudExamplePrompt_shard2_replica1/../../../../contrib/clustering/lib
   [junit4]   2> 1953911 WARN  (qtp25598653-16173) [n:localhost:47056_solr c:testCloudExamplePrompt s:shard1  x:testCloudExamplePrompt_shard1_replica2] o.a.s.c.SolrConfig Couldn't add files from /home/jenkins/workspace/Lucene-Solr-trunk-Linux/solr/build/solr-core/test/J0/temp/solr.util.TestSolrCLIRunExample_513DD2224788F90B-001/tempDir-002/node1/testCloudExamplePrompt_shard1_replica2/../../../../dist filtered by solr-langid-\d.*\.jar to classpath: /home/jenkins/workspace/Lucene-Solr-trunk-Linux/solr/build/solr-core/test/J0/temp/solr.util.TestSolrCLIRunExample_513DD2224788F90B-001/tempDir-002/node1/testCloudExamplePrompt_shard1_replica2/../../../../dist
   [junit4]   2> 1953912 WARN  (qtp25598653-16178) [n:localhost:47056_solr c:testCloudExamplePrompt s:shard2  x:testCloudExamplePrompt_shard2_replica1] o.a.s.c.SolrConfig Couldn't add files from /home/jenkins/workspace/Lucene-Solr-trunk-Linux/solr/build/solr-core/test/J0/temp/solr.util.TestSolrCLIRunExample_513DD2224788F90B-001/tempDir-002/node1/testCloudExamplePrompt_shard2_replica1/../../../../dist filtered by solr-clustering-\d.*\.jar to classpath: /home/jenkins/workspace/Lucene-Solr-trunk-Linux/solr/build/solr-core/test/J0/temp/solr.util.TestSolrCLIRunExample_513DD2224788F90B-001/tempDir-002/node1/testCloudExamplePrompt_shard2_replica1/../../../../dist
   [junit4]   2> 1953912 WARN  (qtp25598653-16173) [n:localhost:47056_solr c:testCloudExamplePrompt s:shard1  x:testCloudExamplePrompt_shard1_replica2] o.a.s.c.SolrConfig Couldn't add files from /home/jenkins/workspace/Lucene-Solr-trunk-Linux/solr/build/solr-core/test/J0/temp/solr.util.TestSolrCLIRunExample_513DD2224788F90B-001/tempDir-002/node1/testCloudExamplePrompt_shard1_replica2/../../../../contrib/velocity/lib filtered by .*\.jar to classpath: /home/jenkins/workspace/Lucene-Solr-trunk-Linux/solr/build/solr-core/test/J0/temp/solr.util.TestSolrCLIRunExample_513DD2224788F90B-001/tempDir-002/node1/testCloudExamplePrompt_shard1_replica2/../../../../contrib/velocity/lib
   [junit4]   2> 1953912 WARN  (qtp25598653-16178) [n:localhost:47056_solr c:testCloudExamplePrompt s:shard2  x:testCloudExamplePrompt_shard2_replica1] o.a.s.c.SolrConfig Couldn't add files from /home/jenkins/workspace/Lucene-Solr-trunk-Linux/solr/build/solr-core/test/J0/temp/solr.util.TestSolrCLIRunExample_513DD2224788F90B-001/tempDir-002/node1/testCloudExamplePrompt_shard2_replica1/../../../../contrib/langid/lib filtered by .*\.jar to classpath: /home/jenkins/workspace/Lucene-Solr-trunk-Linux/solr/build/solr-core/test/J0/temp/solr.util.TestSolrCLIRunExample_513DD2224788F90B-001/tempDir-002/node1/testCloudExamplePrompt_shard2_replica1/../../../../contrib/langid/lib
   [junit4]   2> 1953913 WARN  (qtp25598653-16173) [n:localhost:47056_solr c:testCloudExamplePrompt s:shard1  x:testCloudExamplePrompt_shard1_replica2] o.a.s.c.SolrConfig Couldn't add files from /home/jenkins/workspace/Lucene-Solr-trunk-Linux/solr/build/solr-core/test/J0/temp/solr.util.TestSolrCLIRunExample_513DD2224788F90B-001/tempDir-002/node1/testCloudExamplePrompt_shard1_replica2/../../../../dist filtered by solr-velocity-\d.*\.jar to classpath: /home/jenkins/workspace/Lucene-Solr-trunk-Linux/solr/build/solr-core/test/J0/temp/solr.util.TestSolrCLIRunExample_513DD2224788F90B-001/tempDir-002/node1/testCloudExamplePrompt_shard1_replica2/../../../../dist
   [junit4]   2> 1953913 WARN  (qtp25598653-16178) [n:localhost:47056_solr c:testCloudExamplePrompt s:shard2  x:testCloudExamplePrompt_shard2_replica1] o.a.s.c.SolrConfig Couldn't add files from /home/jenkins/workspace/Lucene-Solr-trunk-Linux/solr/build/solr-core/test/J0/temp/solr.util.TestSolrCLIRunExample_513DD2224788F90B-001/tempDir-002/node1/testCloudExamplePrompt_shard2_replica1/../../../../dist filtered by solr-langid-\d.*\.jar to classpath: /home/jenkins/workspace/Lucene-Solr-trunk-Linux/solr/build/solr-core/test/J0/temp/solr.util.TestSolrCLIRunExample_513DD2224788F90B-001/tempDir-002/node1/testCloudExamplePrompt_shard2_replica1/../../../../dist
   [junit4]   2> 1953914 WARN  (qtp25598653-16178) [n:localhost:47056_solr c:testCloudExamplePrompt s:shard2  x:testCloudExamplePrompt_shard2_replica1] o.a.s.c.SolrConfig Couldn't add files from /home/jenkins/workspace/Lucene-Solr-trunk-Linux/solr/build/solr-core/test/J0/temp/solr.util.TestSolrCLIRunExample_513DD2224788F90B-001/tempDir-002/node1/testCloudExamplePrompt_shard2_replica1/../../../../contrib/velocity/lib filtered by .*\.jar to classpath: /home/jenkins/workspace/Lucene-Solr-trunk-Linux/solr/build/solr-core/test/J0/temp/solr.util.TestSolrCLIRunExample_513DD2224788F90B-001/tempDir-002/node1/testCloudExamplePrompt_shard2_replica1/../../../../contrib/velocity/lib
   [junit4]   2> 1953914 WARN  (qtp25598653-16178) [n:localhost:47056_solr c:testCloudExamplePrompt s:shard2  x:testCloudExamplePrompt_shard2_replica1] o.a.s.c.SolrConfig Couldn't add files from /home/jenkins/workspace/Lucene-Solr-trunk-Linux/solr/build/solr-core/test/J0/temp/solr.util.TestSolrCLIRunExample_513DD2224788F90B-001/tempDir-002/node1/testCloudExamplePrompt_shard2_replica1/../../../../dist filtered by solr-velocity-\d.*\.jar to classpath: /home/jenkins/workspace/Lucene-Solr-trunk-Linux/solr/build/solr-core/test/J0/temp/solr.util.TestSolrCLIRunExample_513DD2224788F90B-001/tempDir-002/node1/testCloudExamplePrompt_shard2_replica1/../../../../dist
   [junit4]   2> 1953916 WARN  (qtp25598653-16177) [n:localhost:47056_solr c:testCloudExamplePrompt s:shard2  x:testCloudExamplePrompt_shard2_replica2] o.a.s.c.Config Beginning with Solr 5.5, <maxMergeDocs> is deprecated, configure it on the relevant <mergePolicyFactory> instead.
   [junit4]   2> 1953917 WARN  (qtp25598653-16177) [n:localhost:47056_solr c:testCloudExamplePrompt s:shard2  x:testCloudExamplePrompt_shard2_replica2] o.a.s.c.Config Beginning with Solr 5.5, <mergeFactor> is deprecated, configure it on the relevant <mergePolicyFactory> instead.
   [junit4]   2> 1953918 INFO  (qtp25598653-16215) [n:localhost:47056_solr c:testCloudExamplePrompt s:shard1  x:testCloudExamplePrompt_shard1_replica1] o.a.s.c.RequestParams conf resource params.json loaded . version : 0 
   [junit4]   2> 1953918 INFO  (qtp25598653-16215) [n:localhost:47056_solr c:testCloudExamplePrompt s:shard1  x:testCloudExamplePrompt_shard1_replica1] o.a.s.c.RequestParams request params refreshed to version 0
   [junit4]   2> 1953918 INFO  (qtp25598653-16215) [n:localhost:47056_solr c:testCloudExamplePrompt s:shard1  x:testCloudExamplePrompt_shard1_replica1] o.a.s.c.SolrConfig current version of requestparams : 0
   [junit4]   2> 1953918 INFO  (qtp25598653-16177) [n:localhost:47056_solr c:testCloudExamplePrompt s:shard2  x:testCloudExamplePrompt_shard2_replica2] o.a.s.c.SolrConfig Using Lucene MatchVersion: 6.0.0
   [junit4]   2> 1953919 INFO  (qtp25598653-16215) [n:localhost:47056_solr c:testCloudExamplePrompt s:shard1  x:testCloudExamplePrompt_shard1_replica1] o.a.s.c.SolrConfig Adding specified lib dirs to ClassLoader
   [junit4]   2> 1953919 WARN  (qtp25598653-16215) [n:localhost:47056_solr c:testCloudExamplePrompt s:shard1  x:testCloudExamplePrompt_shard1_replica1] o.a.s.c.SolrConfig Couldn't add files from /home/jenkins/workspace/Lucene-Solr-trunk-Linux/solr/build/solr-core/test/J0/temp/solr.util.TestSolrCLIRunExample_513DD2224788F90B-001/tempDir-002/node1/testCloudExamplePrompt_shard1_replica1/../../../../contrib/extraction/lib filtered by .*\.jar to classpath: /home/jenkins/workspace/Lucene-Solr-trunk-Linux/solr/build/solr-core/test/J0/temp/solr.util.TestSolrCLIRunExample_513DD2224788F90B-001/tempDir-002/node1/testCloudExamplePrompt_shard1_replica1/../../../../contrib/extraction/lib
   [junit4]   2> 1953920 WARN  (qtp25598653-16215) [n:localhost:47056_solr c:testCloudExamplePrompt s:shard1  x:testCloudExamplePrompt_shard1_replica1] o.a.s.c.SolrConfig Couldn't add files from /home/jenkins/workspace/Lucene-Solr-trunk-Linux/solr/build/solr-core/test/J0/temp/solr.util.TestSolrCLIRunExample_513DD2224788F90B-001/tempDir-002/node1/testCloudExamplePrompt_shard1_replica1/../../../../dist filtered by solr-cell-\d.*\.jar to classpath: /home/jenkins/workspace/Lucene-Solr-trunk-Linux/solr/build/solr-core/test/J0/temp/solr.util.TestSolrCLIRunExample_513DD2224788F90B-001/tempDir-002/node1/testCloudExamplePrompt_shard1_replica1/../../../../dist
   [junit4]   2> 1953920 WARN  (qtp25598653-16215) [n:localhost:47056_solr c:testCloudExamplePrompt s:shard1  x:testCloudExamplePrompt_shard1_replica1] o.a.s.c.SolrConfig Couldn't add files from /home/jenkins/workspace/Lucene-Solr-trunk-Linux/solr/build/solr-core/test/J0/temp/solr.util.TestSolrCLIRunExample_513DD2224788F90B-001/tempDir-002/node1/testCloudExamplePrompt_shard1_replica1/../../../../contrib/clustering/lib filtered by .*\.jar to classpath: /home/jenkins/workspace/Lucene-Solr-trunk-Linux/solr/build/solr-core/test/J0/temp/solr.util.TestSolrCLIRunExample_513DD2224788F90B-001/tempDir-002/node1/testCloudExamplePrompt_shard1_replica1/../../../../contrib/clustering/lib
   [junit4]   2> 1953920 WARN  (qtp25598653-16215) [n:localhost:47056_solr c:testCloudExamplePrompt s:shard1  x:testCloudExamplePrompt_shard1_replica1] o.a.s.c.SolrConfig Couldn't add files from /home/jenkins/workspace/Lucene-Solr-trunk-Linux/solr/build/solr-core/test/J0/temp/solr.util.TestSolrCLIRunExample_513DD2224788F90B-001/tempDir-002/node1/testCloudExamplePrompt_shard1_replica1/../../../../dist filtered by solr-clustering-\d.*\.jar to classpath: /home/jenkins/workspace/Lucene-Solr-trunk-Linux/solr/build/solr-core/test/J0/temp/solr.util.TestSolrCLIRunExample_513DD2224788F90B-001/tempDir-002/node1/testCloudExamplePrompt_shard1_replica1/../../../../dist
   [junit4]   2> 1953921 WARN  (qtp25598653-16215) [n:localhost:47056_solr c:testCloudExamplePrompt s:shard1  x:testCloudExamplePrompt_shard1_replica1] o.a.s.c.SolrConfig Couldn't add files from /home/jenkins/workspace/Lucene-Solr-trunk-Linux/solr/build/solr-core/test/J0/temp/solr.util.TestSolrCLIRunExample_513DD2224788F90B-001/tempDir-002/node1/testCloudExamplePrompt_shard1_replica1/../../../../contrib/langid/lib filtered by .*\.jar to classpath: /home/jenkins/workspace/Lucene-Solr-trunk-Linux/solr/build/solr-core/test/J0/temp/solr.util.TestSolrCLIRunExample_513DD2224788F90B-001/tempDir-002/node1/testCloudExamplePrompt_shard1_replica1/../../../../contrib/langid/lib
   [junit4]   2> 1953921 WARN  (qtp25598653-16215) [n:localhost:47056_solr c:testCloudExamplePrompt s:shard1  x:testCloudExamplePrompt_shard1_replica1] o.a.s.c.SolrConfig Couldn't add files from /home/jenkins/workspace/Lucene-Solr-trunk-Linux/solr/build/solr-core/test/J0/temp/solr.util.TestSolrCLIRunExample_513DD2224788F90B-001/tempDir-002/node1/testCloudExamplePrompt_shard1_replica1/../../../../dist filtered by solr-langid-\d.*\.jar to classpath: /home/jenkins/workspace/Lucene-Solr-trunk-Linux/solr/build/solr-core/test/J0/temp/solr.util.TestSolrCLIRunExample_513DD2224788F90B-001/tempDir-002/node1/testCloudExamplePrompt_shard1_replica1/../../../../dist
   [junit4]   2> 1953922 WARN  (qtp25598653-16215) [n:localhost:47056_solr c:testCloudExamplePrompt s:shard1  x:testCloudExamplePrompt_shard1_replica1] o.a.s.c.SolrConfig Couldn't add files from /home/jenkins/workspace/Lucene-Solr-trunk-Linux/solr/build/solr-core/test/J0/temp/solr.util.TestSolrCLIRunExample_513DD2224788F90B-001/tempDir-002/node1/testCloudExamplePrompt_shard1_replica1/../../../../contrib/velocity/lib filtered by .*\.jar to classpath: /home/jenkins/workspace/Lucene-Solr-trunk-Linux/solr/build/solr-core/test/J0/temp/solr.util.TestSolrCLIRunExample_513DD2224788F90B-001/tempDir-002/node1/testCloudExamplePrompt_shard1_replica1/../../../../contrib/velocity/lib
   [junit4]   2> 1953922 WARN  (qtp25598653-16215) [n:localhost:47056_solr c:testCloudExamplePrompt s:shard1  x:testCloudExamplePrompt_shard1_replica1] o.a.s.c.SolrConfig Couldn't add files from /home/jenkins/workspace/Lucene-Solr-trunk-Linux/solr/build/solr-core/test/J0/temp/solr.util.TestSolrCLIRunExample_513DD2224788F90B-001/tempDir-002/node1/testCloudExamplePrompt_shard1_replica1/../../../../dist filtered by solr-velocity-\d.*\.jar to classpath: /home/jenkins/workspace/Lucene-Solr-trunk-Linux/solr/build/solr-core/test/J0/temp/solr.util.TestSolrCLIRunExample_513DD2224788F90B-001/tempDir-002/node1/testCloudExamplePrompt_shard1_replica1/../../../../dist
   [junit4]   2> 1953926 WARN  (qtp25598653-16178) [n:localhost:47056_solr c:testCloudExamplePrompt s:shard2  x:testCloudExamplePrompt_shard2_replica1] o.a.s.c.Config Beginning with Solr 5.5, <maxMergeDocs> is deprecated, configure it on the relevant <mergePolicyFactory> instead.
   [junit4]   2> 1953926 WARN  (qtp25598653-16178) [n:localhost:47056_solr c:testCloudExamplePrompt s:shard2  x:testCloudExamplePrompt_shard2_replica1] o.a.s.c.Config Beginning with Solr 5.5, <mergeFactor> is deprecated, configure it on the relevant <mergePolicyFactory> instead.
   [junit4]   2> 1953926 WARN  (qtp25598653-16173) [n:localhost:47056_solr c:testCloudExamplePrompt s:shard1  x:testCloudExamplePrompt_shard1_replica2] o.a.s.c.Config Beginning with Solr 5.5, <maxMergeDocs> is deprecated, configure it on the relevant <mergePolicyFactory> instead.
   [junit4]   2> 1953927 WARN  (qtp25598653-16173) [n:localhost:47056_solr c:testCloudExamplePrompt s:shard1  x:testCloudExamplePrompt_shard1_replica2] o.a.s.c.Config Beginning with Solr 5.5, <mergeFactor> is deprecated, configure it on the relevant <mergePolicyFactory> instead.
   [junit4]   2> 1953928 WARN  (qtp25598653-16215) [n:localhost:47056_solr c:testCloudExamplePrompt s:shard1  x:testCloudExamplePrompt_shard1_replica1] o.a.s.c.Config Beginning with Solr 5.5, <maxMergeDocs> is deprecated, configure it on the relevant <mergePolicyFactory> instead.
   [junit4]   2> 1953929 WARN  (qtp25598653-16215) [n:localhost:47056_solr c:testCloudExamplePrompt s:shard1  x:testCloudExamplePrompt_shard1_replica1] o.a.s.c.Config Beginning with Solr 5.5, <mergeFactor> is deprecated, configure it on the relevant <mergePolicyFactory> instead.
   [junit4]   2> 1953929 INFO  (qtp25598653-16178) [n:localhost:47056_solr c:testCloudExamplePrompt s:shard2  x:testCloudExamplePrompt_shard2_replica1] o.a.s.c.SolrConfig Using Lucene MatchVersion: 6.0.0
   [junit4]   2> 1953930 INFO  (qtp25598653-16215) [n:localhost:47056_solr c:testCloudExamplePrompt s:shard1  x:testCloudExamplePrompt_shard1_replica1] o.a.s.c.SolrConfig Using Lucene MatchVersion: 6.0.0
   [junit4]   2> 1953931 INFO  (qtp25598653-16173) [n:localhost:47056_solr c:testCloudExamplePrompt s:shard1  x:testCloudExamplePrompt_shard1_replica2] o.a.s.c.SolrConfig Using Lucene MatchVersion: 6.0.0
   [junit4]   2> 1953942 INFO  (qtp25598653-16177) [n:localhost:47056_solr c:testCloudExamplePrompt s:shard2  x:testCloudExamplePrompt_shard2_replica2] o.a.s.c.SolrConfig Loaded SolrConfig: solrconfig.xml
   [junit4]   2> 1953952 INFO  (qtp25598653-16177) [n:localhost:47056_solr c:testCloudExamplePrompt s:shard2  x:testCloudExamplePrompt_shard2_replica2] o.a.s.s.IndexSchema [testCloudExamplePrompt_shard2_replica2] Schema name=example-data-driven-schema
   [junit4]   2> 1953991 INFO  (qtp25598653-16178) [n:localhost:47056_solr c:testCloudExamplePrompt s:shard2  x:testCloudExamplePrompt_shard2_replica1] o.a.s.c.SolrConfig Loaded SolrConfig: solrconfig.xml
   [junit4]   2> 1953998 INFO  (qtp25598653-16173) [n:localhost:47056_solr c:testCloudExamplePrompt s:shard1  x:testCloudExamplePrompt_shard1_replica2] o.a.s.c.SolrConfig Loaded SolrConfig: solrconfig.xml
   [junit4]   2> 1954013 INFO  (qtp25598653-16173) [n:localhost:47056_solr c:testCloudExamplePrompt s:shard1  x:testCloudExamplePrompt_shard1_replica2] o.a.s.s.IndexSchema [testCloudExamplePrompt_shard1_replica2] Schema name=example-data-driven-schema
   [junit4]   2> 1954015 INFO  (qtp25598653-16215) [n:localhost:47056_solr c:testCloudExamplePrompt s:shard1  x:testCloudExamplePrompt_shard1_replica1] o.a.s.c.SolrConfig Loaded SolrConfig: solrconfig.xml
   [junit4]   2> 1954036 INFO  (qtp25598653-16215) [n:localhost:47056_solr c:testCloudExamplePrompt s:shard1  x:testCloudExamplePrompt_shard1_replica1] o.a.s.s.IndexSche

[...truncated too long message...]

  x:gettingstarted] o.a.s.u.DefaultSolrCoreState SolrCoreState ref count has reached 0 - closing IndexWriter
   [junit4]   2> 1968243 INFO  (coreCloseExecutor-8059-thread-1) [    x:gettingstarted] o.a.s.u.DefaultSolrCoreState closing IndexWriter with IndexWriterCloser
   [junit4]   2> 1968244 INFO  (coreCloseExecutor-8059-thread-1) [    x:gettingstarted] o.a.s.c.SolrCore [gettingstarted] Closing main searcher on request.
   [junit4]   2> 1968259 INFO  (coreCloseExecutor-8059-thread-1) [    x:gettingstarted] o.a.s.c.CachingDirectoryFactory Closing MockDirectoryFactory - 2 directories currently being tracked
   [junit4]   2> 1968259 INFO  (coreCloseExecutor-8059-thread-1) [    x:gettingstarted] o.a.s.c.CachingDirectoryFactory looking to close /home/jenkins/workspace/Lucene-Solr-trunk-Linux/solr/build/solr-core/test/J0/temp/solr.util.TestSolrCLIRunExample_513DD2224788F90B-001/tempDir-003/schemaless/solr/gettingstarted/data [CachedDir<<refCount=0;path=/home/jenkins/workspace/Lucene-Solr-trunk-Linux/solr/build/solr-core/test/J0/temp/solr.util.TestSolrCLIRunExample_513DD2224788F90B-001/tempDir-003/schemaless/solr/gettingstarted/data;done=false>>]
   [junit4]   2> 1968259 INFO  (coreCloseExecutor-8059-thread-1) [    x:gettingstarted] o.a.s.c.CachingDirectoryFactory Closing directory: /home/jenkins/workspace/Lucene-Solr-trunk-Linux/solr/build/solr-core/test/J0/temp/solr.util.TestSolrCLIRunExample_513DD2224788F90B-001/tempDir-003/schemaless/solr/gettingstarted/data
   [junit4]   2> 1968259 INFO  (coreCloseExecutor-8059-thread-1) [    x:gettingstarted] o.a.s.c.CachingDirectoryFactory looking to close /home/jenkins/workspace/Lucene-Solr-trunk-Linux/solr/build/solr-core/test/J0/temp/solr.util.TestSolrCLIRunExample_513DD2224788F90B-001/tempDir-003/schemaless/solr/gettingstarted/data/index [CachedDir<<refCount=0;path=/home/jenkins/workspace/Lucene-Solr-trunk-Linux/solr/build/solr-core/test/J0/temp/solr.util.TestSolrCLIRunExample_513DD2224788F90B-001/tempDir-003/schemaless/solr/gettingstarted/data/index;done=false>>]
   [junit4]   2> 1968259 INFO  (coreCloseExecutor-8059-thread-1) [    x:gettingstarted] o.a.s.c.CachingDirectoryFactory Closing directory: /home/jenkins/workspace/Lucene-Solr-trunk-Linux/solr/build/solr-core/test/J0/temp/solr.util.TestSolrCLIRunExample_513DD2224788F90B-001/tempDir-003/schemaless/solr/gettingstarted/data/index
   [junit4]   2> 1968260 INFO  (TEST-TestSolrCLIRunExample.testSchemalessExample-seed#[513DD2224788F90B]) [    ] o.e.j.s.h.ContextHandler Stopped o.e.j.s.ServletContextHandler@1d0c690{/solr,null,UNAVAILABLE}
   [junit4]   2> 1968261 INFO  (TEST-TestSolrCLIRunExample.testSchemalessExample-seed#[513DD2224788F90B]) [    ] o.a.s.u.TestSolrCLIRunExample Stopped standalone Solr instance running on port 47297
   [junit4]   2> 1968261 INFO  (TEST-TestSolrCLIRunExample.testSchemalessExample-seed#[513DD2224788F90B]) [    ] o.a.s.SolrTestCaseJ4 ###Ending testSchemalessExample
   [junit4]   2> 1968262 INFO  (SUITE-TestSolrCLIRunExample-seed#[513DD2224788F90B]-worker) [    ] o.a.s.SolrTestCaseJ4 ###deleteCore
   [junit4]   2> NOTE: leaving temporary files on disk at: /home/jenkins/workspace/Lucene-Solr-trunk-Linux/solr/build/solr-core/test/J0/temp/solr.util.TestSolrCLIRunExample_513DD2224788F90B-001
   [junit4]   2> NOTE: test params are: codec=Asserting(Lucene60): {}, docValues:{}, sim=RandomSimilarity(queryNorm=false,coord=yes): {}, locale=en-CA, timezone=Pacific/Fiji
   [junit4]   2> NOTE: Linux 3.19.0-47-generic i386/Oracle Corporation 1.8.0_72 (32-bit)/cpus=12,threads=1,free=131196792,total=323559424
   [junit4]   2> NOTE: All tests run in this JVM: [TestStressLucene, TestPseudoReturnFields, TestClusterStateMutator, SolrCoreTest, PingRequestHandlerTest, ExternalFileFieldSortTest, DateFieldTest, TestNamedUpdateProcessors, TestCSVLoader, BJQParserTest, TestUseDocValuesAsStored, TestReplicationHandler, TestDynamicFieldCollectionResource, TestReplicationHandlerBackup, HdfsChaosMonkeySafeLeaderTest, IgnoreCommitOptimizeUpdateProcessorFactoryTest, TestRemoteStreaming, LeaderElectionIntegrationTest, TestScoreJoinQPScore, TestCollectionAPI, PathHierarchyTokenizerFactoryTest, RollingRestartTest, SignatureUpdateProcessorFactoryTest, TestHighlightDedupGrouping, CdcrReplicationDistributedZkTest, TestPKIAuthenticationPlugin, TestSolr4Spatial, TestCollationFieldDocValues, QueryResultKeyTest, TestHashQParserPlugin, TestConfig, TestClassNameShortening, DocumentAnalysisRequestHandlerTest, TestBlendedInfixSuggestions, TestDownShardTolerantSearch, TestAtomicUpdateErrorCases, TestFieldResource, TestBinaryField, UUIDFieldTest, AnalysisAfterCoreReloadTest, InfoHandlerTest, BufferStoreTest, ResponseHeaderTest, DistributedQueryElevationComponentTest, DistributedDebugComponentTest, TestFoldingMultitermQuery, TestMissingGroups, ResourceLoaderTest, DeleteShardTest, SyncSliceTest, TestExpandComponent, TestDocSet, ConnectionReuseTest, DefaultValueUpdateProcessorTest, IndexSchemaRuntimeFieldTest, TestConfigSetProperties, ChangedSchemaMergeTest, CoreAdminCreateDiscoverTest, SimpleCollectionCreateDeleteTest, AddBlockUpdateTest, TestCloudManagedSchema, CloudExitableDirectoryReaderTest, BlockJoinFacetSimpleTest, TestRTGBase, TestSearcherReuse, TestReRankQParserPlugin, AnalyticsQueryTest, TestOmitPositions, TestFunctionQuery, TlogReplayBufferedWhileIndexingTest, TestRandomFaceting, TestArbitraryIndexDir, TestSQLHandler, TestSolrQueryParserDefaultOperatorResource, TestFaceting, TestQueryWrapperFilter, DistribDocExpirationUpdateProcessorTest, RankQueryTest, RuleEngineTest, JSONWriterTest, QueryEqualityTest, SolrRequestParserTest, BasicAuthIntegrationTest, TestManagedStopFilterFactory, TestLRUCache, TestComponentsName, SynonymTokenizerTest, TestTestInjection, TestManagedResourceStorage, TestObjectReleaseTracker, AsyncCallRequestStatusResponseTest, TestIBSimilarityFactory, ShardSplitTest, TestPhraseSuggestions, ClusterStateUpdateTest, ZkSolrClientTest, TestDistributedGrouping, TestRealTimeGet, HardAutoCommitTest, TestRangeQuery, SimpleFacetsTest, StatsComponentTest, TestGroupingSearch, PeerSyncTest, TestLazyCores, CurrencyFieldOpenExchangeTest, CurrencyFieldXmlFileTest, SolrIndexSplitterTest, TestCoreDiscovery, SuggesterFSTTest, CoreAdminHandlerTest, SuggesterTest, SuggesterWFSTTest, SolrCoreCheckLockOnStartupTest, DirectUpdateHandlerOptimizeTest, XsltUpdateRequestHandlerTest, DebugComponentTest, IndexBasedSpellCheckerTest, TestQueryTypes, TermsComponentTest, RequestHandlersTest, TermVectorComponentTest, RequiredFieldsTest, FastVectorHighlighterTest, SolrPluginUtilsTest, TestCollationField, ReturnFieldsTest, JsonLoaderTest, HighlighterConfigTest, SOLR749Test, CopyFieldTest, MultiTermTest, MinimalSchemaTest, TestLuceneMatchVersion, TestSweetSpotSimilarityFactory, TestLMDirichletSimilarityFactory, URLClassifyProcessorTest, TestSystemIdResolver, SpellingQueryConverterTest, ZkNodePropsTest, SystemInfoHandlerTest, CursorPagingTest, SolrTestCaseJ4Test, TestCrossCoreJoin, TestCursorMarkWithoutUniqueKey, TestDistributedMissingSort, TestSimpleTrackingShardHandler, TestTolerantSearch, TestEmbeddedSolrServerConstructors, ActionThrottleTest, AssignTest, AsyncMigrateRouteKeyTest, CollectionsAPIAsyncDistributedZkTest, DeleteInactiveReplicaTest, DistributedQueueTest, DistributedVersionInfoTest, LeaderInitiatedRecoveryOnCommitTest, MultiThreadedOCPTest, ReplicationFactorTest, RestartWhileUpdatingTest, SaslZkACLProviderTest, TestConfigSetsAPI, TestLeaderElectionZkExpiry, TestLeaderInitiatedRecoveryThread, TestMiniSolrCloudClusterSSL, TestRandomRequestDistribution, TestRebalanceLeaders, TestRequestStatusCollectionAPI, TestSolrCloudWithKerberosAlt, CachingDirectoryFactoryTest, TestInitParams, TestReloadAndDeleteDocs, TestShardHandlerFactory, TestSolrConfigHandler, TestReqParamsAPI, TestSolrConfigHandlerCloud, DistributedFacetPivotLongTailTest, DistributedSuggestComponentTest, FacetPivotSmallTest, SpatialHeatmapFacetsTest, JavabinLoaderTest, HighlighterMaxOffsetTest, WrapperMergePolicyFactoryTest, CheckHdfsIndexTest, TestIntervalFaceting, TestCustomDocTransformer, TestRawTransformer, TestSolrQueryResponse, TestSortingResponseWriter, TestManagedSchemaFieldResource, TestRemoveLastDynamicCopyField, TestSchemaNameResource, TestSchemaSimilarityResource, TestSerializedLuceneMatchVersion, SpatialRPTFieldTypeTest, TestCloudSchemaless, TestSchemaManager, TestUseDocValuesAsStored2, AnalyticsMergeStrategyTest, TestJsonFacets, TestExactSharedStatsCache, PKIAuthenticationIntegrationTest, ParsingFieldUpdateProcessorsTest, PreAnalyzedUpdateProcessorTest, UUIDUpdateProcessorFallbackTest, DistanceUnitsTest, TestRTimerTree, TestSolrCLIRunExample]
   [junit4] Completed [579/579 (1!)] on J0 in 16.06s, 3 tests, 1 error, 1 skipped <<< FAILURES!

[...truncated 11 lines...]
BUILD FAILED
/home/jenkins/workspace/Lucene-Solr-trunk-Linux/build.xml:740: The following error occurred while executing this line:
/home/jenkins/workspace/Lucene-Solr-trunk-Linux/build.xml:684: The following error occurred while executing this line:
/home/jenkins/workspace/Lucene-Solr-trunk-Linux/build.xml:59: The following error occurred while executing this line:
/home/jenkins/workspace/Lucene-Solr-trunk-Linux/solr/build.xml:233: The following error occurred while executing this line:
/home/jenkins/workspace/Lucene-Solr-trunk-Linux/solr/common-build.xml:524: The following error occurred while executing this line:
/home/jenkins/workspace/Lucene-Solr-trunk-Linux/lucene/common-build.xml:1457: The following error occurred while executing this line:
/home/jenkins/workspace/Lucene-Solr-trunk-Linux/lucene/common-build.xml:1014: There were test failures: 579 suites (8 ignored), 2331 tests, 1 error, 117 ignored (72 assumptions) [seed: 513DD2224788F90B]

Total time: 56 minutes 24 seconds
Build step 'Invoke Ant' marked build as failure
Archiving artifacts
[WARNINGS] Skipping publisher since build result is FAILURE
Recording test results
Email was triggered for: Failure - Any
Sending email for trigger: Failure - Any



Mime
View raw message