lucene-dev mailing list archives

Site index · List index
Message view « Date » · « Thread »
Top « Date » · « Thread »
From Policeman Jenkins Server <jenk...@thetaphi.de>
Subject [JENKINS] Lucene-Solr-trunk-Solaris (64bit/jdk1.8.0) - Build # 378 - Failure!
Date Thu, 04 Feb 2016 02:03:56 GMT
Build: http://jenkins.thetaphi.de/job/Lucene-Solr-trunk-Solaris/378/
Java: 64bit/jdk1.8.0 -XX:+UseCompressedOops -XX:+UseConcMarkSweepGC

1 tests failed.
FAILED:  org.apache.solr.cloud.hdfs.StressHdfsTest.test

Error Message:
KeeperErrorCode = Session expired for /clusterstate.json

Stack Trace:
org.apache.zookeeper.KeeperException$SessionExpiredException: KeeperErrorCode = Session expired for /clusterstate.json
	at __randomizedtesting.SeedInfo.seed([FC75998DF3022030:7421A6575DFE4DC8]:0)
	at org.apache.zookeeper.KeeperException.create(KeeperException.java:127)
	at org.apache.zookeeper.KeeperException.create(KeeperException.java:51)
	at org.apache.zookeeper.ZooKeeper.getData(ZooKeeper.java:1155)
	at org.apache.solr.common.cloud.SolrZkClient$7.execute(SolrZkClient.java:354)
	at org.apache.solr.common.cloud.SolrZkClient$7.execute(SolrZkClient.java:351)
	at org.apache.solr.common.cloud.ZkCmdExecutor.retryOperation(ZkCmdExecutor.java:61)
	at org.apache.solr.common.cloud.SolrZkClient.getData(SolrZkClient.java:351)
	at org.apache.solr.common.cloud.ZkStateReader.refreshLegacyClusterState(ZkStateReader.java:440)
	at org.apache.solr.common.cloud.ZkStateReader.updateClusterState(ZkStateReader.java:240)
	at org.apache.solr.cloud.AbstractDistribZkTestBase.waitForRecoveriesToFinish(AbstractDistribZkTestBase.java:149)
	at org.apache.solr.cloud.AbstractDistribZkTestBase.waitForRecoveriesToFinish(AbstractDistribZkTestBase.java:136)
	at org.apache.solr.cloud.AbstractDistribZkTestBase.waitForRecoveriesToFinish(AbstractDistribZkTestBase.java:131)
	at org.apache.solr.cloud.AbstractFullDistribZkTestBase.waitForRecoveriesToFinish(AbstractFullDistribZkTestBase.java:850)
	at org.apache.solr.cloud.hdfs.StressHdfsTest.createAndDeleteCollection(StressHdfsTest.java:156)
	at org.apache.solr.cloud.hdfs.StressHdfsTest.test(StressHdfsTest.java:100)
	at sun.reflect.NativeMethodAccessorImpl.invoke0(Native Method)
	at sun.reflect.NativeMethodAccessorImpl.invoke(NativeMethodAccessorImpl.java:62)
	at sun.reflect.DelegatingMethodAccessorImpl.invoke(DelegatingMethodAccessorImpl.java:43)
	at java.lang.reflect.Method.invoke(Method.java:498)
	at com.carrotsearch.randomizedtesting.RandomizedRunner.invoke(RandomizedRunner.java:1764)
	at com.carrotsearch.randomizedtesting.RandomizedRunner$8.evaluate(RandomizedRunner.java:871)
	at com.carrotsearch.randomizedtesting.RandomizedRunner$9.evaluate(RandomizedRunner.java:907)
	at com.carrotsearch.randomizedtesting.RandomizedRunner$10.evaluate(RandomizedRunner.java:921)
	at org.apache.solr.BaseDistributedSearchTestCase$ShardsRepeatRule$ShardsFixedStatement.callStatement(BaseDistributedSearchTestCase.java:965)
	at org.apache.solr.BaseDistributedSearchTestCase$ShardsRepeatRule$ShardsStatement.evaluate(BaseDistributedSearchTestCase.java:940)
	at com.carrotsearch.randomizedtesting.rules.SystemPropertiesRestoreRule$1.evaluate(SystemPropertiesRestoreRule.java:57)
	at org.apache.lucene.util.TestRuleSetupTeardownChained$1.evaluate(TestRuleSetupTeardownChained.java:50)
	at org.apache.lucene.util.AbstractBeforeAfterRule$1.evaluate(AbstractBeforeAfterRule.java:46)
	at org.apache.lucene.util.TestRuleThreadAndTestName$1.evaluate(TestRuleThreadAndTestName.java:49)
	at org.apache.lucene.util.TestRuleIgnoreAfterMaxFailures$1.evaluate(TestRuleIgnoreAfterMaxFailures.java:65)
	at org.apache.lucene.util.TestRuleMarkFailure$1.evaluate(TestRuleMarkFailure.java:48)
	at com.carrotsearch.randomizedtesting.rules.StatementAdapter.evaluate(StatementAdapter.java:36)
	at com.carrotsearch.randomizedtesting.ThreadLeakControl$StatementRunner.run(ThreadLeakControl.java:367)
	at com.carrotsearch.randomizedtesting.ThreadLeakControl.forkTimeoutingTask(ThreadLeakControl.java:809)
	at com.carrotsearch.randomizedtesting.ThreadLeakControl$3.evaluate(ThreadLeakControl.java:460)
	at com.carrotsearch.randomizedtesting.RandomizedRunner.runSingleTest(RandomizedRunner.java:880)
	at com.carrotsearch.randomizedtesting.RandomizedRunner$5.evaluate(RandomizedRunner.java:781)
	at com.carrotsearch.randomizedtesting.RandomizedRunner$6.evaluate(RandomizedRunner.java:816)
	at com.carrotsearch.randomizedtesting.RandomizedRunner$7.evaluate(RandomizedRunner.java:827)
	at com.carrotsearch.randomizedtesting.rules.StatementAdapter.evaluate(StatementAdapter.java:36)
	at com.carrotsearch.randomizedtesting.rules.SystemPropertiesRestoreRule$1.evaluate(SystemPropertiesRestoreRule.java:57)
	at org.apache.lucene.util.AbstractBeforeAfterRule$1.evaluate(AbstractBeforeAfterRule.java:46)
	at com.carrotsearch.randomizedtesting.rules.StatementAdapter.evaluate(StatementAdapter.java:36)
	at org.apache.lucene.util.TestRuleStoreClassName$1.evaluate(TestRuleStoreClassName.java:42)
	at com.carrotsearch.randomizedtesting.rules.NoShadowingOrOverridesOnMethodsRule$1.evaluate(NoShadowingOrOverridesOnMethodsRule.java:40)
	at com.carrotsearch.randomizedtesting.rules.NoShadowingOrOverridesOnMethodsRule$1.evaluate(NoShadowingOrOverridesOnMethodsRule.java:40)
	at com.carrotsearch.randomizedtesting.rules.StatementAdapter.evaluate(StatementAdapter.java:36)
	at com.carrotsearch.randomizedtesting.rules.StatementAdapter.evaluate(StatementAdapter.java:36)
	at com.carrotsearch.randomizedtesting.rules.StatementAdapter.evaluate(StatementAdapter.java:36)
	at org.apache.lucene.util.TestRuleAssertionsRequired$1.evaluate(TestRuleAssertionsRequired.java:54)
	at org.apache.lucene.util.TestRuleMarkFailure$1.evaluate(TestRuleMarkFailure.java:48)
	at org.apache.lucene.util.TestRuleIgnoreAfterMaxFailures$1.evaluate(TestRuleIgnoreAfterMaxFailures.java:65)
	at org.apache.lucene.util.TestRuleIgnoreTestSuites$1.evaluate(TestRuleIgnoreTestSuites.java:55)
	at com.carrotsearch.randomizedtesting.rules.StatementAdapter.evaluate(StatementAdapter.java:36)
	at com.carrotsearch.randomizedtesting.ThreadLeakControl$StatementRunner.run(ThreadLeakControl.java:367)
	at java.lang.Thread.run(Thread.java:745)




Build Log:
[...truncated 11691 lines...]
   [junit4] Suite: org.apache.solr.cloud.hdfs.StressHdfsTest
   [junit4]   2> Creating dataDir: /export/home/jenkins/workspace/Lucene-Solr-trunk-Solaris/solr/build/solr-core/test/J0/temp/solr.cloud.hdfs.StressHdfsTest_FC75998DF3022030-001/init-core-data-001
   [junit4]   2> 2669607 WARN  (SUITE-StressHdfsTest-seed#[FC75998DF3022030]-worker) [    ] o.a.s.SolrTestCaseJ4 startTrackingSearchers: numOpens=4 numCloses=4
   [junit4]   2> 2669608 INFO  (SUITE-StressHdfsTest-seed#[FC75998DF3022030]-worker) [    ] o.a.s.BaseDistributedSearchTestCase Setting hostContext system property: /
   [junit4]   1> Formatting using clusterid: testClusterID
   [junit4]   2> 2669715 WARN  (SUITE-StressHdfsTest-seed#[FC75998DF3022030]-worker) [    ] o.a.h.m.i.MetricsConfig Cannot locate configuration: tried hadoop-metrics2-namenode.properties,hadoop-metrics2.properties
   [junit4]   2> 2669727 WARN  (SUITE-StressHdfsTest-seed#[FC75998DF3022030]-worker) [    ] o.a.h.h.HttpRequestLog Jetty request log can only be enabled using Log4j
   [junit4]   2> 2669730 INFO  (SUITE-StressHdfsTest-seed#[FC75998DF3022030]-worker) [    ] o.m.log jetty-6.1.26
   [junit4]   2> 2669747 INFO  (SUITE-StressHdfsTest-seed#[FC75998DF3022030]-worker) [    ] o.m.log Extract jar:file:/export/home/jenkins/.ivy2/cache/org.apache.hadoop/hadoop-hdfs/tests/hadoop-hdfs-2.6.0-tests.jar!/webapps/hdfs to ./temp/Jetty_solaris.vm_33203_hdfs____.otmk2h/webapp
   [junit4]   2> 2669852 INFO  (SUITE-StressHdfsTest-seed#[FC75998DF3022030]-worker) [    ] o.m.log NO JSP Support for /, did not find org.apache.jasper.servlet.JspServlet
   [junit4]   2> 2670832 INFO  (SUITE-StressHdfsTest-seed#[FC75998DF3022030]-worker) [    ] o.m.log Started HttpServer2$SelectChannelConnectorWithSafeStartup@solaris-vm:33203
   [junit4]   2> 2671317 WARN  (SUITE-StressHdfsTest-seed#[FC75998DF3022030]-worker) [    ] o.a.h.h.HttpRequestLog Jetty request log can only be enabled using Log4j
   [junit4]   2> 2671319 INFO  (SUITE-StressHdfsTest-seed#[FC75998DF3022030]-worker) [    ] o.m.log jetty-6.1.26
   [junit4]   2> 2671333 INFO  (SUITE-StressHdfsTest-seed#[FC75998DF3022030]-worker) [    ] o.m.log Extract jar:file:/export/home/jenkins/.ivy2/cache/org.apache.hadoop/hadoop-hdfs/tests/hadoop-hdfs-2.6.0-tests.jar!/webapps/datanode to ./temp/Jetty_solaris.vm_59291_datanode____.nytv2j/webapp
   [junit4]   2> 2671465 INFO  (SUITE-StressHdfsTest-seed#[FC75998DF3022030]-worker) [    ] o.m.log NO JSP Support for /, did not find org.apache.jasper.servlet.JspServlet
   [junit4]   2> 2671874 INFO  (SUITE-StressHdfsTest-seed#[FC75998DF3022030]-worker) [    ] o.m.log Started HttpServer2$SelectChannelConnectorWithSafeStartup@solaris-vm:59291
   [junit4]   2> 2672028 WARN  (SUITE-StressHdfsTest-seed#[FC75998DF3022030]-worker) [    ] o.a.h.h.HttpRequestLog Jetty request log can only be enabled using Log4j
   [junit4]   2> 2672030 INFO  (SUITE-StressHdfsTest-seed#[FC75998DF3022030]-worker) [    ] o.m.log jetty-6.1.26
   [junit4]   2> 2672056 INFO  (SUITE-StressHdfsTest-seed#[FC75998DF3022030]-worker) [    ] o.m.log Extract jar:file:/export/home/jenkins/.ivy2/cache/org.apache.hadoop/hadoop-hdfs/tests/hadoop-hdfs-2.6.0-tests.jar!/webapps/datanode to ./temp/Jetty_solaris.vm_50035_datanode____wwxco6/webapp
   [junit4]   2> 2672114 INFO  (IPC Server handler 4 on 48162) [    ] BlockStateChange BLOCK* processReport: from storage DS-e4f118dd-0963-4437-accb-84c0f3df0156 node DatanodeRegistration(127.0.0.1, datanodeUuid=3d5dbaec-f6d1-48c1-8b30-23e0b34eb33e, infoPort=59291, ipcPort=43260, storageInfo=lv=-56;cid=testClusterID;nsid=1702945079;c=0), blocks: 0, hasStaleStorages: true, processing time: 0 msecs
   [junit4]   2> 2672114 INFO  (IPC Server handler 4 on 48162) [    ] BlockStateChange BLOCK* processReport: from storage DS-5093f232-86a2-4527-9afc-74022c1168ea node DatanodeRegistration(127.0.0.1, datanodeUuid=3d5dbaec-f6d1-48c1-8b30-23e0b34eb33e, infoPort=59291, ipcPort=43260, storageInfo=lv=-56;cid=testClusterID;nsid=1702945079;c=0), blocks: 0, hasStaleStorages: false, processing time: 0 msecs
   [junit4]   2> 2672203 INFO  (SUITE-StressHdfsTest-seed#[FC75998DF3022030]-worker) [    ] o.m.log NO JSP Support for /, did not find org.apache.jasper.servlet.JspServlet
   [junit4]   2> 2672655 INFO  (SUITE-StressHdfsTest-seed#[FC75998DF3022030]-worker) [    ] o.m.log Started HttpServer2$SelectChannelConnectorWithSafeStartup@solaris-vm:50035
   [junit4]   2> 2673010 INFO  (IPC Server handler 9 on 48162) [    ] BlockStateChange BLOCK* processReport: from storage DS-c70b2da1-2256-4e91-bc7a-99138c6086c8 node DatanodeRegistration(127.0.0.1, datanodeUuid=56daea22-20ac-4729-a282-f46ebea1542b, infoPort=50035, ipcPort=55947, storageInfo=lv=-56;cid=testClusterID;nsid=1702945079;c=0), blocks: 0, hasStaleStorages: true, processing time: 0 msecs
   [junit4]   2> 2673011 INFO  (IPC Server handler 9 on 48162) [    ] BlockStateChange BLOCK* processReport: from storage DS-fb6b9dfb-beab-48e0-b886-ffb96d88dd4d node DatanodeRegistration(127.0.0.1, datanodeUuid=56daea22-20ac-4729-a282-f46ebea1542b, infoPort=50035, ipcPort=55947, storageInfo=lv=-56;cid=testClusterID;nsid=1702945079;c=0), blocks: 0, hasStaleStorages: false, processing time: 0 msecs
   [junit4]   2> 2673161 INFO  (TEST-StressHdfsTest.test-seed#[FC75998DF3022030]) [    ] o.a.s.c.ZkTestServer STARTING ZK TEST SERVER
   [junit4]   2> 2673162 INFO  (Thread-7730) [    ] o.a.s.c.ZkTestServer client port:0.0.0.0/0.0.0.0:0
   [junit4]   2> 2673162 INFO  (Thread-7730) [    ] o.a.s.c.ZkTestServer Starting server
   [junit4]   2> 2673264 INFO  (TEST-StressHdfsTest.test-seed#[FC75998DF3022030]) [    ] o.a.s.c.ZkTestServer start zk server on port:50110
   [junit4]   2> 2673265 INFO  (TEST-StressHdfsTest.test-seed#[FC75998DF3022030]) [    ] o.a.s.c.c.SolrZkClient Using default ZkCredentialsProvider
   [junit4]   2> 2673268 INFO  (TEST-StressHdfsTest.test-seed#[FC75998DF3022030]) [    ] o.a.s.c.c.ConnectionManager Waiting for client to connect to ZooKeeper
   [junit4]   2> 2673276 INFO  (zkCallback-2856-thread-1) [    ] o.a.s.c.c.ConnectionManager Watcher org.apache.solr.common.cloud.ConnectionManager@62bbea9b name:ZooKeeperConnection Watcher:127.0.0.1:50110 got event WatchedEvent state:SyncConnected type:None path:null path:null type:None
   [junit4]   2> 2673276 INFO  (TEST-StressHdfsTest.test-seed#[FC75998DF3022030]) [    ] o.a.s.c.c.ConnectionManager Client is connected to ZooKeeper
   [junit4]   2> 2673277 INFO  (TEST-StressHdfsTest.test-seed#[FC75998DF3022030]) [    ] o.a.s.c.c.SolrZkClient Using default ZkACLProvider
   [junit4]   2> 2673277 INFO  (TEST-StressHdfsTest.test-seed#[FC75998DF3022030]) [    ] o.a.s.c.c.SolrZkClient makePath: /solr
   [junit4]   2> 2673282 INFO  (TEST-StressHdfsTest.test-seed#[FC75998DF3022030]) [    ] o.a.s.c.c.SolrZkClient Using default ZkCredentialsProvider
   [junit4]   2> 2673283 INFO  (TEST-StressHdfsTest.test-seed#[FC75998DF3022030]) [    ] o.a.s.c.c.ConnectionManager Waiting for client to connect to ZooKeeper
   [junit4]   2> 2673284 INFO  (zkCallback-2857-thread-1) [    ] o.a.s.c.c.ConnectionManager Watcher org.apache.solr.common.cloud.ConnectionManager@3accb907 name:ZooKeeperConnection Watcher:127.0.0.1:50110/solr got event WatchedEvent state:SyncConnected type:None path:null path:null type:None
   [junit4]   2> 2673285 INFO  (TEST-StressHdfsTest.test-seed#[FC75998DF3022030]) [    ] o.a.s.c.c.ConnectionManager Client is connected to ZooKeeper
   [junit4]   2> 2673285 INFO  (TEST-StressHdfsTest.test-seed#[FC75998DF3022030]) [    ] o.a.s.c.c.SolrZkClient Using default ZkACLProvider
   [junit4]   2> 2673285 INFO  (TEST-StressHdfsTest.test-seed#[FC75998DF3022030]) [    ] o.a.s.c.c.SolrZkClient makePath: /collections/collection1
   [junit4]   2> 2673289 INFO  (TEST-StressHdfsTest.test-seed#[FC75998DF3022030]) [    ] o.a.s.c.c.SolrZkClient makePath: /collections/collection1/shards
   [junit4]   2> 2673292 INFO  (TEST-StressHdfsTest.test-seed#[FC75998DF3022030]) [    ] o.a.s.c.c.SolrZkClient makePath: /collections/control_collection
   [junit4]   2> 2673295 INFO  (TEST-StressHdfsTest.test-seed#[FC75998DF3022030]) [    ] o.a.s.c.c.SolrZkClient makePath: /collections/control_collection/shards
   [junit4]   2> 2673297 INFO  (TEST-StressHdfsTest.test-seed#[FC75998DF3022030]) [    ] o.a.s.c.AbstractZkTestCase put /export/home/jenkins/workspace/Lucene-Solr-trunk-Solaris/solr/core/src/test-files/solr/collection1/conf/solrconfig-tlog.xml to /configs/conf1/solrconfig.xml
   [junit4]   2> 2673297 INFO  (TEST-StressHdfsTest.test-seed#[FC75998DF3022030]) [    ] o.a.s.c.c.SolrZkClient makePath: /configs/conf1/solrconfig.xml
   [junit4]   2> 2673301 INFO  (TEST-StressHdfsTest.test-seed#[FC75998DF3022030]) [    ] o.a.s.c.AbstractZkTestCase put /export/home/jenkins/workspace/Lucene-Solr-trunk-Solaris/solr/core/src/test-files/solr/collection1/conf/schema.xml to /configs/conf1/schema.xml
   [junit4]   2> 2673302 INFO  (TEST-StressHdfsTest.test-seed#[FC75998DF3022030]) [    ] o.a.s.c.c.SolrZkClient makePath: /configs/conf1/schema.xml
   [junit4]   2> 2673306 INFO  (TEST-StressHdfsTest.test-seed#[FC75998DF3022030]) [    ] o.a.s.c.AbstractZkTestCase put /export/home/jenkins/workspace/Lucene-Solr-trunk-Solaris/solr/core/src/test-files/solr/collection1/conf/solrconfig.snippet.randomindexconfig.xml to /configs/conf1/solrconfig.snippet.randomindexconfig.xml
   [junit4]   2> 2673307 INFO  (TEST-StressHdfsTest.test-seed#[FC75998DF3022030]) [    ] o.a.s.c.c.SolrZkClient makePath: /configs/conf1/solrconfig.snippet.randomindexconfig.xml
   [junit4]   2> 2673310 INFO  (TEST-StressHdfsTest.test-seed#[FC75998DF3022030]) [    ] o.a.s.c.AbstractZkTestCase put /export/home/jenkins/workspace/Lucene-Solr-trunk-Solaris/solr/core/src/test-files/solr/collection1/conf/stopwords.txt to /configs/conf1/stopwords.txt
   [junit4]   2> 2673310 INFO  (TEST-StressHdfsTest.test-seed#[FC75998DF3022030]) [    ] o.a.s.c.c.SolrZkClient makePath: /configs/conf1/stopwords.txt
   [junit4]   2> 2673314 INFO  (TEST-StressHdfsTest.test-seed#[FC75998DF3022030]) [    ] o.a.s.c.AbstractZkTestCase put /export/home/jenkins/workspace/Lucene-Solr-trunk-Solaris/solr/core/src/test-files/solr/collection1/conf/protwords.txt to /configs/conf1/protwords.txt
   [junit4]   2> 2673314 INFO  (TEST-StressHdfsTest.test-seed#[FC75998DF3022030]) [    ] o.a.s.c.c.SolrZkClient makePath: /configs/conf1/protwords.txt
   [junit4]   2> 2673317 INFO  (TEST-StressHdfsTest.test-seed#[FC75998DF3022030]) [    ] o.a.s.c.AbstractZkTestCase put /export/home/jenkins/workspace/Lucene-Solr-trunk-Solaris/solr/core/src/test-files/solr/collection1/conf/currency.xml to /configs/conf1/currency.xml
   [junit4]   2> 2673318 INFO  (TEST-StressHdfsTest.test-seed#[FC75998DF3022030]) [    ] o.a.s.c.c.SolrZkClient makePath: /configs/conf1/currency.xml
   [junit4]   2> 2673320 INFO  (TEST-StressHdfsTest.test-seed#[FC75998DF3022030]) [    ] o.a.s.c.AbstractZkTestCase put /export/home/jenkins/workspace/Lucene-Solr-trunk-Solaris/solr/core/src/test-files/solr/collection1/conf/enumsConfig.xml to /configs/conf1/enumsConfig.xml
   [junit4]   2> 2673321 INFO  (TEST-StressHdfsTest.test-seed#[FC75998DF3022030]) [    ] o.a.s.c.c.SolrZkClient makePath: /configs/conf1/enumsConfig.xml
   [junit4]   2> 2673324 INFO  (TEST-StressHdfsTest.test-seed#[FC75998DF3022030]) [    ] o.a.s.c.AbstractZkTestCase put /export/home/jenkins/workspace/Lucene-Solr-trunk-Solaris/solr/core/src/test-files/solr/collection1/conf/open-exchange-rates.json to /configs/conf1/open-exchange-rates.json
   [junit4]   2> 2673325 INFO  (TEST-StressHdfsTest.test-seed#[FC75998DF3022030]) [    ] o.a.s.c.c.SolrZkClient makePath: /configs/conf1/open-exchange-rates.json
   [junit4]   2> 2673328 INFO  (TEST-StressHdfsTest.test-seed#[FC75998DF3022030]) [    ] o.a.s.c.AbstractZkTestCase put /export/home/jenkins/workspace/Lucene-Solr-trunk-Solaris/solr/core/src/test-files/solr/collection1/conf/mapping-ISOLatin1Accent.txt to /configs/conf1/mapping-ISOLatin1Accent.txt
   [junit4]   2> 2673328 INFO  (TEST-StressHdfsTest.test-seed#[FC75998DF3022030]) [    ] o.a.s.c.c.SolrZkClient makePath: /configs/conf1/mapping-ISOLatin1Accent.txt
   [junit4]   2> 2673331 INFO  (TEST-StressHdfsTest.test-seed#[FC75998DF3022030]) [    ] o.a.s.c.AbstractZkTestCase put /export/home/jenkins/workspace/Lucene-Solr-trunk-Solaris/solr/core/src/test-files/solr/collection1/conf/old_synonyms.txt to /configs/conf1/old_synonyms.txt
   [junit4]   2> 2673332 INFO  (TEST-StressHdfsTest.test-seed#[FC75998DF3022030]) [    ] o.a.s.c.c.SolrZkClient makePath: /configs/conf1/old_synonyms.txt
   [junit4]   2> 2673335 INFO  (TEST-StressHdfsTest.test-seed#[FC75998DF3022030]) [    ] o.a.s.c.AbstractZkTestCase put /export/home/jenkins/workspace/Lucene-Solr-trunk-Solaris/solr/core/src/test-files/solr/collection1/conf/synonyms.txt to /configs/conf1/synonyms.txt
   [junit4]   2> 2673335 INFO  (TEST-StressHdfsTest.test-seed#[FC75998DF3022030]) [    ] o.a.s.c.c.SolrZkClient makePath: /configs/conf1/synonyms.txt
   [junit4]   2> 2673781 INFO  (TEST-StressHdfsTest.test-seed#[FC75998DF3022030]) [    ] o.a.s.SolrTestCaseJ4 Writing core.properties file to /export/home/jenkins/workspace/Lucene-Solr-trunk-Solaris/solr/build/solr-core/test/J0/temp/solr.cloud.hdfs.StressHdfsTest_FC75998DF3022030-001/control-001/cores/collection1
   [junit4]   2> 2673782 INFO  (TEST-StressHdfsTest.test-seed#[FC75998DF3022030]) [    ] o.e.j.s.Server jetty-9.2.13.v20150730
   [junit4]   2> 2673784 INFO  (TEST-StressHdfsTest.test-seed#[FC75998DF3022030]) [    ] o.e.j.s.h.ContextHandler Started o.e.j.s.ServletContextHandler@6c451e18{/,null,AVAILABLE}
   [junit4]   2> 2673784 INFO  (TEST-StressHdfsTest.test-seed#[FC75998DF3022030]) [    ] o.e.j.s.ServerConnector Started ServerConnector@503d2b1f{HTTP/1.1}{127.0.0.1:41763}
   [junit4]   2> 2673785 INFO  (TEST-StressHdfsTest.test-seed#[FC75998DF3022030]) [    ] o.e.j.s.Server Started @2679485ms
   [junit4]   2> 2673785 INFO  (TEST-StressHdfsTest.test-seed#[FC75998DF3022030]) [    ] o.a.s.c.s.e.JettySolrRunner Jetty properties: {solr.data.dir=hdfs://solaris-vm:48162/hdfs__solaris-vm_48162__export_home_jenkins_workspace_Lucene-Solr-trunk-Solaris_solr_build_solr-core_test_J0_temp_solr.cloud.hdfs.StressHdfsTest_FC75998DF3022030-001_tempDir-002_control_data, hostContext=/, hostPort=41763, coreRootDirectory=/export/home/jenkins/workspace/Lucene-Solr-trunk-Solaris/solr/build/solr-core/test/J0/../../../../../../../../../../export/home/jenkins/workspace/Lucene-Solr-trunk-Solaris/solr/build/solr-core/test/J0/temp/solr.cloud.hdfs.StressHdfsTest_FC75998DF3022030-001/control-001/cores}
   [junit4]   2> 2673785 INFO  (TEST-StressHdfsTest.test-seed#[FC75998DF3022030]) [    ] o.a.s.s.SolrDispatchFilter SolrDispatchFilter.init(): sun.misc.Launcher$AppClassLoader@6d06d69c
   [junit4]   2> 2673785 INFO  (TEST-StressHdfsTest.test-seed#[FC75998DF3022030]) [    ] o.a.s.c.SolrResourceLoader new SolrResourceLoader for directory: '/export/home/jenkins/workspace/Lucene-Solr-trunk-Solaris/solr/build/solr-core/test/J0/temp/solr.cloud.hdfs.StressHdfsTest_FC75998DF3022030-001/control-001'
   [junit4]   2> 2673785 INFO  (TEST-StressHdfsTest.test-seed#[FC75998DF3022030]) [    ] o.a.s.c.SolrResourceLoader JNDI not configured for solr (NoInitialContextEx)
   [junit4]   2> 2673785 INFO  (TEST-StressHdfsTest.test-seed#[FC75998DF3022030]) [    ] o.a.s.c.SolrResourceLoader solr home defaulted to 'solr/' (could not find system property or JNDI)
   [junit4]   2> 2673786 INFO  (TEST-StressHdfsTest.test-seed#[FC75998DF3022030]) [    ] o.a.s.c.c.SolrZkClient Using default ZkCredentialsProvider
   [junit4]   2> 2673786 INFO  (TEST-StressHdfsTest.test-seed#[FC75998DF3022030]) [    ] o.a.s.c.c.ConnectionManager Waiting for client to connect to ZooKeeper
   [junit4]   2> 2673787 INFO  (zkCallback-2858-thread-1) [    ] o.a.s.c.c.ConnectionManager Watcher org.apache.solr.common.cloud.ConnectionManager@55f8d10b name:ZooKeeperConnection Watcher:127.0.0.1:50110/solr got event WatchedEvent state:SyncConnected type:None path:null path:null type:None
   [junit4]   2> 2673788 INFO  (TEST-StressHdfsTest.test-seed#[FC75998DF3022030]) [    ] o.a.s.c.c.ConnectionManager Client is connected to ZooKeeper
   [junit4]   2> 2673788 INFO  (TEST-StressHdfsTest.test-seed#[FC75998DF3022030]) [    ] o.a.s.c.c.SolrZkClient Using default ZkACLProvider
   [junit4]   2> 2673790 INFO  (TEST-StressHdfsTest.test-seed#[FC75998DF3022030]) [    ] o.a.s.s.SolrDispatchFilter Loading solr.xml from SolrHome (not found in ZooKeeper)
   [junit4]   2> 2673790 INFO  (TEST-StressHdfsTest.test-seed#[FC75998DF3022030]) [    ] o.a.s.c.SolrXmlConfig Loading container configuration from /export/home/jenkins/workspace/Lucene-Solr-trunk-Solaris/solr/build/solr-core/test/J0/temp/solr.cloud.hdfs.StressHdfsTest_FC75998DF3022030-001/control-001/solr.xml
   [junit4]   2> 2673796 INFO  (TEST-StressHdfsTest.test-seed#[FC75998DF3022030]) [    ] o.a.s.c.CorePropertiesLocator Config-defined core root directory: /export/home/jenkins/workspace/Lucene-Solr-trunk-Solaris/solr/build/solr-core/test/J0/../../../../../../../../../../export/home/jenkins/workspace/Lucene-Solr-trunk-Solaris/solr/build/solr-core/test/J0/temp/solr.cloud.hdfs.StressHdfsTest_FC75998DF3022030-001/control-001/cores
   [junit4]   2> 2673796 INFO  (TEST-StressHdfsTest.test-seed#[FC75998DF3022030]) [    ] o.a.s.c.CoreContainer New CoreContainer 555394889
   [junit4]   2> 2673796 INFO  (TEST-StressHdfsTest.test-seed#[FC75998DF3022030]) [    ] o.a.s.c.CoreContainer Loading cores into CoreContainer [instanceDir=/export/home/jenkins/workspace/Lucene-Solr-trunk-Solaris/solr/build/solr-core/test/J0/temp/solr.cloud.hdfs.StressHdfsTest_FC75998DF3022030-001/control-001]
   [junit4]   2> 2673796 WARN  (TEST-StressHdfsTest.test-seed#[FC75998DF3022030]) [    ] o.a.s.c.CoreContainer Couldn't add files from /export/home/jenkins/workspace/Lucene-Solr-trunk-Solaris/solr/build/solr-core/test/J0/temp/solr.cloud.hdfs.StressHdfsTest_FC75998DF3022030-001/control-001/lib to classpath: /export/home/jenkins/workspace/Lucene-Solr-trunk-Solaris/solr/build/solr-core/test/J0/temp/solr.cloud.hdfs.StressHdfsTest_FC75998DF3022030-001/control-001/lib
   [junit4]   2> 2673797 INFO  (TEST-StressHdfsTest.test-seed#[FC75998DF3022030]) [    ] o.a.s.h.c.HttpShardHandlerFactory created with socketTimeout : 90000,urlScheme : ,connTimeout : 15000,maxConnectionsPerHost : 20,maxConnections : 10000,corePoolSize : 0,maximumPoolSize : 2147483647,maxThreadIdleTime : 5,sizeOfQueue : -1,fairnessPolicy : false,useRetries : false,
   [junit4]   2> 2673799 INFO  (TEST-StressHdfsTest.test-seed#[FC75998DF3022030]) [    ] o.a.s.u.UpdateShardHandler Creating UpdateShardHandler HTTP client with params: socketTimeout=340000&connTimeout=45000&retry=true
   [junit4]   2> 2673799 INFO  (TEST-StressHdfsTest.test-seed#[FC75998DF3022030]) [    ] o.a.s.l.LogWatcher SLF4J impl is org.slf4j.impl.Log4jLoggerFactory
   [junit4]   2> 2673800 INFO  (TEST-StressHdfsTest.test-seed#[FC75998DF3022030]) [    ] o.a.s.l.LogWatcher Registering Log Listener [Log4j (org.slf4j.impl.Log4jLoggerFactory)]
   [junit4]   2> 2673800 INFO  (TEST-StressHdfsTest.test-seed#[FC75998DF3022030]) [    ] o.a.s.c.ZkContainer Zookeeper client=127.0.0.1:50110/solr
   [junit4]   2> 2673800 INFO  (TEST-StressHdfsTest.test-seed#[FC75998DF3022030]) [    ] o.a.s.c.ZkController zkHost includes chroot
   [junit4]   2> 2673800 INFO  (TEST-StressHdfsTest.test-seed#[FC75998DF3022030]) [    ] o.a.s.c.c.SolrZkClient Using default ZkCredentialsProvider
   [junit4]   2> 2673800 INFO  (TEST-StressHdfsTest.test-seed#[FC75998DF3022030]) [    ] o.a.s.c.c.ConnectionManager Waiting for client to connect to ZooKeeper
   [junit4]   2> 2673802 INFO  (zkCallback-2861-thread-1) [    ] o.a.s.c.c.ConnectionManager Watcher org.apache.solr.common.cloud.ConnectionManager@e059576 name:ZooKeeperConnection Watcher:127.0.0.1:50110 got event WatchedEvent state:SyncConnected type:None path:null path:null type:None
   [junit4]   2> 2673802 INFO  (TEST-StressHdfsTest.test-seed#[FC75998DF3022030]) [    ] o.a.s.c.c.ConnectionManager Client is connected to ZooKeeper
   [junit4]   2> 2673802 INFO  (TEST-StressHdfsTest.test-seed#[FC75998DF3022030]) [    ] o.a.s.c.c.SolrZkClient Using default ZkACLProvider
   [junit4]   2> 2673804 INFO  (TEST-StressHdfsTest.test-seed#[FC75998DF3022030]) [n:127.0.0.1:41763_    ] o.a.s.c.c.ConnectionManager Waiting for client to connect to ZooKeeper
   [junit4]   2> 2673806 INFO  (zkCallback-2862-thread-1-processing-n:127.0.0.1:41763_) [n:127.0.0.1:41763_    ] o.a.s.c.c.ConnectionManager Watcher org.apache.solr.common.cloud.ConnectionManager@6bdf07e0 name:ZooKeeperConnection Watcher:127.0.0.1:50110/solr got event WatchedEvent state:SyncConnected type:None path:null path:null type:None
   [junit4]   2> 2673806 INFO  (TEST-StressHdfsTest.test-seed#[FC75998DF3022030]) [n:127.0.0.1:41763_    ] o.a.s.c.c.ConnectionManager Client is connected to ZooKeeper
   [junit4]   2> 2673807 INFO  (TEST-StressHdfsTest.test-seed#[FC75998DF3022030]) [n:127.0.0.1:41763_    ] o.a.s.c.c.SolrZkClient makePath: /overseer/queue
   [junit4]   2> 2673809 INFO  (TEST-StressHdfsTest.test-seed#[FC75998DF3022030]) [n:127.0.0.1:41763_    ] o.a.s.c.c.SolrZkClient makePath: /overseer/collection-queue-work
   [junit4]   2> 2673813 INFO  (TEST-StressHdfsTest.test-seed#[FC75998DF3022030]) [n:127.0.0.1:41763_    ] o.a.s.c.c.SolrZkClient makePath: /overseer/collection-map-running
   [junit4]   2> 2673816 INFO  (TEST-StressHdfsTest.test-seed#[FC75998DF3022030]) [n:127.0.0.1:41763_    ] o.a.s.c.c.SolrZkClient makePath: /overseer/collection-map-completed
   [junit4]   2> 2673820 INFO  (TEST-StressHdfsTest.test-seed#[FC75998DF3022030]) [n:127.0.0.1:41763_    ] o.a.s.c.c.SolrZkClient makePath: /overseer/collection-map-failure
   [junit4]   2> 2673824 INFO  (TEST-StressHdfsTest.test-seed#[FC75998DF3022030]) [n:127.0.0.1:41763_    ] o.a.s.c.c.SolrZkClient makePath: /live_nodes
   [junit4]   2> 2673826 INFO  (TEST-StressHdfsTest.test-seed#[FC75998DF3022030]) [n:127.0.0.1:41763_    ] o.a.s.c.c.SolrZkClient makePath: /aliases.json
   [junit4]   2> 2673829 INFO  (TEST-StressHdfsTest.test-seed#[FC75998DF3022030]) [n:127.0.0.1:41763_    ] o.a.s.c.c.SolrZkClient makePath: /clusterstate.json
   [junit4]   2> 2673831 INFO  (TEST-StressHdfsTest.test-seed#[FC75998DF3022030]) [n:127.0.0.1:41763_    ] o.a.s.c.c.SolrZkClient makePath: /security.json
   [junit4]   2> 2673833 INFO  (TEST-StressHdfsTest.test-seed#[FC75998DF3022030]) [n:127.0.0.1:41763_    ] o.a.s.c.ZkController Register node as live in ZooKeeper:/live_nodes/127.0.0.1:41763_
   [junit4]   2> 2673833 INFO  (TEST-StressHdfsTest.test-seed#[FC75998DF3022030]) [n:127.0.0.1:41763_    ] o.a.s.c.c.SolrZkClient makePath: /live_nodes/127.0.0.1:41763_
   [junit4]   2> 2673836 INFO  (TEST-StressHdfsTest.test-seed#[FC75998DF3022030]) [n:127.0.0.1:41763_    ] o.a.s.c.c.SolrZkClient makePath: /overseer_elect
   [junit4]   2> 2673838 INFO  (TEST-StressHdfsTest.test-seed#[FC75998DF3022030]) [n:127.0.0.1:41763_    ] o.a.s.c.c.SolrZkClient makePath: /overseer_elect/election
   [junit4]   2> 2673840 INFO  (TEST-StressHdfsTest.test-seed#[FC75998DF3022030]) [n:127.0.0.1:41763_    ] o.a.s.c.Overseer Overseer (id=null) closing
   [junit4]   2> 2673841 INFO  (TEST-StressHdfsTest.test-seed#[FC75998DF3022030]) [n:127.0.0.1:41763_    ] o.a.s.c.LeaderElector Joined leadership election with path: /overseer_elect/election/95325455917318148-127.0.0.1:41763_-n_0000000000
   [junit4]   2> 2673841 INFO  (TEST-StressHdfsTest.test-seed#[FC75998DF3022030]) [n:127.0.0.1:41763_    ] o.a.s.c.OverseerElectionContext I am going to be the leader 127.0.0.1:41763_
   [junit4]   2> 2673841 INFO  (TEST-StressHdfsTest.test-seed#[FC75998DF3022030]) [n:127.0.0.1:41763_    ] o.a.s.c.c.SolrZkClient makePath: /overseer_elect/leader
   [junit4]   2> 2673843 INFO  (TEST-StressHdfsTest.test-seed#[FC75998DF3022030]) [n:127.0.0.1:41763_    ] o.a.s.c.Overseer Overseer (id=95325455917318148-127.0.0.1:41763_-n_0000000000) starting
   [junit4]   2> 2673845 INFO  (TEST-StressHdfsTest.test-seed#[FC75998DF3022030]) [n:127.0.0.1:41763_    ] o.a.s.c.c.SolrZkClient makePath: /overseer/queue-work
   [junit4]   2> 2673857 INFO  (TEST-StressHdfsTest.test-seed#[FC75998DF3022030]) [n:127.0.0.1:41763_    ] o.a.s.c.OverseerAutoReplicaFailoverThread Starting OverseerAutoReplicaFailoverThread autoReplicaFailoverWorkLoopDelay=10000 autoReplicaFailoverWaitAfterExpiration=10000 autoReplicaFailoverBadNodeExpiration=60000
   [junit4]   2> 2673858 INFO  (OverseerCollectionConfigSetProcessor-95325455917318148-127.0.0.1:41763_-n_0000000000) [n:127.0.0.1:41763_    ] o.a.s.c.OverseerTaskProcessor Process current queue of overseer operations
   [junit4]   2> 2673859 INFO  (TEST-StressHdfsTest.test-seed#[FC75998DF3022030]) [n:127.0.0.1:41763_    ] o.a.s.c.c.ZkStateReader Updating cluster state from ZooKeeper... 
   [junit4]   2> 2673859 INFO  (OverseerStateUpdate-95325455917318148-127.0.0.1:41763_-n_0000000000) [n:127.0.0.1:41763_    ] o.a.s.c.Overseer Starting to work on the main queue
   [junit4]   2> 2673892 INFO  (TEST-StressHdfsTest.test-seed#[FC75998DF3022030]) [n:127.0.0.1:41763_    ] o.a.s.c.CoreContainer Security conf doesn't exist. Skipping setup for authorization module.
   [junit4]   2> 2673892 INFO  (TEST-StressHdfsTest.test-seed#[FC75998DF3022030]) [n:127.0.0.1:41763_    ] o.a.s.c.CoreContainer No authentication plugin used.
   [junit4]   2> 2673893 INFO  (TEST-StressHdfsTest.test-seed#[FC75998DF3022030]) [n:127.0.0.1:41763_    ] o.a.s.c.CorePropertiesLocator Looking for core definitions underneath /export/home/jenkins/workspace/Lucene-Solr-trunk-Solaris/solr/build/solr-core/test/J0/../../../../../../../../../../export/home/jenkins/workspace/Lucene-Solr-trunk-Solaris/solr/build/solr-core/test/J0/temp/solr.cloud.hdfs.StressHdfsTest_FC75998DF3022030-001/control-001/cores
   [junit4]   2> 2673894 INFO  (TEST-StressHdfsTest.test-seed#[FC75998DF3022030]) [n:127.0.0.1:41763_    ] o.a.s.c.CoreDescriptor Created CoreDescriptor: {name=collection1, config=solrconfig.xml, transient=false, schema=schema.xml, loadOnStartup=true, configSetProperties=configsetprops.json, collection=control_collection, coreNodeName=, dataDir=data/, shard=}
   [junit4]   2> 2673894 INFO  (TEST-StressHdfsTest.test-seed#[FC75998DF3022030]) [n:127.0.0.1:41763_    ] o.a.s.c.CorePropertiesLocator Found core collection1 in /export/home/jenkins/workspace/Lucene-Solr-trunk-Solaris/solr/build/solr-core/test/J0/../../../../../../../../../../export/home/jenkins/workspace/Lucene-Solr-trunk-Solaris/solr/build/solr-core/test/J0/temp/solr.cloud.hdfs.StressHdfsTest_FC75998DF3022030-001/control-001/cores/collection1
   [junit4]   2> 2673894 INFO  (TEST-StressHdfsTest.test-seed#[FC75998DF3022030]) [n:127.0.0.1:41763_    ] o.a.s.c.CorePropertiesLocator Found 1 core definitions
   [junit4]   2> 2673896 INFO  (TEST-StressHdfsTest.test-seed#[FC75998DF3022030]) [n:127.0.0.1:41763_    ] o.a.s.s.SolrDispatchFilter user.dir=/export/home/jenkins/workspace/Lucene-Solr-trunk-Solaris/solr/build/solr-core/test/J0
   [junit4]   2> 2673897 INFO  (TEST-StressHdfsTest.test-seed#[FC75998DF3022030]) [n:127.0.0.1:41763_    ] o.a.s.s.SolrDispatchFilter SolrDispatchFilter.init() done
   [junit4]   2> 2673897 INFO  (coreLoadExecutor-8173-thread-1-processing-n:127.0.0.1:41763_) [n:127.0.0.1:41763_ c:control_collection   x:collection1] o.a.s.c.ZkController publishing state=down
   [junit4]   2> 2673897 INFO  (coreLoadExecutor-8173-thread-1-processing-n:127.0.0.1:41763_) [n:127.0.0.1:41763_ c:control_collection   x:collection1] o.a.s.c.ZkController numShards not found on descriptor - reading it from system property
   [junit4]   2> 2673902 INFO  (OverseerStateUpdate-95325455917318148-127.0.0.1:41763_-n_0000000000) [n:127.0.0.1:41763_    ] o.a.s.c.Overseer processMessage: queueSize: 1, message = {
   [junit4]   2>   "core":"collection1",
   [junit4]   2>   "roles":null,
   [junit4]   2>   "base_url":"http://127.0.0.1:41763",
   [junit4]   2>   "node_name":"127.0.0.1:41763_",
   [junit4]   2>   "numShards":"1",
   [junit4]   2>   "state":"down",
   [junit4]   2>   "shard":null,
   [junit4]   2>   "collection":"control_collection",
   [junit4]   2>   "operation":"state"} current state version: 0
   [junit4]   2> 2673902 INFO  (coreLoadExecutor-8173-thread-1-processing-n:127.0.0.1:41763_) [n:127.0.0.1:41763_ c:control_collection   x:collection1] o.a.s.c.ZkController look for our core node name
   [junit4]   2> 2673903 INFO  (OverseerStateUpdate-95325455917318148-127.0.0.1:41763_-n_0000000000) [n:127.0.0.1:41763_    ] o.a.s.c.o.ReplicaMutator Update state numShards=1 message={
   [junit4]   2>   "core":"collection1",
   [junit4]   2>   "roles":null,
   [junit4]   2>   "base_url":"http://127.0.0.1:41763",
   [junit4]   2>   "node_name":"127.0.0.1:41763_",
   [junit4]   2>   "numShards":"1",
   [junit4]   2>   "state":"down",
   [junit4]   2>   "shard":null,
   [junit4]   2>   "collection":"control_collection",
   [junit4]   2>   "operation":"state"}
   [junit4]   2> 2673903 INFO  (OverseerStateUpdate-95325455917318148-127.0.0.1:41763_-n_0000000000) [n:127.0.0.1:41763_    ] o.a.s.c.o.ClusterStateMutator building a new cName: control_collection
   [junit4]   2> 2673904 INFO  (OverseerStateUpdate-95325455917318148-127.0.0.1:41763_-n_0000000000) [n:127.0.0.1:41763_    ] o.a.s.c.o.ReplicaMutator Assigning new node to shard shard=shard1
   [junit4]   2> 2673909 INFO  (zkCallback-2862-thread-1-processing-n:127.0.0.1:41763_) [n:127.0.0.1:41763_    ] o.a.s.c.c.ZkStateReader A cluster state change: [WatchedEvent state:SyncConnected type:NodeDataChanged path:/clusterstate.json], has occurred - updating... (live nodes size: [1])
   [junit4]   2> 2674905 INFO  (coreLoadExecutor-8173-thread-1-processing-n:127.0.0.1:41763_) [n:127.0.0.1:41763_ c:control_collection   x:collection1] o.a.s.c.ZkController waiting to find shard id in clusterstate for collection1
   [junit4]   2> 2674905 INFO  (coreLoadExecutor-8173-thread-1-processing-n:127.0.0.1:41763_) [n:127.0.0.1:41763_ c:control_collection   x:collection1] o.a.s.c.ZkController Check for collection zkNode:control_collection
   [junit4]   2> 2674906 INFO  (coreLoadExecutor-8173-thread-1-processing-n:127.0.0.1:41763_) [n:127.0.0.1:41763_ c:control_collection   x:collection1] o.a.s.c.ZkController Collection zkNode exists
   [junit4]   2> 2674906 INFO  (coreLoadExecutor-8173-thread-1-processing-n:127.0.0.1:41763_) [n:127.0.0.1:41763_ c:control_collection   x:collection1] o.a.s.c.c.ZkStateReader Load collection config from: [/collections/control_collection]
   [junit4]   2> 2674907 INFO  (coreLoadExecutor-8173-thread-1-processing-n:127.0.0.1:41763_) [n:127.0.0.1:41763_ c:control_collection   x:collection1] o.a.s.c.c.ZkStateReader path=[/collections/control_collection] [configName]=[conf1] specified config exists in ZooKeeper
   [junit4]   2> 2674907 INFO  (coreLoadExecutor-8173-thread-1-processing-n:127.0.0.1:41763_) [n:127.0.0.1:41763_ c:control_collection   x:collection1] o.a.s.c.SolrResourceLoader new SolrResourceLoader for directory: '/export/home/jenkins/workspace/Lucene-Solr-trunk-Solaris/solr/build/solr-core/test/J0/temp/solr.cloud.hdfs.StressHdfsTest_FC75998DF3022030-001/control-001/cores/collection1'
   [junit4]   2> 2674907 INFO  (coreLoadExecutor-8173-thread-1-processing-n:127.0.0.1:41763_) [n:127.0.0.1:41763_ c:control_collection   x:collection1] o.a.s.c.SolrResourceLoader JNDI not configured for solr (NoInitialContextEx)
   [junit4]   2> 2674907 INFO  (coreLoadExecutor-8173-thread-1-processing-n:127.0.0.1:41763_) [n:127.0.0.1:41763_ c:control_collection   x:collection1] o.a.s.c.SolrResourceLoader solr home defaulted to 'solr/' (could not find system property or JNDI)
   [junit4]   2> 2674913 INFO  (coreLoadExecutor-8173-thread-1-processing-n:127.0.0.1:41763_) [n:127.0.0.1:41763_ c:control_collection   x:collection1] o.a.s.c.Config loaded config solrconfig.xml with version 0 
   [junit4]   2> 2674918 INFO  (coreLoadExecutor-8173-thread-1-processing-n:127.0.0.1:41763_) [n:127.0.0.1:41763_ c:control_collection   x:collection1] o.a.s.c.SolrConfig current version of requestparams : -1
   [junit4]   2> 2674922 INFO  (coreLoadExecutor-8173-thread-1-processing-n:127.0.0.1:41763_) [n:127.0.0.1:41763_ c:control_collection   x:collection1] o.a.s.c.SolrConfig Using Lucene MatchVersion: 6.0.0
   [junit4]   2> 2674929 INFO  (coreLoadExecutor-8173-thread-1-processing-n:127.0.0.1:41763_) [n:127.0.0.1:41763_ c:control_collection   x:collection1] o.a.s.c.SolrConfig Loaded SolrConfig: solrconfig.xml
   [junit4]   2> 2674935 INFO  (coreLoadExecutor-8173-thread-1-processing-n:127.0.0.1:41763_) [n:127.0.0.1:41763_ c:control_collection   x:collection1] o.a.s.s.IndexSchema [collection1] Schema name=test
   [junit4]   2> 2675035 INFO  (coreLoadExecutor-8173-thread-1-processing-n:127.0.0.1:41763_) [n:127.0.0.1:41763_ c:control_collection   x:collection1] o.a.s.s.OpenExchangeRatesOrgProvider Initialized with rates=open-exchange-rates.json, refreshInterval=1440.
   [junit4]   2> 2675041 INFO  (coreLoadExecutor-8173-thread-1-processing-n:127.0.0.1:41763_) [n:127.0.0.1:41763_ c:control_collection   x:collection1] o.a.s.s.IndexSchema default search field in schema is text
   [junit4]   2> 2675042 INFO  (coreLoadExecutor-8173-thread-1-processing-n:127.0.0.1:41763_) [n:127.0.0.1:41763_ c:control_collection   x:collection1] o.a.s.s.IndexSchema unique key field: id
   [junit4]   2> 2675058 INFO  (coreLoadExecutor-8173-thread-1-processing-n:127.0.0.1:41763_) [n:127.0.0.1:41763_ c:control_collection   x:collection1] o.a.s.s.FileExchangeRateProvider Reloading exchange rates from file currency.xml
   [junit4]   2> 2675061 INFO  (coreLoadExecutor-8173-thread-1-processing-n:127.0.0.1:41763_) [n:127.0.0.1:41763_ c:control_collection   x:collection1] o.a.s.s.FileExchangeRateProvider Reloading exchange rates from file currency.xml
   [junit4]   2> 2675064 INFO  (coreLoadExecutor-8173-thread-1-processing-n:127.0.0.1:41763_) [n:127.0.0.1:41763_ c:control_collection   x:collection1] o.a.s.s.OpenExchangeRatesOrgProvider Reloading exchange rates from open-exchange-rates.json
   [junit4]   2> 2675066 INFO  (coreLoadExecutor-8173-thread-1-processing-n:127.0.0.1:41763_) [n:127.0.0.1:41763_ c:control_collection   x:collection1] o.a.s.s.OpenExchangeRatesOrgProvider Reloading exchange rates from open-exchange-rates.json
   [junit4]   2> 2675069 INFO  (coreLoadExecutor-8173-thread-1-processing-n:127.0.0.1:41763_) [n:127.0.0.1:41763_ c:control_collection   x:collection1] o.a.s.c.ConfigSetProperties Did not find ConfigSet properties, assuming default properties: Can't find resource 'configsetprops.json' in classpath or '/configs/conf1', cwd=/export/home/jenkins/workspace/Lucene-Solr-trunk-Solaris/solr/build/solr-core/test/J0
   [junit4]   2> 2675069 INFO  (coreLoadExecutor-8173-thread-1-processing-n:127.0.0.1:41763_) [n:127.0.0.1:41763_ c:control_collection   x:collection1] o.a.s.c.CoreContainer Creating SolrCore 'collection1' using configuration from collection control_collection
   [junit4]   2> 2675070 INFO  (coreLoadExecutor-8173-thread-1-processing-n:127.0.0.1:41763_) [n:127.0.0.1:41763_ c:control_collection s:shard1 r:core_node1 x:collection1] o.a.s.c.SolrCore org.apache.solr.core.HdfsDirectoryFactory
   [junit4]   2> 2675138 INFO  (coreLoadExecutor-8173-thread-1-processing-n:127.0.0.1:41763_) [n:127.0.0.1:41763_ c:control_collection s:shard1 r:core_node1 x:collection1] o.a.s.c.HdfsDirectoryFactory solr.hdfs.home=hdfs://solaris-vm:48162/solr_hdfs_home
   [junit4]   2> 2675138 INFO  (coreLoadExecutor-8173-thread-1-processing-n:127.0.0.1:41763_) [n:127.0.0.1:41763_ c:control_collection s:shard1 r:core_node1 x:collection1] o.a.s.c.HdfsDirectoryFactory Solr Kerberos Authentication disabled
   [junit4]   2> 2675139 INFO  (coreLoadExecutor-8173-thread-1-processing-n:127.0.0.1:41763_) [n:127.0.0.1:41763_ c:control_collection s:shard1 r:core_node1 x:collection1] o.a.s.c.SolrCore [[collection1] ] Opening new SolrCore at [/export/home/jenkins/workspace/Lucene-Solr-trunk-Solaris/solr/build/solr-core/test/J0/temp/solr.cloud.hdfs.StressHdfsTest_FC75998DF3022030-001/control-001/cores/collection1], dataDir=[hdfs://solaris-vm:48162/solr_hdfs_home/control_collection/core_node1/data/]
   [junit4]   2> 2675139 INFO  (coreLoadExecutor-8173-thread-1-processing-n:127.0.0.1:41763_) [n:127.0.0.1:41763_ c:control_collection s:shard1 r:core_node1 x:collection1] o.a.s.c.JmxMonitoredMap JMX monitoring is enabled. Adding Solr mbeans to JMX Server: com.sun.jmx.mbeanserver.JmxMBeanServer@4e807e0a
   [junit4]   2> 2675139 INFO  (coreLoadExecutor-8173-thread-1-processing-n:127.0.0.1:41763_) [n:127.0.0.1:41763_ c:control_collection s:shard1 r:core_node1 x:collection1] o.a.s.c.HdfsDirectoryFactory creating directory factory for path hdfs://solaris-vm:48162/solr_hdfs_home/control_collection/core_node1/data
   [junit4]   2> 2675234 INFO  (coreLoadExecutor-8173-thread-1-processing-n:127.0.0.1:41763_) [n:127.0.0.1:41763_ c:control_collection s:shard1 r:core_node1 x:collection1] o.a.s.c.CachingDirectoryFactory return new directory for hdfs://solaris-vm:48162/solr_hdfs_home/control_collection/core_node1/data
   [junit4]   2> 2675242 INFO  (coreLoadExecutor-8173-thread-1-processing-n:127.0.0.1:41763_) [n:127.0.0.1:41763_ c:control_collection s:shard1 r:core_node1 x:collection1] o.a.s.c.SolrCore New index directory detected: old=null new=hdfs://solaris-vm:48162/solr_hdfs_home/control_collection/core_node1/data/index/
   [junit4]   2> 2675263 WARN  (coreLoadExecutor-8173-thread-1-processing-n:127.0.0.1:41763_) [n:127.0.0.1:41763_ c:control_collection s:shard1 r:core_node1 x:collection1] o.a.s.c.SolrCore [collection1] Solr index directory 'hdfs:/solaris-vm:48162/solr_hdfs_home/control_collection/core_node1/data/index' doesn't exist. Creating new index...
   [junit4]   2> 2675264 INFO  (coreLoadExecutor-8173-thread-1-processing-n:127.0.0.1:41763_) [n:127.0.0.1:41763_ c:control_collection s:shard1 r:core_node1 x:collection1] o.a.s.c.HdfsDirectoryFactory creating directory factory for path hdfs://solaris-vm:48162/solr_hdfs_home/control_collection/core_node1/data/index
   [junit4]   2> 2675274 INFO  (coreLoadExecutor-8173-thread-1-processing-n:127.0.0.1:41763_) [n:127.0.0.1:41763_ c:control_collection s:shard1 r:core_node1 x:collection1] o.a.s.c.HdfsDirectoryFactory Number of slabs of block cache [1] with direct memory allocation set to [true]
   [junit4]   2> 2675275 INFO  (coreLoadExecutor-8173-thread-1-processing-n:127.0.0.1:41763_) [n:127.0.0.1:41763_ c:control_collection s:shard1 r:core_node1 x:collection1] o.a.s.c.HdfsDirectoryFactory Block cache target memory usage, slab size of [8388608] will allocate [1] slabs and use ~[8388608] bytes
   [junit4]   2> 2675275 INFO  (coreLoadExecutor-8173-thread-1-processing-n:127.0.0.1:41763_) [n:127.0.0.1:41763_ c:control_collection s:shard1 r:core_node1 x:collection1] o.a.s.c.HdfsDirectoryFactory Creating new global HDFS BlockCache
   [junit4]   2> 2677619 INFO  (coreLoadExecutor-8173-thread-1-processing-n:127.0.0.1:41763_) [n:127.0.0.1:41763_ c:control_collection s:shard1 r:core_node1 x:collection1] o.a.s.s.b.BlockDirectory Block cache on write is disabled
   [junit4]   2> 2677619 INFO  (coreLoadExecutor-8173-thread-1-processing-n:127.0.0.1:41763_) [n:127.0.0.1:41763_ c:control_collection s:shard1 r:core_node1 x:collection1] o.a.s.c.CachingDirectoryFactory return new directory for hdfs://solaris-vm:48162/solr_hdfs_home/control_collection/core_node1/data/index
   [junit4]   2> 2677620 INFO  (coreLoadExecutor-8173-thread-1-processing-n:127.0.0.1:41763_) [n:127.0.0.1:41763_ c:control_collection s:shard1 r:core_node1 x:collection1] o.a.s.u.RandomMergePolicy RandomMergePolicy wrapping class org.apache.lucene.index.AlcoholicMergePolicy: [AlcoholicMergePolicy: minMergeSize=0, mergeFactor=10, maxMergeSize=13687917, maxMergeSizeForForcedMerge=9223372036854775807, calibrateSizeByDeletes=true, maxMergeDocs=2147483647, maxCFSSegmentSizeMB=8.796093022207999E12, noCFSRatio=0.1]
   [junit4]   2> 2677670 INFO  (IPC Server handler 9 on 48162) [    ] BlockStateChange BLOCK* addStoredBlock: blockMap updated: 127.0.0.1:58697 is added to blk_1073741825_1001{blockUCState=UNDER_CONSTRUCTION, primaryNodeIndex=-1, replicas=[ReplicaUnderConstruction[[DISK]DS-e4f118dd-0963-4437-accb-84c0f3df0156:NORMAL:127.0.0.1:56074|RBW], ReplicaUnderConstruction[[DISK]DS-c70b2da1-2256-4e91-bc7a-99138c6086c8:NORMAL:127.0.0.1:58697|RBW]]} size 0
   [junit4]   2> 2677674 INFO  (IPC Server handler 3 on 48162) [    ] BlockStateChange BLOCK* addStoredBlock: blockMap updated: 127.0.0.1:56074 is added to blk_1073741825_1001{blockUCState=UNDER_CONSTRUCTION, primaryNodeIndex=-1, replicas=[ReplicaUnderConstruction[[DISK]DS-c70b2da1-2256-4e91-bc7a-99138c6086c8:NORMAL:127.0.0.1:58697|RBW], ReplicaUnderConstruction[[DISK]DS-5093f232-86a2-4527-9afc-74022c1168ea:NORMAL:127.0.0.1:56074|FINALIZED]]} size 0
   [junit4]   2> 2677695 INFO  (coreLoadExecutor-8173-thread-1-processing-n:127.0.0.1:41763_) [n:127.0.0.1:41763_ c:control_collection s:shard1 r:core_node1 x:collection1] o.a.s.c.SolrDeletionPolicy SolrDeletionPolicy.onCommit: commits: num=1
   [junit4]   2> 	commit{dir=NRTCachingDirectory(BlockDirectory(HdfsDirectory@hdfs://solaris-vm:48162/solr_hdfs_home/control_collection/core_node1/data/index lockFactory=org.apache.lucene.store.SingleInstanceLockFactory@44f55430); maxCacheMB=192.0 maxMergeSizeMB=16.0),segFN=segments_1,generation=1}
   [junit4]   2> 2677695 INFO  (coreLoadExecutor-8173-thread-1-processing-n:127.0.0.1:41763_) [n:127.0.0.1:41763_ c:control_collection s:shard1 r:core_node1 x:collection1] o.a.s.c.SolrDeletionPolicy newest commit generation = 1
   [junit4]   2> 2677699 INFO  (OldIndexDirectoryCleanupThreadForCore-collection1) [n:127.0.0.1:41763_ c:control_collection s:shard1 r:core_node1 x:collection1] o.a.s.c.SolrCore Looking for old index directories to cleanup for core collection1 in hdfs://solaris-vm:48162/solr_hdfs_home/control_collection/core_node1/data/
   [junit4]   2> 2677701 INFO  (coreLoadExecutor-8173-thread-1-processing-n:127.0.0.1:41763_) [n:127.0.0.1:41763_ c:control_collection s:shard1 r:core_node1 x:collection1] o.a.s.u.p.UpdateRequestProcessorChain creating updateRequestProcessorChain "nodistrib"
   [junit4]   2> 2677701 INFO  (coreLoadExecutor-8173-thread-1-processing-n:127.0.0.1:41763_) [n:127.0.0.1:41763_ c:control_collection s:shard1 r:core_node1 x:collection1] o.a.s.u.p.UpdateRequestProcessorChain creating updateRequestProcessorChain "dedupe"
   [junit4]   2> 2677702 INFO  (coreLoadExecutor-8173-thread-1-processing-n:127.0.0.1:41763_) [n:127.0.0.1:41763_ c:control_collection s:shard1 r:core_node1 x:collection1] o.a.s.u.p.UpdateRequestProcessorChain inserting DistributedUpdateProcessorFactory into updateRequestProcessorChain "dedupe"
   [junit4]   2> 2677702 INFO  (coreLoadExecutor-8173-thread-1-processing-n:127.0.0.1:41763_) [n:127.0.0.1:41763_ c:control_collection s:shard1 r:core_node1 x:collection1] o.a.s.u.p.UpdateRequestProcessorChain creating updateRequestProcessorChain "stored_sig"
   [junit4]   2> 2677702 INFO  (coreLoadExecutor-8173-thread-1-processing-n:127.0.0.1:41763_) [n:127.0.0.1:41763_ c:control_collection s:shard1 r:core_node1 x:collection1] o.a.s.u.p.UpdateRequestProcessorChain inserting DistributedUpdateProcessorFactory into updateRequestProcessorChain "stored_sig"
   [junit4]   2> 2677702 INFO  (coreLoadExecutor-8173-thread-1-processing-n:127.0.0.1:41763_) [n:127.0.0.1:41763_ c:control_collection s:shard1 r:core_node1 x:collection1] o.a.s.u.p.UpdateRequestProcessorChain creating updateRequestProcessorChain "distrib-dup-test-chain-explicit"
   [junit4]   2> 2677702 INFO  (coreLoadExecutor-8173-thread-1-processing-n:127.0.0.1:41763_) [n:127.0.0.1:41763_ c:control_collection s:shard1 r:core_node1 x:collection1] o.a.s.u.p.UpdateRequestProcessorChain creating updateRequestProcessorChain "distrib-dup-test-chain-implicit"
   [junit4]   2> 2677702 INFO  (coreLoadExecutor-8173-thread-1-processing-n:127.0.0.1:41763_) [n:127.0.0.1:41763_ c:control_collection s:shard1 r:core_node1 x:collection1] o.a.s.u.p.UpdateRequestProcessorChain inserting DistributedUpdateProcessorFactory into updateRequestProcessorChain "distrib-dup-test-chain-implicit"
   [junit4]   2> 2677702 INFO  (coreLoadExecutor-8173-thread-1-processing-n:127.0.0.1:41763_) [n:127.0.0.1:41763_ c:control_collection s:shard1 r:core_node1 x:collection1] o.a.s.c.SolrCore no updateRequestProcessorChain defined as default, creating implicit default
   [junit4]   2> 2677702 WARN  (coreLoadExecutor-8173-thread-1-processing-n:127.0.0.1:41763_) [n:127.0.0.1:41763_ c:control_collection s:shard1 r:core_node1 x:collection1] o.a.s.c.RequestHandlers INVALID paramSet a in requestHandler {type = requestHandler,name = /dump,class = DumpRequestHandler,args = {defaults={a=A,b=B}}}
   [junit4]   2> 2677705 INFO  (coreLoadExecutor-8173-thread-1-processing-n:127.0.0.1:41763_) [n:127.0.0.1:41763_ c:control_collection s:shard1 r:core_node1 x:collection1] o.a.s.h.l.XMLLoader xsltCacheLifetimeSeconds=60
   [junit4]   2> 2677707 INFO  (coreLoadExecutor-8173-thread-1-processing-n:127.0.0.1:41763_) [n:127.0.0.1:41763_ c:control_collection s:shard1 r:core_node1 x:collection1] o.a.s.h.l.XMLLoader xsltCacheLifetimeSeconds=60
   [junit4]   2> 2677707 INFO  (coreLoadExecutor-8173-thread-1-processing-n:127.0.0.1:41763_) [n:127.0.0.1:41763_ c:control_collection s:shard1 r:core_node1 x:collection1] o.a.s.h.l.XMLLoader xsltCacheLifetimeSeconds=60
   [junit4]   2> 2677708 INFO  (coreLoadExecutor-8173-thread-1-processing-n:127.0.0.1:41763_) [n:127.0.0.1:41763_ c:control_collection s:shard1 r:core_node1 x:collection1] o.a.s.h.l.XMLLoader xsltCacheLifetimeSeconds=60
   [junit4]   2> 2677711 INFO  (coreLoadExecutor-8173-thread-1-processing-n:127.0.0.1:41763_) [n:127.0.0.1:41763_ c:control_collection s:shard1 r:core_node1 x:collection1] o.a.s.c.RequestHandlers Registered paths: /admin/mbeans,standard,/dump,/update/csv,/sql,/update/json/docs,/admin/luke,/export,/admin/segments,/get,/admin/system,/replication,/admin/properties,/config,/stream,/schema,/admin/plugins,/admin/logging,/update/json,/admin/threads,/admin/ping,/update,/admin/file
   [junit4]   2> 2677712 INFO  (coreLoadExecutor-8173-thread-1-processing-n:127.0.0.1:41763_) [n:127.0.0.1:41763_ c:control_collection s:shard1 r:core_node1 x:collection1] o.a.s.c.SolrCore Using default statsCache cache: org.apache.solr.search.stats.LocalStatsCache
   [junit4]   2> 2677726 INFO  (coreLoadExecutor-8173-thread-1-processing-n:127.0.0.1:41763_) [n:127.0.0.1:41763_ c:control_collection s:shard1 r:core_node1 x:collection1] o.a.s.u.UpdateHandler Using UpdateLog implementation: org.apache.solr.update.HdfsUpdateLog
   [junit4]   2> 2677727 INFO  (coreLoadExecutor-8173-thread-1-processing-n:127.0.0.1:41763_) [n:127.0.0.1:41763_ c:control_collection s:shard1 r:core_node1 x:collection1] o.a.s.u.HdfsUpdateLog Initializing HdfsUpdateLog: dataDir= defaultSyncLevel=FLUSH numRecordsToKeep=100 maxNumLogsToKeep=10 tlogDfsReplication=2
   [junit4]   2> 2677743 INFO  (coreLoadExecutor-8173-thread-1-processing-n:127.0.0.1:41763_) [n:127.0.0.1:41763_ c:control_collection s:shard1 r:core_node1 x:collection1] o.a.s.u.CommitTracker Hard AutoCommit: disabled
   [junit4]   2> 2677743 INFO  (coreLoadExecutor-8173-thread-1-processing-n:127.0.0.1:41763_) [n:127.0.0.1:41763_ c:control_collection s:shard1 r:core_node1 x:collection1] o.a.s.u.CommitTracker Soft AutoCommit: disabled
   [junit4]   2> 2677746 INFO  (coreLoadExecutor-8173-thread-1-processing-n:127.0.0.1:41763_) [n:127.0.0.1:41763_ c:control_collection s:shard1 r:core_node1 x:collection1] o.a.s.u.RandomMergePolicy RandomMergePolicy wrapping class org.apache.lucene.index.LogDocMergePolicy: [LogDocMergePolicy: minMergeSize=1000, mergeFactor=39, maxMergeSize=9223372036854775807, maxMergeSizeForForcedMerge=9223372036854775807, calibrateSizeByDeletes=true, maxMergeDocs=2147483647, maxCFSSegmentSizeMB=8.796093022207999E12, noCFSRatio=1.0]
   [junit4]   2> 2677890 INFO  (coreLoadExecutor-8173-thread-1-processing-n:127.0.0.1:41763_) [n:127.0.0.1:41763_ c:control_collection s:shard1 r:core_node1 x:collection1] o.a.s.c.SolrDeletionPolicy SolrDeletionPolicy.onInit: commits: num=1
   [junit4]   2> 	commit{dir=NRTCachingDirectory(BlockDirectory(HdfsDirectory@hdfs://solaris-vm:48162/solr_hdfs_home/control_collection/core_node1/data/index lockFactory=org.apache.lucene.store.SingleInstanceLockFactory@44f55430); maxCacheMB=192.0 maxMergeSizeMB=16.0),segFN=segments_1,generation=1}
   [junit4]   2> 2677891 INFO  (coreLoadExecutor-8173-thread-1-processing-n:127.0.0.1:41763_) [n:127.0.0.1:41763_ c:control_collection s:shard1 r:core_node1 x:collection1] o.a.s.c.SolrDeletionPolicy newest commit generation = 1
   [junit4]   2> 2677891 INFO  (coreLoadExecutor-8173-thread-1-processing-n:127.0.0.1:41763_) [n:127.0.0.1:41763_ c:control_collection s:shard1 r:core_node1 x:collection1] o.a.s.s.SolrIndexSearcher Opening [Searcher@63cf8ed8[collection1] main]
   [junit4]   2> 2677891 INFO  (coreLoadExecutor-8173-thread-1-processing-n:127.0.0.1:41763_) [n:127.0.0.1:41763_ c:control_collection s:shard1 r:core_node1 x:collection1] o.a.s.c.c.ZkStateReader Load collection config from: [/collections/control_collection]
   [junit4]   2> 2677892 INFO  (coreLoadExecutor-8173-thread-1-processing-n:127.0.0.1:41763_) [n:127.0.0.1:41763_ c:control_collection s:shard1 r:core_node1 x:collection1] o.a.s.c.c.ZkStateReader path=[/collections/control_collection] [configName]=[conf1] specified config exists in ZooKeeper
   [junit4]   2> 2677892 INFO  (coreLoadExecutor-8173-thread-1-processing-n:127.0.0.1:41763_) [n:127.0.0.1:41763_ c:control_collection s:shard1 r:core_node1 x:collection1] o.a.s.r.ManagedResourceStorage Setting up ZooKeeper-based storage for the RestManager with znodeBase: /configs/conf1
   [junit4]   2> 2677893 INFO  (coreLoadExecutor-8173-thread-1-processing-n:127.0.0.1:41763_) [n:127.0.0.1:41763_ c:control_collection s:shard1 r:core_node1 x:collection1] o.a.s.r.ManagedResourceStorage Configured ZooKeeperStorageIO with znodeBase: /configs/conf1
   [junit4]   2> 2677893 INFO  (coreLoadExecutor-8173-thread-1-processing-n:127.0.0.1:41763_) [n:127.0.0.1:41763_ c:control_collection s:shard1 r:core_node1 x:collection1] o.a.s.r.RestManager Initializing RestManager with initArgs: {}
   [junit4]   2> 2677893 INFO  (coreLoadExecutor-8173-thread-1-processing-n:127.0.0.1:41763_) [n:127.0.0.1:41763_ c:control_collection s:shard1 r:core_node1 x:collection1] o.a.s.r.ManagedResourceStorage Reading _rest_managed.json using ZooKeeperStorageIO:path=/configs/conf1
   [junit4]   2> 2677893 INFO  (coreLoadExecutor-8173-thread-1-processing-n:127.0.0.1:41763_) [n:127.0.0.1:41763_ c:control_collection s:shard1 r:core_node1 x:collection1] o.a.s.r.ManagedResourceStorage No data found for znode /configs/conf1/_rest_managed.json
   [junit4]   2> 2677893 INFO  (coreLoadExecutor-8173-thread-1-processing-n:127.0.0.1:41763_) [n:127.0.0.1:41763_ c:control_collection s:shard1 r:core_node1 x:collection1] o.a.s.r.ManagedResourceStorage Loaded null at path _rest_managed.json using ZooKeeperStorageIO:path=/configs/conf1
   [junit4]   2> 2677894 INFO  (coreLoadExecutor-8173-thread-1-processing-n:127.0.0.1:41763_) [n:127.0.0.1:41763_ c:control_collection s:shard1 r:core_node1 x:collection1] o.a.s.r.RestManager Initializing 0 registered ManagedResources
   [junit4]   2> 2677898 INFO  (coreLoadExecutor-8173-thread-1-processing-n:127.0.0.1:41763_) [n:127.0.0.1:41763_ c:control_collection s:shard1 r:core_node1 x:collection1] o.a.s.h.ReplicationHandler Commits will be reserved for  10000
   [junit4]   2> 2677900 INFO  (searcherExecutor-8174-thread-1-processing-n:127.0.0.1:41763_ x:collection1 s:shard1 c:control_collection r:core_node1) [n:127.0.0.1:41763_ c:control_collection s:shard1 r:core_node1 x:collection1] o.a.s.c.SolrCore [collection1] Registered new searcher Searcher@63cf8ed8[collection1] main{ExitableDirectoryReader(UninvertingDirectoryReader())}
   [junit4]   2> 2677901 INFO  (coreLoadExecutor-8173-thread-1-processing-n:127.0.0.1:41763_) [n:127.0.0.1:41763_ c:control_collection s:shard1 r:core_node1 x:collection1] o.a.s.u.UpdateLog Looking up max value of version field to seed version buckets
   [junit4]   2> 2677901 INFO  (coreLoadExecutor-8173-thread-1-processing-n:127.0.0.1:41763_) [n:127.0.0.1:41763_ c:control_collection s:shard1 r:core_node1 x:collection1] o.a.s.u.VersionInfo Refreshing highest value of _version_ for 256 version buckets from index
   [junit4]   2> 2677901 INFO  (coreLoadExecutor-8173-thread-1-processing-n:127.0.0.1:41763_) [n:127.0.0.1:41763_ c:control_collection s:shard1 r:core_node1 x:collection1] o.a.s.u.VersionInfo No terms found for _version_, cannot seed version bucket highest value from index
   [junit4]   2> 2677901 INFO  (coreLoadExecutor-8173-thread-1-processing-n:127.0.0.1:41763_) [n:127.0.0.1:41763_ c:control_collection s:shard1 r:core_node1 x:collection1] o.a.s.u.UpdateLog Could not find max version in index or recent updates, using new clock 1525207299643146240
   [junit4]   2> 2677901 INFO  (coreLoadExecutor-8173-thread-1-processing-n:127.0.0.1:41763_) [n:127.0.0.1:41763_ c:control_collection s:shard1 r:core_node1 x:collection1] o.a.s.u.UpdateLog Took 0.0ms to seed version buckets with highest version 1525207299643146240
   [junit4]   2> 2677901 INFO  (coreLoadExecutor-8173-thread-1-processing-n:127.0.0.1:41763_) [n:127.0.0.1:41763_ c:control_collection s:shard1 r:core_node1 x:collection1] o.a.s.c.ZkController watch zkdir /configs/conf1
   [junit4]   2> 2677902 INFO  (coreLoadExecutor-8173-thread-1-processing-n:127.0.0.1:41763_) [n:127.0.0.1:41763_ c:control_collection s:shard1 r:core_node1 x:collection1] o.a.s.c.CoreContainer registering core: collection1
   [junit4]   2> 2677903 INFO  (coreZkRegister-8167-thread-1-processing-n:127.0.0.1:41763_ x:collection1 s:shard1 c:control_collection r:core_node1) [n:127.0.0.1:41763_ c:control_collection s:shard1 r:core_node1 x:collection1] o.a.s.c.ZkController Register replica - core:collection1 address:http://127.0.0.1:41763 collection:control_collection shard:shard1
   [junit4]   2> 2677904 INFO  (coreZkRegister-8167-thread-1-processing-n:127.0.0.1:41763_ x:collection1 s:shard1 c:control_collection r:core_node1) [n:127.0.0.1:41763_ c:control_collection s:shard1 r:core_node1 x:collection1] o.a.s.c.c.SolrZkClient makePath: /collections/control_collection/leader_elect/shard1/election
   [junit4]   2> 2677906 INFO  (TEST-StressHdfsTest.test-seed#[FC75998DF3022030]) [    ] o.a.s.c.c.SolrZkClient Using default ZkCredentialsProvider
   [junit4]   2> 2677906 INFO  (TEST-StressHdfsTest.test-seed#[FC75998DF3022030]) [    ] o.a.s.c.c.ConnectionManager Waiting for client to connect to ZooKeeper
   [junit4]   2> 2677908 INFO  (zkCallback-2864-thread-1) [    ] o.a.s.c.c.ConnectionManager Watcher org.apache.solr.common.cloud.ConnectionManager@254c3dca name:ZooKeeperConnection Watcher:127.0.0.1:50110/solr got event WatchedEvent state:SyncConnected type:None path:null path:null type:None
   [junit4]   2> 2677908 INFO  (TEST-StressHdfsTest.test-seed#[FC75998DF3022030]) [    ] o.a.s.c.c.ConnectionManager Client is connected to ZooKeeper
   [junit4]   2> 2677908 INFO  (TEST-StressHdfsTest.test-seed#[FC75998DF3022030]) [    ] o.a.s.c.c.SolrZkClient Using default ZkACLProvider
   [junit4]   2> 2677908 INFO  (TEST-StressHdfsTest.test-seed#[FC75998DF3022030]) [    ] o.a.s.c.c.ZkStateReader Updating cluster state from ZooKeeper... 
   [junit4]   2> 2677912 INFO  (coreZkRegister-8167-thread-1-processing-n:127.0.0.1:41763_ x:collection1 s:shard1 c:control_collection r:core_node1) [n:127.0.0.1:41763_ c:control_collection s:shard1 r:core_node1 x:collection1] o.a.s.c.LeaderElector Joined leadership election with path: /collections/control_collection/leader_elect/shard1/election/95325455917318148-core_node1-n_0000000000
   [junit4]   2> 2677913 INFO  (coreZkRegister-8167-thread-1-processing-n:127.0.0.1:41763_ x:collection1 s:shard1 c:control_collection r:core_node1) [n:127.0.0.1:41763_ c:control_collection s:shard1 r:core_node1 x:collection1] o.a.s.c.ShardLeaderElectionContext Running the leader process for shard=shard1 and weAreReplacement=false and leaderVoteWait=180000
   [junit4]   2> 2677913 INFO  (TEST-StressHdfsTest.test-seed#[FC75998DF3022030]) [    ] o.a.s.c.ChaosMonkey monkey: init - expire sessions:false cause connection loss:false
   [junit4]   2> 2677915 INFO  (coreZkRegister-8167-thread-1-processing-n:127.0.0.1:41763_ x:collection1 s:shard1 c:control_collection r:core_node1) [n:127.0.0.1:41763_ c:control_collection s:shard1 r:core_node1 x:collection1] o.a.s.c.ShardLeaderElectionContext Enough replicas found to continue.
   [junit4]   2> 2677916 INFO  (coreZkRegister-8167-thread-1-processing-n:127.0.0.1:41763_ x:collection1 s:shard1 c:control_collection r:core_node1) [n:127.0.0.1:41763_ c:control_collection s:shard1 r:core_node1 x:collection1] o.a.s.c.ShardLeaderElectionContext I may be the new leader - try and sync
   [junit4]   2> 2677916 INFO  (OverseerStateUpdate-95325455917318148-127.0.0.1:41763_-n_0000000000) [n:127.0.0.1:41763_    ] o.a.s.c.Overseer processMessage: queueSize: 1, message = {
   [junit4]   2>   "operation":"leader",
   [junit4]   2>   "shard":"shard1",
   [junit4]   2>   "collection":"control_collection"} current state version: 1
   [junit4]   2> 2677916 INFO  (coreZkRegister-8167-thread-1-processing-n:127.0.0.1:41763_ x:collection1 s:shard1 c:control_collection r:core_node1) [n:127.0.0.1:41763_ c:control_collection s:shard1 r:core_node1 x:collection1] o.a.s.c.SyncStrategy Sync replicas to http://127.0.0.1:41763/collection1/
   [junit4]   2> 2677917 INFO  (coreZkRegister-8167-thread-1-processing-n:127.0.0.1:41763_ x:collection1 s:shard1 c:control_collection r:core_node1) [n:127.0.0.1:41763_ c:control_collection s:shard1 r:core_node1 x:collection1] o.a.s.c.SyncStrategy Sync Success - now sync replicas to me
   [junit4]   2> 2677917 INFO  (coreZkRegister-8167-thread-1-processing-n:127.0.0.1:41763_ x:collection1 s:shard1 c:control_collection r:core_node1) [n:127.0.0.1:41763_ c:control_collection s:shard1 r:core_node1 x:collection1] o.a.s.c.SyncStrategy http://127.0.0.1:41763/collection1/ has no replicas
   [junit4]   2> 2677918 INFO  (zkCallback-2862-thread-1-processing-n:127.0.0.1:41763_) [n:127.0.0.1:41763_    ] o.a.s.c.c.ZkStateReader A cluster state change: [WatchedEvent state:SyncConnected type:NodeDataChanged path:/clusterstate.json], has occurred - updating... (live nodes size: [1])
   [junit4]   2> 2677918 INFO  (zkCallback-2864-thread-1) [    ] o.a.s.c.c.ZkStateReader A cluster state change: [WatchedEvent state:SyncConnected type:NodeDataChanged path:/clusterstate.json], has occurred - updating... (live nodes size: [1])
   [junit4]   2> 2677919 INFO  (coreZkRegister-8167-thread-1-processing-n:127.0.0.1:41763_ x:collection1 s:shard1 c:control_collection r:core_node1) [n:127.0.0.1:41763_ c:control_collection s:shard1 r:core_node1 x:collection1] o.a.s.c.c.SolrZkClient makePath: /collections/control_collection/leaders/shard1
   [junit4]   2> 2677925 INFO  (coreZkRegister-8167-thread-1-processing-n:127.0.0.1:41763_ x:collection1 s:shard1 c:control_collection r:core_node1) [n:127.0.0.1:41763_ c:control_collection s:shard1 r:core_node1 x:collection1] o.a.s.c.ShardLeaderElectionContextBase Creating leader registration node
   [junit4]   2> 2677929 INFO  (coreZkRegister-8167-thread-1-processing-n:127.0.0.1:41763_ x:collection1 s:shard1 c:control_collection r:core_node1) [n:127.0.0.1:41763_ c:control_collection s:shard1 r:core_node1 x:collection1] o.a.s.c.ShardLeaderElectionContext I am the new leader: http://127.0.0.1:41763/collection1/ shard1
   [junit4]   2> 2677930 INFO  (OverseerStateUpdate-95325455917318148-127.0.0.1:41763_-n_0000000000) [n:127.0.0.1:41763_    ] o.a.s.c.Overseer processMessage: queueSize: 1, message = {
   [junit4]   2>   "operation":"leader",
   [junit4]   2>   "shard":"shard1",
   [junit4]   2>   "collection":"control_collection",
   [junit4]   2>   "base_url":"http://127.0.0.1:41763",
   [junit4]   2>   "core":"collection1",
   [junit4]   2>   "state":"active"} current state version: 2
   [junit4]   2> 2678034 INFO  (zkCallback-2864-thread-1) [    ] o.a.s.c.c.ZkStateReader A cluster state change: [WatchedEvent state:SyncConnected type:NodeDataChanged path:/clusterstate.json], has occurred - updating... (live nodes size: [1])
   [junit4]   2> 2678034 INFO  (zkCallback-2862-thread-1-processing-n:127.0.0.1:41763_) [n:127.0.0.1:41763_    ] o.a.s.c.c.ZkStateReader A cluster state change: [WatchedEvent state:SyncConnected type:NodeDataChanged path:/clusterstate.json], has occurred - updating... (live nodes size: [1])
   [junit4]   2> 2678062 INFO  (TEST-StressHdfsTest.test-seed#[FC75998DF3022030]) [    ] o.a.s.SolrTestCaseJ4 Writing core.properties file to /export/home/jenkins/workspace/Lucene-Solr-trunk-Solaris/solr/build/solr-core/test/J0/temp/solr.cloud.hdfs.StressHdfsTest_FC75998DF3022030-001/shard-1-001/cores/collection1
   [junit4]   2> 2678063 INFO  (TEST-StressHdfsTest.test-seed#[FC75998DF3022030]) [    ] o.a.s.c.AbstractFullDistribZkTestBase create jetty 1 in directory /export/home/jenkins/workspace/Lucene-Solr-trunk-Solaris/solr/build/solr-core/test/J0/temp/solr.cloud.hdfs.StressHdfsTest_FC75998DF3022030-001/shard-1-001
   [junit4]   2> 2678063 INFO  (TEST-StressHdfsTest.test-seed#[FC75998DF3022030]) [    ] o.e.j.s.Server jetty-9.2.13.v20150730
   [junit4]   2> 2678065 INFO  (TEST-StressHdfsTest.test-seed#[FC75998DF3022030]) [    ] o.e.j.s.h.ContextHandler Started o.e.j.s.ServletContextHandler@1e185e00{/,null,AVAILABLE}
   [junit4]   2> 2678066 INFO  (TEST-StressHdfsTest.test-seed#[FC75998DF3022030]) [    ] o.e.j.s.ServerConnector Started ServerConnector@35b833b5{HTTP/1.1}{127.0.0.1:37507}
   [junit4]   2> 2678066 INFO  (TEST-StressHdfsTest.test-seed#[FC75998DF3022030]) [    ] o.e.j.s.Server Started @2683768ms
   [junit4]   2> 2678066 INFO  (TEST-StressHdfsTest.test-seed#[FC75998DF3022030]) [    ] o.a.s.c.s.e.JettySolrRunner Jetty properties: {solr.data.dir=hdfs://solaris-vm:48162/hdfs__solaris-vm_48162__export_home_jenkins_workspace_Lucene-Solr-trunk-Solaris_solr_build_solr-core_test_J0_temp_solr.cloud.hdfs.StressHdfsTest_FC75998DF3022030-001_tempDir-002_jetty1, solrconfig=solrconfig.xml, hostContext=/, hostPort=37507, coreRootDirectory=/export/home/jenkins/workspace/Lucene-Solr-trunk-Solaris/solr/build/solr-core/test/J0/temp/solr.cloud.hdfs.StressHdfsTest_FC75998DF3022030-001/shard-1-001/cores}
   [junit4]   2> 2678066 INFO  (TEST-StressHdfsTest.test-seed#[FC75998DF3022030]) [    ] o.a.s.s.SolrDispatchFilter SolrDispatchFilter.init(): sun.misc.Launcher$AppClassLoader@6d06d69c
   [junit4]   2> 2678066 INFO  (TEST-StressHdfsTest.test-seed#[FC75998DF3022030]) [    ] o.a.s.c.SolrResourceLoader new SolrResourceLoader for directory: '/export/home/jenkins/workspace/Lucene-Solr-trunk-Solaris/solr/build/solr-core/test/J0/temp/solr.cloud.hdfs.StressHdfsTest_FC75998DF3022030-001/shard-1-001'
   [junit4]   2> 2678067 INFO  (TEST-StressHdfsTest.test-seed#[FC75998DF3022030]) [    ] o.a.s.c.SolrResourceLoader JNDI not configured for solr (NoInitialContextEx)
   [junit4]   2> 2678067 INFO  (TEST-StressHdfsTest.test-seed#[FC75998DF3022030]) [    ] o.a.s.c.SolrResourceLoader solr home defaulted to 'solr/' (could not find system property or JNDI)
   [junit4]   2> 2678067 INFO  (TEST-StressHdfsTest.test-seed#[FC75998DF3022030]) [    ] o.a.s.c.c.SolrZkClient Using default ZkCredentialsProvider
   [junit4]   2> 2678067 INFO  (TEST-StressHdfsTest.test-seed#[FC75998DF3022030]) [    ] o.a.s.c.c.ConnectionManager Waiting for client to connect to ZooKeeper
   [junit4]   2> 2678069 INFO  (zkCallback-2865-thread-1) [    ] o.a.s.c.c.ConnectionManager Watcher org.apache.solr.common.cloud.ConnectionManager@6626afe4 name:ZooKeeperConnection Watcher:127.0.0.1:50110/solr got event WatchedEvent state:SyncConnected type:None path:null path:null type:None
   [junit4]   2> 2678069 INFO  (TEST-StressHdfsTest.test-seed#[FC75998DF3022030]) [    ] o.a.s.c.c.ConnectionManager Client is connected to ZooKeeper
   [junit4]   2> 2678069 INFO  (TEST-StressHdfsTest.test-seed#[FC75998DF3022030]) [    ] o.a.s.c.c.SolrZkClient Using default ZkACLProvider
   [junit4]   2> 2678072 INFO  (TEST-StressHdfsTest.test-seed#[FC75998DF3022030]) [    ] o.a.s.s.SolrDispatchFilter Loading solr.xml from SolrHome (not found in ZooKeeper)
   [junit4]   2> 2678072 INFO  (TEST-StressHdfsTest.test-seed#[FC75998DF3022030]) [    ] o.a.s.c.SolrXmlConfig Loading container configuration from /export/home/jenkins/workspace/Lucene-Solr-trunk-Solaris/solr/build/solr-core/test/J0/temp/solr.cloud.hdfs.StressHdfsTest_FC75998DF3022030-001/shard-1-001/solr.xml
   [junit4]   2> 2678076 INFO  (TEST-StressHdfsTest.test-seed#[FC75998DF3022030]) [    ] o.a.s.c.CorePropertiesLocator Config-defined core root directory: /export/home/jenkins/workspace/Lucene-Solr-trunk-Solaris/solr/build/solr-core/test/J0/temp/solr.cloud.hdfs.StressHdfsTest_FC75998DF3022030-001/shard-1-001/cores
   [junit4]   2> 2678076 INFO  (TEST-StressHdfsTest.test-seed#[FC75998DF3022030]) [    ] o.a.s.c.CoreContainer New CoreContainer 1516342624
   [junit4]   2> 2678076 INFO  (TEST-StressHdfsTest.test-seed#[FC75998DF3022030]) [    ] o.a.s.c.CoreContainer Loading cores into CoreContainer [instanceDir=/export/home/jenkins/workspace/Lucene-Solr-trunk-Solaris/solr/build/solr-core/test/J0/temp/solr.cloud.hdfs.StressHdfsTest_FC75998DF3022030-001/shard-1-001]
   [junit4]   2> 2678076 WARN  (TEST-StressHdfsTest.test-seed#[FC75998DF3022030]) [    ] o.a.s.c.CoreContainer Couldn't add files from /export/home/jenkins/workspace/Lucene-Solr-trunk-Solaris/solr/build/solr-core/test/J0/temp/solr.cloud.hdfs.StressHdfsTest_FC75998DF3022030-001/shard-1-001/lib to classpath: /export/home/jenkins/workspace/Lucene-Solr-trunk-Solaris/solr/build/solr-core/test/J0/temp/solr.cloud.hdfs.StressHdfsTest_FC75998DF3022030-001/shard-1-001/lib
   [junit4]   2> 2678077 INFO  (TEST-StressHdfsTest.test-seed#[FC75998DF3022030]) [    ] o.a.s.h.c.HttpShardHandlerFactory created with socketTimeout : 90000,urlScheme : ,connTimeout : 15000,maxConnectionsPerHost : 20,maxConnections : 10000,corePoolSize : 0,maximumPoolSize : 2147483647,maxThreadIdleTime : 5,sizeOfQueue : -1,fairnessPolicy : false,useRetries : false,
   [junit4]   2> 2678079 INFO  (TEST-StressHdfsTest.test-seed#[FC75998DF3022030]) [    ] o.a.s.u.UpdateShardHandler Creating UpdateShardHandler HTTP client with params: socketTimeout=340000&connTimeout=45000&retry=true
   [junit4]   2> 2678079 INFO  (TEST-StressHdfsTest.test-seed#[FC75998DF3022030]) [    ] o.a.s.l.LogWatcher SLF4J impl is org.slf4j.impl.Log4jLoggerFactory
   [junit4]   2> 2678079 INFO  (TEST-StressHdfsTest.test-seed#[FC75998DF3022030]) [    ] o.a.s.l.LogWatcher Registering Log Listener [Log4j (org.slf4j.impl.Log4jLoggerFactory)]
   [junit4]   2> 2678079 INFO  (TEST-StressHdfsTest.test-seed#[FC75998DF3022030]) [    ] o.a.s.c.ZkContainer Zookeeper client=127.0.0.1:50110/solr
   [junit4]   2> 2678079 INFO  (TEST-StressHdfsTest.test-seed#[FC75998DF3022030]) [    ] o.a.s.c.ZkController zkHost includes chroot
   [junit4]   2> 2678079 INFO  (TEST-StressHdfsTest.test-seed#[FC75998DF3022030]) [    ] o.a.s.c.c.SolrZkClient Using default ZkCredentialsProvider
   [junit4]   2> 2678080 INFO  (TEST-StressHdfsTest.test-seed#[FC75998DF3022030]) [    ] o.a.s.c.c.ConnectionManager Waiting for client to connect to ZooKeeper
   [junit4]   2> 2678082 INFO  (zkCallback-2868-thread-1) [    ] o.a.s.c.c.ConnectionManager Watcher org.apache.solr.common.cloud.ConnectionManager@2ecaf919 name:ZooKeeperConnection Watcher:127.0.0.1:50110 got event WatchedEvent state:SyncConnected type:None path:null path:null type:None
   [junit4]   2> 2678082 INFO  (coreZkRegister-8167-thread-1-processing-n:127.0.0.1:41763_ x:collection1 s:shard1 c:control_collection r:core_node1) [n:127.0.0.1:41763_ c:control_collection s:shard1 r:core_node1 x:collection1] o.a.s.c.ZkController We are http://127.0.0.1:41763/collection1/ and leader is http://127.0.0.1:41763/collection1/
   [junit4]   2> 2678082 INFO  (coreZkRegister-8167-thread-1-processing-n:127.0.0.1:41763_ x:collection1 s:shard1 c:control_collection r:core_node1) [n:127.0.0.1:41763_ c:control_collection s:shard1 r:core_node1 x:collection1] o.a.s.c.ZkController No LogReplay needed for core=collection1 baseURL=http://127.0.0.1:41763
   [junit4]   2> 2678082 INFO  (TEST-StressHdfsTest.test-seed#[FC75998DF3022030]) [    ] o.a.s.c.c.ConnectionManager Client is connected to ZooKeeper
   [junit4]   2> 2678082 INFO  (coreZkRegister-8167-thread-1-processing-n:127.0.0.1:41763_ x:collection1 s:shard1 c:control_collection r:core_node1) [n:127.0.0.1:41763_ c:control_collection s:shard1 r:core_node1 x:collection1] o.a.s.c.ZkController I am the leader, no recovery necessary
   [junit4]   2> 2678082 INFO  (coreZkRegister-8167-thread-1-processing-n:127.0.0.1:41763_ x:collection1 s:shard1 c:control_collection r:core_node1) [n:127.0.0.1:41763_ c:control_collection s:shard1 r:core_node1 x:collection1] o.a.s.c.ZkController publishing state=active
   [junit4]   2> 2678082 INFO  (coreZkRegister-8167-thread-1-processing-n:127.0.0.1:41763_ x:collection1 s:shard1 c:control_collection r:core_node1) [n:127.0.0.1:41763_ c:control_collection s:shard1 r:core_node1 x:collection1] o.a.s.c.ZkController numShards not found on descriptor - reading it from system property
   [junit4]   2> 2678083 INFO  (TEST-StressHdfsTest.test-seed#[FC75998DF3022030]) [    ] o.a.s.c.c.SolrZkClient Using default ZkACLProvider
   [junit4]   2> 2678086 INFO  (TEST-StressHdfsTest.test-seed#[FC75998DF3022030]) [n:127.0.0.1:37507_    ] o.a.s.c.c.ConnectionManager Waiting for client to connect to ZooKeeper
   [junit4]   2> 2678086 INFO  (OverseerStateUpdate-95325455917318148-127.0.0.1:41763_-n_0000000000) [n:127.0.0.1:41763_    ] o.a.s.c.Overseer processMessage: queueSize: 1, message = {
   [junit4]   2>   "core":"collection1",
   [junit4]   2>   "core_node_name":"core_node1",
   [junit4]   2>   "roles":null,
   [junit4]   2>   "base_url":"http://127.0.0.1:41763",
   [junit4]   2>   "node_name":"127.0.0.1:41763_",
   [junit4]   2>   "numShards":"1",
   [junit4]   2>   "state":"active",
   [junit4]   2>   "shard":"shard1",
   [junit4]   2>   "collection":"control_collection",
   [junit4]   2>   "operation":"state"} current state version: 3
   [junit4]   2> 2678087 INFO  (OverseerStateUpdate-95325455917318148-127.0.0.1:41763_-n_0000000000) [n:127.0.0.1:41763_    ] o.a.s.c.o.ReplicaMutator Update state numShards=1 message={
   [junit4]   2>   "core":"collection1",
   [junit4]   2>   "core_node_name":"core_node1",
   [junit4]   2>   "roles":null,
   [junit4]   2>   "base_url":"http://127.0.0.1:41763",
   [junit4]   2>   "node_name":"127.0.0.1:41763_",
   [junit4]   2>   "numShards":"1",
   [junit4]   2>   "state":"active",
   [junit4]   2>   "shard":"shard1",
   [junit4]   2>   "collection":"control_collection",
   [junit4]   2>   "operation":"state"}
   [junit4]   2> 2678087 INFO  (zkCallback-2869-thread-1-processing-n:127.0.0.1:37507_) [n:127.0.0.1:37507_    ] o.a.s.c.c.ConnectionManager Watcher org.apache.solr.common.cloud.ConnectionManager@8cb32c7 name:ZooKeeperConnection Watcher:127.0.0.1:50110/solr got event WatchedEvent state:SyncConnected type:None path:null path:null type:None
   [junit4]   2> 2678088 INFO  (TEST-StressHdfsTest.test-seed#[FC75998DF3022030]) [n:127.0.0.1:37507_    ] o.a.s.c.c.ConnectionManager Client is connected to ZooKeeper
   [junit4]   2> 2678099 INFO  (TEST-StressHdfsTest.test-seed#[FC75998DF3022030]) [n:127.0.0.1:37507_    ] o.a.s.c.c.ZkStateReader Updating cluster state from ZooKeeper... 
   [junit4]   2> 2678191 INFO  (zkCallback-2864-thread-1) [    ] o.a.s.c.c.ZkStateReader A cluster state change: [WatchedEvent state:SyncConnected type:NodeDataChanged path:/clusterstate.json], has occurred - updating... (live nodes size: [1])
   [junit4]   2> 2678191 INFO  (zkCallback-2862-thread-1-processing-n:127.0.0.1:41763_) [n:127.0.0.1:41763_    ] o.a.s.c.c.ZkStateReader A cluster state change: [WatchedEvent state:SyncConnected type:NodeDataChanged path:/clusterstate.json], has occurred - updating... (live nodes size: [1])
   [junit4]   2> 2678192 INFO  (zkCallback-2869-thread-1-processing-n:127.0.0.1:37507_) [n:127.0.0.1:37507_    ] o.a.s.c.c.ZkStateReader A cluster state change: [WatchedEvent state:SyncConnected type:NodeDataChanged path:/clusterstate.json], has occurred - updating... (live nodes size: [1])
   [junit4]   2> 2679114 INFO  (TEST-StressHdfsTest.test-seed#[FC75998DF3022030]) [n:127.0.0.1:37507_    ] o.a.s.c.ZkController Register node as live in ZooKeeper:/live_nodes/127.0.0.1:37507_
   [junit4]   2> 2679114 INFO  (TEST-StressHdfsTest.test-seed#[FC75998DF3022030]) [n:127.0.0.1:37507_    ] o.a.s.c.c.SolrZkClient makePath: /live_nodes/127.0.0.1:37507_
   [junit4]   2> 2679116 INFO  (zkCallback-2864-thread-1) [    ] o.a.s.c.c.ZkStateReader A live node change: [WatchedEvent state:SyncConnected type:NodeChildrenChanged path:/live_nodes], has occurred - updating... (live nodes size: [1])
   [junit4]   2> 2679116 INFO  (zkCallback-2862-thread-1-processing-n:127.0.0.1:41763_) [n:127.0.0.1:41763_    ] o.a.s.c.c.ZkStateReader A live node change: [WatchedEvent state:SyncConnected type:NodeChildrenChanged path:/live_nodes], has occurred - updating... (live nodes size: [1])
   [junit4]   2> 2679117 INFO  (zkCallback-2869-thread-1-processing-n:127.0.0.1:37507_) [n:127.0.0.1:37507_    ] o.a.s.c.c.ZkStateReader A live node change: [WatchedEvent state:SyncConnected type:NodeChildrenChanged path:/live_nodes], has occurred - updating... (live nodes size: [1])
   [junit4]   2> 2679119 INFO  (TEST-StressHdfsTest.test-seed#[FC75998DF3022030]) [n:127.0.0.1:37507_    ] o.a.s.c.Overseer Overseer (id=null) closing
   [junit4]   2> 2679120 INFO  (TEST-StressHdfsTest.test-seed#[FC75998DF3022030]) [n:127.0.0.1:37507_    ] o.a.s.c.LeaderElector Joined leadership election with path: /overseer_elect/election/95325455917318152-127.0.0.1:37507_-n_0000000001
   [junit4]   2> 2679128 INFO  (TEST-StressHdfsTest.test-seed#[FC75998DF3022030]) [n:127.0.0.1:37507_    ] o.a.s.c.LeaderElector Watching path /overseer_elect/election/95325455917318148-127.0.0.1:41763_-n_0000000000 to know if I could be the leader
   [junit4]   2> 2679183 INFO  (TEST-StressHdfsTest.test-seed#[FC75998DF3022030]) [n:127.0.0.1:37507_    ] o.a.s.c.CoreContainer Security conf doesn't exist. Skipping setup for authorization module.
   [junit4]   2> 2679183 INFO  (TEST-StressHdfsTest.test-seed#[FC75998DF3022030]) [n:127.0.0.1:37507_    ] o.a.s.c.CoreContainer No authentication plugin used.
   [junit4]   2> 2679184 INFO  (TEST-StressHdfsTest.test-seed#[FC75998DF3022030]) [n:127.0.0.1:37507_    ] o.a.s.c.CorePropertiesLocator Looking for core definitions underneath /export/home/jenkins/workspace/Lucene-Solr-trunk-Solaris/solr/build/solr-core/test/J0/temp/solr.cloud.hdfs.StressHdfsTest_FC75998DF3022030-001/shard-1-001/cores
   [junit4]   2> 2679185 INFO  (TEST-StressHdfsTest.test-seed#[FC75998DF3022030]) [n:127.0.0.1:37507_    ] o.a.s.c.CoreDescriptor Created CoreDescriptor: {name=collection1, config=solrconfig.xml, transient=false, schema=schema.xml, loadOnStartup=true, configSetProperties=configsetprops.json, collection=collection1, coreNodeName=, dataDir=data/, shard=}
   [junit4]   2> 2679185 INFO  (TEST-StressHdfsTest.test-seed#[FC75998DF3022030]) [n:127.0.0.1:37507_    ] o.a.s.c.CorePropertiesLocator Found core collection1 in /export/home/jenkins/workspace/Lucene-Solr-trunk-Solaris/solr/build/solr-core/test/J0/temp/solr.cloud.hdfs.StressHdfsTest_FC75998DF3022030-001/shard-1-001/cores/collection1
   [junit4]   2> 2679185 INFO  (TEST-StressHdfsTest.test-seed#[FC75998DF3022030]) [n:127.0.0.1:37507_    ] o.a.s.c.CorePropertiesLocator Found 1 core definitions
   [junit4]   2> 2679186 INFO  (TEST-StressHdfsTest.test-seed#[FC75998DF3022030]) [n:127.0.0.1:37507_    ] o.a.s.s.SolrDispatchFilter user.dir=/export/home/jenkins/workspace/Lucene-Solr-trunk-Solaris/solr/build/solr-core/test/J0
   [junit4]   2> 2679186 INFO  (TEST-StressHdfsTest.test-seed#[FC75998DF3022030]) [n:127.0.0.1:37507_    ] o.a.s.s.SolrDispatchFilter SolrDispatchFilter.init() done
   [junit4]   2> 2679187 INFO  (coreLoadExecutor-8184-thread-1-processing-n:127.0.0.1:37507_) [n:127.0.0.1:37507_ c:collection1   x:collection1] o.a.s.c.ZkController publishing state=down
   [junit4]   2> 2679187 INFO  (coreLoadExecutor-8184-thread-1-processing-n:127.0.0.1:37507_) [n:127.0.0.1:37507_ c:collection1   x:collection1] o.a.s.c.ZkController numShards not found on descriptor - reading it from system property
   [junit4]   2> 2679190 INFO  (coreLoadExecutor-8184-thread-1-processing-n:127.0.0.1:37507_) [n:127.0.0.1:37507_ c:collection1   x:collection1] o.a.s.c.ZkController look for our core node name
   [junit4]   2> 2679190 INFO  (OverseerStateUpdate-95325455917318148-127.0.0.1:41763_-n_0000000000) [n:127.0.0.1:41763_    ] o.a.s.c.Overseer processMessage: queueSize: 1, message = {
   [junit4]   2>   "core":"collection1",
   [junit4]   2>   "roles":null,
   [junit4]   2>   "base_url":"http://127.0.0.1:37507",
   [junit4]   2>   "node_name":"127.0.0.1:37507_",
   [junit4]   2>   "numShards":"1",
   [junit4]   2>   "state":"down",
   [junit4]   2>   "shard":null,
   [junit4]   2>   "collection":"collection1",
   [junit4]   2>   "operation":"state"} current state version: 4
   [junit4]   2> 2679191 INFO  (OverseerStateUpdate-95325455917318148-127.0.0.1:41763_-n_0000000000) [n:127.0.0.1:41763_    ] o.a.s.c.o.ReplicaMutator Update state numShards=1 message={
   [junit4]   2>   "core":"collection1",
   [junit4]   2>   "roles":null,
   [junit4]   2>   "base_url":"http://127.0.0.1:37507",
   [junit4]   2>   "node_name":"127.0.0.1:37507_",
   [junit4]   2>   "numShards":"1",
   [junit4]   2>   "state":"down",
   [junit4]   2>   "shard":null,
   [junit4]   2>   "collection":"collection1",
   [junit4]   2>   "operation":"state"}
   [junit4]   2> 2679191 INFO  (OverseerStateUpdate-95325455917318148-127.0.0.1:41763_-n_0000000000) [n:127.0.0.1:41763_    ] o.a.s.c.o.ClusterStateMutator building a new cName: collection1
   [junit4]   2> 2679192 INFO  (OverseerStateUpdate-95325455917318148-127.0.0.1:41763_-n_0000000000) [n:127.0.0.1:41763_    ] o.a.s.c.o.ReplicaMutator Assigning new node to shard shard=shard1
   [junit4]   2> 2679296 INFO  (zkCallback-2864-thread-1) [    ] o.a.s.c.c.ZkStateReader A cluster state change: [WatchedEvent state:SyncConnected type:NodeDataChanged path:/clusterstate.json], has occurred - updating... (live nodes size: [2])
   [junit4]   2> 2679296 INFO  (zkCallback-2862-thread-1-processing-n:127.0.0.1:41763_) [n:127.0.0.1:41763_    ] o.a.s.c.c.ZkStateReader A cluster state change: [WatchedEvent state:SyncConnected type:NodeDataChanged path:/clusterstate.json], has occurred - updating... (live nodes size: [2])
   [junit4]   2> 2679297 INFO  (zkCallback-2869-thread-1-processing-n:127.0.0.1:37507_) [n:127.0.0.1:37507_    ] o.a.s.c.c.ZkStateReader A cluster state change: [WatchedEvent state:SyncConnected type:NodeDataChanged path:/clusterstate.json], has occurred - updating... (live nodes size: [2])
   [junit4]   2> 2680195 INFO  (coreLoadExecutor-8184-thread-1-processing-n:127.0.0.1:37507_) [n:127.0.0.1:37507_ c:collection1   x:collection1] o.a.s.c.ZkController waiting to find shard id in clusterstate for collection1
   [junit4]   2> 2680196 INFO  (coreLoadExecutor-8184-thread-1-processing-n:127.0.0.1:37507_) [n:127.0.0.1:37507_ c:collection1   x:collection1] o.a.s.c.ZkController Check for collection zkNode:collection1
   [junit4]   2> 2680196 INFO  (coreLoadExecutor-8184-thread-1-processing-n:127.0.0.1:37507_) [n:127.0.0.1:37507_ c:collection1   x:collection1] o.a.s.c.ZkController Collection zkNode exists
   [junit4]   2> 2680196 INFO  (coreLoadExecutor-8184-thread-1-processing-n:127.0.0.1:37507_) [n:127.0.0.1:37507_ c:collection1   x:collection1] o.a.s.c.c.ZkStateReader Load collection config from: [/collections/collection1]
   [junit4]   2> 2680197 INFO  (coreLoadExecutor-8184-thread-1-processing-n:127.0.0.1:37507_) [n:127.0.0.1:37507_ c:collection1   x:collection1] o.a.s.c.c.ZkStateReader path=[/collections/collection1] [configName]=[conf1] specified config exists in ZooKeeper
   [junit4]   2> 2680198 INFO  (coreLoadExecutor-8184-thread-1-processing-n:127.0.0.1:37507_) [n:127.0.0.1:37507_ c:collection1   x:collection1] o.a.s.c.SolrResourceLoader new SolrResourceLoader for directory: '/export/home/jenkins/workspace/Lucene-Solr-trunk-Solaris/solr/build/solr-core/test/J0/temp/solr.cloud.hdfs.StressHdfsTest_FC75998DF3022030-001/shard-1-001/cores/collection1'
   [junit4]   2> 2680198 INFO  (coreLoadExecutor-8184-thread-1-processing-n:127.0.0.1:37507_) [n:127.0.0.1:37507_ c:collection1   x:collection1] o.a.s.c.SolrResourceLoader JNDI not configured for solr (NoInitialContextEx)
   [junit4]   2> 2680198 INFO  (coreLoadExecutor-8184-thread-1-processing-n:127.0.0.1:37507_) [n:127.0.0.1:37507_ c:collection1   x:collection1] o.a.s.c.SolrResourceLoader solr home defaulted to 'solr/' (could not find system property or JNDI)
   [junit4]   2> 2680200 INFO  (coreLoadExecutor-8184-thread-1-processing-n:127.0.0.1:37507_) [n:127.0.0.1:37507_ c:collection1   x:collection1] o.a.s.c.Config loaded config solrconfig.xml with version 0 
   [junit4]   2> 2680208 INFO  (coreLoadExecutor-8184-thread-1-processing-n:127.0.0.1:37507_) [n:127.0.0.1:37507_ c:collection1   x:collection1] o.a.s.c.SolrConfig current version of requestparams : -1
   [junit4]   2> 2680211 INFO  (coreLoadExecutor-8184-thread-1-processing-n:127.0.0.1:37507_) [n:127.0.0.1:37507_ c:collection1   x:collection1] o.a.s.c.SolrConfig Using Lucene MatchVersion: 6.0.0
   [junit4]   2> 2680220 INFO  (coreLoadExecutor-8184-thread-1-processing-n:127.0.0.1:37507_) [n:127.0.0.1:37507_ c:collection1   x:collection1] o.a.s.c.SolrConfig Loaded SolrConfig: solrconfig.xml
   [junit4]   2> 2680226 INFO  (coreLoadExecutor-8184-thread-1-processing-n:127.0.0.1:37507_) [n:127.0.0.1:37507_ c:collection1   x:collection1] o.a.s.s.IndexSchema [collection1] Schema name=test
   [junit4]   2> 2680324 INFO  (coreLoadExecutor-8184-thread-1-processing-n:127.0.0.1:37507_) [n:127.0.0.1:37507_ c:collection1   x:collection1] o.a.s.s.OpenExchangeRatesOrgProvider Initialized with rates=open-exchange-rates.json, refreshInterval=1440.
   [junit4]   2> 2680330 INFO  (coreLoadExecutor-8184-thread-1-processing-n:127.0.0.1:37507_) [n:127.0.0.1:37507_ c:collection1   x:collection1] o.a.s.s.IndexSchema default search field in schema is text
   [junit4]   2> 2680330 INFO  (coreLoadExecutor-8184-thread-1-processing-n:127.0.0.1:37507_) [n:127.0.0.1:37507_ c:collection1   x:collection1] o.a.s.s.IndexSchema unique key field: id
   [junit4]   2> 2680350 INFO  (coreLoadExecutor-8184-thread-1-processing-n:127.0.0.1:37507_) [n:127.0.0.1:37507_ c:collection1   x:collection1] o.a.s.s.FileExchangeRateProvider Reloading exchange rates from file currency.xml
   [junit4]   2> 2680353 INFO  (coreLoadExecutor-8184-thread-1-processing-n:127.0.0.1:37507_) [n:127.0.0.1:37507_ c:collection1   x:collection1] o.a.s.s.FileExchangeRateProvider Reloading exchange rates from file currency.xml
   [junit4]   2> 2680355 INFO  (coreLoadExecutor-8184-thread-1-processing-n:127.0.0.1:37507_) [n:127.0.0.1:37507_ c:collection1   x:collection1] o.a.s.s.OpenExchangeRatesOrgProvider Reloading exchange rates from open-exchange-rates.json
   [junit4]   2> 2680356 INFO  (coreLoadExecutor-8184-thread-1-processing-n:127.0.0.1:37507_) [n:127.0.0.1:37507_ c:collection1   x:collection1] o.a.s.s.OpenExchangeRatesOrgProvider Reloading exchange rates from open-exchange-rates.json
   [junit4]   2> 2680358 INFO  (coreLoadExecutor-8184-thread-1-processing-n:127.0.0.1:37507_) [n:127.0.0.1:37507_ c:col

[...truncated too long message...]

ClassName$1.evaluate(TestRuleStoreClassName.java:42)
   [junit4]   2> 	at com.carrotsearch.randomizedtesting.rules.NoShadowingOrOverridesOnMethodsRule$1.evaluate(NoShadowingOrOverridesOnMethodsRule.java:40)
   [junit4]   2> 	at com.carrotsearch.randomizedtesting.rules.NoShadowingOrOverridesOnMethodsRule$1.evaluate(NoShadowingOrOverridesOnMethodsRule.java:40)
   [junit4]   2> 	at com.carrotsearch.randomizedtesting.rules.StatementAdapter.evaluate(StatementAdapter.java:36)
   [junit4]   2> 	at com.carrotsearch.randomizedtesting.rules.StatementAdapter.evaluate(StatementAdapter.java:36)
   [junit4]   2> 	at com.carrotsearch.randomizedtesting.rules.StatementAdapter.evaluate(StatementAdapter.java:36)
   [junit4]   2> 	at org.apache.lucene.util.TestRuleAssertionsRequired$1.evaluate(TestRuleAssertionsRequired.java:54)
   [junit4]   2> 	at org.apache.lucene.util.TestRuleMarkFailure$1.evaluate(TestRuleMarkFailure.java:48)
   [junit4]   2> 	at org.apache.lucene.util.TestRuleIgnoreAfterMaxFailures$1.evaluate(TestRuleIgnoreAfterMaxFailures.java:65)
   [junit4]   2> 	at org.apache.lucene.util.TestRuleIgnoreTestSuites$1.evaluate(TestRuleIgnoreTestSuites.java:55)
   [junit4]   2> 	at com.carrotsearch.randomizedtesting.rules.StatementAdapter.evaluate(StatementAdapter.java:36)
   [junit4]   2> 	at com.carrotsearch.randomizedtesting.ThreadLeakControl$StatementRunner.run(ThreadLeakControl.java:367)
   [junit4]   2> 	at java.lang.Thread.run(Thread.java:745)
   [junit4]   2> Caused by: java.lang.NullPointerException
   [junit4]   2> 	at org.apache.hadoop.hdfs.server.blockmanagement.BlocksMap.size(BlocksMap.java:198)
   [junit4]   2> 	at org.apache.hadoop.hdfs.server.blockmanagement.BlockManager.getTotalBlocks(BlockManager.java:3291)
   [junit4]   2> 	at org.apache.hadoop.hdfs.server.namenode.FSNamesystem.getBlocksTotal(FSNamesystem.java:6223)
   [junit4]   2> 	... 54 more
   [junit4]   2> 2719307 INFO  (SUITE-StressHdfsTest-seed#[FC75998DF3022030]-worker) [n:127.0.0.1:37507_ c:delete_data_dir s:shard2 r:core_node1 x:delete_data_dir_shard2_replica1] o.a.s.SolrTestCaseJ4 ###deleteCore
   [junit4]   2> NOTE: leaving temporary files on disk at: /export/home/jenkins/workspace/Lucene-Solr-trunk-Solaris/solr/build/solr-core/test/J0/temp/solr.cloud.hdfs.StressHdfsTest_FC75998DF3022030-001
   [junit4]   2> Feb 04, 2016 1:57:50 AM com.carrotsearch.randomizedtesting.ThreadLeakControl checkThreadLeaks
   [junit4]   2> WARNING: Will linger awaiting termination of 2 leaked thread(s).
   [junit4]   2> NOTE: test params are: codec=Asserting(Lucene60): {range_facet_l_dv=PostingsFormat(name=MockRandom), _version_=PostingsFormat(name=Memory doPackFST= true), multiDefault=PostingsFormat(name=LuceneVarGapDocFreqInterval), intDefault=PostingsFormat(name=Memory doPackFST= true), id=PostingsFormat(name=MockRandom), range_facet_i_dv=PostingsFormat(name=LuceneVarGapDocFreqInterval), text=Lucene50(blocksize=128), range_facet_l=PostingsFormat(name=LuceneVarGapDocFreqInterval), timestamp=PostingsFormat(name=LuceneVarGapDocFreqInterval), txt_t=Lucene50(blocksize=128)}, docValues:{range_facet_l_dv=DocValuesFormat(name=Lucene54), range_facet_i_dv=DocValuesFormat(name=Asserting), timestamp=DocValuesFormat(name=Asserting)}, sim=ClassicSimilarity, locale=et, timezone=Canada/Atlantic
   [junit4]   2> NOTE: SunOS 5.11 amd64/Oracle Corporation 1.8.0_72 (64-bit)/cpus=3,threads=3,free=118428736,total=482082816
   [junit4]   2> NOTE: All tests run in this JVM: [TestObjectReleaseTracker, TestConfigOverlay, TestDFISimilarityFactory, TestConfigSetsAPI, TestWordDelimiterFilterFactory, TestCloudManagedSchema, TestLMDirichletSimilarityFactory, HighlighterMaxOffsetTest, PathHierarchyTokenizerFactoryTest, TestGroupingSearch, TestPartialUpdateDeduplication, TestDistributedSearch, TestDocumentBuilder, CollectionStateFormat2Test, OverseerRolesTest, PrimUtilsTest, TestSort, TestXIncludeConfig, TestManagedSynonymFilterFactory, XmlUpdateRequestHandlerTest, LeaderFailoverAfterPartitionTest, DirectUpdateHandlerTest, SuggestComponentTest, TestSolrConfigHandlerConcurrent, MultiThreadedOCPTest, TestFieldResource, TestIntervalFaceting, FullHLLTest, TestUniqueKeyFieldResource, TestConfigSetProperties, TestPseudoReturnFields, URLClassifyProcessorTest, TestSQLHandler, CursorMarkTest, DistributedSuggestComponentTest, JSONWriterTest, CircularListTest, TestDocBasedVersionConstraints, RegexBoostProcessorTest, LeaderInitiatedRecoveryOnShardRestartTest, SimpleFacetsTest, TestCustomSort, TestScoreJoinQPNoScore, ActionThrottleTest, TestSortByMinMaxFunction, TestSchemaResource, ExternalFileFieldSortTest, TestSimpleQParserPlugin, TestChildDocTransformer, TestSolrQueryParserDefaultOperatorResource, ResponseHeaderTest, TestExpandComponent, TestRawResponseWriter, TestLFUCache, RankQueryTest, SimplePostToolTest, TestFileDictionaryLookup, TestFieldTypeResource, RequestLoggingTest, SOLR749Test, TestComponentsName, TestRemoteStreaming, ChaosMonkeyNothingIsSafeTest, HdfsRestartWhileUpdatingTest, CloudExitableDirectoryReaderTest, TestDistribDocBasedVersion, HdfsCollectionsAPIDistributedZkTest, PreAnalyzedUpdateProcessorTest, HighlighterTest, HdfsRecoverLeaseTest, HdfsBasicDistributedZk2Test, SolrIndexConfigTest, TestArbitraryIndexDir, TestPerFieldSimilarityClassic, DocValuesMissingTest, TermsComponentTest, StandardRequestHandlerTest, SpatialRPTFieldTypeTest, TestInitQParser, TestUpdate, TestStressVersions, TestCloudSchemaless, SolrTestCaseJ4Test, SolrCloudExampleTest, TestMinMaxOnMultiValuedField, TestExactStatsCache, TestDynamicFieldResource, PreAnalyzedFieldTest, TestLazyCores, TestAuthenticationFramework, BasicDistributedZkTest, TestRuleBasedAuthorizationPlugin, DocumentBuilderTest, TestMergePolicyConfig, MBeansHandlerTest, TestExtendedDismaxParser, TestReRankQParserPlugin, TestReqParamsAPI, ClusterStateTest, TestJsonRequest, TestConfigSetsAPIZkFailure, TestFaceting, TestFastLRUCache, UUIDFieldTest, TestRestManager, TestCursorMarkWithoutUniqueKey, SSLMigrationTest, TestReplicationHandler, TestNRTOpen, TestDynamicLoading, DistributedQueryElevationComponentTest, OverseerTaskQueueTest, TestAnalyzedSuggestions, SyncSliceTest, SpatialHeatmapFacetsTest, OverseerTest, BitVectorTest, TestCollapseQParserPlugin, RulesTest, TestCoreContainer, TestClusterStateMutator, UUIDUpdateProcessorFallbackTest, TestCloudPivotFacet, PolyFieldTest, TestMissingGroups, FastVectorHighlighterTest, DocumentAnalysisRequestHandlerTest, ScriptEngineTest, TestExclusionRuleCollectionAccess, CollectionsAPIAsyncDistributedZkTest, UnloadDistributedZkTest, TriLevelCompositeIdRoutingTest, TestDocSet, TestMiniSolrCloudClusterBase, HardAutoCommitTest, IndexSchemaTest, DistributedExpandComponentTest, PeerSyncTest, DirectSolrSpellCheckerTest, TestFunctionQuery, AnalysisAfterCoreReloadTest, AlternateDirectoryTest, RecoveryZkTest, LeaderElectionTest, AutoCommitTest, TestHashPartitioner, TermVectorComponentDistributedTest, TestRealTimeGet, TestJoin, TestReload, DistributedTermsComponentTest, SpellCheckComponentTest, CurrencyFieldOpenExchangeTest, CurrencyFieldXmlFileTest, SolrIndexSplitterTest, TestCoreDiscovery, SignatureUpdateProcessorFactoryTest, SuggesterFSTTest, DocValuesTest, TestStressLucene, SpatialFilterTest, NoCacheHeaderTest, SolrCoreCheckLockOnStartupTest, FieldMutatingUpdateProcessorTest, TestAtomicUpdateErrorCases, StatelessScriptUpdateProcessorFactoryTest, XsltUpdateRequestHandlerTest, TestSurroundQueryParser, DisMaxRequestHandlerTest, TestQueryUtils, TestWriterPerf, TestQueryTypes, FileBasedSpellCheckerTest, MoreLikeThisHandlerTest, SolrPluginUtilsTest, TestCollationField, ReturnFieldsTest, BinaryUpdateRequestHandlerTest, TestPHPSerializedResponseWriter, CSVRequestHandlerTest, HighlighterConfigTest, TestQuerySenderListener, UpdateParamsTest, TestSolrIndexConfig, TestQuerySenderNoQuery, CopyFieldTest, BadComponentTest, TestStressRecovery, TestLRUCache, SystemInfoHandlerTest, DistributedMLTComponentTest, TestHighlightDedupGrouping, TestSimpleTrackingShardHandler, ConnectionReuseTest, AssignTest, AsyncCallRequestStatusResponseTest, AsyncMigrateRouteKeyTest, ConcurrentDeleteAndCreateCollectionTest, ConfigSetsAPITest, CustomCollectionTest, DistribDocExpirationUpdateProcessorTest, LeaderInitiatedRecoveryOnCommitTest, OverriddenZkACLAndCredentialsProvidersTest, OverseerCollectionConfigSetProcessorTest, OverseerStatusTest, RemoteQueryErrorTest, ShardSplitTest, TestMiniSolrCloudClusterSSL, TestRandomRequestDistribution, TestRebalanceLeaders, TestRequestForwarding, TestSolrCloudWithKerberosAlt, HdfsUnloadDistributedZkTest, HdfsWriteToMultipleCollectionsTest, StressHdfsTest]
   [junit4] Completed [479/577 (1!)] on J0 in 59.42s, 1 test, 1 error <<< FAILURES!

[...truncated 336 lines...]
BUILD FAILED
/export/home/jenkins/workspace/Lucene-Solr-trunk-Solaris/build.xml:740: The following error occurred while executing this line:
/export/home/jenkins/workspace/Lucene-Solr-trunk-Solaris/build.xml:684: The following error occurred while executing this line:
/export/home/jenkins/workspace/Lucene-Solr-trunk-Solaris/build.xml:59: The following error occurred while executing this line:
/export/home/jenkins/workspace/Lucene-Solr-trunk-Solaris/solr/build.xml:233: The following error occurred while executing this line:
/export/home/jenkins/workspace/Lucene-Solr-trunk-Solaris/solr/common-build.xml:524: The following error occurred while executing this line:
/export/home/jenkins/workspace/Lucene-Solr-trunk-Solaris/lucene/common-build.xml:1457: The following error occurred while executing this line:
/export/home/jenkins/workspace/Lucene-Solr-trunk-Solaris/lucene/common-build.xml:1014: There were test failures: 577 suites (8 ignored), 2321 tests, 1 error, 85 ignored (70 assumptions) [seed: FC75998DF3022030]

Total time: 69 minutes 13 seconds
Build step 'Invoke Ant' marked build as failure
Archiving artifacts
[WARNINGS] Skipping publisher since build result is FAILURE
Recording test results
Email was triggered for: Failure - Any
Sending email for trigger: Failure - Any



Mime
View raw message