lucene-dev mailing list archives

Site index · List index
Message view « Date » · « Thread »
Top « Date » · « Thread »
From Policeman Jenkins Server <jenk...@thetaphi.de>
Subject [JENKINS] Lucene-Solr-5.5-Linux (32bit/jdk1.8.0_72) - Build # 53 - Failure!
Date Sat, 20 Feb 2016 12:58:34 GMT
Build: http://jenkins.thetaphi.de/job/Lucene-Solr-5.5-Linux/53/
Java: 32bit/jdk1.8.0_72 -client -XX:+UseParallelGC

1 tests failed.
FAILED:  org.apache.solr.core.TestNRTOpen.testSharedCores

Error Message:
expected:<3> but was:<2>

Stack Trace:
java.lang.AssertionError: expected:<3> but was:<2>
	at __randomizedtesting.SeedInfo.seed([D54CEA05181C7729:334FA04A90EA5A26]:0)
	at org.junit.Assert.fail(Assert.java:93)
	at org.junit.Assert.failNotEquals(Assert.java:647)
	at org.junit.Assert.assertEquals(Assert.java:128)
	at org.junit.Assert.assertEquals(Assert.java:472)
	at org.junit.Assert.assertEquals(Assert.java:456)
	at org.apache.solr.core.TestNRTOpen.testSharedCores(TestNRTOpen.java:116)
	at sun.reflect.NativeMethodAccessorImpl.invoke0(Native Method)
	at sun.reflect.NativeMethodAccessorImpl.invoke(NativeMethodAccessorImpl.java:62)
	at sun.reflect.DelegatingMethodAccessorImpl.invoke(DelegatingMethodAccessorImpl.java:43)
	at java.lang.reflect.Method.invoke(Method.java:498)
	at com.carrotsearch.randomizedtesting.RandomizedRunner.invoke(RandomizedRunner.java:1764)
	at com.carrotsearch.randomizedtesting.RandomizedRunner$8.evaluate(RandomizedRunner.java:871)
	at com.carrotsearch.randomizedtesting.RandomizedRunner$9.evaluate(RandomizedRunner.java:907)
	at com.carrotsearch.randomizedtesting.RandomizedRunner$10.evaluate(RandomizedRunner.java:921)
	at com.carrotsearch.randomizedtesting.rules.SystemPropertiesRestoreRule$1.evaluate(SystemPropertiesRestoreRule.java:57)
	at org.apache.lucene.util.TestRuleSetupTeardownChained$1.evaluate(TestRuleSetupTeardownChained.java:49)
	at org.apache.lucene.util.AbstractBeforeAfterRule$1.evaluate(AbstractBeforeAfterRule.java:45)
	at org.apache.lucene.util.TestRuleThreadAndTestName$1.evaluate(TestRuleThreadAndTestName.java:48)
	at org.apache.lucene.util.TestRuleIgnoreAfterMaxFailures$1.evaluate(TestRuleIgnoreAfterMaxFailures.java:64)
	at org.apache.lucene.util.TestRuleMarkFailure$1.evaluate(TestRuleMarkFailure.java:47)
	at com.carrotsearch.randomizedtesting.rules.StatementAdapter.evaluate(StatementAdapter.java:36)
	at com.carrotsearch.randomizedtesting.ThreadLeakControl$StatementRunner.run(ThreadLeakControl.java:367)
	at com.carrotsearch.randomizedtesting.ThreadLeakControl.forkTimeoutingTask(ThreadLeakControl.java:809)
	at com.carrotsearch.randomizedtesting.ThreadLeakControl$3.evaluate(ThreadLeakControl.java:460)
	at com.carrotsearch.randomizedtesting.RandomizedRunner.runSingleTest(RandomizedRunner.java:880)
	at com.carrotsearch.randomizedtesting.RandomizedRunner$5.evaluate(RandomizedRunner.java:781)
	at com.carrotsearch.randomizedtesting.RandomizedRunner$6.evaluate(RandomizedRunner.java:816)
	at com.carrotsearch.randomizedtesting.RandomizedRunner$7.evaluate(RandomizedRunner.java:827)
	at com.carrotsearch.randomizedtesting.rules.StatementAdapter.evaluate(StatementAdapter.java:36)
	at com.carrotsearch.randomizedtesting.rules.SystemPropertiesRestoreRule$1.evaluate(SystemPropertiesRestoreRule.java:57)
	at org.apache.lucene.util.AbstractBeforeAfterRule$1.evaluate(AbstractBeforeAfterRule.java:45)
	at com.carrotsearch.randomizedtesting.rules.StatementAdapter.evaluate(StatementAdapter.java:36)
	at org.apache.lucene.util.TestRuleStoreClassName$1.evaluate(TestRuleStoreClassName.java:41)
	at com.carrotsearch.randomizedtesting.rules.NoShadowingOrOverridesOnMethodsRule$1.evaluate(NoShadowingOrOverridesOnMethodsRule.java:40)
	at com.carrotsearch.randomizedtesting.rules.NoShadowingOrOverridesOnMethodsRule$1.evaluate(NoShadowingOrOverridesOnMethodsRule.java:40)
	at com.carrotsearch.randomizedtesting.rules.StatementAdapter.evaluate(StatementAdapter.java:36)
	at com.carrotsearch.randomizedtesting.rules.StatementAdapter.evaluate(StatementAdapter.java:36)
	at com.carrotsearch.randomizedtesting.rules.StatementAdapter.evaluate(StatementAdapter.java:36)
	at org.apache.lucene.util.TestRuleAssertionsRequired$1.evaluate(TestRuleAssertionsRequired.java:53)
	at org.apache.lucene.util.TestRuleMarkFailure$1.evaluate(TestRuleMarkFailure.java:47)
	at org.apache.lucene.util.TestRuleIgnoreAfterMaxFailures$1.evaluate(TestRuleIgnoreAfterMaxFailures.java:64)
	at org.apache.lucene.util.TestRuleIgnoreTestSuites$1.evaluate(TestRuleIgnoreTestSuites.java:54)
	at com.carrotsearch.randomizedtesting.rules.StatementAdapter.evaluate(StatementAdapter.java:36)
	at com.carrotsearch.randomizedtesting.ThreadLeakControl$StatementRunner.run(ThreadLeakControl.java:367)
	at java.lang.Thread.run(Thread.java:745)




Build Log:
[...truncated 12107 lines...]
   [junit4] Suite: org.apache.solr.core.TestNRTOpen
   [junit4]   2> Creating dataDir: /home/jenkins/workspace/Lucene-Solr-5.5-Linux/solr/build/solr-core/test/J0/temp/solr.core.TestNRTOpen_D54CEA05181C7729-001/init-core-data-001
   [junit4]   2> 1606448 INFO  (SUITE-TestNRTOpen-seed#[D54CEA05181C7729]-worker) [    ] o.a.s.SolrTestCaseJ4 Randomized ssl (false) and clientAuth (false)
   [junit4]   2> 1606448 INFO  (SUITE-TestNRTOpen-seed#[D54CEA05181C7729]-worker) [    ] o.a.s.SolrTestCaseJ4 ####initCore
   [junit4]   2> 1606448 INFO  (SUITE-TestNRTOpen-seed#[D54CEA05181C7729]-worker) [    ] o.a.s.c.SolrResourceLoader new SolrResourceLoader for directory: '/home/jenkins/workspace/Lucene-Solr-5.5-Linux/solr/core/src/test-files/solr/collection1'
   [junit4]   2> 1606448 INFO  (SUITE-TestNRTOpen-seed#[D54CEA05181C7729]-worker) [    ] o.a.s.c.SolrResourceLoader JNDI not configured for solr (NoInitialContextEx)
   [junit4]   2> 1606448 INFO  (SUITE-TestNRTOpen-seed#[D54CEA05181C7729]-worker) [    ] o.a.s.c.SolrResourceLoader using system property solr.solr.home: /home/jenkins/workspace/Lucene-Solr-5.5-Linux/solr/core/src/test-files/solr
   [junit4]   2> 1606449 INFO  (SUITE-TestNRTOpen-seed#[D54CEA05181C7729]-worker) [    ] o.a.s.c.SolrResourceLoader Adding 'file:/home/jenkins/workspace/Lucene-Solr-5.5-Linux/solr/core/src/test-files/solr/collection1/lib/classes/' to classloader
   [junit4]   2> 1606449 INFO  (SUITE-TestNRTOpen-seed#[D54CEA05181C7729]-worker) [    ] o.a.s.c.SolrResourceLoader Adding 'file:/home/jenkins/workspace/Lucene-Solr-5.5-Linux/solr/core/src/test-files/solr/collection1/lib/README' to classloader
   [junit4]   2> 1606474 INFO  (SUITE-TestNRTOpen-seed#[D54CEA05181C7729]-worker) [    ] o.a.s.c.SolrConfig current version of requestparams : -1
   [junit4]   2> 1606476 INFO  (SUITE-TestNRTOpen-seed#[D54CEA05181C7729]-worker) [    ] o.a.s.c.SolrConfig Using Lucene MatchVersion: 5.5.0
   [junit4]   2> 1606481 INFO  (SUITE-TestNRTOpen-seed#[D54CEA05181C7729]-worker) [    ] o.a.s.c.SolrConfig Loaded SolrConfig: solrconfig-basic.xml
   [junit4]   2> 1606483 INFO  (SUITE-TestNRTOpen-seed#[D54CEA05181C7729]-worker) [    ] o.a.s.s.IndexSchema [null] Schema name=minimal
   [junit4]   2> 1606485 WARN  (SUITE-TestNRTOpen-seed#[D54CEA05181C7729]-worker) [    ] o.a.s.s.IndexSchema no uniqueKey specified in schema.
   [junit4]   2> 1606485 INFO  (SUITE-TestNRTOpen-seed#[D54CEA05181C7729]-worker) [    ] o.a.s.c.SolrResourceLoader JNDI not configured for solr (NoInitialContextEx)
   [junit4]   2> 1606485 INFO  (SUITE-TestNRTOpen-seed#[D54CEA05181C7729]-worker) [    ] o.a.s.c.SolrResourceLoader using system property solr.solr.home: /home/jenkins/workspace/Lucene-Solr-5.5-Linux/solr/core/src/test-files/solr
   [junit4]   2> 1606485 INFO  (SUITE-TestNRTOpen-seed#[D54CEA05181C7729]-worker) [    ] o.a.s.c.SolrResourceLoader new SolrResourceLoader for directory: '/home/jenkins/workspace/Lucene-Solr-5.5-Linux/solr/core/src/test-files/solr'
   [junit4]   2> 1606485 INFO  (SUITE-TestNRTOpen-seed#[D54CEA05181C7729]-worker) [    ] o.a.s.c.SolrResourceLoader JNDI not configured for solr (NoInitialContextEx)
   [junit4]   2> 1606485 INFO  (SUITE-TestNRTOpen-seed#[D54CEA05181C7729]-worker) [    ] o.a.s.c.SolrResourceLoader using system property solr.solr.home: /home/jenkins/workspace/Lucene-Solr-5.5-Linux/solr/core/src/test-files/solr
   [junit4]   2> 1606485 INFO  (SUITE-TestNRTOpen-seed#[D54CEA05181C7729]-worker) [    ] o.a.s.c.CoreContainer New CoreContainer 18308103
   [junit4]   2> 1606485 INFO  (SUITE-TestNRTOpen-seed#[D54CEA05181C7729]-worker) [    ] o.a.s.c.CoreContainer Loading cores into CoreContainer [instanceDir=/home/jenkins/workspace/Lucene-Solr-5.5-Linux/solr/core/src/test-files/solr]
   [junit4]   2> 1606486 WARN  (SUITE-TestNRTOpen-seed#[D54CEA05181C7729]-worker) [    ] o.a.s.c.CoreContainer Couldn't add files from /home/jenkins/workspace/Lucene-Solr-5.5-Linux/solr/core/src/test-files/solr/lib to classpath: /home/jenkins/workspace/Lucene-Solr-5.5-Linux/solr/core/src/test-files/solr/lib
   [junit4]   2> 1606486 INFO  (SUITE-TestNRTOpen-seed#[D54CEA05181C7729]-worker) [    ] o.a.s.h.c.HttpShardHandlerFactory created with socketTimeout : 600000,connTimeout : 60000,maxConnectionsPerHost : 20,maxConnections : 10000,corePoolSize : 0,maximumPoolSize : 2147483647,maxThreadIdleTime : 5,sizeOfQueue : -1,fairnessPolicy : false,useRetries : false,
   [junit4]   2> 1606488 INFO  (SUITE-TestNRTOpen-seed#[D54CEA05181C7729]-worker) [    ] o.a.s.u.UpdateShardHandler Creating UpdateShardHandler HTTP client with params: socketTimeout=30000&connTimeout=30000&retry=true
   [junit4]   2> 1606488 INFO  (SUITE-TestNRTOpen-seed#[D54CEA05181C7729]-worker) [    ] o.a.s.l.LogWatcher SLF4J impl is org.slf4j.impl.Log4jLoggerFactory
   [junit4]   2> 1606488 INFO  (SUITE-TestNRTOpen-seed#[D54CEA05181C7729]-worker) [    ] o.a.s.l.LogWatcher Registering Log Listener [Log4j (org.slf4j.impl.Log4jLoggerFactory)]
   [junit4]   2> 1606488 INFO  (SUITE-TestNRTOpen-seed#[D54CEA05181C7729]-worker) [    ] o.a.s.c.CoreContainer Security conf doesn't exist. Skipping setup for authorization module.
   [junit4]   2> 1606488 INFO  (SUITE-TestNRTOpen-seed#[D54CEA05181C7729]-worker) [    ] o.a.s.c.CoreContainer No authentication plugin used.
   [junit4]   2> 1606489 INFO  (SUITE-TestNRTOpen-seed#[D54CEA05181C7729]-worker) [    ] o.a.s.c.CoreDescriptor Created CoreDescriptor: {name=collection1, config=solrconfig-basic.xml, transient=false, schema=schema-minimal.xml, loadOnStartup=true, configSetProperties=configsetprops.json, collection=collection1, dataDir=/home/jenkins/workspace/Lucene-Solr-5.5-Linux/solr/build/solr-core/test/J0/temp/solr.core.TestNRTOpen_D54CEA05181C7729-001/init-core-data-001, shard=shard1}
   [junit4]   2> 1606489 INFO  (coreLoadExecutor-6303-thread-1) [    ] o.a.s.c.SolrResourceLoader new SolrResourceLoader for directory: '/home/jenkins/workspace/Lucene-Solr-5.5-Linux/solr/core/src/test-files/solr/collection1'
   [junit4]   2> 1606489 INFO  (coreLoadExecutor-6303-thread-1) [    ] o.a.s.c.SolrResourceLoader JNDI not configured for solr (NoInitialContextEx)
   [junit4]   2> 1606489 INFO  (coreLoadExecutor-6303-thread-1) [    ] o.a.s.c.SolrResourceLoader using system property solr.solr.home: /home/jenkins/workspace/Lucene-Solr-5.5-Linux/solr/core/src/test-files/solr
   [junit4]   2> 1606489 INFO  (coreLoadExecutor-6303-thread-1) [    ] o.a.s.c.SolrResourceLoader Adding 'file:/home/jenkins/workspace/Lucene-Solr-5.5-Linux/solr/core/src/test-files/solr/collection1/lib/classes/' to classloader
   [junit4]   2> 1606489 INFO  (coreLoadExecutor-6303-thread-1) [    ] o.a.s.c.SolrResourceLoader Adding 'file:/home/jenkins/workspace/Lucene-Solr-5.5-Linux/solr/core/src/test-files/solr/collection1/lib/README' to classloader
   [junit4]   2> 1606508 INFO  (coreLoadExecutor-6303-thread-1) [    ] o.a.s.c.SolrConfig current version of requestparams : -1
   [junit4]   2> 1606510 INFO  (coreLoadExecutor-6303-thread-1) [    ] o.a.s.c.SolrConfig Using Lucene MatchVersion: 5.5.0
   [junit4]   2> 1606514 INFO  (coreLoadExecutor-6303-thread-1) [    ] o.a.s.c.SolrConfig Loaded SolrConfig: solrconfig-basic.xml
   [junit4]   2> 1606517 INFO  (coreLoadExecutor-6303-thread-1) [    ] o.a.s.s.IndexSchema [collection1] Schema name=minimal
   [junit4]   2> 1606518 WARN  (coreLoadExecutor-6303-thread-1) [    ] o.a.s.s.IndexSchema no uniqueKey specified in schema.
   [junit4]   2> 1606520 INFO  (coreLoadExecutor-6303-thread-1) [    ] o.a.s.c.ConfigSetProperties Did not find ConfigSet properties, assuming default properties: Can't find resource 'configsetprops.json' in classpath or '/home/jenkins/workspace/Lucene-Solr-5.5-Linux/solr/core/src/test-files/solr/collection1'
   [junit4]   2> 1606520 INFO  (coreLoadExecutor-6303-thread-1) [    ] o.a.s.c.CoreContainer Creating SolrCore 'collection1' using configuration from instancedir /home/jenkins/workspace/Lucene-Solr-5.5-Linux/solr/core/src/test-files/solr/collection1
   [junit4]   2> 1606520 INFO  (coreLoadExecutor-6303-thread-1) [    x:collection1] o.a.s.c.SolrCore solr.StandardDirectoryFactory
   [junit4]   2> 1606520 INFO  (coreLoadExecutor-6303-thread-1) [    x:collection1] o.a.s.c.SolrCore [[collection1] ] Opening new SolrCore at [/home/jenkins/workspace/Lucene-Solr-5.5-Linux/solr/core/src/test-files/solr/collection1], dataDir=[/home/jenkins/workspace/Lucene-Solr-5.5-Linux/solr/build/solr-core/test/J0/temp/solr.core.TestNRTOpen_D54CEA05181C7729-001/init-core-data-001/]
   [junit4]   2> 1606520 INFO  (coreLoadExecutor-6303-thread-1) [    x:collection1] o.a.s.c.SolrCore JMX monitoring not detected for core: collection1
   [junit4]   2> 1606521 INFO  (coreLoadExecutor-6303-thread-1) [    x:collection1] o.a.s.c.CachingDirectoryFactory return new directory for /home/jenkins/workspace/Lucene-Solr-5.5-Linux/solr/build/solr-core/test/J0/temp/solr.core.TestNRTOpen_D54CEA05181C7729-001/init-core-data-001
   [junit4]   2> 1606521 INFO  (coreLoadExecutor-6303-thread-1) [    x:collection1] o.a.s.c.SolrCore New index directory detected: old=null new=/home/jenkins/workspace/Lucene-Solr-5.5-Linux/solr/build/solr-core/test/J0/temp/solr.core.TestNRTOpen_D54CEA05181C7729-001/init-core-data-001/index/
   [junit4]   2> 1606521 WARN  (coreLoadExecutor-6303-thread-1) [    x:collection1] o.a.s.c.SolrCore [collection1] Solr index directory '/home/jenkins/workspace/Lucene-Solr-5.5-Linux/solr/build/solr-core/test/J0/temp/solr.core.TestNRTOpen_D54CEA05181C7729-001/init-core-data-001/index' doesn't exist. Creating new index...
   [junit4]   2> 1606521 INFO  (coreLoadExecutor-6303-thread-1) [    x:collection1] o.a.s.c.CachingDirectoryFactory return new directory for /home/jenkins/workspace/Lucene-Solr-5.5-Linux/solr/build/solr-core/test/J0/temp/solr.core.TestNRTOpen_D54CEA05181C7729-001/init-core-data-001/index
   [junit4]   2> 1606521 INFO  (coreLoadExecutor-6303-thread-1) [    x:collection1] o.a.s.u.RandomMergePolicy RandomMergePolicy wrapping class org.apache.lucene.index.MockRandomMergePolicy: org.apache.lucene.index.MockRandomMergePolicy@1e3e81f
   [junit4]   2> 1606601 INFO  (coreLoadExecutor-6303-thread-1) [    x:collection1] o.a.s.c.SolrDeletionPolicy SolrDeletionPolicy.onCommit: commits: num=1
   [junit4]   2> 	commit{dir=/home/jenkins/workspace/Lucene-Solr-5.5-Linux/solr/build/solr-core/test/J0/temp/solr.core.TestNRTOpen_D54CEA05181C7729-001/init-core-data-001/index,segFN=segments_1,generation=1}
   [junit4]   2> 1606601 INFO  (coreLoadExecutor-6303-thread-1) [    x:collection1] o.a.s.c.SolrDeletionPolicy newest commit generation = 1
   [junit4]   2> 1606602 INFO  (OldIndexDirectoryCleanupThreadForCore-collection1) [    x:collection1] o.a.s.c.SolrCore Looking for old index directories to cleanup for core collection1 in /home/jenkins/workspace/Lucene-Solr-5.5-Linux/solr/build/solr-core/test/J0/temp/solr.core.TestNRTOpen_D54CEA05181C7729-001/init-core-data-001/
   [junit4]   2> 1606603 INFO  (coreLoadExecutor-6303-thread-1) [    x:collection1] o.a.s.c.SolrCore no updateRequestProcessorChain defined as default, creating implicit default
   [junit4]   2> 1606605 INFO  (coreLoadExecutor-6303-thread-1) [    x:collection1] o.a.s.h.l.XMLLoader xsltCacheLifetimeSeconds=60
   [junit4]   2> 1606606 INFO  (coreLoadExecutor-6303-thread-1) [    x:collection1] o.a.s.h.l.XMLLoader xsltCacheLifetimeSeconds=60
   [junit4]   2> 1606606 INFO  (coreLoadExecutor-6303-thread-1) [    x:collection1] o.a.s.h.l.XMLLoader xsltCacheLifetimeSeconds=60
   [junit4]   2> 1606607 INFO  (coreLoadExecutor-6303-thread-1) [    x:collection1] o.a.s.h.l.XMLLoader xsltCacheLifetimeSeconds=60
   [junit4]   2> 1606608 INFO  (coreLoadExecutor-6303-thread-1) [    x:collection1] o.a.s.c.RequestHandlers Registered paths: /admin/mbeans,standard,/update/csv,/update/json/docs,/admin/luke,/admin/segments,/get,/admin/system,/replication,/admin/properties,/config,/schema,/admin/plugins,/admin/logging,/update/json,/admin/threads,/admin/ping,/update,/admin/file
   [junit4]   2> 1606608 INFO  (coreLoadExecutor-6303-thread-1) [    x:collection1] o.a.s.c.SolrCore Using default statsCache cache: org.apache.solr.search.stats.LocalStatsCache
   [junit4]   2> 1606609 INFO  (coreLoadExecutor-6303-thread-1) [    x:collection1] o.a.s.u.CommitTracker Hard AutoCommit: disabled
   [junit4]   2> 1606609 INFO  (coreLoadExecutor-6303-thread-1) [    x:collection1] o.a.s.u.CommitTracker Soft AutoCommit: disabled
   [junit4]   2> 1606609 INFO  (coreLoadExecutor-6303-thread-1) [    x:collection1] o.a.s.u.RandomMergePolicy RandomMergePolicy wrapping class org.apache.lucene.index.TieredMergePolicy: [TieredMergePolicy: maxMergeAtOnce=21, maxMergeAtOnceExplicit=21, maxMergedSegmentMB=15.51953125, floorSegmentMB=0.21875, forceMergeDeletesPctAllowed=13.54600023670676, segmentsPerTier=23.0, maxCFSSegmentSizeMB=8.796093022207999E12, noCFSRatio=0.8203341694538797
   [junit4]   2> 1606609 INFO  (coreLoadExecutor-6303-thread-1) [    x:collection1] o.a.s.c.SolrDeletionPolicy SolrDeletionPolicy.onInit: commits: num=1
   [junit4]   2> 	commit{dir=/home/jenkins/workspace/Lucene-Solr-5.5-Linux/solr/build/solr-core/test/J0/temp/solr.core.TestNRTOpen_D54CEA05181C7729-001/init-core-data-001/index,segFN=segments_1,generation=1}
   [junit4]   2> 1606609 INFO  (coreLoadExecutor-6303-thread-1) [    x:collection1] o.a.s.c.SolrDeletionPolicy newest commit generation = 1
   [junit4]   2> 1606610 INFO  (coreLoadExecutor-6303-thread-1) [    x:collection1] o.a.s.s.SolrIndexSearcher Opening Searcher@1abd918[collection1] main
   [junit4]   2> 1606610 WARN  (coreLoadExecutor-6303-thread-1) [    x:collection1] o.a.s.r.ManagedResourceStorage Cannot write to config directory /home/jenkins/workspace/Lucene-Solr-5.5-Linux/solr/core/src/test-files/solr/collection1/conf; switching to use InMemory storage instead.
   [junit4]   2> 1606610 INFO  (coreLoadExecutor-6303-thread-1) [    x:collection1] o.a.s.r.RestManager Initializing RestManager with initArgs: {}
   [junit4]   2> 1606610 INFO  (coreLoadExecutor-6303-thread-1) [    x:collection1] o.a.s.r.ManagedResourceStorage Reading _rest_managed.json using InMemoryStorage
   [junit4]   2> 1606610 INFO  (coreLoadExecutor-6303-thread-1) [    x:collection1] o.a.s.r.RestManager Initializing 0 registered ManagedResources
   [junit4]   2> 1606610 INFO  (coreLoadExecutor-6303-thread-1) [    x:collection1] o.a.s.h.ReplicationHandler Commits will be reserved for  10000
   [junit4]   2> 1606610 INFO  (searcherExecutor-6304-thread-1-processing-x:collection1) [    x:collection1] o.a.s.c.SolrCore [collection1] Registered new searcher Searcher@1abd918[collection1] main{ExitableDirectoryReader(UninvertingDirectoryReader())}
   [junit4]   2> 1606610 INFO  (coreLoadExecutor-6303-thread-1) [    x:collection1] o.a.s.c.CoreContainer registering core: collection1
   [junit4]   2> 1606611 INFO  (SUITE-TestNRTOpen-seed#[D54CEA05181C7729]-worker) [    ] o.a.s.SolrTestCaseJ4 ####initCore end
   [junit4]   2> 1606612 INFO  (SUITE-TestNRTOpen-seed#[D54CEA05181C7729]-worker) [    ] o.a.s.u.p.LogUpdateProcessorFactory [collection1]  webapp=null path=null params={}{add=[(null)]} 0 0
   [junit4]   2> 1606614 INFO  (SUITE-TestNRTOpen-seed#[D54CEA05181C7729]-worker) [    ] o.a.s.u.DirectUpdateHandler2 start commit{,optimize=false,openSearcher=true,waitSearcher=true,expungeDeletes=false,softCommit=false,prepareCommit=false}
   [junit4]   2> 1606905 INFO  (SUITE-TestNRTOpen-seed#[D54CEA05181C7729]-worker) [    ] o.a.s.c.SolrDeletionPolicy SolrDeletionPolicy.onCommit: commits: num=2
   [junit4]   2> 	commit{dir=/home/jenkins/workspace/Lucene-Solr-5.5-Linux/solr/build/solr-core/test/J0/temp/solr.core.TestNRTOpen_D54CEA05181C7729-001/init-core-data-001/index,segFN=segments_1,generation=1}
   [junit4]   2> 	commit{dir=/home/jenkins/workspace/Lucene-Solr-5.5-Linux/solr/build/solr-core/test/J0/temp/solr.core.TestNRTOpen_D54CEA05181C7729-001/init-core-data-001/index,segFN=segments_2,generation=2}
   [junit4]   2> 1606906 INFO  (SUITE-TestNRTOpen-seed#[D54CEA05181C7729]-worker) [    ] o.a.s.c.SolrDeletionPolicy newest commit generation = 2
   [junit4]   2> 1606908 INFO  (SUITE-TestNRTOpen-seed#[D54CEA05181C7729]-worker) [    ] o.a.s.s.SolrIndexSearcher Opening Searcher@183fc46[collection1] main
   [junit4]   2> 1606908 INFO  (SUITE-TestNRTOpen-seed#[D54CEA05181C7729]-worker) [    ] o.a.s.u.DirectUpdateHandler2 end_commit_flush
   [junit4]   2> 1606908 INFO  (searcherExecutor-6304-thread-1) [    ] o.a.s.c.SolrCore [collection1] Registered new searcher Searcher@183fc46[collection1] main{ExitableDirectoryReader(UninvertingDirectoryReader(Uninverting(_0(5.5.0):c1)))}
   [junit4]   2> 1606908 INFO  (SUITE-TestNRTOpen-seed#[D54CEA05181C7729]-worker) [    ] o.a.s.u.p.LogUpdateProcessorFactory [collection1]  webapp=null path=null params={}{commit=} 0 294
   [junit4]   2> 1606909 INFO  (SUITE-TestNRTOpen-seed#[D54CEA05181C7729]-worker) [    ] o.a.s.SolrTestCaseJ4 ###deleteCore
   [junit4]   2> 1606909 INFO  (SUITE-TestNRTOpen-seed#[D54CEA05181C7729]-worker) [    ] o.a.s.c.CoreContainer Shutting down CoreContainer instance=18308103
   [junit4]   2> 1606909 INFO  (coreCloseExecutor-6308-thread-1) [    x:collection1] o.a.s.c.SolrCore [collection1]  CLOSING SolrCore org.apache.solr.core.SolrCore@a4c328
   [junit4]   2> 1606909 INFO  (coreCloseExecutor-6308-thread-1) [    x:collection1] o.a.s.u.DirectUpdateHandler2 closing DirectUpdateHandler2{commits=1,autocommits=0,soft autocommits=0,optimizes=0,rollbacks=0,expungeDeletes=0,docsPending=0,adds=0,deletesById=0,deletesByQuery=0,errors=0,cumulative_adds=1,cumulative_deletesById=0,cumulative_deletesByQuery=0,cumulative_errors=0}
   [junit4]   2> 1606909 INFO  (coreCloseExecutor-6308-thread-1) [    x:collection1] o.a.s.u.SolrCoreState Closing SolrCoreState
   [junit4]   2> 1606909 INFO  (coreCloseExecutor-6308-thread-1) [    x:collection1] o.a.s.u.DefaultSolrCoreState SolrCoreState ref count has reached 0 - closing IndexWriter
   [junit4]   2> 1606909 INFO  (coreCloseExecutor-6308-thread-1) [    x:collection1] o.a.s.u.DefaultSolrCoreState closing IndexWriter with IndexWriterCloser
   [junit4]   2> 1606910 INFO  (coreCloseExecutor-6308-thread-1) [    x:collection1] o.a.s.c.SolrCore [collection1] Closing main searcher on request.
   [junit4]   2> 1606910 INFO  (coreCloseExecutor-6308-thread-1) [    x:collection1] o.a.s.c.CachingDirectoryFactory Closing StandardDirectoryFactory - 2 directories currently being tracked
   [junit4]   2> 1606910 INFO  (coreCloseExecutor-6308-thread-1) [    x:collection1] o.a.s.c.CachingDirectoryFactory looking to close /home/jenkins/workspace/Lucene-Solr-5.5-Linux/solr/build/solr-core/test/J0/temp/solr.core.TestNRTOpen_D54CEA05181C7729-001/init-core-data-001 [CachedDir<<refCount=0;path=/home/jenkins/workspace/Lucene-Solr-5.5-Linux/solr/build/solr-core/test/J0/temp/solr.core.TestNRTOpen_D54CEA05181C7729-001/init-core-data-001;done=false>>]
   [junit4]   2> 1606910 INFO  (coreCloseExecutor-6308-thread-1) [    x:collection1] o.a.s.c.CachingDirectoryFactory Closing directory: /home/jenkins/workspace/Lucene-Solr-5.5-Linux/solr/build/solr-core/test/J0/temp/solr.core.TestNRTOpen_D54CEA05181C7729-001/init-core-data-001
   [junit4]   2> 1606910 INFO  (coreCloseExecutor-6308-thread-1) [    x:collection1] o.a.s.c.CachingDirectoryFactory looking to close /home/jenkins/workspace/Lucene-Solr-5.5-Linux/solr/build/solr-core/test/J0/temp/solr.core.TestNRTOpen_D54CEA05181C7729-001/init-core-data-001/index [CachedDir<<refCount=0;path=/home/jenkins/workspace/Lucene-Solr-5.5-Linux/solr/build/solr-core/test/J0/temp/solr.core.TestNRTOpen_D54CEA05181C7729-001/init-core-data-001/index;done=false>>]
   [junit4]   2> 1606910 INFO  (coreCloseExecutor-6308-thread-1) [    x:collection1] o.a.s.c.CachingDirectoryFactory Closing directory: /home/jenkins/workspace/Lucene-Solr-5.5-Linux/solr/build/solr-core/test/J0/temp/solr.core.TestNRTOpen_D54CEA05181C7729-001/init-core-data-001/index
   [junit4]   2> 1606911 INFO  (SUITE-TestNRTOpen-seed#[D54CEA05181C7729]-worker) [    ] o.a.s.SolrTestCaseJ4 ####initCore
   [junit4]   2> 1606911 INFO  (SUITE-TestNRTOpen-seed#[D54CEA05181C7729]-worker) [    ] o.a.s.c.SolrResourceLoader new SolrResourceLoader for directory: '/home/jenkins/workspace/Lucene-Solr-5.5-Linux/solr/core/src/test-files/solr/collection1'
   [junit4]   2> 1606911 INFO  (SUITE-TestNRTOpen-seed#[D54CEA05181C7729]-worker) [    ] o.a.s.c.SolrResourceLoader JNDI not configured for solr (NoInitialContextEx)
   [junit4]   2> 1606911 INFO  (SUITE-TestNRTOpen-seed#[D54CEA05181C7729]-worker) [    ] o.a.s.c.SolrResourceLoader using system property solr.solr.home: /home/jenkins/workspace/Lucene-Solr-5.5-Linux/solr/core/src/test-files/solr
   [junit4]   2> 1606911 INFO  (SUITE-TestNRTOpen-seed#[D54CEA05181C7729]-worker) [    ] o.a.s.c.SolrResourceLoader Adding 'file:/home/jenkins/workspace/Lucene-Solr-5.5-Linux/solr/core/src/test-files/solr/collection1/lib/classes/' to classloader
   [junit4]   2> 1606911 INFO  (SUITE-TestNRTOpen-seed#[D54CEA05181C7729]-worker) [    ] o.a.s.c.SolrResourceLoader Adding 'file:/home/jenkins/workspace/Lucene-Solr-5.5-Linux/solr/core/src/test-files/solr/collection1/lib/README' to classloader
   [junit4]   2> 1606939 INFO  (SUITE-TestNRTOpen-seed#[D54CEA05181C7729]-worker) [    ] o.a.s.c.SolrConfig current version of requestparams : -1
   [junit4]   2> 1606941 INFO  (SUITE-TestNRTOpen-seed#[D54CEA05181C7729]-worker) [    ] o.a.s.c.SolrConfig Using Lucene MatchVersion: 5.5.0
   [junit4]   2> 1606946 INFO  (SUITE-TestNRTOpen-seed#[D54CEA05181C7729]-worker) [    ] o.a.s.c.SolrConfig Loaded SolrConfig: solrconfig-basic.xml
   [junit4]   2> 1606949 INFO  (SUITE-TestNRTOpen-seed#[D54CEA05181C7729]-worker) [    ] o.a.s.s.IndexSchema [null] Schema name=minimal
   [junit4]   2> 1606950 WARN  (SUITE-TestNRTOpen-seed#[D54CEA05181C7729]-worker) [    ] o.a.s.s.IndexSchema no uniqueKey specified in schema.
   [junit4]   2> 1606951 INFO  (SUITE-TestNRTOpen-seed#[D54CEA05181C7729]-worker) [    ] o.a.s.c.SolrResourceLoader JNDI not configured for solr (NoInitialContextEx)
   [junit4]   2> 1606951 INFO  (SUITE-TestNRTOpen-seed#[D54CEA05181C7729]-worker) [    ] o.a.s.c.SolrResourceLoader using system property solr.solr.home: /home/jenkins/workspace/Lucene-Solr-5.5-Linux/solr/core/src/test-files/solr
   [junit4]   2> 1606951 INFO  (SUITE-TestNRTOpen-seed#[D54CEA05181C7729]-worker) [    ] o.a.s.c.SolrResourceLoader new SolrResourceLoader for directory: '/home/jenkins/workspace/Lucene-Solr-5.5-Linux/solr/core/src/test-files/solr'
   [junit4]   2> 1606951 INFO  (SUITE-TestNRTOpen-seed#[D54CEA05181C7729]-worker) [    ] o.a.s.c.SolrResourceLoader JNDI not configured for solr (NoInitialContextEx)
   [junit4]   2> 1606951 INFO  (SUITE-TestNRTOpen-seed#[D54CEA05181C7729]-worker) [    ] o.a.s.c.SolrResourceLoader using system property solr.solr.home: /home/jenkins/workspace/Lucene-Solr-5.5-Linux/solr/core/src/test-files/solr
   [junit4]   2> 1606951 INFO  (SUITE-TestNRTOpen-seed#[D54CEA05181C7729]-worker) [    ] o.a.s.c.CoreContainer New CoreContainer 23908376
   [junit4]   2> 1606951 INFO  (SUITE-TestNRTOpen-seed#[D54CEA05181C7729]-worker) [    ] o.a.s.c.CoreContainer Loading cores into CoreContainer [instanceDir=/home/jenkins/workspace/Lucene-Solr-5.5-Linux/solr/core/src/test-files/solr]
   [junit4]   2> 1606951 WARN  (SUITE-TestNRTOpen-seed#[D54CEA05181C7729]-worker) [    ] o.a.s.c.CoreContainer Couldn't add files from /home/jenkins/workspace/Lucene-Solr-5.5-Linux/solr/core/src/test-files/solr/lib to classpath: /home/jenkins/workspace/Lucene-Solr-5.5-Linux/solr/core/src/test-files/solr/lib
   [junit4]   2> 1606951 INFO  (SUITE-TestNRTOpen-seed#[D54CEA05181C7729]-worker) [    ] o.a.s.h.c.HttpShardHandlerFactory created with socketTimeout : 600000,connTimeout : 60000,maxConnectionsPerHost : 20,maxConnections : 10000,corePoolSize : 0,maximumPoolSize : 2147483647,maxThreadIdleTime : 5,sizeOfQueue : -1,fairnessPolicy : false,useRetries : false,
   [junit4]   2> 1606952 INFO  (SUITE-TestNRTOpen-seed#[D54CEA05181C7729]-worker) [    ] o.a.s.u.UpdateShardHandler Creating UpdateShardHandler HTTP client with params: socketTimeout=30000&connTimeout=30000&retry=true
   [junit4]   2> 1606952 INFO  (SUITE-TestNRTOpen-seed#[D54CEA05181C7729]-worker) [    ] o.a.s.l.LogWatcher SLF4J impl is org.slf4j.impl.Log4jLoggerFactory
   [junit4]   2> 1606952 INFO  (SUITE-TestNRTOpen-seed#[D54CEA05181C7729]-worker) [    ] o.a.s.l.LogWatcher Registering Log Listener [Log4j (org.slf4j.impl.Log4jLoggerFactory)]
   [junit4]   2> 1606953 INFO  (SUITE-TestNRTOpen-seed#[D54CEA05181C7729]-worker) [    ] o.a.s.c.CoreContainer Security conf doesn't exist. Skipping setup for authorization module.
   [junit4]   2> 1606953 INFO  (SUITE-TestNRTOpen-seed#[D54CEA05181C7729]-worker) [    ] o.a.s.c.CoreContainer No authentication plugin used.
   [junit4]   2> 1606953 INFO  (SUITE-TestNRTOpen-seed#[D54CEA05181C7729]-worker) [    ] o.a.s.c.CoreDescriptor Created CoreDescriptor: {name=collection1, config=solrconfig-basic.xml, transient=false, schema=schema-minimal.xml, loadOnStartup=true, configSetProperties=configsetprops.json, collection=collection1, dataDir=/home/jenkins/workspace/Lucene-Solr-5.5-Linux/solr/build/solr-core/test/J0/temp/solr.core.TestNRTOpen_D54CEA05181C7729-001/init-core-data-001, shard=shard1}
   [junit4]   2> 1606954 INFO  (coreLoadExecutor-6314-thread-1) [    ] o.a.s.c.SolrResourceLoader new SolrResourceLoader for directory: '/home/jenkins/workspace/Lucene-Solr-5.5-Linux/solr/core/src/test-files/solr/collection1'
   [junit4]   2> 1606954 INFO  (coreLoadExecutor-6314-thread-1) [    ] o.a.s.c.SolrResourceLoader JNDI not configured for solr (NoInitialContextEx)
   [junit4]   2> 1606954 INFO  (coreLoadExecutor-6314-thread-1) [    ] o.a.s.c.SolrResourceLoader using system property solr.solr.home: /home/jenkins/workspace/Lucene-Solr-5.5-Linux/solr/core/src/test-files/solr
   [junit4]   2> 1606954 INFO  (coreLoadExecutor-6314-thread-1) [    ] o.a.s.c.SolrResourceLoader Adding 'file:/home/jenkins/workspace/Lucene-Solr-5.5-Linux/solr/core/src/test-files/solr/collection1/lib/classes/' to classloader
   [junit4]   2> 1606955 INFO  (coreLoadExecutor-6314-thread-1) [    ] o.a.s.c.SolrResourceLoader Adding 'file:/home/jenkins/workspace/Lucene-Solr-5.5-Linux/solr/core/src/test-files/solr/collection1/lib/README' to classloader
   [junit4]   2> 1606974 INFO  (coreLoadExecutor-6314-thread-1) [    ] o.a.s.c.SolrConfig current version of requestparams : -1
   [junit4]   2> 1606976 INFO  (coreLoadExecutor-6314-thread-1) [    ] o.a.s.c.SolrConfig Using Lucene MatchVersion: 5.5.0
   [junit4]   2> 1606980 INFO  (coreLoadExecutor-6314-thread-1) [    ] o.a.s.c.SolrConfig Loaded SolrConfig: solrconfig-basic.xml
   [junit4]   2> 1606983 INFO  (coreLoadExecutor-6314-thread-1) [    ] o.a.s.s.IndexSchema [collection1] Schema name=minimal
   [junit4]   2> 1606984 WARN  (coreLoadExecutor-6314-thread-1) [    ] o.a.s.s.IndexSchema no uniqueKey specified in schema.
   [junit4]   2> 1606985 INFO  (coreLoadExecutor-6314-thread-1) [    ] o.a.s.c.ConfigSetProperties Did not find ConfigSet properties, assuming default properties: Can't find resource 'configsetprops.json' in classpath or '/home/jenkins/workspace/Lucene-Solr-5.5-Linux/solr/core/src/test-files/solr/collection1'
   [junit4]   2> 1606985 INFO  (coreLoadExecutor-6314-thread-1) [    ] o.a.s.c.CoreContainer Creating SolrCore 'collection1' using configuration from instancedir /home/jenkins/workspace/Lucene-Solr-5.5-Linux/solr/core/src/test-files/solr/collection1
   [junit4]   2> 1606986 INFO  (coreLoadExecutor-6314-thread-1) [    x:collection1] o.a.s.c.SolrCore solr.StandardDirectoryFactory
   [junit4]   2> 1606986 INFO  (coreLoadExecutor-6314-thread-1) [    x:collection1] o.a.s.c.SolrCore [[collection1] ] Opening new SolrCore at [/home/jenkins/workspace/Lucene-Solr-5.5-Linux/solr/core/src/test-files/solr/collection1], dataDir=[/home/jenkins/workspace/Lucene-Solr-5.5-Linux/solr/build/solr-core/test/J0/temp/solr.core.TestNRTOpen_D54CEA05181C7729-001/init-core-data-001/]
   [junit4]   2> 1606986 INFO  (coreLoadExecutor-6314-thread-1) [    x:collection1] o.a.s.c.SolrCore JMX monitoring not detected for core: collection1
   [junit4]   2> 1606986 INFO  (coreLoadExecutor-6314-thread-1) [    x:collection1] o.a.s.c.CachingDirectoryFactory return new directory for /home/jenkins/workspace/Lucene-Solr-5.5-Linux/solr/build/solr-core/test/J0/temp/solr.core.TestNRTOpen_D54CEA05181C7729-001/init-core-data-001
   [junit4]   2> 1606986 INFO  (coreLoadExecutor-6314-thread-1) [    x:collection1] o.a.s.c.SolrCore New index directory detected: old=null new=/home/jenkins/workspace/Lucene-Solr-5.5-Linux/solr/build/solr-core/test/J0/temp/solr.core.TestNRTOpen_D54CEA05181C7729-001/init-core-data-001/index/
   [junit4]   2> 1606987 INFO  (OldIndexDirectoryCleanupThreadForCore-collection1) [    x:collection1] o.a.s.c.SolrCore Looking for old index directories to cleanup for core collection1 in /home/jenkins/workspace/Lucene-Solr-5.5-Linux/solr/build/solr-core/test/J0/temp/solr.core.TestNRTOpen_D54CEA05181C7729-001/init-core-data-001/
   [junit4]   2> 1606988 INFO  (coreLoadExecutor-6314-thread-1) [    x:collection1] o.a.s.c.SolrCore no updateRequestProcessorChain defined as default, creating implicit default
   [junit4]   2> 1606990 INFO  (coreLoadExecutor-6314-thread-1) [    x:collection1] o.a.s.h.l.XMLLoader xsltCacheLifetimeSeconds=60
   [junit4]   2> 1606991 INFO  (coreLoadExecutor-6314-thread-1) [    x:collection1] o.a.s.h.l.XMLLoader xsltCacheLifetimeSeconds=60
   [junit4]   2> 1606991 INFO  (coreLoadExecutor-6314-thread-1) [    x:collection1] o.a.s.h.l.XMLLoader xsltCacheLifetimeSeconds=60
   [junit4]   2> 1606992 INFO  (coreLoadExecutor-6314-thread-1) [    x:collection1] o.a.s.h.l.XMLLoader xsltCacheLifetimeSeconds=60
   [junit4]   2> 1606993 INFO  (coreLoadExecutor-6314-thread-1) [    x:collection1] o.a.s.c.RequestHandlers Registered paths: /admin/mbeans,standard,/update/csv,/update/json/docs,/admin/luke,/admin/segments,/get,/admin/system,/replication,/admin/properties,/config,/schema,/admin/plugins,/admin/logging,/update/json,/admin/threads,/admin/ping,/update,/admin/file
   [junit4]   2> 1606993 INFO  (coreLoadExecutor-6314-thread-1) [    x:collection1] o.a.s.c.SolrCore Using default statsCache cache: org.apache.solr.search.stats.LocalStatsCache
   [junit4]   2> 1606993 INFO  (coreLoadExecutor-6314-thread-1) [    x:collection1] o.a.s.u.CommitTracker Hard AutoCommit: disabled
   [junit4]   2> 1606994 INFO  (coreLoadExecutor-6314-thread-1) [    x:collection1] o.a.s.u.CommitTracker Soft AutoCommit: disabled
   [junit4]   2> 1606994 INFO  (coreLoadExecutor-6314-thread-1) [    x:collection1] o.a.s.c.CachingDirectoryFactory return new directory for /home/jenkins/workspace/Lucene-Solr-5.5-Linux/solr/build/solr-core/test/J0/temp/solr.core.TestNRTOpen_D54CEA05181C7729-001/init-core-data-001/index
   [junit4]   2> 1606994 INFO  (coreLoadExecutor-6314-thread-1) [    x:collection1] o.a.s.u.RandomMergePolicy RandomMergePolicy wrapping class org.apache.lucene.index.MockRandomMergePolicy: org.apache.lucene.index.MockRandomMergePolicy@22d87c
   [junit4]   2> 1606995 INFO  (coreLoadExecutor-6314-thread-1) [    x:collection1] o.a.s.c.SolrDeletionPolicy SolrDeletionPolicy.onInit: commits: num=1
   [junit4]   2> 	commit{dir=/home/jenkins/workspace/Lucene-Solr-5.5-Linux/solr/build/solr-core/test/J0/temp/solr.core.TestNRTOpen_D54CEA05181C7729-001/init-core-data-001/index,segFN=segments_2,generation=2}
   [junit4]   2> 1606995 INFO  (coreLoadExecutor-6314-thread-1) [    x:collection1] o.a.s.c.SolrDeletionPolicy newest commit generation = 2
   [junit4]   2> 1606996 INFO  (coreLoadExecutor-6314-thread-1) [    x:collection1] o.a.s.s.SolrIndexSearcher Opening Searcher@18d349e[collection1] main
   [junit4]   2> 1606996 WARN  (coreLoadExecutor-6314-thread-1) [    x:collection1] o.a.s.r.ManagedResourceStorage Cannot write to config directory /home/jenkins/workspace/Lucene-Solr-5.5-Linux/solr/core/src/test-files/solr/collection1/conf; switching to use InMemory storage instead.
   [junit4]   2> 1606996 INFO  (coreLoadExecutor-6314-thread-1) [    x:collection1] o.a.s.r.RestManager Initializing RestManager with initArgs: {}
   [junit4]   2> 1606997 INFO  (coreLoadExecutor-6314-thread-1) [    x:collection1] o.a.s.r.ManagedResourceStorage Reading _rest_managed.json using InMemoryStorage
   [junit4]   2> 1606997 INFO  (coreLoadExecutor-6314-thread-1) [    x:collection1] o.a.s.r.RestManager Initializing 0 registered ManagedResources
   [junit4]   2> 1606997 INFO  (coreLoadExecutor-6314-thread-1) [    x:collection1] o.a.s.h.ReplicationHandler Commits will be reserved for  10000
   [junit4]   2> 1606997 INFO  (searcherExecutor-6315-thread-1-processing-x:collection1) [    x:collection1] o.a.s.c.SolrCore [collection1] Registered new searcher Searcher@18d349e[collection1] main{ExitableDirectoryReader(UninvertingDirectoryReader(Uninverting(_0(5.5.0):c1)))}
   [junit4]   2> 1606997 INFO  (coreLoadExecutor-6314-thread-1) [    x:collection1] o.a.s.c.CoreContainer registering core: collection1
   [junit4]   2> 1606998 INFO  (SUITE-TestNRTOpen-seed#[D54CEA05181C7729]-worker) [    ] o.a.s.SolrTestCaseJ4 ####initCore end
   [junit4]   2> 1607000 INFO  (TEST-TestNRTOpen.testSharedCores-seed#[D54CEA05181C7729]) [    ] o.a.s.SolrTestCaseJ4 ###Starting testSharedCores
   [junit4]   2> 1607000 INFO  (TEST-TestNRTOpen.testSharedCores-seed#[D54CEA05181C7729]) [    ] o.a.s.u.DirectUpdateHandler2 [collection1] REMOVING ALL DOCUMENTS FROM INDEX
   [junit4]   2> 1607001 INFO  (TEST-TestNRTOpen.testSharedCores-seed#[D54CEA05181C7729]) [    ] o.a.s.u.p.LogUpdateProcessorFactory [collection1]  webapp=null path=null params={}{deleteByQuery=*:*} 0 0
   [junit4]   2> 1607002 INFO  (TEST-TestNRTOpen.testSharedCores-seed#[D54CEA05181C7729]) [    ] o.a.s.u.p.LogUpdateProcessorFactory [collection1]  webapp=null path=null params={}{add=[(null)]} 0 0
   [junit4]   2> 1607002 INFO  (TEST-TestNRTOpen.testSharedCores-seed#[D54CEA05181C7729]) [    ] o.a.s.u.DirectUpdateHandler2 start commit{,optimize=false,openSearcher=true,waitSearcher=true,expungeDeletes=false,softCommit=false,prepareCommit=false}
   [junit4]   2> 1607276 INFO  (TEST-TestNRTOpen.testSharedCores-seed#[D54CEA05181C7729]) [    ] o.a.s.c.SolrDeletionPolicy SolrDeletionPolicy.onCommit: commits: num=2
   [junit4]   2> 	commit{dir=/home/jenkins/workspace/Lucene-Solr-5.5-Linux/solr/build/solr-core/test/J0/temp/solr.core.TestNRTOpen_D54CEA05181C7729-001/init-core-data-001/index,segFN=segments_2,generation=2}
   [junit4]   2> 	commit{dir=/home/jenkins/workspace/Lucene-Solr-5.5-Linux/solr/build/solr-core/test/J0/temp/solr.core.TestNRTOpen_D54CEA05181C7729-001/init-core-data-001/index,segFN=segments_3,generation=3}
   [junit4]   2> 1607276 INFO  (TEST-TestNRTOpen.testSharedCores-seed#[D54CEA05181C7729]) [    ] o.a.s.c.SolrDeletionPolicy newest commit generation = 3
   [junit4]   2> 1607302 INFO  (TEST-TestNRTOpen.testSharedCores-seed#[D54CEA05181C7729]) [    ] o.a.s.s.SolrIndexSearcher Opening Searcher@1c3dbac[collection1] main
   [junit4]   2> 1607302 INFO  (TEST-TestNRTOpen.testSharedCores-seed#[D54CEA05181C7729]) [    ] o.a.s.u.DirectUpdateHandler2 end_commit_flush
   [junit4]   2> 1607302 INFO  (searcherExecutor-6315-thread-1) [    ] o.a.s.c.SolrCore [collection1] Registered new searcher Searcher@1c3dbac[collection1] main{ExitableDirectoryReader(UninvertingDirectoryReader(Uninverting(_1(5.5.0):c1)))}
   [junit4]   2> 1607303 INFO  (TEST-TestNRTOpen.testSharedCores-seed#[D54CEA05181C7729]) [    ] o.a.s.u.p.LogUpdateProcessorFactory [collection1]  webapp=null path=null params={}{commit=} 0 300
   [junit4]   2> 1607303 INFO  (TEST-TestNRTOpen.testSharedCores-seed#[D54CEA05181C7729]) [    ] o.a.s.u.DirectUpdateHandler2 start commit{,optimize=true,openSearcher=true,waitSearcher=true,expungeDeletes=false,softCommit=false,prepareCommit=false}
   [junit4]   2> 1607303 WARN  (TEST-TestNRTOpen.testSharedCores-seed#[D54CEA05181C7729]) [    ] o.a.s.u.DirectUpdateHandler2 Starting optimize... Reading and rewriting the entire index! Use with care.
   [junit4]   2> 1607304 INFO  (TEST-TestNRTOpen.testSharedCores-seed#[D54CEA05181C7729]) [    ] o.a.s.u.DirectUpdateHandler2 No uncommitted changes. Skipping IW.commit.
   [junit4]   2> 1607304 INFO  (TEST-TestNRTOpen.testSharedCores-seed#[D54CEA05181C7729]) [    ] o.a.s.c.SolrCore SolrIndexSearcher has not changed - not re-opening: org.apache.solr.search.SolrIndexSearcher
   [junit4]   2> 1607304 INFO  (TEST-TestNRTOpen.testSharedCores-seed#[D54CEA05181C7729]) [    ] o.a.s.u.DirectUpdateHandler2 end_commit_flush
   [junit4]   2> 1607304 INFO  (TEST-TestNRTOpen.testSharedCores-seed#[D54CEA05181C7729]) [    ] o.a.s.u.p.LogUpdateProcessorFactory [collection1]  webapp=null path=null params={}{optimize=} 0 0
   [junit4]   2> 1607305 INFO  (TEST-TestNRTOpen.testSharedCores-seed#[D54CEA05181C7729]) [    ] o.a.s.u.p.LogUpdateProcessorFactory [collection1]  webapp=null path=null params={}{add=[(null)]} 0 0
   [junit4]   2> 1607305 INFO  (TEST-TestNRTOpen.testSharedCores-seed#[D54CEA05181C7729]) [    ] o.a.s.u.DirectUpdateHandler2 start commit{,optimize=false,openSearcher=true,waitSearcher=true,expungeDeletes=false,softCommit=true,prepareCommit=false}
   [junit4]   2> 1607350 INFO  (TEST-TestNRTOpen.testSharedCores-seed#[D54CEA05181C7729]) [    ] o.a.s.s.SolrIndexSearcher Opening Searcher@4289d3[collection1] main
   [junit4]   2> 1607350 INFO  (TEST-TestNRTOpen.testSharedCores-seed#[D54CEA05181C7729]) [    ] o.a.s.u.DirectUpdateHandler2 end_commit_flush
   [junit4]   2> 1607350 INFO  (searcherExecutor-6315-thread-1) [    ] o.a.s.c.SolrCore [collection1] Registered new searcher Searcher@4289d3[collection1] main{ExitableDirectoryReader(UninvertingDirectoryReader(Uninverting(_1(5.5.0):c1) Uninverting(_2(5.5.0):c1)))}
   [junit4]   2> 1607350 INFO  (TEST-TestNRTOpen.testSharedCores-seed#[D54CEA05181C7729]) [    ] o.a.s.u.p.LogUpdateProcessorFactory [collection1]  webapp=null path=null params={}{commit=} 0 45
   [junit4]   2> 1607352 INFO  (TEST-TestNRTOpen.testSharedCores-seed#[D54CEA05181C7729]) [    ] o.a.s.u.p.LogUpdateProcessorFactory [collection1]  webapp=null path=null params={}{add=[(null)]} 0 0
   [junit4]   2> 1607352 INFO  (TEST-TestNRTOpen.testSharedCores-seed#[D54CEA05181C7729]) [    ] o.a.s.u.p.LogUpdateProcessorFactory [collection1]  webapp=null path=null params={}{add=[(null)]} 0 0
   [junit4]   2> 1607353 INFO  (TEST-TestNRTOpen.testSharedCores-seed#[D54CEA05181C7729]) [    ] o.a.s.u.DirectUpdateHandler2 start commit{,optimize=false,openSearcher=true,waitSearcher=true,expungeDeletes=false,softCommit=false,prepareCommit=false}
   [junit4]   2> 1607591 INFO  (TEST-TestNRTOpen.testSharedCores-seed#[D54CEA05181C7729]) [    ] o.a.s.c.SolrDeletionPolicy SolrDeletionPolicy.onCommit: commits: num=2
   [junit4]   2> 	commit{dir=/home/jenkins/workspace/Lucene-Solr-5.5-Linux/solr/build/solr-core/test/J0/temp/solr.core.TestNRTOpen_D54CEA05181C7729-001/init-core-data-001/index,segFN=segments_3,generation=3}
   [junit4]   2> 	commit{dir=/home/jenkins/workspace/Lucene-Solr-5.5-Linux/solr/build/solr-core/test/J0/temp/solr.core.TestNRTOpen_D54CEA05181C7729-001/init-core-data-001/index,segFN=segments_4,generation=4}
   [junit4]   2> 1607591 INFO  (TEST-TestNRTOpen.testSharedCores-seed#[D54CEA05181C7729]) [    ] o.a.s.c.SolrDeletionPolicy newest commit generation = 4
   [junit4]   2> 1607595 INFO  (TEST-TestNRTOpen.testSharedCores-seed#[D54CEA05181C7729]) [    ] o.a.s.s.SolrIndexSearcher Opening Searcher@414251[collection1] main
   [junit4]   2> 1607595 INFO  (TEST-TestNRTOpen.testSharedCores-seed#[D54CEA05181C7729]) [    ] o.a.s.u.DirectUpdateHandler2 end_commit_flush
   [junit4]   2> 1607595 INFO  (searcherExecutor-6315-thread-1) [    ] o.a.s.c.SolrCore [collection1] Registered new searcher Searcher@414251[collection1] main{ExitableDirectoryReader(UninvertingDirectoryReader(Uninverting(_4(5.5.0):c2) Uninverting(_5(5.5.0):c2)))}
   [junit4]   2> 1607595 INFO  (TEST-TestNRTOpen.testSharedCores-seed#[D54CEA05181C7729]) [    ] o.a.s.u.p.LogUpdateProcessorFactory [collection1]  webapp=null path=null params={}{commit=} 0 242
   [junit4]   2> 1607596 INFO  (TEST-TestNRTOpen.testSharedCores-seed#[D54CEA05181C7729]) [    ] o.a.s.SolrTestCaseJ4 ###Ending testSharedCores
   [junit4]   2> NOTE: reproduce with: ant test  -Dtestcase=TestNRTOpen -Dtests.method=testSharedCores -Dtests.seed=D54CEA05181C7729 -Dtests.multiplier=3 -Dtests.slow=true -Dtests.locale=es-PA -Dtests.timezone=Africa/Cairo -Dtests.asserts=true -Dtests.file.encoding=UTF-8
   [junit4] FAILURE 0.60s J0 | TestNRTOpen.testSharedCores <<<
   [junit4]    > Throwable #1: java.lang.AssertionError: expected:<3> but was:<2>
   [junit4]    > 	at __randomizedtesting.SeedInfo.seed([D54CEA05181C7729:334FA04A90EA5A26]:0)
   [junit4]    > 	at org.apache.solr.core.TestNRTOpen.testSharedCores(TestNRTOpen.java:116)
   [junit4]    > 	at java.lang.Thread.run(Thread.java:745)
   [junit4]   2> 1607600 INFO  (TEST-TestNRTOpen.testReaderIsNRT-seed#[D54CEA05181C7729]) [    ] o.a.s.SolrTestCaseJ4 ###Starting testReaderIsNRT
   [junit4]   2> 1607600 INFO  (TEST-TestNRTOpen.testReaderIsNRT-seed#[D54CEA05181C7729]) [    ] o.a.s.u.DirectUpdateHandler2 [collection1] REMOVING ALL DOCUMENTS FROM INDEX
   [junit4]   2> 1607601 INFO  (TEST-TestNRTOpen.testReaderIsNRT-seed#[D54CEA05181C7729]) [    ] o.a.s.u.p.LogUpdateProcessorFactory [collection1]  webapp=null path=null params={}{deleteByQuery=*:*} 0 0
   [junit4]   2> 1607602 INFO  (TEST-TestNRTOpen.testReaderIsNRT-seed#[D54CEA05181C7729]) [    ] o.a.s.u.p.LogUpdateProcessorFactory [collection1]  webapp=null path=null params={}{add=[(null)]} 0 0
   [junit4]   2> 1607602 INFO  (TEST-TestNRTOpen.testReaderIsNRT-seed#[D54CEA05181C7729]) [    ] o.a.s.u.DirectUpdateHandler2 start commit{,optimize=false,openSearcher=true,waitSearcher=true,expungeDeletes=false,softCommit=false,prepareCommit=false}
   [junit4]   2> 1607763 INFO  (TEST-TestNRTOpen.testReaderIsNRT-seed#[D54CEA05181C7729]) [    ] o.a.s.c.SolrDeletionPolicy SolrDeletionPolicy.onCommit: commits: num=2
   [junit4]   2> 	commit{dir=/home/jenkins/workspace/Lucene-Solr-5.5-Linux/solr/build/solr-core/test/J0/temp/solr.core.TestNRTOpen_D54CEA05181C7729-001/init-core-data-001/index,segFN=segments_4,generation=4}
   [junit4]   2> 	commit{dir=/home/jenkins/workspace/Lucene-Solr-5.5-Linux/solr/build/solr-core/test/J0/temp/solr.core.TestNRTOpen_D54CEA05181C7729-001/init-core-data-001/index,segFN=segments_5,generation=5}
   [junit4]   2> 1607763 INFO  (TEST-TestNRTOpen.testReaderIsNRT-seed#[D54CEA05181C7729]) [    ] o.a.s.c.SolrDeletionPolicy newest commit generation = 5
   [junit4]   2> 1607764 INFO  (TEST-TestNRTOpen.testReaderIsNRT-seed#[D54CEA05181C7729]) [    ] o.a.s.s.SolrIndexSearcher Opening Searcher@1596e3[collection1] main
   [junit4]   2> 1607764 INFO  (TEST-TestNRTOpen.testReaderIsNRT-seed#[D54CEA05181C7729]) [    ] o.a.s.u.DirectUpdateHandler2 end_commit_flush
   [junit4]   2> 1607764 INFO  (searcherExecutor-6315-thread-1) [    ] o.a.s.c.SolrCore [collection1] Registered new searcher Searcher@1596e3[collection1] main{ExitableDirectoryReader(UninvertingDirectoryReader(Uninverting(_6(5.5.0):c1)))}
   [junit4]   2> 1607765 INFO  (TEST-TestNRTOpen.testReaderIsNRT-seed#[D54CEA05181C7729]) [    ] o.a.s.u.p.LogUpdateProcessorFactory [collection1]  webapp=null path=null params={}{commit=} 0 162
   [junit4]   2> 1607766 INFO  (TEST-TestNRTOpen.testReaderIsNRT-seed#[D54CEA05181C7729]) [    ] o.a.s.c.SolrResourceLoader new SolrResourceLoader for directory: '/home/jenkins/workspace/Lucene-Solr-5.5-Linux/solr/core/src/test-files/solr/collection1'
   [junit4]   2> 1607766 INFO  (TEST-TestNRTOpen.testReaderIsNRT-seed#[D54CEA05181C7729]) [    ] o.a.s.c.SolrResourceLoader JNDI not configured for solr (NoInitialContextEx)
   [junit4]   2> 1607766 INFO  (TEST-TestNRTOpen.testReaderIsNRT-seed#[D54CEA05181C7729]) [    ] o.a.s.c.SolrResourceLoader using system property solr.solr.home: /home/jenkins/workspace/Lucene-Solr-5.5-Linux/solr/core/src/test-files/solr
   [junit4]   2> 1607766 INFO  (TEST-TestNRTOpen.testReaderIsNRT-seed#[D54CEA05181C7729]) [    ] o.a.s.c.SolrResourceLoader Adding 'file:/home/jenkins/workspace/Lucene-Solr-5.5-Linux/solr/core/src/test-files/solr/collection1/lib/classes/' to classloader
   [junit4]   2> 1607766 INFO  (TEST-TestNRTOpen.testReaderIsNRT-seed#[D54CEA05181C7729]) [    ] o.a.s.c.SolrResourceLoader Adding 'file:/home/jenkins/workspace/Lucene-Solr-5.5-Linux/solr/core/src/test-files/solr/collection1/lib/README' to classloader
   [junit4]   2> 1607791 INFO  (TEST-TestNRTOpen.testReaderIsNRT-seed#[D54CEA05181C7729]) [    ] o.a.s.c.SolrConfig current version of requestparams : -1
   [junit4]   2> 1607793 INFO  (TEST-TestNRTOpen.testReaderIsNRT-seed#[D54CEA05181C7729]) [    ] o.a.s.c.SolrConfig Using Lucene MatchVersion: 5.5.0
   [junit4]   2> 1607797 INFO  (TEST-TestNRTOpen.testReaderIsNRT-seed#[D54CEA05181C7729]) [    ] o.a.s.c.SolrConfig Loaded SolrConfig: solrconfig-basic.xml
   [junit4]   2> 1607800 INFO  (TEST-TestNRTOpen.testReaderIsNRT-seed#[D54CEA05181C7729]) [    ] o.a.s.s.IndexSchema [collection1] Schema name=minimal
   [junit4]   2> 1607802 WARN  (TEST-TestNRTOpen.testReaderIsNRT-seed#[D54CEA05181C7729]) [    ] o.a.s.s.IndexSchema no uniqueKey specified in schema.
   [junit4]   2> 1607803 INFO  (TEST-TestNRTOpen.testReaderIsNRT-seed#[D54CEA05181C7729]) [    ] o.a.s.c.ConfigSetProperties Did not find ConfigSet properties, assuming default properties: Can't find resource 'configsetprops.json' in classpath or '/home/jenkins/workspace/Lucene-Solr-5.5-Linux/solr/core/src/test-files/solr/collection1'
   [junit4]   2> 1607803 INFO  (TEST-TestNRTOpen.testReaderIsNRT-seed#[D54CEA05181C7729]) [    ] o.a.s.c.CoreContainer Reloading SolrCore 'collection1' using configuration from instancedir /home/jenkins/workspace/Lucene-Solr-5.5-Linux/solr/core/src/test-files/solr/collection1
   [junit4]   2> 1607804 INFO  (TEST-TestNRTOpen.testReaderIsNRT-seed#[D54CEA05181C7729]) [    x:collection1] o.a.s.c.SolrCore [[collection1] ] Opening new SolrCore at [/home/jenkins/workspace/Lucene-Solr-5.5-Linux/solr/core/src/test-files/solr/collection1], dataDir=[/home/jenkins/workspace/Lucene-Solr-5.5-Linux/solr/build/solr-core/test/J0/temp/solr.core.TestNRTOpen_D54CEA05181C7729-001/init-core-data-001/]
   [junit4]   2> 1607804 INFO  (TEST-TestNRTOpen.testReaderIsNRT-seed#[D54CEA05181C7729]) [    x:collection1] o.a.s.c.SolrCore JMX monitoring not detected for core: collection1
   [junit4]   2> 1607804 INFO  (TEST-TestNRTOpen.testReaderIsNRT-seed#[D54CEA05181C7729]) [    x:collection1] o.a.s.c.SolrCore New index directory detected: old=null new=/home/jenkins/workspace/Lucene-Solr-5.5-Linux/solr/build/solr-core/test/J0/temp/solr.core.TestNRTOpen_D54CEA05181C7729-001/init-core-data-001/index/
   [junit4]   2> 1607804 INFO  (OldIndexDirectoryCleanupThreadForCore-collection1) [    x:collection1] o.a.s.c.SolrCore Looking for old index directories to cleanup for core collection1 in /home/jenkins/workspace/Lucene-Solr-5.5-Linux/solr/build/solr-core/test/J0/temp/solr.core.TestNRTOpen_D54CEA05181C7729-001/init-core-data-001/
   [junit4]   2> 1607806 INFO  (TEST-TestNRTOpen.testReaderIsNRT-seed#[D54CEA05181C7729]) [    x:collection1] o.a.s.c.SolrCore no updateRequestProcessorChain defined as default, creating implicit default
   [junit4]   2> 1607807 INFO  (TEST-TestNRTOpen.testReaderIsNRT-seed#[D54CEA05181C7729]) [    x:collection1] o.a.s.h.l.XMLLoader xsltCacheLifetimeSeconds=60
   [junit4]   2> 1607808 INFO  (TEST-TestNRTOpen.testReaderIsNRT-seed#[D54CEA05181C7729]) [    x:collection1] o.a.s.h.l.XMLLoader xsltCacheLifetimeSeconds=60
   [junit4]   2> 1607809 INFO  (TEST-TestNRTOpen.testReaderIsNRT-seed#[D54CEA05181C7729]) [    x:collection1] o.a.s.h.l.XMLLoader xsltCacheLifetimeSeconds=60
   [junit4]   2> 1607810 INFO  (TEST-TestNRTOpen.testReaderIsNRT-seed#[D54CEA05181C7729]) [    x:collection1] o.a.s.h.l.XMLLoader xsltCacheLifetimeSeconds=60
   [junit4]   2> 1607811 INFO  (TEST-TestNRTOpen.testReaderIsNRT-seed#[D54CEA05181C7729]) [    x:collection1] o.a.s.c.RequestHandlers Registered paths: /admin/mbeans,standard,/update/csv,/update/json/docs,/admin/luke,/admin/segments,/get,/admin/system,/replication,/admin/properties,/config,/schema,/admin/plugins,/admin/logging,/update/json,/admin/threads,/admin/ping,/update,/admin/file
   [junit4]   2> 1607811 INFO  (TEST-TestNRTOpen.testReaderIsNRT-seed#[D54CEA05181C7729]) [    x:collection1] o.a.s.c.SolrCore Using default statsCache cache: org.apache.solr.search.stats.LocalStatsCache
   [junit4]   2> 1607811 INFO  (TEST-TestNRTOpen.testReaderIsNRT-seed#[D54CEA05181C7729]) [    x:collection1] o.a.s.u.CommitTracker Hard AutoCommit: disabled
   [junit4]   2> 1607811 INFO  (TEST-TestNRTOpen.testReaderIsNRT-seed#[D54CEA05181C7729]) [    x:collection1] o.a.s.u.CommitTracker Soft AutoCommit: disabled
   [junit4]   2> 1607812 INFO  (TEST-TestNRTOpen.testReaderIsNRT-seed#[D54CEA05181C7729]) [    x:collection1] o.a.s.s.SolrIndexSearcher Opening Searcher@1635822[collection1] main
   [junit4]   2> 1607812 WARN  (TEST-TestNRTOpen.testReaderIsNRT-seed#[D54CEA05181C7729]) [    x:collection1] o.a.s.r.ManagedResourceStorage Cannot write to config directory /home/jenkins/workspace/Lucene-Solr-5.5-Linux/solr/core/src/test-files/solr/collection1/conf; switching to use InMemory storage instead.
   [junit4]   2> 1607812 INFO  (TEST-TestNRTOpen.testReaderIsNRT-seed#[D54CEA05181C7729]) [    x:collection1] o.a.s.r.RestManager Initializing RestManager with initArgs: {}
   [junit4]   2> 1607812 INFO  (TEST-TestNRTOpen.testReaderIsNRT-seed#[D54CEA05181C7729]) [    x:collection1] o.a.s.r.ManagedResourceStorage Reading _rest_managed.json using InMemoryStorage
   [junit4]   2> 1607812 INFO  (TEST-TestNRTOpen.testReaderIsNRT-seed#[D54CEA05181C7729]) [    x:collection1] o.a.s.r.RestManager Initializing 0 registered ManagedResources
   [junit4]   2> 1607812 INFO  (TEST-TestNRTOpen.testReaderIsNRT-seed#[D54CEA05181C7729]) [    x:collection1] o.a.s.h.ReplicationHandler Commits will be reserved for  10000
   [junit4]   2> 1607813 INFO  (searcherExecutor-6319-thread-1-processing-x:collection1) [    x:collection1] o.a.s.c.SolrCore [collection1] Registered new searcher Searcher@1635822[collection1] main{ExitableDirectoryReader(UninvertingDirectoryReader(Uninverting(_6(5.5.0):c1)))}
   [junit4]   2> 1607813 INFO  (TEST-TestNRTOpen.testReaderIsNRT-seed#[D54CEA05181C7729]) [    x:collection1] o.a.s.u.DefaultSolrCoreState Closing old IndexWriter... core=collection1
   [junit4]   2> 1607813 INFO  (TEST-TestNRTOpen.testReaderIsNRT-seed#[D54CEA05181C7729]) [    x:collection1] o.a.s.u.RandomMergePolicy RandomMergePolicy wrapping class org.apache.lucene.index.AlcoholicMergePolicy: [AlcoholicMergePolicy: minMergeSize=0, mergeFactor=10, maxMergeSize=1868359524, maxMergeSizeForForcedMerge=9223372036854775807, calibrateSizeByDeletes=true, maxMergeDocs=2147483647, maxCFSSegmentSizeMB=8.796093022207999E12, noCFSRatio=0.1]
   [junit4]   2> 1607814 INFO  (TEST-TestNRTOpen.testReaderIsNRT-seed#[D54CEA05181C7729]) [    x:collection1] o.a.s.c.SolrDeletionPolicy SolrDeletionPolicy.onInit: commits: num=1
   [junit4]   2> 	commit{dir=/home/jenkins/workspace/Lucene-Solr-5.5-Linux/solr/build/solr-core/test/J0/temp/solr.core.TestNRTOpen_D54CEA05181C7729-001/init-core-data-001/index,segFN=segments_5,generation=5}
   [junit4]   2> 1607815 INFO  (TEST-TestNRTOpen.testReaderIsNRT-seed#[D54CEA05181C7729]) [    x:collection1] o.a.s.c.SolrDeletionPolicy newest commit generation = 5
   [junit4]   2> 1607815 INFO  (TEST-TestNRTOpen.testReaderIsNRT-seed#[D54CEA05181C7729]) [    x:collection1] o.a.s.u.DefaultSolrCoreState New IndexWriter is ready to be used.
   [junit4]   2> 1607816 INFO  (TEST-TestNRTOpen.testReaderIsNRT-seed#[D54CEA05181C7729]) [    x:collection1] o.a.s.s.SolrIndexSearcher Opening Searcher@17191ce[collection1] main
   [junit4]   2> 1607816 INFO  (TEST-TestNRTOpen.testReaderIsNRT-seed#[D54CEA05181C7729]) [    x:collection1] o.a.s.c.CoreContainer replacing core: collection1
   [junit4]   2> 1607816 INFO  (TEST-TestNRTOpen.testReaderIsNRT-seed#[D54CEA05181C7729]) [    x:collection1] o.a.s.c.SolrCore [collection1]  CLOSING SolrCore org.apache.solr.core.SolrCore@dc7cf3
   [junit4]   2> 1607816 INFO  (searcherExecutor-6319-thread-1-processing-x:collection1) [    x:collection1] o.a.s.c.SolrCore [collection1] Registered new searcher Searcher@17191ce[collection1] main{ExitableDirectoryReader(UninvertingDirectoryReader(Uninverting(_6(5.5.0):c1)))}
   [junit4]   2> 1607816 INFO  (TEST-TestNRTOpen.testReaderIsNRT-seed#[D54CEA05181C7729]) [    x:collection1] o.a.s.u.DirectUpdateHandler2 closing DirectUpdateHandler2{commits=4,autocommits=0,soft autocommits=0,optimizes=1,rollbacks=0,expungeDeletes=0,docsPending=0,adds=0,deletesById=0,deletesByQuery=0,errors=0,cumulative_adds=5,cumulative_deletesById=0,cumulative_deletesByQuery=2,cumulative_errors=0}
   [junit4]   2> 1607816 INFO  (TEST-TestNRTOpen.testReaderIsNRT-seed#[D54CEA05181C7729]) [    x:collection1] o.a.s.c.SolrCore [collection1] Closing main searcher on request.
   [junit4]   2> 1607817 INFO  (TEST-TestNRTOpen.testReaderIsNRT-seed#[D54CEA05181C7729]) [    x:collection1] o.a.s.u.p.LogUpdateProcessorFactory [collection1]  webapp=null path=null params={}{add=[(null)]} 0 0
   [junit4]   2> 1607818 INFO  (TEST-TestNRTOpen.testReaderIsNRT-seed#[D54CEA05181C7729]) [    x:collection1] o.a.s.u.DirectUpdateHandler2 start commit{,optimize=false,openSearcher=true,waitSearcher=true,expungeDeletes=false,softCommit=true,prepareCommit=false}
   [junit4]   2> 1607822 INFO  (TEST-TestNRTOpen.testReaderIsNRT-seed#[D54CEA05181C7729]) [    x:collection1] o.a.s.s.SolrIndexSearcher Opening Searcher@13d2c3a[collection1] main
   [junit4]   2> 1607822 INFO  (TEST-TestNRTOpen.testReaderIsNRT-seed#[D54CEA05181C7729]) [    x:collection1] o.a.s.u.DirectUpdateHandler2 end_commit_flush
   [junit4]   2> 1607822 INFO  (searcherExecutor-6319-thread-1-processing-x:collection1) [    x:collection1] o.a.s.c.SolrCore [collection1] Registered new searcher Searcher@13d2c3a[collection1] main{ExitableDirectoryReader(UninvertingDirectoryReader(Uninverting(_6(5.5.0):c1) Uninverting(_7(5.5.0):c1)))}
   [junit4]   2> 1607822 INFO  (TEST-TestNRTOpen.testReaderIsNRT-seed#[D54CEA05181C7729]) [    x:collection1] o.a.s.u.p.LogUpdateProcessorFactory [collection1]  webapp=null path=null params={}{commit=} 0 4
   [junit4]   2> 1607823 INFO  (TEST-TestNRTOpen.testReaderIsNRT-seed#[D54CEA05181C7729]) [    x:collection1] o.a.s.u.p.LogUpdateProcessorFactory [collection1]  webapp=null path=null params={}{add=[(null)]} 0 0
   [junit4]   2> 1607823 INFO  (TEST-TestNRTOpen.testReaderIsNRT-seed#[D54CEA05181C7729]) [    x:collection1] o.a.s.u.DirectUpdateHandler2 start commit{,optimize=false,openSearcher=true,waitSearcher=true,expungeDeletes=false,softCommit=false,prepareCommit=false}
   [junit4]   2> 1608087 INFO  (TEST-TestNRTOpen.testReaderIsNRT-seed#[D54CEA05181C7729]) [    x:collection1] o.a.s.c.SolrDeletionPolicy SolrDeletionPolicy.onCommit: commits: num=2
   [junit4]   2> 	commit{dir=/home/jenkins/workspace/Lucene-Solr-5.5-Linux/solr/build/solr-core/test/J0/temp/solr.core.TestNRTOpen_D54CEA05181C7729-001/init-core-data-001/index,segFN=segments_5,generation=5}
   [junit4]   2> 	commit{dir=/home/jenkins/workspace/Lucene-Solr-5.5-Linux/solr/build/solr-core/test/J0/temp/solr.core.TestNRTOpen_D54CEA05181C7729-001/init-core-data-001/index,segFN=segments_6,generation=6}
   [junit4]   2> 1608087 INFO  (TEST-TestNRTOpen.testReaderIsNRT-seed#[D54CEA05181C7729]) [    x:collection1] o.a.s.c.SolrDeletionPolicy newest commit generation = 6
   [junit4]   2> 1608088 INFO  (TEST-TestNRTOpen.testReaderIsNRT-seed#[D54CEA05181C7729]) [    x:collection1] o.a.s.s.SolrIndexSearcher Opening Searcher@1ec3ace[collection1] main
   [junit4]   2> 1608089 INFO  (TEST-TestNRTOpen.testReaderIsNRT-seed#[D54CEA05181C7729]) [    x:collection1] o.a.s.u.DirectUpdateHandler2 end_commit_flush
   [junit4]   2> 1608089 INFO  (searcherExecutor-6319-thread-1-processing-x:collection1) [    x:collection1] o.a.s.c.SolrCore [collection1] Registered new searcher Searcher@1ec3ace[collection1] main{ExitableDirectoryReader(UninvertingDirectoryReader(Uninverting(_6(5.5.0):c1) Uninverting(_7(5.5.0):c1) Uninverting(_8(5.5.0):c1)))}
   [junit4]   2> 1608089 INFO  (TEST-TestNRTOpen.testReaderIsNRT-seed#[D54CEA05181C7729]) [    x:collection1] o.a.s.u.p.LogUpdateProcessorFactory [collection1]  webapp=null path=null params={}{commit=} 0 265
   [junit4]   2> 1608090 INFO  (TEST-TestNRTOpen.testReaderIsNRT-seed#[D54CEA05181C7729]) [    x:collection1] o.a.s.u.p.LogUpdateProcessorFactory [collection1]  webapp=null path=null params={}{add=[(null)]} 0 0
   [junit4]   2> 1608091 INFO  (TEST-TestNRTOpen.testReaderIsNRT-seed#[D54CEA05181C7729]) [    x:collection1] o.a.s.c.SolrResourceLoader new SolrResourceLoader for directory: '/home/jenkins/workspace/Lucene-Solr-5.5-Linux/solr/core/src/test-files/solr/collection1'
   [junit4]   2> 1608091 INFO  (TEST-TestNRTOpen.testReaderIsNRT-seed#[D54CEA05181C7729]) [    x:collection1] o.a.s.c.SolrResourceLoader JNDI not configured for solr (NoInitialContextEx)
   [junit4]   2> 1608091 INFO  (TEST-TestNRTOpen.testReaderIsNRT-seed#[D54CEA05181C7729]) [    x:collection1] o.a.s.c.SolrResourceLoader using system property solr.solr.home: /home/jenkins/workspace/Lucene-Solr-5.5-Linux/solr/core/src/test-files/solr
   [junit4]   2> 1608091 INFO  (TEST-TestNRTOpen.testReaderIsNRT-seed#[D54CEA05181C7729]) [    x:collection1] o.a.s.c.SolrResourceLoader Adding 'file:/home/jenkins/workspace/Lucene-Solr-5.5-Linux/solr/core/src/test-files/solr/collection1/lib/classes/' to classloader
   [junit4]   2> 1608091 INFO  (TEST-TestNRTOpen.testReaderIsNRT-seed#[D54CEA05181C7729]) [    x:collection1] o.a.s.c.SolrResourceLoader Adding 'file:/home/jenkins/workspace/Lucene-Solr-5.5-Linux/solr/core/src/test-files/solr/collection1/lib/README' to classloader
   [junit4]   2> 1608113 INFO  (TEST-TestNRTOpen.testReaderIsNRT-seed#[D54CEA05181C7729]) [    x:collection1] o.a.s.c.SolrConfig current version of requestparams : -1
   [junit4]   2> 1608120 INFO  (TEST-TestNRTOpen.testReaderIsNRT-seed#[D54CEA05181C7729]) [    x:collection1] o.a.s.c.SolrConfig Using Lucene MatchVersion: 5.5.0
   [junit4]   2> 1608124 INFO  (TEST-TestNRTOpen.testReaderIsNRT-seed#[D54CEA05181C7729]) [    x:collection1] o.a.s.c.SolrConfig Loaded SolrConfig: solrconfig-basic.xml
   [junit4]   2> 1608127 INFO  (TEST-TestNRTOpen.testReaderIsNRT-seed#[D54CEA05181C7729]) [    x:collection1] o.a.s.s.IndexSchema [collection1] Schema name=minimal
   [junit4]   2> 1608128 WARN  (TEST-TestNRTOpen.testReaderIsNRT-seed#[D54CEA05181C7729]) [    x:collection1] o.a.s.s.IndexSchema no uniqueKey specified in schema.
   [junit4]   2> 1608130 INFO  (TEST-TestNRTOpen.testReaderIsNRT-seed#[D54CEA05181C7729]) [    x:collection1] o.a.s.c.ConfigSetProperties Did not find ConfigSet properties, assuming default properties: Can't find resource 'configsetprops.json' in classpath or '/home/jenkins/workspace/Lucene-Solr-5.5-Linux/solr/core/src/test-files/solr/collection1'
   [junit4]   2> 1608130 INFO  (TEST-TestNRTOpen.testReaderIsNRT-seed#[D54CEA05181C7729]) [    x:collection1] o.a.s.c.CoreContainer Reloading SolrCore 'collection1' using configuration from instancedir /home/jenkins/workspace/Lucene-Solr-5.5-Linux/solr/core/src/test-files/solr/collection1
   [junit4]   2> 1608131 INFO  (TEST-TestNRTOpen.testReaderIsNRT-seed#[D54CEA05181C7729]) [    x:collection1] o.a.s.c.SolrCore [[collection1] ] Opening new SolrCore at [/home/jenkins/workspace/Lucene-Solr-5.5-Linux/solr/core/src/test-files/solr/collection1], dataDir=[/home/jenkins/workspace/Lucene-Solr-5.5-Linux/solr/build/solr-core/test/J0/temp/solr.core.TestNRTOpen_D54CEA05181C7729-001/init-core-data-001/]
   [junit4]   2> 1608131 INFO  (TEST-TestNRTOpen.testReaderIsNRT-seed#[D54CEA05181C7729]) [    x:collection1] o.a.s.c.SolrCore JMX monitoring not detected for core: collection1
   [junit4]   2> 1608131 INFO  (TEST-TestNRTOpen.testReaderIsNRT-seed#[D54CEA05181C7729]) [    x:collection1] o.a.s.c.SolrCore New index directory detected: old=null new=/home/jenkins/workspace/Lucene-Solr-5.5-Linux/solr/build/solr-core/test/J0/temp/solr.core.TestNRTOpen_D54CEA05181C7729-001/init-core-data-001/index/
   [junit4]   2> 1608131 INFO  (OldIndexDirectoryCleanupThreadForCore-collection1) [    x:collection1] o.a.s.c.SolrCore Looking for old index directories to cleanup for core collection1 in /home/jenkins/workspace/Lucene-Solr-5.5-Linux/solr/build/solr-core/test/J0/temp/solr.core.TestNRTOpen_D54CEA05181C7729-001/init-core-data-001/
   [junit4]   2> 1608133 INFO  (TEST-TestNRTOpen.testReaderIsNRT-seed#[D54CEA05181C7729]) [    x:collection1] o.a.s.c.SolrCore no updateRequestProcessorChain defined as default, creating implicit default
   [junit4]   2> 1608135 INFO  (TEST-TestNRTOpen.testReaderIsNRT-seed#[D54CEA05181C7729]) [    x:collection1] o.a.s.h.l.XMLLoader xsltCacheLifetimeSeconds=60
   [junit4]   2> 1608136 INFO  (TEST-TestNRTOpen.testReaderIsNRT-seed#[D54CEA05181C7729]) [    x:collection1] o.a.s.h.l.XMLLoader xsltCacheLifetimeSeconds=60
   [junit4]   2> 1608137 INFO  (TEST-TestNRTOpen.testReaderIsNRT-seed#[D54CEA05181C7729]) [    x:collection1] o.a.s.h.l.XMLLoader xsltCacheLifetimeSeconds=60
   [junit4]   2> 1608138 INFO  (TEST-TestNRTOpen.testReaderIsNRT-seed#[D54CEA05181C7729]) [    x:collection1] o.a.s.h.l.XMLLoader xsltCacheLifetimeSeconds=60
   [junit4]   2> 1608139 INFO  (TEST-TestNRTOpen.testReaderIsNRT-seed#[D54CEA05181C7729]) [    x:collection1] o.a.s.c.RequestHandlers Registered paths: /admin/mbeans,standard,/update/csv,/update/json/docs,/admin/luke,/admin/segments,/get,/admin/system,/replication,/admin/properties,/config,/schema,/admin/plugins,/admin/logging,/update/json,/admin/threads,/admin/ping,/update,/admin/file
   [junit4]   2> 1608139 INFO  (TEST-TestNRTOpen.testReaderIsNRT-seed#[D54CEA05181C7729]) [    x:collection1] o.a.s.c.SolrCore Using default statsCache cache: org.apache.solr.search.stats.LocalStatsCache
   [junit4]   2> 1608140 INFO  (TEST-TestNRTOpen.testReaderIsNRT-seed#[D54CEA05181C7729]) [    x:collection1] o.a.s.u.CommitTracker Hard AutoCommit: disabled
   [junit4]   2> 1608140 INFO  (TEST-TestNRTOpen.testReaderIsNRT-seed#[D54CEA05181C7729]) [    x:collection1] o.a.s.u.CommitTracker Soft AutoCommit: disabled
   [junit4]   2> 1608143 INFO  (TEST-TestNRTOpen.testReaderIsNRT-seed#[D54CEA05181C7729]) [    x:collection1] o.a.s.s.SolrIndexSearcher Opening Searcher@846981[collection1] main
   [junit4]   2> 1608144 WARN  (TEST-TestNRTOpen.testReaderIsNRT-seed#[D54CEA05181C7729]) [    x:collection1] o.a.s.r.ManagedResourceStorage Cannot write to config directory /home/jenkins/workspace/Lucene-Solr-5.5-Linux/solr/core/src/test-files/solr/collection1/conf; switching to use InMemory storage instead.
   [junit4]   2> 1608144 INFO  (TEST-TestNRTOpen.testReaderIsNRT-seed#[D54CEA05181C7729]) [    x:collection1] o.a.s.r.RestManager Initializing RestManager with initArgs: {}
   [junit4]   2> 1608144 INFO  (TEST-TestNRTOpen.testReaderIsNRT-seed#[D54CEA05181C7729]) [    x:collection1] o.a.s.r.ManagedResourceStorage Reading _rest_managed.json using InMemoryStorage
   [junit4]   2> 1608144 INFO  (TEST-TestNRTOpen.testReaderIsNRT-seed#[D54CEA05181C7729]) [    x:collection1] o.a.s.r.RestManager Initializing 0 registered ManagedResources
   [junit4]   2> 1608144 INFO  (TEST-TestNRTOpen.testReaderIsNRT-seed#[D54CEA05181C7729]) [    x:collection1] o.a.s.h.ReplicationHandler Commits will be reserved for  10000
   [junit4]   2> 1608144 INFO  (searcherExecutor-6323-thread-1-processing-x:collection1) [    x:collection1] o.a.s.c.SolrCore [collection1] Registered new searcher Searcher@846981[collection1] main{ExitableDirectoryReader(UninvertingDirectoryReader(Uninverting(_6(5.5.0):c1) Uninverting(_7(5.5.0):c1) Uninverting(_8(5.5.0):c1) Uninverting(_9(5.5.0):c1)))}
   [junit4]   2> 1608145 INFO  (TEST-TestNRTOpen.testReaderIsNRT-seed#[D54CEA05181C7729]) [    x:collection1] o.a.s.u.DefaultSolrCoreState Closing old IndexWriter... core=collection1
   [junit4]   2> 1608231 INFO  (TEST-TestNRTOpen.testReaderIsNRT-seed#[D54CEA05181C7729]) [    x:collection1] o.a.s.c.SolrDeletionPolicy SolrDeletionPolicy.onCommit: commits: num=2
   [junit4]   2> 	commit{dir=/home/jenkins/workspace/Lucene-Solr-5.5-Linux/solr/build/solr-core/test/J0/temp/solr.core.TestNRTOpen_D54CEA05181C7729-001/init-core-data-001/index,segFN=segments_6,generation=6}
   [junit4]   2> 	commit{dir=/home/jenkins/workspace/Lucene-Solr-5.5-Linux/solr/build/solr-core/test/J0/temp/solr.core.TestNRTOpen_D54CEA05181C7729-001/init-core-data-001/index,segFN=segments_7,generation=7}
   [junit4]   2> 1608231 INFO  (TEST-TestNRTOpen.testReaderIsNRT-seed#[D54CEA05181C7729]) [    x:collection1] o.a.s.c.SolrDeletionPolicy newest commit generation = 7
   [junit4]   2> 1608232 INFO  (TEST-TestNRTOpen.testReaderIsNRT-seed#[D54CEA05181C7729]) [    x:collection1] o.a.s.u.RandomMergePolicy RandomMergePolicy wrapping class org.apache.lucene.index.LogDocMergePolicy: [LogDocMergePolicy: minMergeSize=1000, mergeFactor=21, maxMergeSize=9223372036854775807, maxMergeSizeForForcedMerge=9223372036854775807, calibrateSizeByDeletes=false, maxMergeDocs=2147483647, maxCFSSegmentSizeMB=8.796093022207999E12, noCFSRatio=0.0]
   [junit4]   2> 1608234 INFO  (TEST-TestNRTOpen.testReaderIsNRT-seed#[D54CEA05181C7729]) [    x:collection1] o.a.s.c.SolrDeletionPolicy SolrDeletionPolicy.onInit: commits: num=1
   [junit4]   2> 	commit{dir=/home/jenkins/workspace/Lucene-Solr-5.5-Linux/solr/build/solr-core/test/J0/temp/solr.core.TestNRTOpen_D54CEA05181C7729-001/init-core-data-001/index,segFN=segments_7,generation=7}
   [junit4]   2> 1608234 INFO  (TEST-TestNRTOpen.testReaderIsNRT-seed#[D54CEA05181C7729]) [    x:collection1] o.a.s.c.SolrDeletionPolicy newest commit generation = 7
   [junit4]   2> 1608235 INFO  (TEST-TestNRTOpen.testReaderIsNRT-seed#[D54CEA05181C7729]) [    x:collection1] o.a.s.u.DefaultSolrCoreState New IndexWriter is ready to be used.
   [junit4]   2> 1608237 INFO  (TEST-TestNRTOpen.testReaderIsNRT-seed#[D54CEA05181C7729]) [    x:collection1] o.a.s.s.SolrIndexSearcher Opening Searcher@1c11b05[collection1] main
   [junit4]   2> 1608238 INFO  (TEST-TestNRTOpen.testReaderIsNRT-seed#[D54CEA05181C7729]) [    x:collection1] o.a.s.c.CoreContainer replacing core: collection1
   [junit4]   2> 1608238 INFO  (searcherExecutor-6323-thread-1-processing-x:collection1) [    x:collection1] o.a.s.c.SolrCore [collection1] Registered new searcher Searcher@1c11b05[collection1] main{ExitableDirectoryReader(UninvertingDirectoryReader(Uninverting(_6(5.5.0):c1) Uninverting(_7(5.5.0):c1) Uninverting(_8(5.5.0):c1) Uninverting(_9(5.5.0):c1)))}
   [junit4]   2> 1608238 INFO  (TEST-TestNRTOpen.testReaderIsNRT-seed#[D54CEA05181C7729]) [    x:collection1] o.a.s.c.SolrCore [collection1]  CLOSING SolrCore org.apache.solr.core.SolrCore@d178c0
   [junit4]   2> 1608238 INFO  (TEST-TestNRTOpen.testReaderIsNRT-seed#[D54CEA05181C7729]) [    x:collection1] o.a.s.u.DirectUpdateHandler2 closing DirectUpdateHandler2{commits=2,autocommits=0,soft autocommits=0,optimizes=0,rollbacks=0,expungeDeletes=0,docsPending=1,adds=1,deletesById=0,deletesByQuery=0,errors=0,cumulative_adds=3,cumulative_deletesById=0,cumulative_deletesByQuery=0,cumulative_errors=0}
   [junit4]   2> 1608238 INFO  (TEST-TestNRTOpen.testReaderIsNRT-seed#[D54CEA05181C7729]) [    x:collection1] o.a.s.c.SolrCore [collection1] Closing main searcher on request.
   [junit4]   2> 1608238 INFO  (TEST-TestNRTOpen.testReaderIsNRT-seed#[D54CEA05181C7729]) [    x:collection1] o.a.s.SolrTestCaseJ4 ###Ending testReaderIsNRT
   [junit4]   2> 1608239 INFO  (SUITE-TestNRTOpen-seed#[D54CEA05181C7729]-worker) [    x:collection1] o.a.s.SolrTestCaseJ4 ###deleteCore
   [junit4]   2> 1608239 INFO  (SUITE-TestNRTOpen-seed#[D54CEA05181C7729]-worker) [    x:collection1] o.a.s.c.CoreContainer Shutting down CoreContainer instance=23908376
   [junit4]   2> 1608239 INFO  (coreCloseExecutor-6327-thread-1-processing-x:collection1) [    x:collection1] o.a.s.c.SolrCore [collection1]  CLOSING SolrCore org.apache.solr.core.SolrCore@d2d873
   [junit4]   2> 1608239 INFO  (coreCloseExecutor-6327-thread-1-processing-x:collection1) [    x:collection1] o.a.s.u.DirectUpdateHandler2 closing DirectUpdateHandler2{commits=0,autocommits=0,soft autocommits=0,optimizes=0,rollbacks=0,expungeDeletes=0,docsPending=0,adds=0,deletesById=0,deletesByQuery=0,errors=0,cumulative_adds=0,cumulative_deletesById=0,cumulative_deletesByQuery=0,cumulative_errors=0}
   [junit4]   2> 1608239 INFO  (coreCloseExecutor-6327-thread-1-processing-x:collection1) [    x:collection1] o.a.s.u.SolrCoreState Closing SolrCoreState
   [junit4]   2> 1608239 INFO  (coreCloseExecutor-6327-thread-1-processing-x:collection1) [    x:collection1] o.a.s.u.DefaultSolrCoreState SolrCoreState ref count has reached 0 - closing IndexWriter
   [junit4]   2> 1608239 INFO  (coreCloseExecutor-6327-thread-1-processing-x:collection1) [    x:collection1] o.a.s.u.DefaultSolrCoreState closing IndexWriter with IndexWriterCloser
   [junit4]   2> 1608240 INFO  (coreCloseExecutor-6327-thread-1-processing-x:collection1) [    x:collection1] o.a.s.c.SolrCore [collection1] Closing main searcher on request.
   [junit4]   2> 1608240 INFO  (coreCloseExecutor-6327-thread-1-processing-x:collection1) [    x:collection1] o.a.s.c.CachingDirectoryFactory Closing StandardDirectoryFactory - 2 directories currently being tracked
   [junit4]   2> 1608240 INFO  (coreCloseExecutor-6327-thread-1-processing-x:collection1) [    x:collection1] o.a.s.c.CachingDirectoryFactory looking to close /home/jenkins/workspace/Lucene-Solr-5.5-Linux/solr/build/solr-core/test/J0/temp/solr.core.TestNRTOpen_D54CEA05181C7729-001/init-core-data-001 [CachedDir<<refCount=0;path=/home/jenkins/workspace/Lucene-Solr-5.5-Linux/solr/build/solr-core/test/J0/temp/solr.core.TestNRTOpen_D54CEA05181C7729-001/init-core-data-001;done=false>>]
   [junit4]   2> 1608240 INFO  (coreCloseExecutor-6327-thread-1-processing-x:collection1) [    x:collection1] o.a.s.c.CachingDirectoryFactory Closing directory: /home/jenkins/workspace/Lucene-Solr-5.5-Linux/solr/build/solr-core/test/J0/temp/solr.core.TestNRTOpen_D54CEA05181C7729-001/init-core-data-001
   [junit4]   2> 1608240 INFO  (coreCloseExecutor-6327-thread-1-processing-x:collection1) [    x:collection1] o.a.s.c.CachingDirectoryFactory looking to close /home/jenkins/workspace/Lucene-Solr-5.5-Linux/solr/build/solr-core/test/J0/temp/solr.core.TestNRTOpen_D54CEA05181C7729-001/init-core-data-001/index [CachedDir<<refCount=0;path=/home/jenkins/workspace/Lucene-Solr-5.5-Linux/solr/build/solr-core/test/J0/temp/solr.core.TestNRTOpen_D54CEA05181C7729-001/init-core-data-001/index;done=false>>]
   [junit4]   2> 1608240 INFO  (coreCloseExecutor-6327-thread-1-processing-x:collection1) [    x:collection1] o.a.s.c.CachingDirectoryFactory Closing directory: /home/jenkins/workspace/Lucene-Solr-5.5-Linux/solr/build/solr-core/test/J0/temp/solr.core.TestNRTOpen_D54CEA05181C7729-001/init-core-data-001/index
   [junit4]   2> NOTE: leaving temporary files on disk at: /home/jenkins/workspace/Lucene-Solr-5.5-Linux/solr/build/solr-core/test/J0/temp/solr.core.TestNRTOpen_D54CEA05181C7729-001
   [junit4]   2> NOTE: test params are: codec=Asserting(Lucene54): {bazz=PostingsFormat(name=Asserting), foo=TestBloomFilteredLucenePostings(BloomFilteringPostingsFormat(Lucene50(blocksize=128))), bazzz=PostingsFormat(name=Asserting), baz=PostingsFormat(name=Asserting), foo2=BlockTreeOrds(blocksize=128)}, docValues:{}, sim=RandomSimilarity(queryNorm=false,coord=crazy): {}, locale=es-PA, timezone=Africa/Cairo
   [junit4]   2> NOTE: Linux 3.19.0-47-generic i386/Oracle Corporation 1.8.0_72 (32-bit)/cpus=12,threads=1,free=160838888,total=423362560
   [junit4]   2> NOTE: All tests run in this JVM: [PingRequestHandlerTest, TestRecoveryHdfs, BlockJoinFacetDistribTest, TestBulkSchemaAPI, SaslZkACLProviderTest, TestAtomicUpdateErrorCases, TestCSVLoader, QueryElevationComponentTest, TestXmlQParser, TestCrossCoreJoin, BigEndianAscendingWordDeserializerTest, ResourceLoaderTest, TestBadConfig, TestSchemaManager, TestDFISimilarityFactory, TestRemoteStreaming, UUIDUpdateProcessorFallbackTest, DistributedQueryComponentOptimizationTest, CustomCollectionTest, TestFastOutputStream, DocumentAnalysisRequestHandlerTest, TestBlobHandler, DateFieldTest, TestJoin, PreAnalyzedFieldTest, TestSchemaResource, CleanupOldIndexTest, TestMiniSolrCloudClusterBase, TestCloudSchemaless, TestDefaultSearchFieldResource, TestRawTransformer, TestFieldTypeResource, ExternalFileFieldSortTest, BufferStoreTest, SharedFSAutoReplicaFailoverUtilsTest, TestSolr4Spatial, TestSolrCloudWithKerberosAlt, ZkNodePropsTest, TestFunctionQuery, BasicAuthIntegrationTest, TestBulkSchemaConcurrent, TestBinaryField, ExplicitHLLTest, CollectionStateFormat2Test, TestReplicationHandler, DeleteReplicaTest, SolrXmlInZkTest, TestDistribDocBasedVersion, TestExactSharedStatsCache, CoreMergeIndexesAdminHandlerTest, SOLR749Test, TestHighlightDedupGrouping, TestLazyCores, SignatureUpdateProcessorFactoryTest, TestArbitraryIndexDir, TestLeaderElectionZkExpiry, URLClassifyProcessorTest, CloneFieldUpdateProcessorFactoryTest, RAMDirectoryFactoryTest, DistributedFacetPivotSmallTest, TestPhraseSuggestions, CurrencyFieldOpenExchangeTest, DistributedQueryElevationComponentTest, SystemInfoHandlerTest, TestRequestForwarding, TestReqParamsAPI, HdfsSyncSliceTest, TestHashQParserPlugin, TestRangeQuery, TestTrackingShardHandlerFactory, PolyFieldTest, HdfsWriteToMultipleCollectionsTest, TestCloudPivotFacet, TestConfig, IndexSchemaRuntimeFieldTest, TestMergePolicyConfig, TestConfigSetsAPIExclusivity, TestIBSimilarityFactory, TestFoldingMultitermQuery, TestAddFieldRealTimeGet, TestComplexPhraseQParserPlugin, TestLMDirichletSimilarityFactory, DefaultValueUpdateProcessorTest, TestPKIAuthenticationPlugin, TestDistributedStatsComponentCardinality, XsltUpdateRequestHandlerTest, WrapperMergePolicyFactoryTest, RulesTest, HLLUtilTest, TestRandomDVFaceting, TestBlendedInfixSuggestions, TestDocSet, TestSimpleQParserPlugin, CollectionsAPIDistributedZkTest, TestDistributedGrouping, DistributedSpellCheckComponentTest, DistributedTermsComponentTest, TestGroupingSearch, SolrCmdDistributorTest, ConvertedLegacyTest, TestFiltering, SolrIndexSplitterTest, TestCoreDiscovery, TestExtendedDismaxParser, SolrRequestParserTest, DocValuesTest, SuggesterTSTTest, NoCacheHeaderTest, SchemaVersionSpecificBehaviorTest, TestPseudoReturnFields, FieldMutatingUpdateProcessorTest, TestWordDelimiterFilterFactory, SortByFunctionTest, SolrInfoMBeanTest, IndexBasedSpellCheckerTest, DisMaxRequestHandlerTest, StandardRequestHandlerTest, DirectSolrSpellCheckerTest, TestOmitPositions, TermsComponentTest, RequestHandlersTest, TestValueSourceCache, MoreLikeThisHandlerTest, FastVectorHighlighterTest, TestCollationField, ReturnFieldsTest, TestAnalyzedSuggestions, BinaryUpdateRequestHandlerTest, TestPartialUpdateDeduplication, SearchHandlerTest, TestQuerySenderListener, AlternateDirectoryTest, CopyFieldTest, TestSearchPerf, OutputWriterTest, NotRequiredUniqueKeyTest, TestCharFilters, SynonymTokenizerTest, EchoParamsTest, TestPerFieldSimilarity, TestFastWriter, TimeZoneUtilsTest, ChaosMonkeyNothingIsSafeTest, TestTolerantSearch, ConnectionReuseTest, TestEmbeddedSolrServerConstructors, ActionThrottleTest, AsyncMigrateRouteKeyTest, DistribDocExpirationUpdateProcessorTest, HttpPartitionTest, OutOfBoxZkACLAndCredentialsProvidersTest, OverriddenZkACLAndCredentialsProvidersTest, OverseerCollectionConfigSetProcessorTest, OverseerRolesTest, RemoteQueryErrorTest, TestLeaderInitiatedRecoveryThread, TriLevelCompositeIdRoutingTest, TestImplicitCoreProperties, TestInfoStreamLogging, TestNRTOpen]
   [junit4] Completed [470/566 (1!)] on J0 in 1.81s, 2 tests, 1 failure <<< FAILURES!

[...truncated 303 lines...]
BUILD FAILED
/home/jenkins/workspace/Lucene-Solr-5.5-Linux/build.xml:750: The following error occurred while executing this line:
/home/jenkins/workspace/Lucene-Solr-5.5-Linux/build.xml:694: The following error occurred while executing this line:
/home/jenkins/workspace/Lucene-Solr-5.5-Linux/build.xml:59: The following error occurred while executing this line:
/home/jenkins/workspace/Lucene-Solr-5.5-Linux/solr/build.xml:233: The following error occurred while executing this line:
/home/jenkins/workspace/Lucene-Solr-5.5-Linux/solr/common-build.xml:534: The following error occurred while executing this line:
/home/jenkins/workspace/Lucene-Solr-5.5-Linux/lucene/common-build.xml:1477: The following error occurred while executing this line:
/home/jenkins/workspace/Lucene-Solr-5.5-Linux/lucene/common-build.xml:1033: There were test failures: 566 suites (7 ignored), 2275 tests, 1 failure, 84 ignored (39 assumptions) [seed: D54CEA05181C7729]

Total time: 54 minutes 35 seconds
Build step 'Invoke Ant' marked build as failure
Archiving artifacts
[WARNINGS] Skipping publisher since build result is FAILURE
Recording test results
Email was triggered for: Failure - Any
Sending email for trigger: Failure - Any



Mime
View raw message