lucene-dev mailing list archives

Site index · List index
Message view « Date » · « Thread »
Top « Date » · « Thread »
From Policeman Jenkins Server <jenk...@thetaphi.de>
Subject [JENKINS] Lucene-Solr-5.x-MacOSX (64bit/jdk1.8.0) - Build # 3034 - Still Failing!
Date Tue, 16 Feb 2016 04:11:49 GMT
Build: http://jenkins.thetaphi.de/job/Lucene-Solr-5.x-MacOSX/3034/
Java: 64bit/jdk1.8.0 -XX:+UseCompressedOops -XX:+UseParallelGC

2 tests failed.
FAILED:  org.apache.solr.TestDistributedSearch.test

Error Message:
Error from server at https://127.0.0.1:64448/_mn/m/collection1: java.lang.NullPointerException  at org.apache.solr.search.grouping.distributed.responseprocessor.TopGroupsShardResponseProcessor.process(TopGroupsShardResponseProcessor.java:105)  at org.apache.solr.handler.component.QueryComponent.handleGroupedResponses(QueryComponent.java:756)  at org.apache.solr.handler.component.QueryComponent.handleResponses(QueryComponent.java:739)  at org.apache.solr.handler.component.SearchHandler.handleRequestBody(SearchHandler.java:405)  at org.apache.solr.handler.RequestHandlerBase.handleRequest(RequestHandlerBase.java:155)  at org.apache.solr.core.SolrCore.execute(SolrCore.java:2082)  at org.apache.solr.servlet.HttpSolrCall.execute(HttpSolrCall.java:670)  at org.apache.solr.servlet.HttpSolrCall.call(HttpSolrCall.java:458)  at org.apache.solr.servlet.SolrDispatchFilter.doFilter(SolrDispatchFilter.java:225)  at org.apache.solr.servlet.SolrDispatchFilter.doFilter(SolrDispatchFilter.java:183)  at org.eclipse.jetty.servlet.ServletHandler$CachedChain.doFilter(ServletHandler.java:1652)  at org.apache.solr.client.solrj.embedded.JettySolrRunner$DebugFilter.doFilter(JettySolrRunner.java:109)  at org.eclipse.jetty.servlet.ServletHandler$CachedChain.doFilter(ServletHandler.java:1652)  at org.eclipse.jetty.servlets.UserAgentFilter.doFilter(UserAgentFilter.java:83)  at org.eclipse.jetty.servlets.GzipFilter.doFilter(GzipFilter.java:364)  at org.eclipse.jetty.servlet.ServletHandler$CachedChain.doFilter(ServletHandler.java:1652)  at org.eclipse.jetty.servlet.ServletHandler.doHandle(ServletHandler.java:585)  at org.eclipse.jetty.server.session.SessionHandler.doHandle(SessionHandler.java:221)  at org.eclipse.jetty.server.handler.ContextHandler.doHandle(ContextHandler.java:1127)  at org.eclipse.jetty.servlet.ServletHandler.doScope(ServletHandler.java:515)  at org.eclipse.jetty.server.session.SessionHandler.doScope(SessionHandler.java:185)  at org.eclipse.jetty.server.handler.ContextHandler.doScope(ContextHandler.java:1061)  at org.eclipse.jetty.server.handler.ScopedHandler.handle(ScopedHandler.java:141)  at org.eclipse.jetty.server.handler.HandlerWrapper.handle(HandlerWrapper.java:97)  at org.eclipse.jetty.server.Server.handle(Server.java:499)  at org.eclipse.jetty.server.HttpChannel.handle(HttpChannel.java:310)  at org.eclipse.jetty.server.HttpConnection.onFillable(HttpConnection.java:257)  at org.eclipse.jetty.io.AbstractConnection$2.run(AbstractConnection.java:540)  at org.eclipse.jetty.util.thread.QueuedThreadPool.runJob(QueuedThreadPool.java:635)  at org.eclipse.jetty.util.thread.QueuedThreadPool$3.run(QueuedThreadPool.java:555)  at java.lang.Thread.run(Thread.java:745) 

Stack Trace:
org.apache.solr.client.solrj.impl.HttpSolrClient$RemoteSolrException: Error from server at https://127.0.0.1:64448/_mn/m/collection1: java.lang.NullPointerException
	at org.apache.solr.search.grouping.distributed.responseprocessor.TopGroupsShardResponseProcessor.process(TopGroupsShardResponseProcessor.java:105)
	at org.apache.solr.handler.component.QueryComponent.handleGroupedResponses(QueryComponent.java:756)
	at org.apache.solr.handler.component.QueryComponent.handleResponses(QueryComponent.java:739)
	at org.apache.solr.handler.component.SearchHandler.handleRequestBody(SearchHandler.java:405)
	at org.apache.solr.handler.RequestHandlerBase.handleRequest(RequestHandlerBase.java:155)
	at org.apache.solr.core.SolrCore.execute(SolrCore.java:2082)
	at org.apache.solr.servlet.HttpSolrCall.execute(HttpSolrCall.java:670)
	at org.apache.solr.servlet.HttpSolrCall.call(HttpSolrCall.java:458)
	at org.apache.solr.servlet.SolrDispatchFilter.doFilter(SolrDispatchFilter.java:225)
	at org.apache.solr.servlet.SolrDispatchFilter.doFilter(SolrDispatchFilter.java:183)
	at org.eclipse.jetty.servlet.ServletHandler$CachedChain.doFilter(ServletHandler.java:1652)
	at org.apache.solr.client.solrj.embedded.JettySolrRunner$DebugFilter.doFilter(JettySolrRunner.java:109)
	at org.eclipse.jetty.servlet.ServletHandler$CachedChain.doFilter(ServletHandler.java:1652)
	at org.eclipse.jetty.servlets.UserAgentFilter.doFilter(UserAgentFilter.java:83)
	at org.eclipse.jetty.servlets.GzipFilter.doFilter(GzipFilter.java:364)
	at org.eclipse.jetty.servlet.ServletHandler$CachedChain.doFilter(ServletHandler.java:1652)
	at org.eclipse.jetty.servlet.ServletHandler.doHandle(ServletHandler.java:585)
	at org.eclipse.jetty.server.session.SessionHandler.doHandle(SessionHandler.java:221)
	at org.eclipse.jetty.server.handler.ContextHandler.doHandle(ContextHandler.java:1127)
	at org.eclipse.jetty.servlet.ServletHandler.doScope(ServletHandler.java:515)
	at org.eclipse.jetty.server.session.SessionHandler.doScope(SessionHandler.java:185)
	at org.eclipse.jetty.server.handler.ContextHandler.doScope(ContextHandler.java:1061)
	at org.eclipse.jetty.server.handler.ScopedHandler.handle(ScopedHandler.java:141)
	at org.eclipse.jetty.server.handler.HandlerWrapper.handle(HandlerWrapper.java:97)
	at org.eclipse.jetty.server.Server.handle(Server.java:499)
	at org.eclipse.jetty.server.HttpChannel.handle(HttpChannel.java:310)
	at org.eclipse.jetty.server.HttpConnection.onFillable(HttpConnection.java:257)
	at org.eclipse.jetty.io.AbstractConnection$2.run(AbstractConnection.java:540)
	at org.eclipse.jetty.util.thread.QueuedThreadPool.runJob(QueuedThreadPool.java:635)
	at org.eclipse.jetty.util.thread.QueuedThreadPool$3.run(QueuedThreadPool.java:555)
	at java.lang.Thread.run(Thread.java:745)

	at __randomizedtesting.SeedInfo.seed([174AD37BED6EA47E:9F1EECA14392C986]:0)
	at org.apache.solr.client.solrj.impl.HttpSolrClient.executeMethod(HttpSolrClient.java:576)
	at org.apache.solr.client.solrj.impl.HttpSolrClient.request(HttpSolrClient.java:240)
	at org.apache.solr.client.solrj.impl.HttpSolrClient.request(HttpSolrClient.java:229)
	at org.apache.solr.client.solrj.SolrRequest.process(SolrRequest.java:149)
	at org.apache.solr.client.solrj.SolrClient.query(SolrClient.java:942)
	at org.apache.solr.client.solrj.SolrClient.query(SolrClient.java:957)
	at org.apache.solr.TestDistributedSearch.queryRandomUpServer(TestDistributedSearch.java:1149)
	at org.apache.solr.TestDistributedSearch.queryPartialResults(TestDistributedSearch.java:1111)
	at org.apache.solr.TestDistributedSearch.test(TestDistributedSearch.java:973)
	at sun.reflect.NativeMethodAccessorImpl.invoke0(Native Method)
	at sun.reflect.NativeMethodAccessorImpl.invoke(NativeMethodAccessorImpl.java:62)
	at sun.reflect.DelegatingMethodAccessorImpl.invoke(DelegatingMethodAccessorImpl.java:43)
	at java.lang.reflect.Method.invoke(Method.java:498)
	at com.carrotsearch.randomizedtesting.RandomizedRunner.invoke(RandomizedRunner.java:1764)
	at com.carrotsearch.randomizedtesting.RandomizedRunner$8.evaluate(RandomizedRunner.java:871)
	at com.carrotsearch.randomizedtesting.RandomizedRunner$9.evaluate(RandomizedRunner.java:907)
	at com.carrotsearch.randomizedtesting.RandomizedRunner$10.evaluate(RandomizedRunner.java:921)
	at org.apache.solr.BaseDistributedSearchTestCase$ShardsRepeatRule$ShardsRepeatStatement.callStatement(BaseDistributedSearchTestCase.java:990)
	at org.apache.solr.BaseDistributedSearchTestCase$ShardsRepeatRule$ShardsStatement.evaluate(BaseDistributedSearchTestCase.java:939)
	at com.carrotsearch.randomizedtesting.rules.SystemPropertiesRestoreRule$1.evaluate(SystemPropertiesRestoreRule.java:57)
	at org.apache.lucene.util.TestRuleSetupTeardownChained$1.evaluate(TestRuleSetupTeardownChained.java:49)
	at org.apache.lucene.util.AbstractBeforeAfterRule$1.evaluate(AbstractBeforeAfterRule.java:45)
	at org.apache.lucene.util.TestRuleThreadAndTestName$1.evaluate(TestRuleThreadAndTestName.java:48)
	at org.apache.lucene.util.TestRuleIgnoreAfterMaxFailures$1.evaluate(TestRuleIgnoreAfterMaxFailures.java:64)
	at org.apache.lucene.util.TestRuleMarkFailure$1.evaluate(TestRuleMarkFailure.java:47)
	at com.carrotsearch.randomizedtesting.rules.StatementAdapter.evaluate(StatementAdapter.java:36)
	at com.carrotsearch.randomizedtesting.ThreadLeakControl$StatementRunner.run(ThreadLeakControl.java:367)
	at com.carrotsearch.randomizedtesting.ThreadLeakControl.forkTimeoutingTask(ThreadLeakControl.java:809)
	at com.carrotsearch.randomizedtesting.ThreadLeakControl$3.evaluate(ThreadLeakControl.java:460)
	at com.carrotsearch.randomizedtesting.RandomizedRunner.runSingleTest(RandomizedRunner.java:880)
	at com.carrotsearch.randomizedtesting.RandomizedRunner$5.evaluate(RandomizedRunner.java:781)
	at com.carrotsearch.randomizedtesting.RandomizedRunner$6.evaluate(RandomizedRunner.java:816)
	at com.carrotsearch.randomizedtesting.RandomizedRunner$7.evaluate(RandomizedRunner.java:827)
	at com.carrotsearch.randomizedtesting.rules.StatementAdapter.evaluate(StatementAdapter.java:36)
	at com.carrotsearch.randomizedtesting.rules.SystemPropertiesRestoreRule$1.evaluate(SystemPropertiesRestoreRule.java:57)
	at org.apache.lucene.util.AbstractBeforeAfterRule$1.evaluate(AbstractBeforeAfterRule.java:45)
	at com.carrotsearch.randomizedtesting.rules.StatementAdapter.evaluate(StatementAdapter.java:36)
	at org.apache.lucene.util.TestRuleStoreClassName$1.evaluate(TestRuleStoreClassName.java:41)
	at com.carrotsearch.randomizedtesting.rules.NoShadowingOrOverridesOnMethodsRule$1.evaluate(NoShadowingOrOverridesOnMethodsRule.java:40)
	at com.carrotsearch.randomizedtesting.rules.NoShadowingOrOverridesOnMethodsRule$1.evaluate(NoShadowingOrOverridesOnMethodsRule.java:40)
	at com.carrotsearch.randomizedtesting.rules.StatementAdapter.evaluate(StatementAdapter.java:36)
	at com.carrotsearch.randomizedtesting.rules.StatementAdapter.evaluate(StatementAdapter.java:36)
	at com.carrotsearch.randomizedtesting.rules.StatementAdapter.evaluate(StatementAdapter.java:36)
	at org.apache.lucene.util.TestRuleAssertionsRequired$1.evaluate(TestRuleAssertionsRequired.java:53)
	at org.apache.lucene.util.TestRuleMarkFailure$1.evaluate(TestRuleMarkFailure.java:47)
	at org.apache.lucene.util.TestRuleIgnoreAfterMaxFailures$1.evaluate(TestRuleIgnoreAfterMaxFailures.java:64)
	at org.apache.lucene.util.TestRuleIgnoreTestSuites$1.evaluate(TestRuleIgnoreTestSuites.java:54)
	at com.carrotsearch.randomizedtesting.rules.StatementAdapter.evaluate(StatementAdapter.java:36)
	at com.carrotsearch.randomizedtesting.ThreadLeakControl$StatementRunner.run(ThreadLeakControl.java:367)
	at java.lang.Thread.run(Thread.java:745)


FAILED:  org.apache.solr.cloud.RemoteQueryErrorTest.test

Error Message:
KeeperErrorCode = Session expired for /clusterstate.json

Stack Trace:
org.apache.zookeeper.KeeperException$SessionExpiredException: KeeperErrorCode = Session expired for /clusterstate.json
	at __randomizedtesting.SeedInfo.seed([174AD37BED6EA47E:9F1EECA14392C986]:0)
	at org.apache.zookeeper.KeeperException.create(KeeperException.java:127)
	at org.apache.zookeeper.KeeperException.create(KeeperException.java:51)
	at org.apache.zookeeper.ZooKeeper.getData(ZooKeeper.java:1155)
	at org.apache.solr.common.cloud.SolrZkClient$7.execute(SolrZkClient.java:345)
	at org.apache.solr.common.cloud.SolrZkClient$7.execute(SolrZkClient.java:342)
	at org.apache.solr.common.cloud.ZkCmdExecutor.retryOperation(ZkCmdExecutor.java:60)
	at org.apache.solr.common.cloud.SolrZkClient.getData(SolrZkClient.java:342)
	at org.apache.solr.common.cloud.ZkStateReader.refreshLegacyClusterState(ZkStateReader.java:443)
	at org.apache.solr.common.cloud.ZkStateReader.updateClusterState(ZkStateReader.java:239)
	at org.apache.solr.cloud.AbstractDistribZkTestBase.waitForRecoveriesToFinish(AbstractDistribZkTestBase.java:148)
	at org.apache.solr.cloud.AbstractDistribZkTestBase.waitForRecoveriesToFinish(AbstractDistribZkTestBase.java:135)
	at org.apache.solr.cloud.AbstractDistribZkTestBase.waitForRecoveriesToFinish(AbstractDistribZkTestBase.java:130)
	at org.apache.solr.cloud.AbstractFullDistribZkTestBase.waitForRecoveriesToFinish(AbstractFullDistribZkTestBase.java:830)
	at org.apache.solr.cloud.RemoteQueryErrorTest.test(RemoteQueryErrorTest.java:57)
	at sun.reflect.NativeMethodAccessorImpl.invoke0(Native Method)
	at sun.reflect.NativeMethodAccessorImpl.invoke(NativeMethodAccessorImpl.java:62)
	at sun.reflect.DelegatingMethodAccessorImpl.invoke(DelegatingMethodAccessorImpl.java:43)
	at java.lang.reflect.Method.invoke(Method.java:498)
	at com.carrotsearch.randomizedtesting.RandomizedRunner.invoke(RandomizedRunner.java:1764)
	at com.carrotsearch.randomizedtesting.RandomizedRunner$8.evaluate(RandomizedRunner.java:871)
	at com.carrotsearch.randomizedtesting.RandomizedRunner$9.evaluate(RandomizedRunner.java:907)
	at com.carrotsearch.randomizedtesting.RandomizedRunner$10.evaluate(RandomizedRunner.java:921)
	at org.apache.solr.BaseDistributedSearchTestCase$ShardsRepeatRule$ShardsFixedStatement.callStatement(BaseDistributedSearchTestCase.java:964)
	at org.apache.solr.BaseDistributedSearchTestCase$ShardsRepeatRule$ShardsStatement.evaluate(BaseDistributedSearchTestCase.java:939)
	at com.carrotsearch.randomizedtesting.rules.SystemPropertiesRestoreRule$1.evaluate(SystemPropertiesRestoreRule.java:57)
	at org.apache.lucene.util.TestRuleSetupTeardownChained$1.evaluate(TestRuleSetupTeardownChained.java:49)
	at org.apache.lucene.util.AbstractBeforeAfterRule$1.evaluate(AbstractBeforeAfterRule.java:45)
	at org.apache.lucene.util.TestRuleThreadAndTestName$1.evaluate(TestRuleThreadAndTestName.java:48)
	at org.apache.lucene.util.TestRuleIgnoreAfterMaxFailures$1.evaluate(TestRuleIgnoreAfterMaxFailures.java:64)
	at org.apache.lucene.util.TestRuleMarkFailure$1.evaluate(TestRuleMarkFailure.java:47)
	at com.carrotsearch.randomizedtesting.rules.StatementAdapter.evaluate(StatementAdapter.java:36)
	at com.carrotsearch.randomizedtesting.ThreadLeakControl$StatementRunner.run(ThreadLeakControl.java:367)
	at com.carrotsearch.randomizedtesting.ThreadLeakControl.forkTimeoutingTask(ThreadLeakControl.java:809)
	at com.carrotsearch.randomizedtesting.ThreadLeakControl$3.evaluate(ThreadLeakControl.java:460)
	at com.carrotsearch.randomizedtesting.RandomizedRunner.runSingleTest(RandomizedRunner.java:880)
	at com.carrotsearch.randomizedtesting.RandomizedRunner$5.evaluate(RandomizedRunner.java:781)
	at com.carrotsearch.randomizedtesting.RandomizedRunner$6.evaluate(RandomizedRunner.java:816)
	at com.carrotsearch.randomizedtesting.RandomizedRunner$7.evaluate(RandomizedRunner.java:827)
	at com.carrotsearch.randomizedtesting.rules.StatementAdapter.evaluate(StatementAdapter.java:36)
	at com.carrotsearch.randomizedtesting.rules.SystemPropertiesRestoreRule$1.evaluate(SystemPropertiesRestoreRule.java:57)
	at org.apache.lucene.util.AbstractBeforeAfterRule$1.evaluate(AbstractBeforeAfterRule.java:45)
	at com.carrotsearch.randomizedtesting.rules.StatementAdapter.evaluate(StatementAdapter.java:36)
	at org.apache.lucene.util.TestRuleStoreClassName$1.evaluate(TestRuleStoreClassName.java:41)
	at com.carrotsearch.randomizedtesting.rules.NoShadowingOrOverridesOnMethodsRule$1.evaluate(NoShadowingOrOverridesOnMethodsRule.java:40)
	at com.carrotsearch.randomizedtesting.rules.NoShadowingOrOverridesOnMethodsRule$1.evaluate(NoShadowingOrOverridesOnMethodsRule.java:40)
	at com.carrotsearch.randomizedtesting.rules.StatementAdapter.evaluate(StatementAdapter.java:36)
	at com.carrotsearch.randomizedtesting.rules.StatementAdapter.evaluate(StatementAdapter.java:36)
	at com.carrotsearch.randomizedtesting.rules.StatementAdapter.evaluate(StatementAdapter.java:36)
	at org.apache.lucene.util.TestRuleAssertionsRequired$1.evaluate(TestRuleAssertionsRequired.java:53)
	at org.apache.lucene.util.TestRuleMarkFailure$1.evaluate(TestRuleMarkFailure.java:47)
	at org.apache.lucene.util.TestRuleIgnoreAfterMaxFailures$1.evaluate(TestRuleIgnoreAfterMaxFailures.java:64)
	at org.apache.lucene.util.TestRuleIgnoreTestSuites$1.evaluate(TestRuleIgnoreTestSuites.java:54)
	at com.carrotsearch.randomizedtesting.rules.StatementAdapter.evaluate(StatementAdapter.java:36)
	at com.carrotsearch.randomizedtesting.ThreadLeakControl$StatementRunner.run(ThreadLeakControl.java:367)
	at java.lang.Thread.run(Thread.java:745)




Build Log:
[...truncated 11381 lines...]
   [junit4] Suite: org.apache.solr.cloud.RemoteQueryErrorTest
   [junit4]   2> Creating dataDir: /Users/jenkins/workspace/Lucene-Solr-5.x-MacOSX/solr/build/solr-core/test/J0/temp/solr.cloud.RemoteQueryErrorTest_174AD37BED6EA47E-001/init-core-data-001
   [junit4]   2> 1527983 INFO  (SUITE-RemoteQueryErrorTest-seed#[174AD37BED6EA47E]-worker) [    ] o.a.s.SolrTestCaseJ4 Randomized ssl (false) and clientAuth (false)
   [junit4]   2> 1527983 INFO  (SUITE-RemoteQueryErrorTest-seed#[174AD37BED6EA47E]-worker) [    ] o.a.s.BaseDistributedSearchTestCase Setting hostContext system property: /
   [junit4]   2> 1527985 INFO  (TEST-RemoteQueryErrorTest.test-seed#[174AD37BED6EA47E]) [    ] o.a.s.c.ZkTestServer STARTING ZK TEST SERVER
   [junit4]   2> 1527986 INFO  (Thread-3804) [    ] o.a.s.c.ZkTestServer client port:0.0.0.0/0.0.0.0:0
   [junit4]   2> 1527986 INFO  (Thread-3804) [    ] o.a.s.c.ZkTestServer Starting server
   [junit4]   2> 1528087 INFO  (TEST-RemoteQueryErrorTest.test-seed#[174AD37BED6EA47E]) [    ] o.a.s.c.ZkTestServer start zk server on port:63421
   [junit4]   2> 1528087 INFO  (TEST-RemoteQueryErrorTest.test-seed#[174AD37BED6EA47E]) [    ] o.a.s.c.c.SolrZkClient Using default ZkCredentialsProvider
   [junit4]   2> 1528087 INFO  (TEST-RemoteQueryErrorTest.test-seed#[174AD37BED6EA47E]) [    ] o.a.s.c.c.ConnectionManager Waiting for client to connect to ZooKeeper
   [junit4]   2> 1528091 INFO  (zkCallback-2015-thread-1) [    ] o.a.s.c.c.ConnectionManager Watcher org.apache.solr.common.cloud.ConnectionManager@5880be39 name:ZooKeeperConnection Watcher:127.0.0.1:63421 got event WatchedEvent state:SyncConnected type:None path:null path:null type:None
   [junit4]   2> 1528091 INFO  (TEST-RemoteQueryErrorTest.test-seed#[174AD37BED6EA47E]) [    ] o.a.s.c.c.ConnectionManager Client is connected to ZooKeeper
   [junit4]   2> 1528092 INFO  (TEST-RemoteQueryErrorTest.test-seed#[174AD37BED6EA47E]) [    ] o.a.s.c.c.SolrZkClient Using default ZkACLProvider
   [junit4]   2> 1528092 INFO  (TEST-RemoteQueryErrorTest.test-seed#[174AD37BED6EA47E]) [    ] o.a.s.c.c.SolrZkClient makePath: /solr
   [junit4]   2> 1528096 INFO  (TEST-RemoteQueryErrorTest.test-seed#[174AD37BED6EA47E]) [    ] o.a.s.c.c.SolrZkClient Using default ZkCredentialsProvider
   [junit4]   2> 1528096 INFO  (TEST-RemoteQueryErrorTest.test-seed#[174AD37BED6EA47E]) [    ] o.a.s.c.c.ConnectionManager Waiting for client to connect to ZooKeeper
   [junit4]   2> 1528098 INFO  (zkCallback-2016-thread-1) [    ] o.a.s.c.c.ConnectionManager Watcher org.apache.solr.common.cloud.ConnectionManager@56cce8c3 name:ZooKeeperConnection Watcher:127.0.0.1:63421/solr got event WatchedEvent state:SyncConnected type:None path:null path:null type:None
   [junit4]   2> 1528098 INFO  (TEST-RemoteQueryErrorTest.test-seed#[174AD37BED6EA47E]) [    ] o.a.s.c.c.ConnectionManager Client is connected to ZooKeeper
   [junit4]   2> 1528098 INFO  (TEST-RemoteQueryErrorTest.test-seed#[174AD37BED6EA47E]) [    ] o.a.s.c.c.SolrZkClient Using default ZkACLProvider
   [junit4]   2> 1528098 INFO  (TEST-RemoteQueryErrorTest.test-seed#[174AD37BED6EA47E]) [    ] o.a.s.c.c.SolrZkClient makePath: /collections/collection1
   [junit4]   2> 1528101 INFO  (TEST-RemoteQueryErrorTest.test-seed#[174AD37BED6EA47E]) [    ] o.a.s.c.c.SolrZkClient makePath: /collections/collection1/shards
   [junit4]   2> 1528104 INFO  (TEST-RemoteQueryErrorTest.test-seed#[174AD37BED6EA47E]) [    ] o.a.s.c.c.SolrZkClient makePath: /collections/control_collection
   [junit4]   2> 1528106 INFO  (TEST-RemoteQueryErrorTest.test-seed#[174AD37BED6EA47E]) [    ] o.a.s.c.c.SolrZkClient makePath: /collections/control_collection/shards
   [junit4]   2> 1528109 INFO  (TEST-RemoteQueryErrorTest.test-seed#[174AD37BED6EA47E]) [    ] o.a.s.c.AbstractZkTestCase put /Users/jenkins/workspace/Lucene-Solr-5.x-MacOSX/solr/core/src/test-files/solr/collection1/conf/solrconfig-tlog.xml to /configs/conf1/solrconfig.xml
   [junit4]   2> 1528110 INFO  (TEST-RemoteQueryErrorTest.test-seed#[174AD37BED6EA47E]) [    ] o.a.s.c.c.SolrZkClient makePath: /configs/conf1/solrconfig.xml
   [junit4]   2> 1528114 INFO  (TEST-RemoteQueryErrorTest.test-seed#[174AD37BED6EA47E]) [    ] o.a.s.c.AbstractZkTestCase put /Users/jenkins/workspace/Lucene-Solr-5.x-MacOSX/solr/core/src/test-files/solr/collection1/conf/schema.xml to /configs/conf1/schema.xml
   [junit4]   2> 1528114 INFO  (TEST-RemoteQueryErrorTest.test-seed#[174AD37BED6EA47E]) [    ] o.a.s.c.c.SolrZkClient makePath: /configs/conf1/schema.xml
   [junit4]   2> 1528118 INFO  (TEST-RemoteQueryErrorTest.test-seed#[174AD37BED6EA47E]) [    ] o.a.s.c.AbstractZkTestCase put /Users/jenkins/workspace/Lucene-Solr-5.x-MacOSX/solr/core/src/test-files/solr/collection1/conf/solrconfig.snippet.randomindexconfig.xml to /configs/conf1/solrconfig.snippet.randomindexconfig.xml
   [junit4]   2> 1528118 INFO  (TEST-RemoteQueryErrorTest.test-seed#[174AD37BED6EA47E]) [    ] o.a.s.c.c.SolrZkClient makePath: /configs/conf1/solrconfig.snippet.randomindexconfig.xml
   [junit4]   2> 1528122 INFO  (TEST-RemoteQueryErrorTest.test-seed#[174AD37BED6EA47E]) [    ] o.a.s.c.AbstractZkTestCase put /Users/jenkins/workspace/Lucene-Solr-5.x-MacOSX/solr/core/src/test-files/solr/collection1/conf/stopwords.txt to /configs/conf1/stopwords.txt
   [junit4]   2> 1528122 INFO  (TEST-RemoteQueryErrorTest.test-seed#[174AD37BED6EA47E]) [    ] o.a.s.c.c.SolrZkClient makePath: /configs/conf1/stopwords.txt
   [junit4]   2> 1528125 INFO  (TEST-RemoteQueryErrorTest.test-seed#[174AD37BED6EA47E]) [    ] o.a.s.c.AbstractZkTestCase put /Users/jenkins/workspace/Lucene-Solr-5.x-MacOSX/solr/core/src/test-files/solr/collection1/conf/protwords.txt to /configs/conf1/protwords.txt
   [junit4]   2> 1528125 INFO  (TEST-RemoteQueryErrorTest.test-seed#[174AD37BED6EA47E]) [    ] o.a.s.c.c.SolrZkClient makePath: /configs/conf1/protwords.txt
   [junit4]   2> 1528128 INFO  (TEST-RemoteQueryErrorTest.test-seed#[174AD37BED6EA47E]) [    ] o.a.s.c.AbstractZkTestCase put /Users/jenkins/workspace/Lucene-Solr-5.x-MacOSX/solr/core/src/test-files/solr/collection1/conf/currency.xml to /configs/conf1/currency.xml
   [junit4]   2> 1528128 INFO  (TEST-RemoteQueryErrorTest.test-seed#[174AD37BED6EA47E]) [    ] o.a.s.c.c.SolrZkClient makePath: /configs/conf1/currency.xml
   [junit4]   2> 1528132 INFO  (TEST-RemoteQueryErrorTest.test-seed#[174AD37BED6EA47E]) [    ] o.a.s.c.AbstractZkTestCase put /Users/jenkins/workspace/Lucene-Solr-5.x-MacOSX/solr/core/src/test-files/solr/collection1/conf/enumsConfig.xml to /configs/conf1/enumsConfig.xml
   [junit4]   2> 1528132 INFO  (TEST-RemoteQueryErrorTest.test-seed#[174AD37BED6EA47E]) [    ] o.a.s.c.c.SolrZkClient makePath: /configs/conf1/enumsConfig.xml
   [junit4]   2> 1528135 INFO  (TEST-RemoteQueryErrorTest.test-seed#[174AD37BED6EA47E]) [    ] o.a.s.c.AbstractZkTestCase put /Users/jenkins/workspace/Lucene-Solr-5.x-MacOSX/solr/core/src/test-files/solr/collection1/conf/open-exchange-rates.json to /configs/conf1/open-exchange-rates.json
   [junit4]   2> 1528135 INFO  (TEST-RemoteQueryErrorTest.test-seed#[174AD37BED6EA47E]) [    ] o.a.s.c.c.SolrZkClient makePath: /configs/conf1/open-exchange-rates.json
   [junit4]   2> 1528138 INFO  (TEST-RemoteQueryErrorTest.test-seed#[174AD37BED6EA47E]) [    ] o.a.s.c.AbstractZkTestCase put /Users/jenkins/workspace/Lucene-Solr-5.x-MacOSX/solr/core/src/test-files/solr/collection1/conf/mapping-ISOLatin1Accent.txt to /configs/conf1/mapping-ISOLatin1Accent.txt
   [junit4]   2> 1528138 INFO  (TEST-RemoteQueryErrorTest.test-seed#[174AD37BED6EA47E]) [    ] o.a.s.c.c.SolrZkClient makePath: /configs/conf1/mapping-ISOLatin1Accent.txt
   [junit4]   2> 1528142 INFO  (TEST-RemoteQueryErrorTest.test-seed#[174AD37BED6EA47E]) [    ] o.a.s.c.AbstractZkTestCase put /Users/jenkins/workspace/Lucene-Solr-5.x-MacOSX/solr/core/src/test-files/solr/collection1/conf/old_synonyms.txt to /configs/conf1/old_synonyms.txt
   [junit4]   2> 1528142 INFO  (TEST-RemoteQueryErrorTest.test-seed#[174AD37BED6EA47E]) [    ] o.a.s.c.c.SolrZkClient makePath: /configs/conf1/old_synonyms.txt
   [junit4]   2> 1528145 INFO  (TEST-RemoteQueryErrorTest.test-seed#[174AD37BED6EA47E]) [    ] o.a.s.c.AbstractZkTestCase put /Users/jenkins/workspace/Lucene-Solr-5.x-MacOSX/solr/core/src/test-files/solr/collection1/conf/synonyms.txt to /configs/conf1/synonyms.txt
   [junit4]   2> 1528145 INFO  (TEST-RemoteQueryErrorTest.test-seed#[174AD37BED6EA47E]) [    ] o.a.s.c.c.SolrZkClient makePath: /configs/conf1/synonyms.txt
   [junit4]   2> 1528651 INFO  (TEST-RemoteQueryErrorTest.test-seed#[174AD37BED6EA47E]) [    ] o.a.s.SolrTestCaseJ4 Writing core.properties file to /Users/jenkins/workspace/Lucene-Solr-5.x-MacOSX/solr/build/solr-core/test/J0/temp/solr.cloud.RemoteQueryErrorTest_174AD37BED6EA47E-001/control-001/cores/collection1
   [junit4]   2> 1528653 INFO  (TEST-RemoteQueryErrorTest.test-seed#[174AD37BED6EA47E]) [    ] o.e.j.s.Server jetty-9.2.13.v20150730
   [junit4]   2> 1528676 INFO  (TEST-RemoteQueryErrorTest.test-seed#[174AD37BED6EA47E]) [    ] o.e.j.s.h.ContextHandler Started o.e.j.s.ServletContextHandler@49937899{/,null,AVAILABLE}
   [junit4]   2> 1528677 INFO  (TEST-RemoteQueryErrorTest.test-seed#[174AD37BED6EA47E]) [    ] o.e.j.s.ServerConnector Started ServerConnector@2d4c31b0{HTTP/1.1}{127.0.0.1:63424}
   [junit4]   2> 1528677 INFO  (TEST-RemoteQueryErrorTest.test-seed#[174AD37BED6EA47E]) [    ] o.e.j.s.Server Started @1532745ms
   [junit4]   2> 1528677 INFO  (TEST-RemoteQueryErrorTest.test-seed#[174AD37BED6EA47E]) [    ] o.a.s.c.s.e.JettySolrRunner Jetty properties: {solr.data.dir=/Users/jenkins/workspace/Lucene-Solr-5.x-MacOSX/solr/build/solr-core/test/J0/temp/solr.cloud.RemoteQueryErrorTest_174AD37BED6EA47E-001/tempDir-001/control/data, hostContext=/, hostPort=63424, coreRootDirectory=/Users/jenkins/workspace/Lucene-Solr-5.x-MacOSX/solr/build/solr-core/test/J0/../../../../../../../../../Users/jenkins/workspace/Lucene-Solr-5.x-MacOSX/solr/build/solr-core/test/J0/temp/solr.cloud.RemoteQueryErrorTest_174AD37BED6EA47E-001/control-001/cores}
   [junit4]   2> 1528677 INFO  (TEST-RemoteQueryErrorTest.test-seed#[174AD37BED6EA47E]) [    ] o.a.s.s.SolrDispatchFilter SolrDispatchFilter.init(): sun.misc.Launcher$AppClassLoader@1540e19d
   [junit4]   2> 1528678 INFO  (TEST-RemoteQueryErrorTest.test-seed#[174AD37BED6EA47E]) [    ] o.a.s.c.SolrResourceLoader new SolrResourceLoader for directory: '/Users/jenkins/workspace/Lucene-Solr-5.x-MacOSX/solr/build/solr-core/test/J0/temp/solr.cloud.RemoteQueryErrorTest_174AD37BED6EA47E-001/control-001'
   [junit4]   2> 1528678 INFO  (TEST-RemoteQueryErrorTest.test-seed#[174AD37BED6EA47E]) [    ] o.a.s.c.SolrResourceLoader JNDI not configured for solr (NoInitialContextEx)
   [junit4]   2> 1528678 INFO  (TEST-RemoteQueryErrorTest.test-seed#[174AD37BED6EA47E]) [    ] o.a.s.c.SolrResourceLoader solr home defaulted to 'solr/' (could not find system property or JNDI)
   [junit4]   2> 1528678 INFO  (TEST-RemoteQueryErrorTest.test-seed#[174AD37BED6EA47E]) [    ] o.a.s.c.c.SolrZkClient Using default ZkCredentialsProvider
   [junit4]   2> 1528679 INFO  (TEST-RemoteQueryErrorTest.test-seed#[174AD37BED6EA47E]) [    ] o.a.s.c.c.ConnectionManager Waiting for client to connect to ZooKeeper
   [junit4]   2> 1528681 INFO  (zkCallback-2017-thread-1) [    ] o.a.s.c.c.ConnectionManager Watcher org.apache.solr.common.cloud.ConnectionManager@6f3e7b5d name:ZooKeeperConnection Watcher:127.0.0.1:63421/solr got event WatchedEvent state:SyncConnected type:None path:null path:null type:None
   [junit4]   2> 1528681 INFO  (TEST-RemoteQueryErrorTest.test-seed#[174AD37BED6EA47E]) [    ] o.a.s.c.c.ConnectionManager Client is connected to ZooKeeper
   [junit4]   2> 1528681 INFO  (TEST-RemoteQueryErrorTest.test-seed#[174AD37BED6EA47E]) [    ] o.a.s.c.c.SolrZkClient Using default ZkACLProvider
   [junit4]   2> 1528683 INFO  (TEST-RemoteQueryErrorTest.test-seed#[174AD37BED6EA47E]) [    ] o.a.s.s.SolrDispatchFilter Loading solr.xml from SolrHome (not found in ZooKeeper)
   [junit4]   2> 1528683 INFO  (TEST-RemoteQueryErrorTest.test-seed#[174AD37BED6EA47E]) [    ] o.a.s.c.SolrXmlConfig Loading container configuration from /Users/jenkins/workspace/Lucene-Solr-5.x-MacOSX/solr/build/solr-core/test/J0/temp/solr.cloud.RemoteQueryErrorTest_174AD37BED6EA47E-001/control-001/solr.xml
   [junit4]   2> 1528690 INFO  (TEST-RemoteQueryErrorTest.test-seed#[174AD37BED6EA47E]) [    ] o.a.s.c.CorePropertiesLocator Config-defined core root directory: /Users/jenkins/workspace/Lucene-Solr-5.x-MacOSX/solr/build/solr-core/test/J0/../../../../../../../../../Users/jenkins/workspace/Lucene-Solr-5.x-MacOSX/solr/build/solr-core/test/J0/temp/solr.cloud.RemoteQueryErrorTest_174AD37BED6EA47E-001/control-001/cores
   [junit4]   2> 1528690 INFO  (TEST-RemoteQueryErrorTest.test-seed#[174AD37BED6EA47E]) [    ] o.a.s.c.CoreContainer New CoreContainer 1808894521
   [junit4]   2> 1528690 INFO  (TEST-RemoteQueryErrorTest.test-seed#[174AD37BED6EA47E]) [    ] o.a.s.c.CoreContainer Loading cores into CoreContainer [instanceDir=/Users/jenkins/workspace/Lucene-Solr-5.x-MacOSX/solr/build/solr-core/test/J0/temp/solr.cloud.RemoteQueryErrorTest_174AD37BED6EA47E-001/control-001]
   [junit4]   2> 1528690 WARN  (TEST-RemoteQueryErrorTest.test-seed#[174AD37BED6EA47E]) [    ] o.a.s.c.CoreContainer Couldn't add files from /Users/jenkins/workspace/Lucene-Solr-5.x-MacOSX/solr/build/solr-core/test/J0/temp/solr.cloud.RemoteQueryErrorTest_174AD37BED6EA47E-001/control-001/lib to classpath: /Users/jenkins/workspace/Lucene-Solr-5.x-MacOSX/solr/build/solr-core/test/J0/temp/solr.cloud.RemoteQueryErrorTest_174AD37BED6EA47E-001/control-001/lib
   [junit4]   2> 1528690 INFO  (TEST-RemoteQueryErrorTest.test-seed#[174AD37BED6EA47E]) [    ] o.a.s.h.c.HttpShardHandlerFactory created with socketTimeout : 90000,urlScheme : ,connTimeout : 15000,maxConnectionsPerHost : 20,maxConnections : 10000,corePoolSize : 0,maximumPoolSize : 2147483647,maxThreadIdleTime : 5,sizeOfQueue : -1,fairnessPolicy : false,useRetries : false,
   [junit4]   2> 1528692 INFO  (TEST-RemoteQueryErrorTest.test-seed#[174AD37BED6EA47E]) [    ] o.a.s.u.UpdateShardHandler Creating UpdateShardHandler HTTP client with params: socketTimeout=340000&connTimeout=45000&retry=true
   [junit4]   2> 1528693 INFO  (TEST-RemoteQueryErrorTest.test-seed#[174AD37BED6EA47E]) [    ] o.a.s.l.LogWatcher SLF4J impl is org.slf4j.impl.Log4jLoggerFactory
   [junit4]   2> 1528693 INFO  (TEST-RemoteQueryErrorTest.test-seed#[174AD37BED6EA47E]) [    ] o.a.s.l.LogWatcher Registering Log Listener [Log4j (org.slf4j.impl.Log4jLoggerFactory)]
   [junit4]   2> 1528693 INFO  (TEST-RemoteQueryErrorTest.test-seed#[174AD37BED6EA47E]) [    ] o.a.s.c.ZkContainer Zookeeper client=127.0.0.1:63421/solr
   [junit4]   2> 1528693 INFO  (TEST-RemoteQueryErrorTest.test-seed#[174AD37BED6EA47E]) [    ] o.a.s.c.ZkController zkHost includes chroot
   [junit4]   2> 1528693 INFO  (TEST-RemoteQueryErrorTest.test-seed#[174AD37BED6EA47E]) [    ] o.a.s.c.c.SolrZkClient Using default ZkCredentialsProvider
   [junit4]   2> 1528694 INFO  (TEST-RemoteQueryErrorTest.test-seed#[174AD37BED6EA47E]) [    ] o.a.s.c.c.ConnectionManager Waiting for client to connect to ZooKeeper
   [junit4]   2> 1528696 INFO  (zkCallback-2020-thread-1) [    ] o.a.s.c.c.ConnectionManager Watcher org.apache.solr.common.cloud.ConnectionManager@b57f43e name:ZooKeeperConnection Watcher:127.0.0.1:63421 got event WatchedEvent state:SyncConnected type:None path:null path:null type:None
   [junit4]   2> 1528696 INFO  (TEST-RemoteQueryErrorTest.test-seed#[174AD37BED6EA47E]) [    ] o.a.s.c.c.ConnectionManager Client is connected to ZooKeeper
   [junit4]   2> 1528696 INFO  (TEST-RemoteQueryErrorTest.test-seed#[174AD37BED6EA47E]) [    ] o.a.s.c.c.SolrZkClient Using default ZkACLProvider
   [junit4]   2> 1528699 INFO  (TEST-RemoteQueryErrorTest.test-seed#[174AD37BED6EA47E]) [n:127.0.0.1:63424_    ] o.a.s.c.c.ConnectionManager Waiting for client to connect to ZooKeeper
   [junit4]   2> 1528701 INFO  (zkCallback-2021-thread-1-processing-n:127.0.0.1:63424_) [n:127.0.0.1:63424_    ] o.a.s.c.c.ConnectionManager Watcher org.apache.solr.common.cloud.ConnectionManager@6eab60d5 name:ZooKeeperConnection Watcher:127.0.0.1:63421/solr got event WatchedEvent state:SyncConnected type:None path:null path:null type:None
   [junit4]   2> 1528701 INFO  (TEST-RemoteQueryErrorTest.test-seed#[174AD37BED6EA47E]) [n:127.0.0.1:63424_    ] o.a.s.c.c.ConnectionManager Client is connected to ZooKeeper
   [junit4]   2> 1528702 INFO  (TEST-RemoteQueryErrorTest.test-seed#[174AD37BED6EA47E]) [n:127.0.0.1:63424_    ] o.a.s.c.c.SolrZkClient makePath: /overseer/queue
   [junit4]   2> 1528707 INFO  (TEST-RemoteQueryErrorTest.test-seed#[174AD37BED6EA47E]) [n:127.0.0.1:63424_    ] o.a.s.c.c.SolrZkClient makePath: /overseer/collection-queue-work
   [junit4]   2> 1528714 INFO  (TEST-RemoteQueryErrorTest.test-seed#[174AD37BED6EA47E]) [n:127.0.0.1:63424_    ] o.a.s.c.c.SolrZkClient makePath: /overseer/collection-map-running
   [junit4]   2> 1528718 INFO  (TEST-RemoteQueryErrorTest.test-seed#[174AD37BED6EA47E]) [n:127.0.0.1:63424_    ] o.a.s.c.c.SolrZkClient makePath: /overseer/collection-map-completed
   [junit4]   2> 1528723 INFO  (TEST-RemoteQueryErrorTest.test-seed#[174AD37BED6EA47E]) [n:127.0.0.1:63424_    ] o.a.s.c.c.SolrZkClient makePath: /overseer/collection-map-failure
   [junit4]   2> 1528728 INFO  (TEST-RemoteQueryErrorTest.test-seed#[174AD37BED6EA47E]) [n:127.0.0.1:63424_    ] o.a.s.c.c.SolrZkClient makePath: /live_nodes
   [junit4]   2> 1528732 INFO  (TEST-RemoteQueryErrorTest.test-seed#[174AD37BED6EA47E]) [n:127.0.0.1:63424_    ] o.a.s.c.c.SolrZkClient makePath: /aliases.json
   [junit4]   2> 1528734 INFO  (TEST-RemoteQueryErrorTest.test-seed#[174AD37BED6EA47E]) [n:127.0.0.1:63424_    ] o.a.s.c.c.SolrZkClient makePath: /clusterstate.json
   [junit4]   2> 1528737 INFO  (TEST-RemoteQueryErrorTest.test-seed#[174AD37BED6EA47E]) [n:127.0.0.1:63424_    ] o.a.s.c.c.SolrZkClient makePath: /security.json
   [junit4]   2> 1528739 INFO  (TEST-RemoteQueryErrorTest.test-seed#[174AD37BED6EA47E]) [n:127.0.0.1:63424_    ] o.a.s.c.ZkController Register node as live in ZooKeeper:/live_nodes/127.0.0.1:63424_
   [junit4]   2> 1528740 INFO  (TEST-RemoteQueryErrorTest.test-seed#[174AD37BED6EA47E]) [n:127.0.0.1:63424_    ] o.a.s.c.c.SolrZkClient makePath: /live_nodes/127.0.0.1:63424_
   [junit4]   2> 1528743 INFO  (TEST-RemoteQueryErrorTest.test-seed#[174AD37BED6EA47E]) [n:127.0.0.1:63424_    ] o.a.s.c.c.SolrZkClient makePath: /overseer_elect
   [junit4]   2> 1528746 INFO  (TEST-RemoteQueryErrorTest.test-seed#[174AD37BED6EA47E]) [n:127.0.0.1:63424_    ] o.a.s.c.c.SolrZkClient makePath: /overseer_elect/election
   [junit4]   2> 1528749 INFO  (TEST-RemoteQueryErrorTest.test-seed#[174AD37BED6EA47E]) [n:127.0.0.1:63424_    ] o.a.s.c.Overseer Overseer (id=null) closing
   [junit4]   2> 1528750 INFO  (TEST-RemoteQueryErrorTest.test-seed#[174AD37BED6EA47E]) [n:127.0.0.1:63424_    ] o.a.s.c.LeaderElector Joined leadership election with path: /overseer_elect/election/95393819931312132-127.0.0.1:63424_-n_0000000000
   [junit4]   2> 1528751 INFO  (TEST-RemoteQueryErrorTest.test-seed#[174AD37BED6EA47E]) [n:127.0.0.1:63424_    ] o.a.s.c.OverseerElectionContext I am going to be the leader 127.0.0.1:63424_
   [junit4]   2> 1528751 INFO  (TEST-RemoteQueryErrorTest.test-seed#[174AD37BED6EA47E]) [n:127.0.0.1:63424_    ] o.a.s.c.c.SolrZkClient makePath: /overseer_elect/leader
   [junit4]   2> 1528754 INFO  (TEST-RemoteQueryErrorTest.test-seed#[174AD37BED6EA47E]) [n:127.0.0.1:63424_    ] o.a.s.c.Overseer Overseer (id=95393819931312132-127.0.0.1:63424_-n_0000000000) starting
   [junit4]   2> 1528759 INFO  (TEST-RemoteQueryErrorTest.test-seed#[174AD37BED6EA47E]) [n:127.0.0.1:63424_    ] o.a.s.c.c.SolrZkClient makePath: /overseer/queue-work
   [junit4]   2> 1528771 INFO  (TEST-RemoteQueryErrorTest.test-seed#[174AD37BED6EA47E]) [n:127.0.0.1:63424_    ] o.a.s.c.OverseerAutoReplicaFailoverThread Starting OverseerAutoReplicaFailoverThread autoReplicaFailoverWorkLoopDelay=10000 autoReplicaFailoverWaitAfterExpiration=30000 autoReplicaFailoverBadNodeExpiration=60000
   [junit4]   2> 1528771 INFO  (TEST-RemoteQueryErrorTest.test-seed#[174AD37BED6EA47E]) [n:127.0.0.1:63424_    ] o.a.s.c.c.ZkStateReader Updating cluster state from ZooKeeper... 
   [junit4]   2> 1528771 INFO  (OverseerCollectionConfigSetProcessor-95393819931312132-127.0.0.1:63424_-n_0000000000) [n:127.0.0.1:63424_    ] o.a.s.c.OverseerTaskProcessor Process current queue of overseer operations
   [junit4]   2> 1528772 INFO  (OverseerStateUpdate-95393819931312132-127.0.0.1:63424_-n_0000000000) [n:127.0.0.1:63424_    ] o.a.s.c.Overseer Starting to work on the main queue
   [junit4]   2> 1528790 INFO  (TEST-RemoteQueryErrorTest.test-seed#[174AD37BED6EA47E]) [n:127.0.0.1:63424_    ] o.a.s.c.CoreContainer Security conf doesn't exist. Skipping setup for authorization module.
   [junit4]   2> 1528790 INFO  (TEST-RemoteQueryErrorTest.test-seed#[174AD37BED6EA47E]) [n:127.0.0.1:63424_    ] o.a.s.c.CoreContainer No authentication plugin used.
   [junit4]   2> 1528791 INFO  (TEST-RemoteQueryErrorTest.test-seed#[174AD37BED6EA47E]) [n:127.0.0.1:63424_    ] o.a.s.c.CorePropertiesLocator Looking for core definitions underneath /Users/jenkins/workspace/Lucene-Solr-5.x-MacOSX/solr/build/solr-core/test/J0/../../../../../../../../../Users/jenkins/workspace/Lucene-Solr-5.x-MacOSX/solr/build/solr-core/test/J0/temp/solr.cloud.RemoteQueryErrorTest_174AD37BED6EA47E-001/control-001/cores
   [junit4]   2> 1528793 INFO  (TEST-RemoteQueryErrorTest.test-seed#[174AD37BED6EA47E]) [n:127.0.0.1:63424_    ] o.a.s.c.CoreDescriptor Created CoreDescriptor: {name=collection1, config=solrconfig.xml, transient=false, schema=schema.xml, loadOnStartup=true, configSetProperties=configsetprops.json, collection=control_collection, coreNodeName=, dataDir=data/, shard=}
   [junit4]   2> 1528793 INFO  (TEST-RemoteQueryErrorTest.test-seed#[174AD37BED6EA47E]) [n:127.0.0.1:63424_    ] o.a.s.c.CorePropertiesLocator Found core collection1 in /Users/jenkins/workspace/Lucene-Solr-5.x-MacOSX/solr/build/solr-core/test/J0/../../../../../../../../../Users/jenkins/workspace/Lucene-Solr-5.x-MacOSX/solr/build/solr-core/test/J0/temp/solr.cloud.RemoteQueryErrorTest_174AD37BED6EA47E-001/control-001/cores/collection1
   [junit4]   2> 1528793 INFO  (TEST-RemoteQueryErrorTest.test-seed#[174AD37BED6EA47E]) [n:127.0.0.1:63424_    ] o.a.s.c.CorePropertiesLocator Found 1 core definitions
   [junit4]   2> 1528795 INFO  (TEST-RemoteQueryErrorTest.test-seed#[174AD37BED6EA47E]) [n:127.0.0.1:63424_    ] o.a.s.s.SolrDispatchFilter user.dir=/Users/jenkins/workspace/Lucene-Solr-5.x-MacOSX/solr/build/solr-core/test/J0
   [junit4]   2> 1528795 INFO  (TEST-RemoteQueryErrorTest.test-seed#[174AD37BED6EA47E]) [n:127.0.0.1:63424_    ] o.a.s.s.SolrDispatchFilter SolrDispatchFilter.init() done
   [junit4]   2> 1528795 INFO  (coreLoadExecutor-4997-thread-1-processing-n:127.0.0.1:63424_) [n:127.0.0.1:63424_ c:control_collection   x:collection1] o.a.s.c.ZkController publishing state=down
   [junit4]   2> 1528795 INFO  (coreLoadExecutor-4997-thread-1-processing-n:127.0.0.1:63424_) [n:127.0.0.1:63424_ c:control_collection   x:collection1] o.a.s.c.ZkController numShards not found on descriptor - reading it from system property
   [junit4]   2> 1528799 INFO  (OverseerStateUpdate-95393819931312132-127.0.0.1:63424_-n_0000000000) [n:127.0.0.1:63424_    ] o.a.s.c.Overseer processMessage: queueSize: 1, message = {
   [junit4]   2>   "core":"collection1",
   [junit4]   2>   "roles":null,
   [junit4]   2>   "base_url":"http://127.0.0.1:63424",
   [junit4]   2>   "node_name":"127.0.0.1:63424_",
   [junit4]   2>   "numShards":"1",
   [junit4]   2>   "state":"down",
   [junit4]   2>   "shard":null,
   [junit4]   2>   "collection":"control_collection",
   [junit4]   2>   "operation":"state"} current state version: 0
   [junit4]   2> 1528800 INFO  (coreLoadExecutor-4997-thread-1-processing-n:127.0.0.1:63424_) [n:127.0.0.1:63424_ c:control_collection   x:collection1] o.a.s.c.ZkController look for our core node name
   [junit4]   2> 1528801 INFO  (OverseerStateUpdate-95393819931312132-127.0.0.1:63424_-n_0000000000) [n:127.0.0.1:63424_    ] o.a.s.c.o.ReplicaMutator Update state numShards=1 message={
   [junit4]   2>   "core":"collection1",
   [junit4]   2>   "roles":null,
   [junit4]   2>   "base_url":"http://127.0.0.1:63424",
   [junit4]   2>   "node_name":"127.0.0.1:63424_",
   [junit4]   2>   "numShards":"1",
   [junit4]   2>   "state":"down",
   [junit4]   2>   "shard":null,
   [junit4]   2>   "collection":"control_collection",
   [junit4]   2>   "operation":"state"}
   [junit4]   2> 1528802 INFO  (OverseerStateUpdate-95393819931312132-127.0.0.1:63424_-n_0000000000) [n:127.0.0.1:63424_    ] o.a.s.c.o.ClusterStateMutator building a new cName: control_collection
   [junit4]   2> 1528803 INFO  (OverseerStateUpdate-95393819931312132-127.0.0.1:63424_-n_0000000000) [n:127.0.0.1:63424_    ] o.a.s.c.o.ReplicaMutator Assigning new node to shard shard=shard1
   [junit4]   2> 1528805 INFO  (zkCallback-2021-thread-1-processing-n:127.0.0.1:63424_) [n:127.0.0.1:63424_    ] o.a.s.c.c.ZkStateReader A cluster state change: [WatchedEvent state:SyncConnected type:NodeDataChanged path:/clusterstate.json], has occurred - updating... (live nodes size: [1])
   [junit4]   2> 1529802 INFO  (coreLoadExecutor-4997-thread-1-processing-n:127.0.0.1:63424_) [n:127.0.0.1:63424_ c:control_collection   x:collection1] o.a.s.c.ZkController waiting to find shard id in clusterstate for collection1
   [junit4]   2> 1529802 INFO  (coreLoadExecutor-4997-thread-1-processing-n:127.0.0.1:63424_) [n:127.0.0.1:63424_ c:control_collection   x:collection1] o.a.s.c.ZkController Check for collection zkNode:control_collection
   [junit4]   2> 1529803 INFO  (coreLoadExecutor-4997-thread-1-processing-n:127.0.0.1:63424_) [n:127.0.0.1:63424_ c:control_collection   x:collection1] o.a.s.c.ZkController Collection zkNode exists
   [junit4]   2> 1529803 INFO  (coreLoadExecutor-4997-thread-1-processing-n:127.0.0.1:63424_) [n:127.0.0.1:63424_ c:control_collection   x:collection1] o.a.s.c.c.ZkStateReader Load collection config from: [/collections/control_collection]
   [junit4]   2> 1529805 INFO  (coreLoadExecutor-4997-thread-1-processing-n:127.0.0.1:63424_) [n:127.0.0.1:63424_ c:control_collection   x:collection1] o.a.s.c.c.ZkStateReader path=[/collections/control_collection] [configName]=[conf1] specified config exists in ZooKeeper
   [junit4]   2> 1529805 INFO  (coreLoadExecutor-4997-thread-1-processing-n:127.0.0.1:63424_) [n:127.0.0.1:63424_ c:control_collection   x:collection1] o.a.s.c.SolrResourceLoader new SolrResourceLoader for directory: '/Users/jenkins/workspace/Lucene-Solr-5.x-MacOSX/solr/build/solr-core/test/J0/temp/solr.cloud.RemoteQueryErrorTest_174AD37BED6EA47E-001/control-001/cores/collection1'
   [junit4]   2> 1529805 INFO  (coreLoadExecutor-4997-thread-1-processing-n:127.0.0.1:63424_) [n:127.0.0.1:63424_ c:control_collection   x:collection1] o.a.s.c.SolrResourceLoader JNDI not configured for solr (NoInitialContextEx)
   [junit4]   2> 1529805 INFO  (coreLoadExecutor-4997-thread-1-processing-n:127.0.0.1:63424_) [n:127.0.0.1:63424_ c:control_collection   x:collection1] o.a.s.c.SolrResourceLoader solr home defaulted to 'solr/' (could not find system property or JNDI)
   [junit4]   2> 1529807 INFO  (coreLoadExecutor-4997-thread-1-processing-n:127.0.0.1:63424_) [n:127.0.0.1:63424_ c:control_collection   x:collection1] o.a.s.c.Config loaded config solrconfig.xml with version 0 
   [junit4]   2> 1529814 INFO  (coreLoadExecutor-4997-thread-1-processing-n:127.0.0.1:63424_) [n:127.0.0.1:63424_ c:control_collection   x:collection1] o.a.s.c.SolrConfig current version of requestparams : -1
   [junit4]   2> 1529816 INFO  (coreLoadExecutor-4997-thread-1-processing-n:127.0.0.1:63424_) [n:127.0.0.1:63424_ c:control_collection   x:collection1] o.a.s.c.SolrConfig Using Lucene MatchVersion: 5.6.0
   [junit4]   2> 1529821 INFO  (coreLoadExecutor-4997-thread-1-processing-n:127.0.0.1:63424_) [n:127.0.0.1:63424_ c:control_collection   x:collection1] o.a.s.c.SolrConfig Loaded SolrConfig: solrconfig.xml
   [junit4]   2> 1529827 INFO  (coreLoadExecutor-4997-thread-1-processing-n:127.0.0.1:63424_) [n:127.0.0.1:63424_ c:control_collection   x:collection1] o.a.s.s.IndexSchema [collection1] Schema name=test
   [junit4]   2> 1529908 INFO  (coreLoadExecutor-4997-thread-1-processing-n:127.0.0.1:63424_) [n:127.0.0.1:63424_ c:control_collection   x:collection1] o.a.s.s.OpenExchangeRatesOrgProvider Initialized with rates=open-exchange-rates.json, refreshInterval=1440.
   [junit4]   2> 1529921 INFO  (coreLoadExecutor-4997-thread-1-processing-n:127.0.0.1:63424_) [n:127.0.0.1:63424_ c:control_collection   x:collection1] o.a.s.s.IndexSchema default search field in schema is text
   [junit4]   2> 1529923 INFO  (coreLoadExecutor-4997-thread-1-processing-n:127.0.0.1:63424_) [n:127.0.0.1:63424_ c:control_collection   x:collection1] o.a.s.s.IndexSchema unique key field: id
   [junit4]   2> 1529947 INFO  (coreLoadExecutor-4997-thread-1-processing-n:127.0.0.1:63424_) [n:127.0.0.1:63424_ c:control_collection   x:collection1] o.a.s.s.FileExchangeRateProvider Reloading exchange rates from file currency.xml
   [junit4]   2> 1529952 INFO  (coreLoadExecutor-4997-thread-1-processing-n:127.0.0.1:63424_) [n:127.0.0.1:63424_ c:control_collection   x:collection1] o.a.s.s.FileExchangeRateProvider Reloading exchange rates from file currency.xml
   [junit4]   2> 1529956 INFO  (coreLoadExecutor-4997-thread-1-processing-n:127.0.0.1:63424_) [n:127.0.0.1:63424_ c:control_collection   x:collection1] o.a.s.s.OpenExchangeRatesOrgProvider Reloading exchange rates from open-exchange-rates.json
   [junit4]   2> 1529958 INFO  (coreLoadExecutor-4997-thread-1-processing-n:127.0.0.1:63424_) [n:127.0.0.1:63424_ c:control_collection   x:collection1] o.a.s.s.OpenExchangeRatesOrgProvider Reloading exchange rates from open-exchange-rates.json
   [junit4]   2> 1529963 INFO  (coreLoadExecutor-4997-thread-1-processing-n:127.0.0.1:63424_) [n:127.0.0.1:63424_ c:control_collection   x:collection1] o.a.s.c.ConfigSetProperties Did not find ConfigSet properties, assuming default properties: Can't find resource 'configsetprops.json' in classpath or '/configs/conf1', cwd=/Users/jenkins/workspace/Lucene-Solr-5.x-MacOSX/solr/build/solr-core/test/J0
   [junit4]   2> 1529963 INFO  (coreLoadExecutor-4997-thread-1-processing-n:127.0.0.1:63424_) [n:127.0.0.1:63424_ c:control_collection   x:collection1] o.a.s.c.CoreContainer Creating SolrCore 'collection1' using configuration from collection control_collection
   [junit4]   2> 1529963 INFO  (coreLoadExecutor-4997-thread-1-processing-n:127.0.0.1:63424_) [n:127.0.0.1:63424_ c:control_collection s:shard1 r:core_node1 x:collection1] o.a.s.c.SolrCore org.apache.solr.core.MockDirectoryFactory
   [junit4]   2> 1529963 INFO  (coreLoadExecutor-4997-thread-1-processing-n:127.0.0.1:63424_) [n:127.0.0.1:63424_ c:control_collection s:shard1 r:core_node1 x:collection1] o.a.s.c.SolrCore [[collection1] ] Opening new SolrCore at [/Users/jenkins/workspace/Lucene-Solr-5.x-MacOSX/solr/build/solr-core/test/J0/temp/solr.cloud.RemoteQueryErrorTest_174AD37BED6EA47E-001/control-001/cores/collection1], dataDir=[/Users/jenkins/workspace/Lucene-Solr-5.x-MacOSX/solr/build/solr-core/test/J0/../../../../../../../../../Users/jenkins/workspace/Lucene-Solr-5.x-MacOSX/solr/build/solr-core/test/J0/temp/solr.cloud.RemoteQueryErrorTest_174AD37BED6EA47E-001/control-001/cores/collection1/data/]
   [junit4]   2> 1529964 INFO  (coreLoadExecutor-4997-thread-1-processing-n:127.0.0.1:63424_) [n:127.0.0.1:63424_ c:control_collection s:shard1 r:core_node1 x:collection1] o.a.s.c.JmxMonitoredMap JMX monitoring is enabled. Adding Solr mbeans to JMX Server: com.sun.jmx.mbeanserver.JmxMBeanServer@32c0b27f
   [junit4]   2> 1529964 INFO  (coreLoadExecutor-4997-thread-1-processing-n:127.0.0.1:63424_) [n:127.0.0.1:63424_ c:control_collection s:shard1 r:core_node1 x:collection1] o.a.s.c.CachingDirectoryFactory return new directory for /Users/jenkins/workspace/Lucene-Solr-5.x-MacOSX/solr/build/solr-core/test/J0/../../../../../../../../../Users/jenkins/workspace/Lucene-Solr-5.x-MacOSX/solr/build/solr-core/test/J0/temp/solr.cloud.RemoteQueryErrorTest_174AD37BED6EA47E-001/control-001/cores/collection1/data
   [junit4]   2> 1529964 INFO  (coreLoadExecutor-4997-thread-1-processing-n:127.0.0.1:63424_) [n:127.0.0.1:63424_ c:control_collection s:shard1 r:core_node1 x:collection1] o.a.s.c.SolrCore New index directory detected: old=null new=/Users/jenkins/workspace/Lucene-Solr-5.x-MacOSX/solr/build/solr-core/test/J0/../../../../../../../../../Users/jenkins/workspace/Lucene-Solr-5.x-MacOSX/solr/build/solr-core/test/J0/temp/solr.cloud.RemoteQueryErrorTest_174AD37BED6EA47E-001/control-001/cores/collection1/data/index/
   [junit4]   2> 1529965 WARN  (coreLoadExecutor-4997-thread-1-processing-n:127.0.0.1:63424_) [n:127.0.0.1:63424_ c:control_collection s:shard1 r:core_node1 x:collection1] o.a.s.c.SolrCore [collection1] Solr index directory '/Users/jenkins/workspace/Lucene-Solr-5.x-MacOSX/solr/build/solr-core/test/J0/../../../../../../../../../Users/jenkins/workspace/Lucene-Solr-5.x-MacOSX/solr/build/solr-core/test/J0/temp/solr.cloud.RemoteQueryErrorTest_174AD37BED6EA47E-001/control-001/cores/collection1/data/index' doesn't exist. Creating new index...
   [junit4]   2> 1529965 INFO  (coreLoadExecutor-4997-thread-1-processing-n:127.0.0.1:63424_) [n:127.0.0.1:63424_ c:control_collection s:shard1 r:core_node1 x:collection1] o.a.s.c.CachingDirectoryFactory return new directory for /Users/jenkins/workspace/Lucene-Solr-5.x-MacOSX/solr/build/solr-core/test/J0/../../../../../../../../../Users/jenkins/workspace/Lucene-Solr-5.x-MacOSX/solr/build/solr-core/test/J0/temp/solr.cloud.RemoteQueryErrorTest_174AD37BED6EA47E-001/control-001/cores/collection1/data/index
   [junit4]   2> 1529965 INFO  (coreLoadExecutor-4997-thread-1-processing-n:127.0.0.1:63424_) [n:127.0.0.1:63424_ c:control_collection s:shard1 r:core_node1 x:collection1] o.a.s.u.RandomMergePolicy RandomMergePolicy wrapping class org.apache.lucene.index.LogByteSizeMergePolicy: [LogByteSizeMergePolicy: minMergeSize=1677721, mergeFactor=17, maxMergeSize=2147483648, maxMergeSizeForForcedMerge=9223372036854775807, calibrateSizeByDeletes=false, maxMergeDocs=2147483647, maxCFSSegmentSizeMB=8.796093022207999E12, noCFSRatio=1.0]
   [junit4]   2> 1529966 INFO  (coreLoadExecutor-4997-thread-1-processing-n:127.0.0.1:63424_) [n:127.0.0.1:63424_ c:control_collection s:shard1 r:core_node1 x:collection1] o.a.s.c.SolrDeletionPolicy SolrDeletionPolicy.onCommit: commits: num=1
   [junit4]   2> 	commit{dir=MockDirectoryWrapper(RAMDirectory@42f2ca73 lockFactory=org.apache.lucene.store.SingleInstanceLockFactory@1444d89),segFN=segments_1,generation=1}
   [junit4]   2> 1529966 INFO  (coreLoadExecutor-4997-thread-1-processing-n:127.0.0.1:63424_) [n:127.0.0.1:63424_ c:control_collection s:shard1 r:core_node1 x:collection1] o.a.s.c.SolrDeletionPolicy newest commit generation = 1
   [junit4]   2> 1529966 INFO  (OldIndexDirectoryCleanupThreadForCore-collection1) [n:127.0.0.1:63424_ c:control_collection s:shard1 r:core_node1 x:collection1] o.a.s.c.SolrCore Looking for old index directories to cleanup for core collection1 in /Users/jenkins/workspace/Lucene-Solr-5.x-MacOSX/solr/build/solr-core/test/J0/../../../../../../../../../Users/jenkins/workspace/Lucene-Solr-5.x-MacOSX/solr/build/solr-core/test/J0/temp/solr.cloud.RemoteQueryErrorTest_174AD37BED6EA47E-001/control-001/cores/collection1/data/
   [junit4]   2> 1529967 WARN  (OldIndexDirectoryCleanupThreadForCore-collection1) [n:127.0.0.1:63424_ c:control_collection s:shard1 r:core_node1 x:collection1] o.a.s.c.DirectoryFactory /Users/jenkins/workspace/Lucene-Solr-5.x-MacOSX/solr/build/solr-core/test/J0/../../../../../../../../../Users/jenkins/workspace/Lucene-Solr-5.x-MacOSX/solr/build/solr-core/test/J0/temp/solr.cloud.RemoteQueryErrorTest_174AD37BED6EA47E-001/control-001/cores/collection1/data/ does not point to a valid data directory; skipping clean-up of old index directories.
   [junit4]   2> 1529969 INFO  (coreLoadExecutor-4997-thread-1-processing-n:127.0.0.1:63424_) [n:127.0.0.1:63424_ c:control_collection s:shard1 r:core_node1 x:collection1] o.a.s.u.p.UpdateRequestProcessorChain creating updateRequestProcessorChain "nodistrib"
   [junit4]   2> 1529969 INFO  (coreLoadExecutor-4997-thread-1-processing-n:127.0.0.1:63424_) [n:127.0.0.1:63424_ c:control_collection s:shard1 r:core_node1 x:collection1] o.a.s.u.p.UpdateRequestProcessorChain creating updateRequestProcessorChain "dedupe"
   [junit4]   2> 1529969 INFO  (coreLoadExecutor-4997-thread-1-processing-n:127.0.0.1:63424_) [n:127.0.0.1:63424_ c:control_collection s:shard1 r:core_node1 x:collection1] o.a.s.u.p.UpdateRequestProcessorChain inserting DistributedUpdateProcessorFactory into updateRequestProcessorChain "dedupe"
   [junit4]   2> 1529970 INFO  (coreLoadExecutor-4997-thread-1-processing-n:127.0.0.1:63424_) [n:127.0.0.1:63424_ c:control_collection s:shard1 r:core_node1 x:collection1] o.a.s.u.p.UpdateRequestProcessorChain creating updateRequestProcessorChain "stored_sig"
   [junit4]   2> 1529970 INFO  (coreLoadExecutor-4997-thread-1-processing-n:127.0.0.1:63424_) [n:127.0.0.1:63424_ c:control_collection s:shard1 r:core_node1 x:collection1] o.a.s.u.p.UpdateRequestProcessorChain inserting DistributedUpdateProcessorFactory into updateRequestProcessorChain "stored_sig"
   [junit4]   2> 1529970 INFO  (coreLoadExecutor-4997-thread-1-processing-n:127.0.0.1:63424_) [n:127.0.0.1:63424_ c:control_collection s:shard1 r:core_node1 x:collection1] o.a.s.u.p.UpdateRequestProcessorChain creating updateRequestProcessorChain "distrib-dup-test-chain-explicit"
   [junit4]   2> 1529970 INFO  (coreLoadExecutor-4997-thread-1-processing-n:127.0.0.1:63424_) [n:127.0.0.1:63424_ c:control_collection s:shard1 r:core_node1 x:collection1] o.a.s.u.p.UpdateRequestProcessorChain creating updateRequestProcessorChain "distrib-dup-test-chain-implicit"
   [junit4]   2> 1529970 INFO  (coreLoadExecutor-4997-thread-1-processing-n:127.0.0.1:63424_) [n:127.0.0.1:63424_ c:control_collection s:shard1 r:core_node1 x:collection1] o.a.s.u.p.UpdateRequestProcessorChain inserting DistributedUpdateProcessorFactory into updateRequestProcessorChain "distrib-dup-test-chain-implicit"
   [junit4]   2> 1529970 INFO  (coreLoadExecutor-4997-thread-1-processing-n:127.0.0.1:63424_) [n:127.0.0.1:63424_ c:control_collection s:shard1 r:core_node1 x:collection1] o.a.s.c.SolrCore no updateRequestProcessorChain defined as default, creating implicit default
   [junit4]   2> 1529970 WARN  (coreLoadExecutor-4997-thread-1-processing-n:127.0.0.1:63424_) [n:127.0.0.1:63424_ c:control_collection s:shard1 r:core_node1 x:collection1] o.a.s.c.RequestHandlers INVALID paramSet a in requestHandler {type = requestHandler,name = /dump,class = DumpRequestHandler,args = {defaults={a=A,b=B}}}
   [junit4]   2> 1529974 INFO  (coreLoadExecutor-4997-thread-1-processing-n:127.0.0.1:63424_) [n:127.0.0.1:63424_ c:control_collection s:shard1 r:core_node1 x:collection1] o.a.s.h.l.XMLLoader xsltCacheLifetimeSeconds=60
   [junit4]   2> 1529976 INFO  (coreLoadExecutor-4997-thread-1-processing-n:127.0.0.1:63424_) [n:127.0.0.1:63424_ c:control_collection s:shard1 r:core_node1 x:collection1] o.a.s.h.l.XMLLoader xsltCacheLifetimeSeconds=60
   [junit4]   2> 1529977 INFO  (coreLoadExecutor-4997-thread-1-processing-n:127.0.0.1:63424_) [n:127.0.0.1:63424_ c:control_collection s:shard1 r:core_node1 x:collection1] o.a.s.h.l.XMLLoader xsltCacheLifetimeSeconds=60
   [junit4]   2> 1529979 INFO  (coreLoadExecutor-4997-thread-1-processing-n:127.0.0.1:63424_) [n:127.0.0.1:63424_ c:control_collection s:shard1 r:core_node1 x:collection1] o.a.s.h.l.XMLLoader xsltCacheLifetimeSeconds=60
   [junit4]   2> 1529982 INFO  (coreLoadExecutor-4997-thread-1-processing-n:127.0.0.1:63424_) [n:127.0.0.1:63424_ c:control_collection s:shard1 r:core_node1 x:collection1] o.a.s.c.RequestHandlers Registered paths: /admin/mbeans,standard,/dump,/update/csv,/update/json/docs,/admin/luke,/admin/segments,/get,/admin/system,/replication,/admin/properties,/config,/schema,/admin/plugins,/admin/logging,/update/json,/admin/threads,/admin/ping,/update,/admin/file
   [junit4]   2> 1529983 INFO  (coreLoadExecutor-4997-thread-1-processing-n:127.0.0.1:63424_) [n:127.0.0.1:63424_ c:control_collection s:shard1 r:core_node1 x:collection1] o.a.s.c.SolrCore Using default statsCache cache: org.apache.solr.search.stats.LocalStatsCache
   [junit4]   2> 1529985 INFO  (coreLoadExecutor-4997-thread-1-processing-n:127.0.0.1:63424_) [n:127.0.0.1:63424_ c:control_collection s:shard1 r:core_node1 x:collection1] o.a.s.u.UpdateHandler Using UpdateLog implementation: org.apache.solr.update.UpdateLog
   [junit4]   2> 1529985 INFO  (coreLoadExecutor-4997-thread-1-processing-n:127.0.0.1:63424_) [n:127.0.0.1:63424_ c:control_collection s:shard1 r:core_node1 x:collection1] o.a.s.u.UpdateLog Initializing UpdateLog: dataDir= defaultSyncLevel=FLUSH numRecordsToKeep=100 maxNumLogsToKeep=10 numVersionBuckets=65536
   [junit4]   2> 1529986 INFO  (coreLoadExecutor-4997-thread-1-processing-n:127.0.0.1:63424_) [n:127.0.0.1:63424_ c:control_collection s:shard1 r:core_node1 x:collection1] o.a.s.u.CommitTracker Hard AutoCommit: disabled
   [junit4]   2> 1529986 INFO  (coreLoadExecutor-4997-thread-1-processing-n:127.0.0.1:63424_) [n:127.0.0.1:63424_ c:control_collection s:shard1 r:core_node1 x:collection1] o.a.s.u.CommitTracker Soft AutoCommit: disabled
   [junit4]   2> 1529987 INFO  (coreLoadExecutor-4997-thread-1-processing-n:127.0.0.1:63424_) [n:127.0.0.1:63424_ c:control_collection s:shard1 r:core_node1 x:collection1] o.a.s.u.RandomMergePolicy RandomMergePolicy wrapping class org.apache.lucene.index.LogDocMergePolicy: [LogDocMergePolicy: minMergeSize=1000, mergeFactor=33, maxMergeSize=9223372036854775807, maxMergeSizeForForcedMerge=9223372036854775807, calibrateSizeByDeletes=true, maxMergeDocs=2147483647, maxCFSSegmentSizeMB=8.796093022207999E12, noCFSRatio=0.45741380629935713]
   [junit4]   2> 1529987 INFO  (coreLoadExecutor-4997-thread-1-processing-n:127.0.0.1:63424_) [n:127.0.0.1:63424_ c:control_collection s:shard1 r:core_node1 x:collection1] o.a.s.c.SolrDeletionPolicy SolrDeletionPolicy.onInit: commits: num=1
   [junit4]   2> 	commit{dir=MockDirectoryWrapper(RAMDirectory@42f2ca73 lockFactory=org.apache.lucene.store.SingleInstanceLockFactory@1444d89),segFN=segments_1,generation=1}
   [junit4]   2> 1529987 INFO  (coreLoadExecutor-4997-thread-1-processing-n:127.0.0.1:63424_) [n:127.0.0.1:63424_ c:control_collection s:shard1 r:core_node1 x:collection1] o.a.s.c.SolrDeletionPolicy newest commit generation = 1
   [junit4]   2> 1529987 INFO  (coreLoadExecutor-4997-thread-1-processing-n:127.0.0.1:63424_) [n:127.0.0.1:63424_ c:control_collection s:shard1 r:core_node1 x:collection1] o.a.s.s.SolrIndexSearcher Opening Searcher@481998e3[collection1] main
   [junit4]   2> 1529987 INFO  (coreLoadExecutor-4997-thread-1-processing-n:127.0.0.1:63424_) [n:127.0.0.1:63424_ c:control_collection s:shard1 r:core_node1 x:collection1] o.a.s.c.c.ZkStateReader Load collection config from: [/collections/control_collection]
   [junit4]   2> 1529991 INFO  (coreLoadExecutor-4997-thread-1-processing-n:127.0.0.1:63424_) [n:127.0.0.1:63424_ c:control_collection s:shard1 r:core_node1 x:collection1] o.a.s.c.c.ZkStateReader path=[/collections/control_collection] [configName]=[conf1] specified config exists in ZooKeeper
   [junit4]   2> 1529991 INFO  (coreLoadExecutor-4997-thread-1-processing-n:127.0.0.1:63424_) [n:127.0.0.1:63424_ c:control_collection s:shard1 r:core_node1 x:collection1] o.a.s.r.ManagedResourceStorage Setting up ZooKeeper-based storage for the RestManager with znodeBase: /configs/conf1
   [junit4]   2> 1529992 INFO  (coreLoadExecutor-4997-thread-1-processing-n:127.0.0.1:63424_) [n:127.0.0.1:63424_ c:control_collection s:shard1 r:core_node1 x:collection1] o.a.s.r.ManagedResourceStorage Configured ZooKeeperStorageIO with znodeBase: /configs/conf1
   [junit4]   2> 1529992 INFO  (coreLoadExecutor-4997-thread-1-processing-n:127.0.0.1:63424_) [n:127.0.0.1:63424_ c:control_collection s:shard1 r:core_node1 x:collection1] o.a.s.r.RestManager Initializing RestManager with initArgs: {}
   [junit4]   2> 1529992 INFO  (coreLoadExecutor-4997-thread-1-processing-n:127.0.0.1:63424_) [n:127.0.0.1:63424_ c:control_collection s:shard1 r:core_node1 x:collection1] o.a.s.r.ManagedResourceStorage Reading _rest_managed.json using ZooKeeperStorageIO:path=/configs/conf1
   [junit4]   2> 1529993 INFO  (coreLoadExecutor-4997-thread-1-processing-n:127.0.0.1:63424_) [n:127.0.0.1:63424_ c:control_collection s:shard1 r:core_node1 x:collection1] o.a.s.r.ManagedResourceStorage No data found for znode /configs/conf1/_rest_managed.json
   [junit4]   2> 1529993 INFO  (coreLoadExecutor-4997-thread-1-processing-n:127.0.0.1:63424_) [n:127.0.0.1:63424_ c:control_collection s:shard1 r:core_node1 x:collection1] o.a.s.r.ManagedResourceStorage Loaded null at path _rest_managed.json using ZooKeeperStorageIO:path=/configs/conf1
   [junit4]   2> 1529994 INFO  (coreLoadExecutor-4997-thread-1-processing-n:127.0.0.1:63424_) [n:127.0.0.1:63424_ c:control_collection s:shard1 r:core_node1 x:collection1] o.a.s.r.RestManager Initializing 0 registered ManagedResources
   [junit4]   2> 1529994 INFO  (coreLoadExecutor-4997-thread-1-processing-n:127.0.0.1:63424_) [n:127.0.0.1:63424_ c:control_collection s:shard1 r:core_node1 x:collection1] o.a.s.h.ReplicationHandler Commits will be reserved for  10000
   [junit4]   2> 1529994 INFO  (searcherExecutor-4998-thread-1-processing-n:127.0.0.1:63424_ x:collection1 s:shard1 c:control_collection r:core_node1) [n:127.0.0.1:63424_ c:control_collection s:shard1 r:core_node1 x:collection1] o.a.s.c.SolrCore [collection1] Registered new searcher Searcher@481998e3[collection1] main{ExitableDirectoryReader(UninvertingDirectoryReader())}
   [junit4]   2> 1529995 INFO  (coreLoadExecutor-4997-thread-1-processing-n:127.0.0.1:63424_) [n:127.0.0.1:63424_ c:control_collection s:shard1 r:core_node1 x:collection1] o.a.s.u.UpdateLog Looking up max value of version field to seed version buckets
   [junit4]   2> 1529995 INFO  (coreLoadExecutor-4997-thread-1-processing-n:127.0.0.1:63424_) [n:127.0.0.1:63424_ c:control_collection s:shard1 r:core_node1 x:collection1] o.a.s.u.VersionInfo Refreshing highest value of _version_ for 65536 version buckets from index
   [junit4]   2> 1529995 INFO  (coreLoadExecutor-4997-thread-1-processing-n:127.0.0.1:63424_) [n:127.0.0.1:63424_ c:control_collection s:shard1 r:core_node1 x:collection1] o.a.s.u.VersionInfo No terms found for _version_, cannot seed version bucket highest value from index
   [junit4]   2> 1529995 INFO  (coreLoadExecutor-4997-thread-1-processing-n:127.0.0.1:63424_) [n:127.0.0.1:63424_ c:control_collection s:shard1 r:core_node1 x:collection1] o.a.s.u.UpdateLog Could not find max version in index or recent updates, using new clock 1526301121004437504
   [junit4]   2> 1529997 INFO  (coreLoadExecutor-4997-thread-1-processing-n:127.0.0.1:63424_) [n:127.0.0.1:63424_ c:control_collection s:shard1 r:core_node1 x:collection1] o.a.s.u.UpdateLog Took 2.0ms to seed version buckets with highest version 1526301121004437504
   [junit4]   2> 1529997 INFO  (coreLoadExecutor-4997-thread-1-processing-n:127.0.0.1:63424_) [n:127.0.0.1:63424_ c:control_collection s:shard1 r:core_node1 x:collection1] o.a.s.c.ZkController watch zkdir /configs/conf1
   [junit4]   2> 1529998 INFO  (coreLoadExecutor-4997-thread-1-processing-n:127.0.0.1:63424_) [n:127.0.0.1:63424_ c:control_collection s:shard1 r:core_node1 x:collection1] o.a.s.c.CoreContainer registering core: collection1
   [junit4]   2> 1529999 INFO  (coreZkRegister-4991-thread-1-processing-n:127.0.0.1:63424_ x:collection1 s:shard1 c:control_collection r:core_node1) [n:127.0.0.1:63424_ c:control_collection s:shard1 r:core_node1 x:collection1] o.a.s.c.ZkController Register replica - core:collection1 address:http://127.0.0.1:63424 collection:control_collection shard:shard1
   [junit4]   2> 1530002 INFO  (coreZkRegister-4991-thread-1-processing-n:127.0.0.1:63424_ x:collection1 s:shard1 c:control_collection r:core_node1) [n:127.0.0.1:63424_ c:control_collection s:shard1 r:core_node1 x:collection1] o.a.s.c.c.SolrZkClient makePath: /collections/control_collection/leader_elect/shard1/election
   [junit4]   2> 1530014 INFO  (coreZkRegister-4991-thread-1-processing-n:127.0.0.1:63424_ x:collection1 s:shard1 c:control_collection r:core_node1) [n:127.0.0.1:63424_ c:control_collection s:shard1 r:core_node1 x:collection1] o.a.s.c.LeaderElector Joined leadership election with path: /collections/control_collection/leader_elect/shard1/election/95393819931312132-core_node1-n_0000000000
   [junit4]   2> 1530015 INFO  (coreZkRegister-4991-thread-1-processing-n:127.0.0.1:63424_ x:collection1 s:shard1 c:control_collection r:core_node1) [n:127.0.0.1:63424_ c:control_collection s:shard1 r:core_node1 x:collection1] o.a.s.c.ShardLeaderElectionContext Running the leader process for shard=shard1 and weAreReplacement=false and leaderVoteWait=10000
   [junit4]   2> 1530019 INFO  (coreZkRegister-4991-thread-1-processing-n:127.0.0.1:63424_ x:collection1 s:shard1 c:control_collection r:core_node1) [n:127.0.0.1:63424_ c:control_collection s:shard1 r:core_node1 x:collection1] o.a.s.c.ShardLeaderElectionContext Enough replicas found to continue.
   [junit4]   2> 1530019 INFO  (coreZkRegister-4991-thread-1-processing-n:127.0.0.1:63424_ x:collection1 s:shard1 c:control_collection r:core_node1) [n:127.0.0.1:63424_ c:control_collection s:shard1 r:core_node1 x:collection1] o.a.s.c.ShardLeaderElectionContext I may be the new leader - try and sync
   [junit4]   2> 1530019 INFO  (coreZkRegister-4991-thread-1-processing-n:127.0.0.1:63424_ x:collection1 s:shard1 c:control_collection r:core_node1) [n:127.0.0.1:63424_ c:control_collection s:shard1 r:core_node1 x:collection1] o.a.s.c.SyncStrategy Sync replicas to http://127.0.0.1:63424/collection1/
   [junit4]   2> 1530019 INFO  (coreZkRegister-4991-thread-1-processing-n:127.0.0.1:63424_ x:collection1 s:shard1 c:control_collection r:core_node1) [n:127.0.0.1:63424_ c:control_collection s:shard1 r:core_node1 x:collection1] o.a.s.c.SyncStrategy Sync Success - now sync replicas to me
   [junit4]   2> 1530019 INFO  (coreZkRegister-4991-thread-1-processing-n:127.0.0.1:63424_ x:collection1 s:shard1 c:control_collection r:core_node1) [n:127.0.0.1:63424_ c:control_collection s:shard1 r:core_node1 x:collection1] o.a.s.c.SyncStrategy http://127.0.0.1:63424/collection1/ has no replicas
   [junit4]   2> 1530019 INFO  (OverseerStateUpdate-95393819931312132-127.0.0.1:63424_-n_0000000000) [n:127.0.0.1:63424_    ] o.a.s.c.Overseer processMessage: queueSize: 1, message = {
   [junit4]   2>   "operation":"leader",
   [junit4]   2>   "shard":"shard1",
   [junit4]   2>   "collection":"control_collection"} current state version: 1
   [junit4]   2> 1530021 INFO  (coreZkRegister-4991-thread-1-processing-n:127.0.0.1:63424_ x:collection1 s:shard1 c:control_collection r:core_node1) [n:127.0.0.1:63424_ c:control_collection s:shard1 r:core_node1 x:collection1] o.a.s.c.c.SolrZkClient makePath: /collections/control_collection/leaders/shard1
   [junit4]   2> 1530026 INFO  (coreZkRegister-4991-thread-1-processing-n:127.0.0.1:63424_ x:collection1 s:shard1 c:control_collection r:core_node1) [n:127.0.0.1:63424_ c:control_collection s:shard1 r:core_node1 x:collection1] o.a.s.c.ShardLeaderElectionContextBase Creating leader registration node
   [junit4]   2> 1530031 INFO  (coreZkRegister-4991-thread-1-processing-n:127.0.0.1:63424_ x:collection1 s:shard1 c:control_collection r:core_node1) [n:127.0.0.1:63424_ c:control_collection s:shard1 r:core_node1 x:collection1] o.a.s.c.ShardLeaderElectionContext I am the new leader: http://127.0.0.1:63424/collection1/ shard1
   [junit4]   2> 1530032 INFO  (OverseerStateUpdate-95393819931312132-127.0.0.1:63424_-n_0000000000) [n:127.0.0.1:63424_    ] o.a.s.c.Overseer processMessage: queueSize: 1, message = {
   [junit4]   2>   "operation":"leader",
   [junit4]   2>   "shard":"shard1",
   [junit4]   2>   "collection":"control_collection",
   [junit4]   2>   "base_url":"http://127.0.0.1:63424",
   [junit4]   2>   "core":"collection1",
   [junit4]   2>   "state":"active"} current state version: 1
   [junit4]   2> 1530138 INFO  (zkCallback-2021-thread-1-processing-n:127.0.0.1:63424_) [n:127.0.0.1:63424_    ] o.a.s.c.c.ZkStateReader A cluster state change: [WatchedEvent state:SyncConnected type:NodeDataChanged path:/clusterstate.json], has occurred - updating... (live nodes size: [1])
   [junit4]   2> 1530186 INFO  (coreZkRegister-4991-thread-1-processing-n:127.0.0.1:63424_ x:collection1 s:shard1 c:control_collection r:core_node1) [n:127.0.0.1:63424_ c:control_collection s:shard1 r:core_node1 x:collection1] o.a.s.c.ZkController We are http://127.0.0.1:63424/collection1/ and leader is http://127.0.0.1:63424/collection1/
   [junit4]   2> 1530186 INFO  (coreZkRegister-4991-thread-1-processing-n:127.0.0.1:63424_ x:collection1 s:shard1 c:control_collection r:core_node1) [n:127.0.0.1:63424_ c:control_collection s:shard1 r:core_node1 x:collection1] o.a.s.c.ZkController No LogReplay needed for core=collection1 baseURL=http://127.0.0.1:63424
   [junit4]   2> 1530186 INFO  (coreZkRegister-4991-thread-1-processing-n:127.0.0.1:63424_ x:collection1 s:shard1 c:control_collection r:core_node1) [n:127.0.0.1:63424_ c:control_collection s:shard1 r:core_node1 x:collection1] o.a.s.c.ZkController I am the leader, no recovery necessary
   [junit4]   2> 1530186 INFO  (coreZkRegister-4991-thread-1-processing-n:127.0.0.1:63424_ x:collection1 s:shard1 c:control_collection r:core_node1) [n:127.0.0.1:63424_ c:control_collection s:shard1 r:core_node1 x:collection1] o.a.s.c.ZkController publishing state=active
   [junit4]   2> 1530186 INFO  (coreZkRegister-4991-thread-1-processing-n:127.0.0.1:63424_ x:collection1 s:shard1 c:control_collection r:core_node1) [n:127.0.0.1:63424_ c:control_collection s:shard1 r:core_node1 x:collection1] o.a.s.c.ZkController numShards not found on descriptor - reading it from system property
   [junit4]   2> 1530190 INFO  (OverseerStateUpdate-95393819931312132-127.0.0.1:63424_-n_0000000000) [n:127.0.0.1:63424_    ] o.a.s.c.Overseer processMessage: queueSize: 1, message = {
   [junit4]   2>   "core":"collection1",
   [junit4]   2>   "core_node_name":"core_node1",
   [junit4]   2>   "roles":null,
   [junit4]   2>   "base_url":"http://127.0.0.1:63424",
   [junit4]   2>   "node_name":"127.0.0.1:63424_",
   [junit4]   2>   "numShards":"1",
   [junit4]   2>   "state":"active",
   [junit4]   2>   "shard":"shard1",
   [junit4]   2>   "collection":"control_collection",
   [junit4]   2>   "operation":"state"} current state version: 2
   [junit4]   2> 1530191 INFO  (OverseerStateUpdate-95393819931312132-127.0.0.1:63424_-n_0000000000) [n:127.0.0.1:63424_    ] o.a.s.c.o.ReplicaMutator Update state numShards=1 message={
   [junit4]   2>   "core":"collection1",
   [junit4]   2>   "core_node_name":"core_node1",
   [junit4]   2>   "roles":null,
   [junit4]   2>   "base_url":"http://127.0.0.1:63424",
   [junit4]   2>   "node_name":"127.0.0.1:63424_",
   [junit4]   2>   "numShards":"1",
   [junit4]   2>   "state":"active",
   [junit4]   2>   "shard":"shard1",
   [junit4]   2>   "collection":"control_collection",
   [junit4]   2>   "operation":"state"}
   [junit4]   2> 1530297 INFO  (zkCallback-2021-thread-1-processing-n:127.0.0.1:63424_) [n:127.0.0.1:63424_    ] o.a.s.c.c.ZkStateReader A cluster state change: [WatchedEvent state:SyncConnected type:NodeDataChanged path:/clusterstate.json], has occurred - updating... (live nodes size: [1])
   [junit4]   2> 1530299 INFO  (TEST-RemoteQueryErrorTest.test-seed#[174AD37BED6EA47E]) [    ] o.a.s.c.c.SolrZkClient Using default ZkCredentialsProvider
   [junit4]   2> 1530300 INFO  (TEST-RemoteQueryErrorTest.test-seed#[174AD37BED6EA47E]) [    ] o.a.s.c.c.ConnectionManager Waiting for client to connect to ZooKeeper
   [junit4]   2> 1530302 INFO  (zkCallback-2023-thread-1) [    ] o.a.s.c.c.ConnectionManager Watcher org.apache.solr.common.cloud.ConnectionManager@45cdc714 name:ZooKeeperConnection Watcher:127.0.0.1:63421/solr got event WatchedEvent state:SyncConnected type:None path:null path:null type:None
   [junit4]   2> 1530302 INFO  (TEST-RemoteQueryErrorTest.test-seed#[174AD37BED6EA47E]) [    ] o.a.s.c.c.ConnectionManager Client is connected to ZooKeeper
   [junit4]   2> 1530302 INFO  (TEST-RemoteQueryErrorTest.test-seed#[174AD37BED6EA47E]) [    ] o.a.s.c.c.SolrZkClient Using default ZkACLProvider
   [junit4]   2> 1530302 INFO  (TEST-RemoteQueryErrorTest.test-seed#[174AD37BED6EA47E]) [    ] o.a.s.c.c.ZkStateReader Updating cluster state from ZooKeeper... 
   [junit4]   2> 1530307 INFO  (TEST-RemoteQueryErrorTest.test-seed#[174AD37BED6EA47E]) [    ] o.a.s.c.ChaosMonkey monkey: init - expire sessions:false cause connection loss:false
   [junit4]   2> 1531128 INFO  (TEST-RemoteQueryErrorTest.test-seed#[174AD37BED6EA47E]) [    ] o.a.s.SolrTestCaseJ4 Writing core.properties file to /Users/jenkins/workspace/Lucene-Solr-5.x-MacOSX/solr/build/solr-core/test/J0/temp/solr.cloud.RemoteQueryErrorTest_174AD37BED6EA47E-001/shard-1-001/cores/collection1
   [junit4]   2> 1531129 INFO  (TEST-RemoteQueryErrorTest.test-seed#[174AD37BED6EA47E]) [    ] o.a.s.c.AbstractFullDistribZkTestBase create jetty 1 in directory /Users/jenkins/workspace/Lucene-Solr-5.x-MacOSX/solr/build/solr-core/test/J0/temp/solr.cloud.RemoteQueryErrorTest_174AD37BED6EA47E-001/shard-1-001
   [junit4]   2> 1531130 INFO  (TEST-RemoteQueryErrorTest.test-seed#[174AD37BED6EA47E]) [    ] o.e.j.s.Server jetty-9.2.13.v20150730
   [junit4]   2> 1531135 INFO  (TEST-RemoteQueryErrorTest.test-seed#[174AD37BED6EA47E]) [    ] o.e.j.s.h.ContextHandler Started o.e.j.s.ServletContextHandler@20db4c76{/,null,AVAILABLE}
   [junit4]   2> 1531135 INFO  (TEST-RemoteQueryErrorTest.test-seed#[174AD37BED6EA47E]) [    ] o.e.j.s.ServerConnector Started ServerConnector@4e871f62{HTTP/1.1}{127.0.0.1:63429}
   [junit4]   2> 1531135 INFO  (TEST-RemoteQueryErrorTest.test-seed#[174AD37BED6EA47E]) [    ] o.e.j.s.Server Started @1535203ms
   [junit4]   2> 1531136 INFO  (TEST-RemoteQueryErrorTest.test-seed#[174AD37BED6EA47E]) [    ] o.a.s.c.s.e.JettySolrRunner Jetty properties: {solr.data.dir=/Users/jenkins/workspace/Lucene-Solr-5.x-MacOSX/solr/build/solr-core/test/J0/temp/solr.cloud.RemoteQueryErrorTest_174AD37BED6EA47E-001/tempDir-001/jetty1, solrconfig=solrconfig.xml, hostContext=/, hostPort=63429, coreRootDirectory=/Users/jenkins/workspace/Lucene-Solr-5.x-MacOSX/solr/build/solr-core/test/J0/../../../../../../../../../Users/jenkins/workspace/Lucene-Solr-5.x-MacOSX/solr/build/solr-core/test/J0/temp/solr.cloud.RemoteQueryErrorTest_174AD37BED6EA47E-001/shard-1-001/cores}
   [junit4]   2> 1531136 INFO  (TEST-RemoteQueryErrorTest.test-seed#[174AD37BED6EA47E]) [    ] o.a.s.s.SolrDispatchFilter SolrDispatchFilter.init(): sun.misc.Launcher$AppClassLoader@1540e19d
   [junit4]   2> 1531136 INFO  (TEST-RemoteQueryErrorTest.test-seed#[174AD37BED6EA47E]) [    ] o.a.s.c.SolrResourceLoader new SolrResourceLoader for directory: '/Users/jenkins/workspace/Lucene-Solr-5.x-MacOSX/solr/build/solr-core/test/J0/temp/solr.cloud.RemoteQueryErrorTest_174AD37BED6EA47E-001/shard-1-001'
   [junit4]   2> 1531136 INFO  (TEST-RemoteQueryErrorTest.test-seed#[174AD37BED6EA47E]) [    ] o.a.s.c.SolrResourceLoader JNDI not configured for solr (NoInitialContextEx)
   [junit4]   2> 1531136 INFO  (TEST-RemoteQueryErrorTest.test-seed#[174AD37BED6EA47E]) [    ] o.a.s.c.SolrResourceLoader solr home defaulted to 'solr/' (could not find system property or JNDI)
   [junit4]   2> 1531137 INFO  (TEST-RemoteQueryErrorTest.test-seed#[174AD37BED6EA47E]) [    ] o.a.s.c.c.SolrZkClient Using default ZkCredentialsProvider
   [junit4]   2> 1531138 INFO  (TEST-RemoteQueryErrorTest.test-seed#[174AD37BED6EA47E]) [    ] o.a.s.c.c.ConnectionManager Waiting for client to connect to ZooKeeper
   [junit4]   2> 1531139 INFO  (zkCallback-2024-thread-1) [    ] o.a.s.c.c.ConnectionManager Watcher org.apache.solr.common.cloud.ConnectionManager@3d77ab8 name:ZooKeeperConnection Watcher:127.0.0.1:63421/solr got event WatchedEvent state:SyncConnected type:None path:null path:null type:None
   [junit4]   2> 1531139 INFO  (TEST-RemoteQueryErrorTest.test-seed#[174AD37BED6EA47E]) [    ] o.a.s.c.c.ConnectionManager Client is connected to ZooKeeper
   [junit4]   2> 1531140 INFO  (TEST-RemoteQueryErrorTest.test-seed#[174AD37BED6EA47E]) [    ] o.a.s.c.c.SolrZkClient Using default ZkACLProvider
   [junit4]   2> 1531142 INFO  (TEST-RemoteQueryErrorTest.test-seed#[174AD37BED6EA47E]) [    ] o.a.s.s.SolrDispatchFilter Loading solr.xml from SolrHome (not found in ZooKeeper)
   [junit4]   2> 1531142 INFO  (TEST-RemoteQueryErrorTest.test-seed#[174AD37BED6EA47E]) [    ] o.a.s.c.SolrXmlConfig Loading container configuration from /Users/jenkins/workspace/Lucene-Solr-5.x-MacOSX/solr/build/solr-core/test/J0/temp/solr.cloud.RemoteQueryErrorTest_174AD37BED6EA47E-001/shard-1-001/solr.xml
   [junit4]   2> 1531157 INFO  (TEST-RemoteQueryErrorTest.test-seed#[174AD37BED6EA47E]) [    ] o.a.s.c.CorePropertiesLocator Config-defined core root directory: /Users/jenkins/workspace/Lucene-Solr-5.x-MacOSX/solr/build/solr-core/test/J0/../../../../../../../../../Users/jenkins/workspace/Lucene-Solr-5.x-MacOSX/solr/build/solr-core/test/J0/temp/solr.cloud.RemoteQueryErrorTest_174AD37BED6EA47E-001/shard-1-001/cores
   [junit4]   2> 1531158 INFO  (TEST-RemoteQueryErrorTest.test-seed#[174AD37BED6EA47E]) [    ] o.a.s.c.CoreContainer New CoreContainer 1965151281
   [junit4]   2> 1531158 INFO  (TEST-RemoteQueryErrorTest.test-seed#[174AD37BED6EA47E]) [    ] o.a.s.c.CoreContainer Loading cores into CoreContainer [instanceDir=/Users/jenkins/workspace/Lucene-Solr-5.x-MacOSX/solr/build/solr-core/test/J0/temp/solr.cloud.RemoteQueryErrorTest_174AD37BED6EA47E-001/shard-1-001]
   [junit4]   2> 1531158 WARN  (TEST-RemoteQueryErrorTest.test-seed#[174AD37BED6EA47E]) [    ] o.a.s.c.CoreContainer Couldn't add files from /Users/jenkins/workspace/Lucene-Solr-5.x-MacOSX/solr/build/solr-core/test/J0/temp/solr.cloud.RemoteQueryErrorTest_174AD37BED6EA47E-001/shard-1-001/lib to classpath: /Users/jenkins/workspace/Lucene-Solr-5.x-MacOSX/solr/build/solr-core/test/J0/temp/solr.cloud.RemoteQueryErrorTest_174AD37BED6EA47E-001/shard-1-001/lib
   [junit4]   2> 1531158 INFO  (TEST-RemoteQueryErrorTest.test-seed#[174AD37BED6EA47E]) [    ] o.a.s.h.c.HttpShardHandlerFactory created with socketTimeout : 90000,urlScheme : ,connTimeout : 15000,maxConnectionsPerHost : 20,maxConnections : 10000,corePoolSize : 0,maximumPoolSize : 2147483647,maxThreadIdleTime : 5,sizeOfQueue : -1,fairnessPolicy : false,useRetries : false,
   [junit4]   2> 1531162 INFO  (TEST-RemoteQueryErrorTest.test-seed#[174AD37BED6EA47E]) [    ] o.a.s.u.UpdateShardHandler Creating UpdateShardHandler HTTP client with params: socketTimeout=340000&connTimeout=45000&retry=true
   [junit4]   2> 1531163 INFO  (TEST-RemoteQueryErrorTest.test-seed#[174AD37BED6EA47E]) [    ] o.a.s.l.LogWatcher SLF4J impl is org.slf4j.impl.Log4jLoggerFactory
   [junit4]   2> 1531163 INFO  (TEST-RemoteQueryErrorTest.test-seed#[174AD37BED6EA47E]) [    ] o.a.s.l.LogWatcher Registering Log Listener [Log4j (org.slf4j.impl.Log4jLoggerFactory)]
   [junit4]   2> 1531163 INFO  (TEST-RemoteQueryErrorTest.test-seed#[174AD37BED6EA47E]) [    ] o.a.s.c.ZkContainer Zookeeper client=127.0.0.1:63421/solr
   [junit4]   2> 1531163 INFO  (TEST-RemoteQueryErrorTest.test-seed#[174AD37BED6EA47E]) [    ] o.a.s.c.ZkController zkHost includes chroot
   [junit4]   2> 1531163 INFO  (TEST-RemoteQueryErrorTest.test-seed#[174AD37BED6EA47E]) [    ] o.a.s.c.c.SolrZkClient Using default ZkCredentialsProvider
   [junit4]   2> 1531164 INFO  (TEST-RemoteQueryErrorTest.test-seed#[174AD37BED6EA47E]) [    ] o.a.s.c.c.ConnectionManager Waiting for client to connect to ZooKeeper
   [junit4]   2> 1531166 INFO  (zkCallback-2027-thread-1) [    ] o.a.s.c.c.ConnectionManager Watcher org.apache.solr.common.cloud.ConnectionManager@20887c76 name:ZooKeeperConnection Watcher:127.0.0.1:63421 got event WatchedEvent state:SyncConnected type:None path:null path:null type:None
   [junit4]   2> 1531167 INFO  (TEST-RemoteQueryErrorTest.test-seed#[174AD37BED6EA47E]) [    ] o.a.s.c.c.ConnectionManager Client is connected to ZooKeeper
   [junit4]   2> 1531167 INFO  (TEST-RemoteQueryErrorTest.test-seed#[174AD37BED6EA47E]) [    ] o.a.s.c.c.SolrZkClient Using default ZkACLProvider
   [junit4]   2> 1531170 INFO  (TEST-RemoteQueryErrorTest.test-seed#[174AD37BED6EA47E]) [n:127.0.0.1:63429_    ] o.a.s.c.c.ConnectionManager Waiting for client to connect to ZooKeeper
   [junit4]   2> 1531171 INFO  (zkCallback-2028-thread-1-processing-n:127.0.0.1:63429_) [n:127.0.0.1:63429_    ] o.a.s.c.c.ConnectionManager Watcher org.apache.solr.common.cloud.ConnectionManager@6adc42ca name:ZooKeeperConnection Watcher:127.0.0.1:63421/solr got event WatchedEvent state:SyncConnected type:None path:null path:null type:None
   [junit4]   2> 1531172 INFO  (TEST-RemoteQueryErrorTest.test-seed#[174AD37BED6EA47E]) [n:127.0.0.1:63429_    ] o.a.s.c.c.ConnectionManager Client is connected to ZooKeeper
   [junit4]   2> 1531184 INFO  (TEST-RemoteQueryErrorTest.test-seed#[174AD37BED6EA47E]) [n:127.0.0.1:63429_    ] o.a.s.c.c.ZkStateReader Updating cluster state from ZooKeeper... 
   [junit4]   2> 1532197 INFO  (TEST-RemoteQueryErrorTest.test-seed#[174AD37BED6EA47E]) [n:127.0.0.1:63429_    ] o.a.s.c.ZkController Register node as live in ZooKeeper:/live_nodes/127.0.0.1:63429_
   [junit4]   2> 1532198 INFO  (TEST-RemoteQueryErrorTest.test-seed#[174AD37BED6EA47E]) [n:127.0.0.1:63429_    ] o.a.s.c.c.SolrZkClient makePath: /live_nodes/127.0.0.1:63429_
   [junit4]   2> 1532200 INFO  (zkCallback-2028-thread-1-processing-n:127.0.0.1:63429_) [n:127.0.0.1:63429_    ] o.a.s.c.c.ZkStateReader A live node change: [WatchedEvent state:SyncConnected type:NodeChildrenChanged path:/live_nodes], has occurred - updating... (live nodes size: [1])
   [junit4]   2> 1532200 INFO  (zkCallback-2023-thread-1) [    ] o.a.s.c.c.ZkStateReader A live node change: [WatchedEvent state:SyncConnected type:NodeChildrenChanged path:/live_nodes], has occurred - updating... (live nodes size: [1])
   [junit4]   2> 1532202 INFO  (zkCallback-2021-thread-1-processing-n:127.0.0.1:63424_) [n:127.0.0.1:63424_    ] o.a.s.c.c.ZkStateReader A live node change: [WatchedEvent state:SyncConnected type:NodeChildrenChanged path:/live_nodes], has occurred - updating... (live nodes size: [1])
   [junit4]   2> 1532203 INFO  (TEST-RemoteQueryErrorTest.test-seed#[174AD37BED6EA47E]) [n:127.0.0.1:63429_    ] o.a.s.c.Overseer Overseer (id=null) closing
   [junit4]   2> 1532204 INFO  (TEST-RemoteQueryErrorTest.test-seed#[174AD37BED6EA47E]) [n:127.0.0.1:63429_    ] o.a.s.c.LeaderElector Joined leadership election with path: /overseer_elect/election/95393819931312136-127.0.0.1:63429_-n_0000000001
   [junit4]   2> 1532206 INFO  (TEST-RemoteQueryErrorTest.test-seed#[174AD37BED6EA47E]) [n:127.0.0.1:63429_    ] o.a.s.c.LeaderElector Watching path /overseer_elect/election/95393819931312132-127.0.0.1:63424_-n_0000000000 to know if I could be the leader
   [junit4]   2> 1532222 INFO  (TEST-RemoteQueryErrorTest.test-seed#[174AD37BED6EA47E]) [n:127.0.0.1:63429_    ] o.a.s.c.CoreContainer Security conf doesn't exist. Skipping setup for authorization module.
   [junit4]   2> 1532222 INFO  (TEST-RemoteQueryErrorTest.test-seed#[174AD37BED6EA47E]) [n:127.0.0.1:63429_    ] o.a.s.c.CoreContainer No authentication plugin used.
   [junit4]   2> 1532225 INFO  (TEST-RemoteQueryErrorTest.test-seed#[174AD37BED6EA47E]) [n:127.0.0.1:63429_    ] o.a.s.c.CorePropertiesLocator Looking for core definitions underneath /Users/jenkins/workspace/Lucene-Solr-5.x-MacOSX/solr/build/solr-core/test/J0/../../../../../../../../../Users/jenkins/workspace/Lucene-Solr-5.x-MacOSX/solr/build/solr-core/test/J0/temp/solr.cloud.RemoteQueryErrorTest_174AD37BED6EA47E-001/shard-1-001/cores
   [junit4]   2> 1532226 INFO  (TEST-RemoteQueryErrorTest.test-seed#[174AD37BED6EA47E]) [n:127.0.0.1:63429_    ] o.a.s.c.CoreDescriptor Created CoreDescriptor: {name=collection1, config=solrconfig.xml, transient=false, schema=schema.xml, loadOnStartup=true, configSetProperties=configsetprops.json, collection=collection1, coreNodeName=, dataDir=data/, shard=}
   [junit4]   2> 1532226 INFO  (TEST-RemoteQueryErrorTest.test-seed#[174AD37BED6EA47E]) [n:127.0.0.1:63429_    ] o.a.s.c.CorePropertiesLocator Found core collection1 in /Users/jenkins/workspace/Lucene-Solr-5.x-MacOSX/solr/build/solr-core/test/J0/../../../../../../../../../Users/jenkins/workspace/Lucene-Solr-5.x-MacOSX/solr/build/solr-core/test/J0/temp/solr.cloud.RemoteQueryErrorTest_174AD37BED6EA47E-001/shard-1-001/cores/collection1
   [junit4]   2> 1532226 INFO  (TEST-RemoteQueryErrorTest.test-seed#[174AD37BED6EA47E]) [n:127.0.0.1:63429_    ] o.a.s.c.CorePropertiesLocator Found 1 core definitions
   [junit4]   2> 1532229 INFO  (TEST-RemoteQueryErrorTest.test-seed#[174AD37BED6EA47E]) [n:127.0.0.1:63429_    ] o.a.s.s.SolrDispatchFilter user.dir=/Users/jenkins/workspace/Lucene-Solr-5.x-MacOSX/solr/build/solr-core/test/J0
   [junit4]   2> 1532229 INFO  (TEST-RemoteQueryErrorTest.test-seed#[174AD37BED6EA47E]) [n:127.0.0.1:63429_    ] o.a.s.s.SolrDispatchFilter SolrDispatchFilter.init() done
   [junit4]   2> 1532229 INFO  (coreLoadExecutor-5008-thread-1-processing-n:127.0.0.1:63429_) [n:127.0.0.1:63429_ c:collection1   x:collection1] o.a.s.c.ZkController publishing state=down
   [junit4]   2> 1532229 INFO  (coreLoadExecutor-5008-thread-1-processing-n:127.0.0.1:63429_) [n:127.0.0.1:63429_ c:collection1   x:collection1] o.a.s.c.ZkController numShards not found on descriptor - reading it from system property
   [junit4]   2> 1532232 INFO  (coreLoadExecutor-5008-thread-1-processing-n:127.0.0.1:63429_) [n:127.0.0.1:63429_ c:collection1   x:collection1] o.a.s.c.ZkController look for our core node name
   [junit4]   2> 1532232 INFO  (OverseerStateUpdate-95393819931312132-127.0.0.1:63424_-n_0000000000) [n:127.0.0.1:63424_    ] o.a.s.c.Overseer processMessage: queueSize: 1, message = {
   [junit4]   2>   "core":"collection1",
   [junit4]   2>   "roles":null,
   [junit4]   2>   "base_url":"http://127.0.0.1:63429",
   [junit4]   2>   "node_name":"127.0.0.1:63429_",
   [junit4]   2>   "numShards":"1",
   [junit4]   2>   "state":"down",
   [junit4]   2>   "shard":null,
   [junit4]   2>   "collection":"collection1",
   [junit4]   2>   "operation":"state"} current state version: 3
   [junit4]   2> 1532233 INFO  (OverseerStateUpdate-95393819931312132-127.0.0.1:63424_-n_0000000000) [n:127.0.0.1:63424_    ] o.a.s.c.o.ReplicaMutator Update state numShards=1 message={
   [junit4]   2>   "core":"collection1",
   [junit4]   2>   "roles":null,
   [junit4]   2>   "base_url":"http://127.0.0.1:63429",
   [junit4]   2>   "node_name":"127.0.0.1:63429_",
   [junit4]   2>   "numShards":"1",
   [junit4]   2>   "state":"down",
   [junit4]   2>   "shard":null,
   [junit4]   2>   "collection":"collection1",
   [junit4]   2>   "operation":"state"}
   [junit4]   2> 1532233 INFO  (OverseerStateUpdate-95393819931312132-127.0.0.1:63424_-n_0000000000) [n:127.0.0.1:63424_    ] o.a.s.c.o.ClusterStateMutator building a new cName: collection1
   [junit4]   2> 1532233 INFO  (OverseerStateUpdate-95393819931312132-127.0.0.1:63424_-n_0000000000) [n:127.0.0.1:63424_    ] o.a.s.c.o.ReplicaMutator Assigning new node to shard shard=shard1
   [junit4]   2> 1532235 INFO  (zkCallback-2021-thread-1-processing-n:127.0.0.1:63424_) [n:127.0.0.1:63424_    ] o.a.s.c.c.ZkStateReader A cluster state change: [WatchedEvent state:SyncConnected type:NodeDataChanged path:/clusterstate.json], has occurred - updating... (live nodes size: [2])
   [junit4]   2> 1532235 INFO  (zkCallback-2028-thread-1-processing-n:127.0.0.1:63429_) [n:127.0.0.1:63429_    ] o.a.s.c.c.ZkStateReader A cluster state change: [WatchedEvent state:SyncConnected type:NodeDataChanged path:/clusterstate.json], has occurred - updating... (live nodes size: [2])
   [junit4]   2> 1532235 INFO  (zkCallback-2023-thread-1) [    ] o.a.s.c.c.ZkStateReader A cluster state change: [WatchedEvent state:SyncConnected type:NodeDataChanged path:/clusterstate.json], has occurred - updating... (live nodes size: [2])
   [junit4]   2> 1533234 INFO  (coreLoadExecutor-5008-thread-1-processing-n:127.0.0.1:63429_) [n:127.0.0.1:63429_ c:collection1   x:collection1] o.a.s.c.ZkController waiting to find shard id in clusterstate for collection1
   [junit4]   2> 1533234 INFO  (coreLoadExecutor-5008-thread-1-processing-n:127.0.0.1:63429_) [n:127.0.0.1:63429_ c:collection1   x:collection1] o.a.s.c.ZkController Check for collection zkNode:collection1
   [junit4]   2> 1533235 INFO  (coreLoadExecutor-5008-thread-1-processing-n:127.0.0.1:63429_) [n:127.0.0.1:63429_ c:collection1   x:collection1] o.a.s.c.ZkController Collection zkNode exists
   [junit4]   2> 1533235 INFO  (coreLoadExecutor-5008-thread-1-processing-n:127.0.0.1:63429_) [n:127.0.0.1:63429_ c:collection1   x:collection1] o.a.s.c.c.ZkStateReader Load collection config from: [/collections/collection1]
   [junit4]   2> 1533236 INFO  (coreLoadExecutor-5008-thread-1-processing-n:127.0.0.1:63429_) [n:127.0.0.1:63429_ c:collection1   x:collection1] o.

[...truncated too long message...]


   [junit4]    > 	at org.eclipse.jetty.server.handler.HandlerWrapper.handle(HandlerWrapper.java:97)
   [junit4]    > 	at org.eclipse.jetty.server.Server.handle(Server.java:499)
   [junit4]    > 	at org.eclipse.jetty.server.HttpChannel.handle(HttpChannel.java:310)
   [junit4]    > 	at org.eclipse.jetty.server.HttpConnection.onFillable(HttpConnection.java:257)
   [junit4]    > 	at org.eclipse.jetty.io.AbstractConnection$2.run(AbstractConnection.java:540)
   [junit4]    > 	at org.eclipse.jetty.util.thread.QueuedThreadPool.runJob(QueuedThreadPool.java:635)
   [junit4]    > 	at org.eclipse.jetty.util.thread.QueuedThreadPool$3.run(QueuedThreadPool.java:555)
   [junit4]    > 	at java.lang.Thread.run(Thread.java:745)
   [junit4]    > 	at __randomizedtesting.SeedInfo.seed([174AD37BED6EA47E:9F1EECA14392C986]:0)
   [junit4]    > 	at org.apache.solr.client.solrj.impl.HttpSolrClient.executeMethod(HttpSolrClient.java:576)
   [junit4]    > 	at org.apache.solr.client.solrj.impl.HttpSolrClient.request(HttpSolrClient.java:240)
   [junit4]    > 	at org.apache.solr.client.solrj.impl.HttpSolrClient.request(HttpSolrClient.java:229)
   [junit4]    > 	at org.apache.solr.client.solrj.SolrRequest.process(SolrRequest.java:149)
   [junit4]    > 	at org.apache.solr.client.solrj.SolrClient.query(SolrClient.java:942)
   [junit4]    > 	at org.apache.solr.client.solrj.SolrClient.query(SolrClient.java:957)
   [junit4]    > 	at org.apache.solr.TestDistributedSearch.queryRandomUpServer(TestDistributedSearch.java:1149)
   [junit4]    > 	at org.apache.solr.TestDistributedSearch.queryPartialResults(TestDistributedSearch.java:1111)
   [junit4]    > 	at org.apache.solr.TestDistributedSearch.test(TestDistributedSearch.java:973)
   [junit4]    > 	at org.apache.solr.BaseDistributedSearchTestCase$ShardsRepeatRule$ShardsRepeatStatement.callStatement(BaseDistributedSearchTestCase.java:990)
   [junit4]    > 	at org.apache.solr.BaseDistributedSearchTestCase$ShardsRepeatRule$ShardsStatement.evaluate(BaseDistributedSearchTestCase.java:939)
   [junit4]    > 	at java.lang.Thread.run(Thread.java:745)
   [junit4]   2> 2033085 INFO  (SUITE-TestDistributedSearch-seed#[174AD37BED6EA47E]-worker) [    ] o.a.s.SolrTestCaseJ4 ###deleteCore
   [junit4]   2> NOTE: leaving temporary files on disk at: /Users/jenkins/workspace/Lucene-Solr-5.x-MacOSX/solr/build/solr-core/test/J1/temp/solr.TestDistributedSearch_174AD37BED6EA47E-001
   [junit4]   2> NOTE: test params are: codec=Asserting(Lucene54): {other_tl1=TestBloomFilteredLucenePostings(BloomFilteringPostingsFormat(Lucene50(blocksize=128))), range_facet_l_dv=BlockTreeOrds(blocksize=128), SubjectTerms_mfacet=TestBloomFilteredLucenePostings(BloomFilteringPostingsFormat(Lucene50(blocksize=128))), n_l1=TestBloomFilteredLucenePostings(BloomFilteringPostingsFormat(Lucene50(blocksize=128))), a_n_tdt=BlockTreeOrds(blocksize=128), multiDefault=Lucene50(blocksize=128), intDefault=TestBloomFilteredLucenePostings(BloomFilteringPostingsFormat(Lucene50(blocksize=128))), n_td1=Lucene50(blocksize=128), n_d1=TestBloomFilteredLucenePostings(BloomFilteringPostingsFormat(Lucene50(blocksize=128))), n_f1=Lucene50(blocksize=128), range_facet_l=TestBloomFilteredLucenePostings(BloomFilteringPostingsFormat(Lucene50(blocksize=128))), n_tl1=Lucene50(blocksize=128), oddField_s=PostingsFormat(name=Direct), n_tf1=TestBloomFilteredLucenePostings(BloomFilteringPostingsFormat(Lucene50(blocksize=128))), lowerfilt1and2=Lucene50(blocksize=128), a_t=TestBloomFilteredLucenePostings(BloomFilteringPostingsFormat(Lucene50(blocksize=128))), lowerfilt=Lucene50(blocksize=128), id=BlockTreeOrds(blocksize=128), text=PostingsFormat(name=Direct), timestamp=TestBloomFilteredLucenePostings(BloomFilteringPostingsFormat(Lucene50(blocksize=128))), severity=PostingsFormat(name=Direct), foo_sev_enum=BlockTreeOrds(blocksize=128), n_dt1=Lucene50(blocksize=128), a_i1=TestBloomFilteredLucenePostings(BloomFilteringPostingsFormat(Lucene50(blocksize=128))), b_n_tdt=TestBloomFilteredLucenePostings(BloomFilteringPostingsFormat(Lucene50(blocksize=128))), n_ti1=BlockTreeOrds(blocksize=128), rnd_b=BlockTreeOrds(blocksize=128), _version_=TestBloomFilteredLucenePostings(BloomFilteringPostingsFormat(Lucene50(blocksize=128))), foo_b=PostingsFormat(name=Direct), n_tdt1=TestBloomFilteredLucenePostings(BloomFilteringPostingsFormat(Lucene50(blocksize=128))), foo_d=BlockTreeOrds(blocksize=128), range_facet_i_dv=TestBloomFilteredLucenePostings(BloomFilteringPostingsFormat(Lucene50(blocksize=128))), foo_f=PostingsFormat(name=Direct)}, docValues:{range_facet_l_dv=DocValuesFormat(name=Memory), foo_sev_enum=DocValuesFormat(name=Memory), range_facet_i_dv=DocValuesFormat(name=Asserting), timestamp=DocValuesFormat(name=Asserting)}, sim=RandomSimilarity(queryNorm=true,coord=no): {}, locale=mk, timezone=Europe/Zurich
   [junit4]   2> NOTE: Mac OS X 10.8.5 x86_64/Oracle Corporation 1.8.0_72 (64-bit)/cpus=3,threads=1,free=268129616,total=529006592
   [junit4]   2> NOTE: All tests run in this JVM: [AliasIntegrationTest, SharedFSAutoReplicaFailoverTest, HighlighterMaxOffsetTest, UpdateRequestProcessorFactoryTest, CloneFieldUpdateProcessorFactoryTest, DebugComponentTest, SpellCheckCollatorTest, TestPHPSerializedResponseWriter, DirectUpdateHandlerOptimizeTest, BasicDistributedZk2Test, CoreAdminRequestStatusTest, TestJsonFacets, TestSolrQueryParserResource, TestReplicaProperties, TestBlendedInfixSuggestions, RecoveryAfterSoftCommitTest, TestStressRecovery, TestCSVResponseWriter, FileUtilsTest, CollectionsAPIDistributedZkTest, TestQueryUtils, TestUseDocValuesAsStored2, CSVRequestHandlerTest, TestHdfsUpdateLog, TestSha256AuthenticationProvider, SortByFunctionTest, TestSolrQueryParser, ExitableDirectoryReaderTest, TestCloudInspectUtil, TestSolrIndexConfig, VMParamsZkACLAndCredentialsProvidersTest, TestRandomRequestDistribution, CollectionStateFormat2Test, QueryResultKeyTest, TestRealTimeGet, TestQueryTypes, TestConfigSetImmutable, ReplicationFactorTest, TestObjectReleaseTracker, FullSolrCloudDistribCmdsTest, ConvertedLegacyTest, TestFreeTextSuggestions, OpenExchangeRatesOrgProviderTest, TestStandardQParsers, DefaultValueUpdateProcessorTest, TestRangeQuery, TestSolr4Spatial, TestCoreDiscovery, HdfsUnloadDistributedZkTest, HdfsSyncSliceTest, AutoCommitTest, LukeRequestHandlerTest, TestSmileRequest, TestRestoreCore, TestSolrConfigHandler, TestUtils, UniqFieldsUpdateProcessorFactoryTest, DistribCursorPagingTest, TestSearcherReuse, ResourceLoaderTest, SynonymTokenizerTest, TestQuerySenderListener, TestReload, TestRawTransformer, BinaryUpdateRequestHandlerTest, TestDownShardTolerantSearch, TestConfigSetsAPIExclusivity, ZkNodePropsTest, FieldAnalysisRequestHandlerTest, SignatureUpdateProcessorFactoryTest, SpellCheckComponentTest, TestManagedSchemaDynamicFieldResource, FileBasedSpellCheckerTest, TestSchemaNameResource, TestDFISimilarityFactory, TestMiniSolrCloudCluster, TestCollationFieldDocValues, SolrCmdDistributorTest, TestTrackingShardHandlerFactory, ShardRoutingCustomTest, TestOrdValues, EnumFieldTest, BJQParserTest, SortSpecParsingTest, OpenCloseCoreStressTest, DistributedTermsComponentTest, TestCloudManagedSchemaConcurrent, DistributedFacetPivotSmallTest, PluginInfoTest, LeaderInitiatedRecoveryOnCommitTest, IndexSchemaRuntimeFieldTest, TestCrossCoreJoin, HdfsChaosMonkeySafeLeaderTest, TestDistributedGrouping, HdfsNNFailoverTest, WordBreakSolrSpellCheckerTest, MultiTermTest, TestSuggestSpellingConverter, InfoHandlerTest, TestSimpleTrackingShardHandler, TestDocBasedVersionConstraints, EchoParamsTest, TestJettySolrRunner, TestExactSharedStatsCache, ConjunctionSolrSpellCheckerTest, HdfsRecoveryZkTest, TestReloadAndDeleteDocs, TestCopyFieldCollectionResource, UUIDUpdateProcessorFallbackTest, TestRecoveryHdfs, TestDistributedMissingSort, CheckHdfsIndexTest, IgnoreCommitOptimizeUpdateProcessorFactoryTest, BlockCacheTest, TestComplexPhraseQParserPlugin, TestManagedStopFilterFactory, CurrencyFieldOpenExchangeTest, TestDefaultStatsCache, DistributedFacetPivotLongTailTest, TestSchemaSimilarityResource, TestPerFieldSimilarityWithDefaultOverride, NotRequiredUniqueKeyTest, AnalysisErrorHandlingTest, OverseerStatusTest, NoCacheHeaderTest, TestFieldCollectionResource, DistributedQueryComponentCustomSortTest, TestTrie, ShowFileRequestHandlerTest, DistributedVersionInfoTest, TermVectorComponentTest, SaslZkACLProviderTest, BadIndexSchemaTest, FullHLLTest, BasicFunctionalityTest, DeleteShardTest, TestSolrXml, ChaosMonkeySafeLeaderTest, SyncSliceTest, OverseerTest, LeaderElectionIntegrationTest, ShardRoutingTest, BasicZkTest, RecoveryZkTest, TestReplicationHandler, TestZkChroot, TestRandomDVFaceting, TestDistributedSearch]
   [junit4] Completed [321/566 (2!)] on J1 in 146.83s, 1 test, 1 error <<< FAILURES!

[...truncated 761 lines...]
BUILD FAILED
/Users/jenkins/workspace/Lucene-Solr-5.x-MacOSX/build.xml:750: The following error occurred while executing this line:
/Users/jenkins/workspace/Lucene-Solr-5.x-MacOSX/build.xml:694: The following error occurred while executing this line:
/Users/jenkins/workspace/Lucene-Solr-5.x-MacOSX/build.xml:59: The following error occurred while executing this line:
/Users/jenkins/workspace/Lucene-Solr-5.x-MacOSX/solr/build.xml:233: The following error occurred while executing this line:
/Users/jenkins/workspace/Lucene-Solr-5.x-MacOSX/solr/common-build.xml:534: The following error occurred while executing this line:
/Users/jenkins/workspace/Lucene-Solr-5.x-MacOSX/lucene/common-build.xml:1477: The following error occurred while executing this line:
/Users/jenkins/workspace/Lucene-Solr-5.x-MacOSX/lucene/common-build.xml:1033: There were test failures: 566 suites (7 ignored), 2279 tests, 2 errors, 89 ignored (38 assumptions) [seed: 174AD37BED6EA47E]

Total time: 76 minutes 10 seconds
Build step 'Invoke Ant' marked build as failure
Archiving artifacts
[WARNINGS] Skipping publisher since build result is FAILURE
Recording test results
Email was triggered for: Failure - Any
Sending email for trigger: Failure - Any



Mime
View raw message