lucene-dev mailing list archives

Site index · List index
Message view « Date » · « Thread »
Top « Date » · « Thread »
From Policeman Jenkins Server <jenk...@thetaphi.de>
Subject [JENKINS] Lucene-Solr-5.x-Linux (32bit/jdk1.8.0_72) - Build # 15520 - Failure!
Date Tue, 09 Feb 2016 10:08:56 GMT
Build: http://jenkins.thetaphi.de/job/Lucene-Solr-5.x-Linux/15520/
Java: 32bit/jdk1.8.0_72 -server -XX:+UseParallelGC

1 tests failed.
FAILED:  org.apache.solr.core.TestNRTOpen.testSharedCores

Error Message:
expected:<3> but was:<2>

Stack Trace:
java.lang.AssertionError: expected:<3> but was:<2>
	at __randomizedtesting.SeedInfo.seed([7C7BFEA4A5A2D7C0:9A78B4EB2D54FACF]:0)
	at org.junit.Assert.fail(Assert.java:93)
	at org.junit.Assert.failNotEquals(Assert.java:647)
	at org.junit.Assert.assertEquals(Assert.java:128)
	at org.junit.Assert.assertEquals(Assert.java:472)
	at org.junit.Assert.assertEquals(Assert.java:456)
	at org.apache.solr.core.TestNRTOpen.testSharedCores(TestNRTOpen.java:116)
	at sun.reflect.NativeMethodAccessorImpl.invoke0(Native Method)
	at sun.reflect.NativeMethodAccessorImpl.invoke(NativeMethodAccessorImpl.java:62)
	at sun.reflect.DelegatingMethodAccessorImpl.invoke(DelegatingMethodAccessorImpl.java:43)
	at java.lang.reflect.Method.invoke(Method.java:498)
	at com.carrotsearch.randomizedtesting.RandomizedRunner.invoke(RandomizedRunner.java:1764)
	at com.carrotsearch.randomizedtesting.RandomizedRunner$8.evaluate(RandomizedRunner.java:871)
	at com.carrotsearch.randomizedtesting.RandomizedRunner$9.evaluate(RandomizedRunner.java:907)
	at com.carrotsearch.randomizedtesting.RandomizedRunner$10.evaluate(RandomizedRunner.java:921)
	at com.carrotsearch.randomizedtesting.rules.SystemPropertiesRestoreRule$1.evaluate(SystemPropertiesRestoreRule.java:57)
	at org.apache.lucene.util.TestRuleSetupTeardownChained$1.evaluate(TestRuleSetupTeardownChained.java:49)
	at org.apache.lucene.util.AbstractBeforeAfterRule$1.evaluate(AbstractBeforeAfterRule.java:45)
	at org.apache.lucene.util.TestRuleThreadAndTestName$1.evaluate(TestRuleThreadAndTestName.java:48)
	at org.apache.lucene.util.TestRuleIgnoreAfterMaxFailures$1.evaluate(TestRuleIgnoreAfterMaxFailures.java:64)
	at org.apache.lucene.util.TestRuleMarkFailure$1.evaluate(TestRuleMarkFailure.java:47)
	at com.carrotsearch.randomizedtesting.rules.StatementAdapter.evaluate(StatementAdapter.java:36)
	at com.carrotsearch.randomizedtesting.ThreadLeakControl$StatementRunner.run(ThreadLeakControl.java:367)
	at com.carrotsearch.randomizedtesting.ThreadLeakControl.forkTimeoutingTask(ThreadLeakControl.java:809)
	at com.carrotsearch.randomizedtesting.ThreadLeakControl$3.evaluate(ThreadLeakControl.java:460)
	at com.carrotsearch.randomizedtesting.RandomizedRunner.runSingleTest(RandomizedRunner.java:880)
	at com.carrotsearch.randomizedtesting.RandomizedRunner$5.evaluate(RandomizedRunner.java:781)
	at com.carrotsearch.randomizedtesting.RandomizedRunner$6.evaluate(RandomizedRunner.java:816)
	at com.carrotsearch.randomizedtesting.RandomizedRunner$7.evaluate(RandomizedRunner.java:827)
	at com.carrotsearch.randomizedtesting.rules.StatementAdapter.evaluate(StatementAdapter.java:36)
	at com.carrotsearch.randomizedtesting.rules.SystemPropertiesRestoreRule$1.evaluate(SystemPropertiesRestoreRule.java:57)
	at org.apache.lucene.util.AbstractBeforeAfterRule$1.evaluate(AbstractBeforeAfterRule.java:45)
	at com.carrotsearch.randomizedtesting.rules.StatementAdapter.evaluate(StatementAdapter.java:36)
	at org.apache.lucene.util.TestRuleStoreClassName$1.evaluate(TestRuleStoreClassName.java:41)
	at com.carrotsearch.randomizedtesting.rules.NoShadowingOrOverridesOnMethodsRule$1.evaluate(NoShadowingOrOverridesOnMethodsRule.java:40)
	at com.carrotsearch.randomizedtesting.rules.NoShadowingOrOverridesOnMethodsRule$1.evaluate(NoShadowingOrOverridesOnMethodsRule.java:40)
	at com.carrotsearch.randomizedtesting.rules.StatementAdapter.evaluate(StatementAdapter.java:36)
	at com.carrotsearch.randomizedtesting.rules.StatementAdapter.evaluate(StatementAdapter.java:36)
	at com.carrotsearch.randomizedtesting.rules.StatementAdapter.evaluate(StatementAdapter.java:36)
	at org.apache.lucene.util.TestRuleAssertionsRequired$1.evaluate(TestRuleAssertionsRequired.java:53)
	at org.apache.lucene.util.TestRuleMarkFailure$1.evaluate(TestRuleMarkFailure.java:47)
	at org.apache.lucene.util.TestRuleIgnoreAfterMaxFailures$1.evaluate(TestRuleIgnoreAfterMaxFailures.java:64)
	at org.apache.lucene.util.TestRuleIgnoreTestSuites$1.evaluate(TestRuleIgnoreTestSuites.java:54)
	at com.carrotsearch.randomizedtesting.rules.StatementAdapter.evaluate(StatementAdapter.java:36)
	at com.carrotsearch.randomizedtesting.ThreadLeakControl$StatementRunner.run(ThreadLeakControl.java:367)
	at java.lang.Thread.run(Thread.java:745)




Build Log:
[...truncated 12083 lines...]
   [junit4] Suite: org.apache.solr.core.TestNRTOpen
   [junit4]   2> Creating dataDir: /home/jenkins/workspace/Lucene-Solr-5.x-Linux/solr/build/solr-core/test/J0/temp/solr.core.TestNRTOpen_7C7BFEA4A5A2D7C0-001/init-core-data-001
   [junit4]   2> 1489857 INFO  (SUITE-TestNRTOpen-seed#[7C7BFEA4A5A2D7C0]-worker) [    ] o.a.s.SolrTestCaseJ4 Randomized ssl (true) and clientAuth (true)
   [junit4]   2> 1489858 INFO  (SUITE-TestNRTOpen-seed#[7C7BFEA4A5A2D7C0]-worker) [    ] o.a.s.SolrTestCaseJ4 ####initCore
   [junit4]   2> 1489858 INFO  (SUITE-TestNRTOpen-seed#[7C7BFEA4A5A2D7C0]-worker) [    ] o.a.s.c.SolrResourceLoader new SolrResourceLoader for directory: '/home/jenkins/workspace/Lucene-Solr-5.x-Linux/solr/core/src/test-files/solr/collection1'
   [junit4]   2> 1489858 INFO  (SUITE-TestNRTOpen-seed#[7C7BFEA4A5A2D7C0]-worker) [    ] o.a.s.c.SolrResourceLoader JNDI not configured for solr (NoInitialContextEx)
   [junit4]   2> 1489858 INFO  (SUITE-TestNRTOpen-seed#[7C7BFEA4A5A2D7C0]-worker) [    ] o.a.s.c.SolrResourceLoader using system property solr.solr.home: /home/jenkins/workspace/Lucene-Solr-5.x-Linux/solr/core/src/test-files/solr
   [junit4]   2> 1489858 INFO  (SUITE-TestNRTOpen-seed#[7C7BFEA4A5A2D7C0]-worker) [    ] o.a.s.c.SolrResourceLoader Adding 'file:/home/jenkins/workspace/Lucene-Solr-5.x-Linux/solr/core/src/test-files/solr/collection1/lib/classes/' to classloader
   [junit4]   2> 1489858 INFO  (SUITE-TestNRTOpen-seed#[7C7BFEA4A5A2D7C0]-worker) [    ] o.a.s.c.SolrResourceLoader Adding 'file:/home/jenkins/workspace/Lucene-Solr-5.x-Linux/solr/core/src/test-files/solr/collection1/lib/README' to classloader
   [junit4]   2> 1489872 INFO  (SUITE-TestNRTOpen-seed#[7C7BFEA4A5A2D7C0]-worker) [    ] o.a.s.c.SolrConfig current version of requestparams : -1
   [junit4]   2> 1489873 INFO  (SUITE-TestNRTOpen-seed#[7C7BFEA4A5A2D7C0]-worker) [    ] o.a.s.c.SolrConfig Using Lucene MatchVersion: 5.5.0
   [junit4]   2> 1489875 INFO  (SUITE-TestNRTOpen-seed#[7C7BFEA4A5A2D7C0]-worker) [    ] o.a.s.c.SolrConfig Loaded SolrConfig: solrconfig-basic.xml
   [junit4]   2> 1489877 INFO  (SUITE-TestNRTOpen-seed#[7C7BFEA4A5A2D7C0]-worker) [    ] o.a.s.s.IndexSchema [null] Schema name=minimal
   [junit4]   2> 1489879 WARN  (SUITE-TestNRTOpen-seed#[7C7BFEA4A5A2D7C0]-worker) [    ] o.a.s.s.IndexSchema no uniqueKey specified in schema.
   [junit4]   2> 1489880 INFO  (SUITE-TestNRTOpen-seed#[7C7BFEA4A5A2D7C0]-worker) [    ] o.a.s.c.SolrResourceLoader JNDI not configured for solr (NoInitialContextEx)
   [junit4]   2> 1489880 INFO  (SUITE-TestNRTOpen-seed#[7C7BFEA4A5A2D7C0]-worker) [    ] o.a.s.c.SolrResourceLoader using system property solr.solr.home: /home/jenkins/workspace/Lucene-Solr-5.x-Linux/solr/core/src/test-files/solr
   [junit4]   2> 1489880 INFO  (SUITE-TestNRTOpen-seed#[7C7BFEA4A5A2D7C0]-worker) [    ] o.a.s.c.SolrResourceLoader new SolrResourceLoader for directory: '/home/jenkins/workspace/Lucene-Solr-5.x-Linux/solr/core/src/test-files/solr'
   [junit4]   2> 1489880 INFO  (SUITE-TestNRTOpen-seed#[7C7BFEA4A5A2D7C0]-worker) [    ] o.a.s.c.SolrResourceLoader JNDI not configured for solr (NoInitialContextEx)
   [junit4]   2> 1489880 INFO  (SUITE-TestNRTOpen-seed#[7C7BFEA4A5A2D7C0]-worker) [    ] o.a.s.c.SolrResourceLoader using system property solr.solr.home: /home/jenkins/workspace/Lucene-Solr-5.x-Linux/solr/core/src/test-files/solr
   [junit4]   2> 1489880 INFO  (SUITE-TestNRTOpen-seed#[7C7BFEA4A5A2D7C0]-worker) [    ] o.a.s.c.CoreContainer New CoreContainer 1258289
   [junit4]   2> 1489880 INFO  (SUITE-TestNRTOpen-seed#[7C7BFEA4A5A2D7C0]-worker) [    ] o.a.s.c.CoreContainer Loading cores into CoreContainer [instanceDir=/home/jenkins/workspace/Lucene-Solr-5.x-Linux/solr/core/src/test-files/solr]
   [junit4]   2> 1489880 WARN  (SUITE-TestNRTOpen-seed#[7C7BFEA4A5A2D7C0]-worker) [    ] o.a.s.c.CoreContainer Couldn't add files from /home/jenkins/workspace/Lucene-Solr-5.x-Linux/solr/core/src/test-files/solr/lib to classpath: /home/jenkins/workspace/Lucene-Solr-5.x-Linux/solr/core/src/test-files/solr/lib
   [junit4]   2> 1489880 INFO  (SUITE-TestNRTOpen-seed#[7C7BFEA4A5A2D7C0]-worker) [    ] o.a.s.h.c.HttpShardHandlerFactory created with socketTimeout : 600000,connTimeout : 60000,maxConnectionsPerHost : 20,maxConnections : 10000,corePoolSize : 0,maximumPoolSize : 2147483647,maxThreadIdleTime : 5,sizeOfQueue : -1,fairnessPolicy : false,useRetries : false,
   [junit4]   2> 1489883 INFO  (SUITE-TestNRTOpen-seed#[7C7BFEA4A5A2D7C0]-worker) [    ] o.a.s.u.UpdateShardHandler Creating UpdateShardHandler HTTP client with params: socketTimeout=30000&connTimeout=30000&retry=true
   [junit4]   2> 1489884 INFO  (SUITE-TestNRTOpen-seed#[7C7BFEA4A5A2D7C0]-worker) [    ] o.a.s.l.LogWatcher SLF4J impl is org.slf4j.impl.Log4jLoggerFactory
   [junit4]   2> 1489885 INFO  (SUITE-TestNRTOpen-seed#[7C7BFEA4A5A2D7C0]-worker) [    ] o.a.s.l.LogWatcher Registering Log Listener [Log4j (org.slf4j.impl.Log4jLoggerFactory)]
   [junit4]   2> 1489885 INFO  (SUITE-TestNRTOpen-seed#[7C7BFEA4A5A2D7C0]-worker) [    ] o.a.s.c.CoreContainer Security conf doesn't exist. Skipping setup for authorization module.
   [junit4]   2> 1489885 INFO  (SUITE-TestNRTOpen-seed#[7C7BFEA4A5A2D7C0]-worker) [    ] o.a.s.c.CoreContainer No authentication plugin used.
   [junit4]   2> 1489885 INFO  (SUITE-TestNRTOpen-seed#[7C7BFEA4A5A2D7C0]-worker) [    ] o.a.s.c.CoreDescriptor Created CoreDescriptor: {name=collection1, config=solrconfig-basic.xml, transient=false, schema=schema-minimal.xml, loadOnStartup=true, configSetProperties=configsetprops.json, collection=collection1, dataDir=/home/jenkins/workspace/Lucene-Solr-5.x-Linux/solr/build/solr-core/test/J0/temp/solr.core.TestNRTOpen_7C7BFEA4A5A2D7C0-001/init-core-data-001, shard=shard1}
   [junit4]   2> 1489886 INFO  (coreLoadExecutor-5898-thread-1) [    ] o.a.s.c.SolrResourceLoader new SolrResourceLoader for directory: '/home/jenkins/workspace/Lucene-Solr-5.x-Linux/solr/core/src/test-files/solr/collection1'
   [junit4]   2> 1489886 INFO  (coreLoadExecutor-5898-thread-1) [    ] o.a.s.c.SolrResourceLoader JNDI not configured for solr (NoInitialContextEx)
   [junit4]   2> 1489886 INFO  (coreLoadExecutor-5898-thread-1) [    ] o.a.s.c.SolrResourceLoader using system property solr.solr.home: /home/jenkins/workspace/Lucene-Solr-5.x-Linux/solr/core/src/test-files/solr
   [junit4]   2> 1489886 INFO  (coreLoadExecutor-5898-thread-1) [    ] o.a.s.c.SolrResourceLoader Adding 'file:/home/jenkins/workspace/Lucene-Solr-5.x-Linux/solr/core/src/test-files/solr/collection1/lib/classes/' to classloader
   [junit4]   2> 1489886 INFO  (coreLoadExecutor-5898-thread-1) [    ] o.a.s.c.SolrResourceLoader Adding 'file:/home/jenkins/workspace/Lucene-Solr-5.x-Linux/solr/core/src/test-files/solr/collection1/lib/README' to classloader
   [junit4]   2> 1489897 INFO  (coreLoadExecutor-5898-thread-1) [    ] o.a.s.c.SolrConfig current version of requestparams : -1
   [junit4]   2> 1489898 INFO  (coreLoadExecutor-5898-thread-1) [    ] o.a.s.c.SolrConfig Using Lucene MatchVersion: 5.5.0
   [junit4]   2> 1489901 INFO  (coreLoadExecutor-5898-thread-1) [    ] o.a.s.c.SolrConfig Loaded SolrConfig: solrconfig-basic.xml
   [junit4]   2> 1489903 INFO  (coreLoadExecutor-5898-thread-1) [    ] o.a.s.s.IndexSchema [collection1] Schema name=minimal
   [junit4]   2> 1489904 WARN  (coreLoadExecutor-5898-thread-1) [    ] o.a.s.s.IndexSchema no uniqueKey specified in schema.
   [junit4]   2> 1489905 INFO  (coreLoadExecutor-5898-thread-1) [    ] o.a.s.c.ConfigSetProperties Did not find ConfigSet properties, assuming default properties: Can't find resource 'configsetprops.json' in classpath or '/home/jenkins/workspace/Lucene-Solr-5.x-Linux/solr/core/src/test-files/solr/collection1'
   [junit4]   2> 1489905 INFO  (coreLoadExecutor-5898-thread-1) [    ] o.a.s.c.CoreContainer Creating SolrCore 'collection1' using configuration from instancedir /home/jenkins/workspace/Lucene-Solr-5.x-Linux/solr/core/src/test-files/solr/collection1
   [junit4]   2> 1489906 INFO  (coreLoadExecutor-5898-thread-1) [    x:collection1] o.a.s.c.SolrCore solr.StandardDirectoryFactory
   [junit4]   2> 1489906 INFO  (coreLoadExecutor-5898-thread-1) [    x:collection1] o.a.s.c.SolrCore [[collection1] ] Opening new SolrCore at [/home/jenkins/workspace/Lucene-Solr-5.x-Linux/solr/core/src/test-files/solr/collection1], dataDir=[/home/jenkins/workspace/Lucene-Solr-5.x-Linux/solr/build/solr-core/test/J0/temp/solr.core.TestNRTOpen_7C7BFEA4A5A2D7C0-001/init-core-data-001/]
   [junit4]   2> 1489906 INFO  (coreLoadExecutor-5898-thread-1) [    x:collection1] o.a.s.c.SolrCore JMX monitoring not detected for core: collection1
   [junit4]   2> 1489906 INFO  (coreLoadExecutor-5898-thread-1) [    x:collection1] o.a.s.c.CachingDirectoryFactory return new directory for /home/jenkins/workspace/Lucene-Solr-5.x-Linux/solr/build/solr-core/test/J0/temp/solr.core.TestNRTOpen_7C7BFEA4A5A2D7C0-001/init-core-data-001
   [junit4]   2> 1489906 INFO  (coreLoadExecutor-5898-thread-1) [    x:collection1] o.a.s.c.SolrCore New index directory detected: old=null new=/home/jenkins/workspace/Lucene-Solr-5.x-Linux/solr/build/solr-core/test/J0/temp/solr.core.TestNRTOpen_7C7BFEA4A5A2D7C0-001/init-core-data-001/index/
   [junit4]   2> 1489906 WARN  (coreLoadExecutor-5898-thread-1) [    x:collection1] o.a.s.c.SolrCore [collection1] Solr index directory '/home/jenkins/workspace/Lucene-Solr-5.x-Linux/solr/build/solr-core/test/J0/temp/solr.core.TestNRTOpen_7C7BFEA4A5A2D7C0-001/init-core-data-001/index' doesn't exist. Creating new index...
   [junit4]   2> 1489906 INFO  (coreLoadExecutor-5898-thread-1) [    x:collection1] o.a.s.c.CachingDirectoryFactory return new directory for /home/jenkins/workspace/Lucene-Solr-5.x-Linux/solr/build/solr-core/test/J0/temp/solr.core.TestNRTOpen_7C7BFEA4A5A2D7C0-001/init-core-data-001/index
   [junit4]   2> 1489907 INFO  (coreLoadExecutor-5898-thread-1) [    x:collection1] o.a.s.u.RandomMergePolicy RandomMergePolicy wrapping class org.apache.lucene.index.TieredMergePolicy: [TieredMergePolicy: maxMergeAtOnce=17, maxMergeAtOnceExplicit=45, maxMergedSegmentMB=48.5908203125, floorSegmentMB=1.7138671875, forceMergeDeletesPctAllowed=3.325060102782201, segmentsPerTier=23.0, maxCFSSegmentSizeMB=8.796093022207999E12, noCFSRatio=0.0
   [junit4]   2> 1489924 INFO  (coreLoadExecutor-5898-thread-1) [    x:collection1] o.a.s.c.SolrDeletionPolicy SolrDeletionPolicy.onCommit: commits: num=1
   [junit4]   2> 	commit{dir=/home/jenkins/workspace/Lucene-Solr-5.x-Linux/solr/build/solr-core/test/J0/temp/solr.core.TestNRTOpen_7C7BFEA4A5A2D7C0-001/init-core-data-001/index,segFN=segments_1,generation=1}
   [junit4]   2> 1489925 INFO  (coreLoadExecutor-5898-thread-1) [    x:collection1] o.a.s.c.SolrDeletionPolicy newest commit generation = 1
   [junit4]   2> 1489925 INFO  (OldIndexDirectoryCleanupThreadForCore-collection1) [    x:collection1] o.a.s.c.SolrCore Looking for old index directories to cleanup for core collection1 in /home/jenkins/workspace/Lucene-Solr-5.x-Linux/solr/build/solr-core/test/J0/temp/solr.core.TestNRTOpen_7C7BFEA4A5A2D7C0-001/init-core-data-001/
   [junit4]   2> 1489926 INFO  (coreLoadExecutor-5898-thread-1) [    x:collection1] o.a.s.c.SolrCore no updateRequestProcessorChain defined as default, creating implicit default
   [junit4]   2> 1489927 INFO  (coreLoadExecutor-5898-thread-1) [    x:collection1] o.a.s.h.l.XMLLoader xsltCacheLifetimeSeconds=60
   [junit4]   2> 1489928 INFO  (coreLoadExecutor-5898-thread-1) [    x:collection1] o.a.s.h.l.XMLLoader xsltCacheLifetimeSeconds=60
   [junit4]   2> 1489928 INFO  (coreLoadExecutor-5898-thread-1) [    x:collection1] o.a.s.h.l.XMLLoader xsltCacheLifetimeSeconds=60
   [junit4]   2> 1489929 INFO  (coreLoadExecutor-5898-thread-1) [    x:collection1] o.a.s.h.l.XMLLoader xsltCacheLifetimeSeconds=60
   [junit4]   2> 1489929 INFO  (coreLoadExecutor-5898-thread-1) [    x:collection1] o.a.s.c.RequestHandlers Registered paths: /admin/mbeans,standard,/update/csv,/update/json/docs,/admin/luke,/admin/segments,/get,/admin/system,/replication,/admin/properties,/config,/schema,/admin/plugins,/admin/logging,/update/json,/admin/threads,/admin/ping,/update,/admin/file
   [junit4]   2> 1489930 INFO  (coreLoadExecutor-5898-thread-1) [    x:collection1] o.a.s.c.SolrCore Using default statsCache cache: org.apache.solr.search.stats.LocalStatsCache
   [junit4]   2> 1489930 INFO  (coreLoadExecutor-5898-thread-1) [    x:collection1] o.a.s.u.CommitTracker Hard AutoCommit: disabled
   [junit4]   2> 1489930 INFO  (coreLoadExecutor-5898-thread-1) [    x:collection1] o.a.s.u.CommitTracker Soft AutoCommit: disabled
   [junit4]   2> 1489930 INFO  (coreLoadExecutor-5898-thread-1) [    x:collection1] o.a.s.u.RandomMergePolicy RandomMergePolicy wrapping class org.apache.lucene.index.TieredMergePolicy: [TieredMergePolicy: maxMergeAtOnce=35, maxMergeAtOnceExplicit=38, maxMergedSegmentMB=97.0576171875, floorSegmentMB=0.7880859375, forceMergeDeletesPctAllowed=8.355658856637193, segmentsPerTier=43.0, maxCFSSegmentSizeMB=8.796093022207999E12, noCFSRatio=0.49048523402882915
   [junit4]   2> 1489930 INFO  (coreLoadExecutor-5898-thread-1) [    x:collection1] o.a.s.c.SolrDeletionPolicy SolrDeletionPolicy.onInit: commits: num=1
   [junit4]   2> 	commit{dir=/home/jenkins/workspace/Lucene-Solr-5.x-Linux/solr/build/solr-core/test/J0/temp/solr.core.TestNRTOpen_7C7BFEA4A5A2D7C0-001/init-core-data-001/index,segFN=segments_1,generation=1}
   [junit4]   2> 1489930 INFO  (coreLoadExecutor-5898-thread-1) [    x:collection1] o.a.s.c.SolrDeletionPolicy newest commit generation = 1
   [junit4]   2> 1489930 INFO  (coreLoadExecutor-5898-thread-1) [    x:collection1] o.a.s.s.SolrIndexSearcher Opening Searcher@4b1f51[collection1] main
   [junit4]   2> 1489930 WARN  (coreLoadExecutor-5898-thread-1) [    x:collection1] o.a.s.r.ManagedResourceStorage Cannot write to config directory /home/jenkins/workspace/Lucene-Solr-5.x-Linux/solr/core/src/test-files/solr/collection1/conf; switching to use InMemory storage instead.
   [junit4]   2> 1489931 INFO  (coreLoadExecutor-5898-thread-1) [    x:collection1] o.a.s.r.RestManager Initializing RestManager with initArgs: {}
   [junit4]   2> 1489931 INFO  (coreLoadExecutor-5898-thread-1) [    x:collection1] o.a.s.r.ManagedResourceStorage Reading _rest_managed.json using InMemoryStorage
   [junit4]   2> 1489931 INFO  (coreLoadExecutor-5898-thread-1) [    x:collection1] o.a.s.r.RestManager Initializing 0 registered ManagedResources
   [junit4]   2> 1489931 INFO  (coreLoadExecutor-5898-thread-1) [    x:collection1] o.a.s.h.ReplicationHandler Commits will be reserved for  10000
   [junit4]   2> 1489931 INFO  (searcherExecutor-5899-thread-1-processing-x:collection1) [    x:collection1] o.a.s.c.SolrCore [collection1] Registered new searcher Searcher@4b1f51[collection1] main{ExitableDirectoryReader(UninvertingDirectoryReader())}
   [junit4]   2> 1489931 INFO  (coreLoadExecutor-5898-thread-1) [    x:collection1] o.a.s.c.CoreContainer registering core: collection1
   [junit4]   2> 1489932 INFO  (SUITE-TestNRTOpen-seed#[7C7BFEA4A5A2D7C0]-worker) [    ] o.a.s.SolrTestCaseJ4 ####initCore end
   [junit4]   2> 1489932 INFO  (SUITE-TestNRTOpen-seed#[7C7BFEA4A5A2D7C0]-worker) [    ] o.a.s.u.p.LogUpdateProcessorFactory [collection1]  webapp=null path=null params={}{add=[(null)]} 0 0
   [junit4]   2> 1489933 INFO  (SUITE-TestNRTOpen-seed#[7C7BFEA4A5A2D7C0]-worker) [    ] o.a.s.u.DirectUpdateHandler2 start commit{,optimize=false,openSearcher=true,waitSearcher=true,expungeDeletes=false,softCommit=false,prepareCommit=false}
   [junit4]   2> 1490119 INFO  (SUITE-TestNRTOpen-seed#[7C7BFEA4A5A2D7C0]-worker) [    ] o.a.s.c.SolrDeletionPolicy SolrDeletionPolicy.onCommit: commits: num=2
   [junit4]   2> 	commit{dir=/home/jenkins/workspace/Lucene-Solr-5.x-Linux/solr/build/solr-core/test/J0/temp/solr.core.TestNRTOpen_7C7BFEA4A5A2D7C0-001/init-core-data-001/index,segFN=segments_1,generation=1}
   [junit4]   2> 	commit{dir=/home/jenkins/workspace/Lucene-Solr-5.x-Linux/solr/build/solr-core/test/J0/temp/solr.core.TestNRTOpen_7C7BFEA4A5A2D7C0-001/init-core-data-001/index,segFN=segments_2,generation=2}
   [junit4]   2> 1490120 INFO  (SUITE-TestNRTOpen-seed#[7C7BFEA4A5A2D7C0]-worker) [    ] o.a.s.c.SolrDeletionPolicy newest commit generation = 2
   [junit4]   2> 1490121 INFO  (SUITE-TestNRTOpen-seed#[7C7BFEA4A5A2D7C0]-worker) [    ] o.a.s.s.SolrIndexSearcher Opening Searcher@18c3671[collection1] main
   [junit4]   2> 1490121 INFO  (SUITE-TestNRTOpen-seed#[7C7BFEA4A5A2D7C0]-worker) [    ] o.a.s.u.DirectUpdateHandler2 end_commit_flush
   [junit4]   2> 1490121 INFO  (searcherExecutor-5899-thread-1) [    ] o.a.s.c.SolrCore [collection1] Registered new searcher Searcher@18c3671[collection1] main{ExitableDirectoryReader(UninvertingDirectoryReader(Uninverting(_0(5.5.0):C1)))}
   [junit4]   2> 1490121 INFO  (SUITE-TestNRTOpen-seed#[7C7BFEA4A5A2D7C0]-worker) [    ] o.a.s.u.p.LogUpdateProcessorFactory [collection1]  webapp=null path=null params={}{commit=} 0 188
   [junit4]   2> 1490122 INFO  (SUITE-TestNRTOpen-seed#[7C7BFEA4A5A2D7C0]-worker) [    ] o.a.s.SolrTestCaseJ4 ###deleteCore
   [junit4]   2> 1490122 INFO  (SUITE-TestNRTOpen-seed#[7C7BFEA4A5A2D7C0]-worker) [    ] o.a.s.c.CoreContainer Shutting down CoreContainer instance=1258289
   [junit4]   2> 1490122 INFO  (coreCloseExecutor-5903-thread-1) [    x:collection1] o.a.s.c.SolrCore [collection1]  CLOSING SolrCore org.apache.solr.core.SolrCore@13eb45a
   [junit4]   2> 1490122 INFO  (coreCloseExecutor-5903-thread-1) [    x:collection1] o.a.s.u.DirectUpdateHandler2 closing DirectUpdateHandler2{commits=1,autocommits=0,soft autocommits=0,optimizes=0,rollbacks=0,expungeDeletes=0,docsPending=0,adds=0,deletesById=0,deletesByQuery=0,errors=0,cumulative_adds=1,cumulative_deletesById=0,cumulative_deletesByQuery=0,cumulative_errors=0}
   [junit4]   2> 1490122 INFO  (coreCloseExecutor-5903-thread-1) [    x:collection1] o.a.s.u.SolrCoreState Closing SolrCoreState
   [junit4]   2> 1490122 INFO  (coreCloseExecutor-5903-thread-1) [    x:collection1] o.a.s.u.DefaultSolrCoreState SolrCoreState ref count has reached 0 - closing IndexWriter
   [junit4]   2> 1490122 INFO  (coreCloseExecutor-5903-thread-1) [    x:collection1] o.a.s.u.DefaultSolrCoreState closing IndexWriter with IndexWriterCloser
   [junit4]   2> 1490123 INFO  (coreCloseExecutor-5903-thread-1) [    x:collection1] o.a.s.c.SolrCore [collection1] Closing main searcher on request.
   [junit4]   2> 1490123 INFO  (coreCloseExecutor-5903-thread-1) [    x:collection1] o.a.s.c.CachingDirectoryFactory Closing StandardDirectoryFactory - 2 directories currently being tracked
   [junit4]   2> 1490123 INFO  (coreCloseExecutor-5903-thread-1) [    x:collection1] o.a.s.c.CachingDirectoryFactory looking to close /home/jenkins/workspace/Lucene-Solr-5.x-Linux/solr/build/solr-core/test/J0/temp/solr.core.TestNRTOpen_7C7BFEA4A5A2D7C0-001/init-core-data-001/index [CachedDir<<refCount=0;path=/home/jenkins/workspace/Lucene-Solr-5.x-Linux/solr/build/solr-core/test/J0/temp/solr.core.TestNRTOpen_7C7BFEA4A5A2D7C0-001/init-core-data-001/index;done=false>>]
   [junit4]   2> 1490123 INFO  (coreCloseExecutor-5903-thread-1) [    x:collection1] o.a.s.c.CachingDirectoryFactory Closing directory: /home/jenkins/workspace/Lucene-Solr-5.x-Linux/solr/build/solr-core/test/J0/temp/solr.core.TestNRTOpen_7C7BFEA4A5A2D7C0-001/init-core-data-001/index
   [junit4]   2> 1490123 INFO  (coreCloseExecutor-5903-thread-1) [    x:collection1] o.a.s.c.CachingDirectoryFactory looking to close /home/jenkins/workspace/Lucene-Solr-5.x-Linux/solr/build/solr-core/test/J0/temp/solr.core.TestNRTOpen_7C7BFEA4A5A2D7C0-001/init-core-data-001 [CachedDir<<refCount=0;path=/home/jenkins/workspace/Lucene-Solr-5.x-Linux/solr/build/solr-core/test/J0/temp/solr.core.TestNRTOpen_7C7BFEA4A5A2D7C0-001/init-core-data-001;done=false>>]
   [junit4]   2> 1490123 INFO  (coreCloseExecutor-5903-thread-1) [    x:collection1] o.a.s.c.CachingDirectoryFactory Closing directory: /home/jenkins/workspace/Lucene-Solr-5.x-Linux/solr/build/solr-core/test/J0/temp/solr.core.TestNRTOpen_7C7BFEA4A5A2D7C0-001/init-core-data-001
   [junit4]   2> 1490124 INFO  (SUITE-TestNRTOpen-seed#[7C7BFEA4A5A2D7C0]-worker) [    ] o.a.s.SolrTestCaseJ4 ####initCore
   [junit4]   2> 1490124 INFO  (SUITE-TestNRTOpen-seed#[7C7BFEA4A5A2D7C0]-worker) [    ] o.a.s.c.SolrResourceLoader new SolrResourceLoader for directory: '/home/jenkins/workspace/Lucene-Solr-5.x-Linux/solr/core/src/test-files/solr/collection1'
   [junit4]   2> 1490124 INFO  (SUITE-TestNRTOpen-seed#[7C7BFEA4A5A2D7C0]-worker) [    ] o.a.s.c.SolrResourceLoader JNDI not configured for solr (NoInitialContextEx)
   [junit4]   2> 1490124 INFO  (SUITE-TestNRTOpen-seed#[7C7BFEA4A5A2D7C0]-worker) [    ] o.a.s.c.SolrResourceLoader using system property solr.solr.home: /home/jenkins/workspace/Lucene-Solr-5.x-Linux/solr/core/src/test-files/solr
   [junit4]   2> 1490124 INFO  (SUITE-TestNRTOpen-seed#[7C7BFEA4A5A2D7C0]-worker) [    ] o.a.s.c.SolrResourceLoader Adding 'file:/home/jenkins/workspace/Lucene-Solr-5.x-Linux/solr/core/src/test-files/solr/collection1/lib/classes/' to classloader
   [junit4]   2> 1490124 INFO  (SUITE-TestNRTOpen-seed#[7C7BFEA4A5A2D7C0]-worker) [    ] o.a.s.c.SolrResourceLoader Adding 'file:/home/jenkins/workspace/Lucene-Solr-5.x-Linux/solr/core/src/test-files/solr/collection1/lib/README' to classloader
   [junit4]   2> 1490147 INFO  (SUITE-TestNRTOpen-seed#[7C7BFEA4A5A2D7C0]-worker) [    ] o.a.s.c.SolrConfig current version of requestparams : -1
   [junit4]   2> 1490154 INFO  (SUITE-TestNRTOpen-seed#[7C7BFEA4A5A2D7C0]-worker) [    ] o.a.s.c.SolrConfig Using Lucene MatchVersion: 5.5.0
   [junit4]   2> 1490158 INFO  (SUITE-TestNRTOpen-seed#[7C7BFEA4A5A2D7C0]-worker) [    ] o.a.s.c.SolrConfig Loaded SolrConfig: solrconfig-basic.xml
   [junit4]   2> 1490160 INFO  (SUITE-TestNRTOpen-seed#[7C7BFEA4A5A2D7C0]-worker) [    ] o.a.s.s.IndexSchema [null] Schema name=minimal
   [junit4]   2> 1490162 WARN  (SUITE-TestNRTOpen-seed#[7C7BFEA4A5A2D7C0]-worker) [    ] o.a.s.s.IndexSchema no uniqueKey specified in schema.
   [junit4]   2> 1490162 INFO  (SUITE-TestNRTOpen-seed#[7C7BFEA4A5A2D7C0]-worker) [    ] o.a.s.c.SolrResourceLoader JNDI not configured for solr (NoInitialContextEx)
   [junit4]   2> 1490162 INFO  (SUITE-TestNRTOpen-seed#[7C7BFEA4A5A2D7C0]-worker) [    ] o.a.s.c.SolrResourceLoader using system property solr.solr.home: /home/jenkins/workspace/Lucene-Solr-5.x-Linux/solr/core/src/test-files/solr
   [junit4]   2> 1490162 INFO  (SUITE-TestNRTOpen-seed#[7C7BFEA4A5A2D7C0]-worker) [    ] o.a.s.c.SolrResourceLoader new SolrResourceLoader for directory: '/home/jenkins/workspace/Lucene-Solr-5.x-Linux/solr/core/src/test-files/solr'
   [junit4]   2> 1490163 INFO  (SUITE-TestNRTOpen-seed#[7C7BFEA4A5A2D7C0]-worker) [    ] o.a.s.c.SolrResourceLoader JNDI not configured for solr (NoInitialContextEx)
   [junit4]   2> 1490163 INFO  (SUITE-TestNRTOpen-seed#[7C7BFEA4A5A2D7C0]-worker) [    ] o.a.s.c.SolrResourceLoader using system property solr.solr.home: /home/jenkins/workspace/Lucene-Solr-5.x-Linux/solr/core/src/test-files/solr
   [junit4]   2> 1490163 INFO  (SUITE-TestNRTOpen-seed#[7C7BFEA4A5A2D7C0]-worker) [    ] o.a.s.c.CoreContainer New CoreContainer 3094077
   [junit4]   2> 1490163 INFO  (SUITE-TestNRTOpen-seed#[7C7BFEA4A5A2D7C0]-worker) [    ] o.a.s.c.CoreContainer Loading cores into CoreContainer [instanceDir=/home/jenkins/workspace/Lucene-Solr-5.x-Linux/solr/core/src/test-files/solr]
   [junit4]   2> 1490163 WARN  (SUITE-TestNRTOpen-seed#[7C7BFEA4A5A2D7C0]-worker) [    ] o.a.s.c.CoreContainer Couldn't add files from /home/jenkins/workspace/Lucene-Solr-5.x-Linux/solr/core/src/test-files/solr/lib to classpath: /home/jenkins/workspace/Lucene-Solr-5.x-Linux/solr/core/src/test-files/solr/lib
   [junit4]   2> 1490163 INFO  (SUITE-TestNRTOpen-seed#[7C7BFEA4A5A2D7C0]-worker) [    ] o.a.s.h.c.HttpShardHandlerFactory created with socketTimeout : 600000,connTimeout : 60000,maxConnectionsPerHost : 20,maxConnections : 10000,corePoolSize : 0,maximumPoolSize : 2147483647,maxThreadIdleTime : 5,sizeOfQueue : -1,fairnessPolicy : false,useRetries : false,
   [junit4]   2> 1490166 INFO  (SUITE-TestNRTOpen-seed#[7C7BFEA4A5A2D7C0]-worker) [    ] o.a.s.u.UpdateShardHandler Creating UpdateShardHandler HTTP client with params: socketTimeout=30000&connTimeout=30000&retry=true
   [junit4]   2> 1490167 INFO  (SUITE-TestNRTOpen-seed#[7C7BFEA4A5A2D7C0]-worker) [    ] o.a.s.l.LogWatcher SLF4J impl is org.slf4j.impl.Log4jLoggerFactory
   [junit4]   2> 1490167 INFO  (SUITE-TestNRTOpen-seed#[7C7BFEA4A5A2D7C0]-worker) [    ] o.a.s.l.LogWatcher Registering Log Listener [Log4j (org.slf4j.impl.Log4jLoggerFactory)]
   [junit4]   2> 1490167 INFO  (SUITE-TestNRTOpen-seed#[7C7BFEA4A5A2D7C0]-worker) [    ] o.a.s.c.CoreContainer Security conf doesn't exist. Skipping setup for authorization module.
   [junit4]   2> 1490167 INFO  (SUITE-TestNRTOpen-seed#[7C7BFEA4A5A2D7C0]-worker) [    ] o.a.s.c.CoreContainer No authentication plugin used.
   [junit4]   2> 1490167 INFO  (SUITE-TestNRTOpen-seed#[7C7BFEA4A5A2D7C0]-worker) [    ] o.a.s.c.CoreDescriptor Created CoreDescriptor: {name=collection1, config=solrconfig-basic.xml, transient=false, schema=schema-minimal.xml, loadOnStartup=true, configSetProperties=configsetprops.json, collection=collection1, dataDir=/home/jenkins/workspace/Lucene-Solr-5.x-Linux/solr/build/solr-core/test/J0/temp/solr.core.TestNRTOpen_7C7BFEA4A5A2D7C0-001/init-core-data-001, shard=shard1}
   [junit4]   2> 1490168 INFO  (coreLoadExecutor-5909-thread-1) [    ] o.a.s.c.SolrResourceLoader new SolrResourceLoader for directory: '/home/jenkins/workspace/Lucene-Solr-5.x-Linux/solr/core/src/test-files/solr/collection1'
   [junit4]   2> 1490168 INFO  (coreLoadExecutor-5909-thread-1) [    ] o.a.s.c.SolrResourceLoader JNDI not configured for solr (NoInitialContextEx)
   [junit4]   2> 1490168 INFO  (coreLoadExecutor-5909-thread-1) [    ] o.a.s.c.SolrResourceLoader using system property solr.solr.home: /home/jenkins/workspace/Lucene-Solr-5.x-Linux/solr/core/src/test-files/solr
   [junit4]   2> 1490168 INFO  (coreLoadExecutor-5909-thread-1) [    ] o.a.s.c.SolrResourceLoader Adding 'file:/home/jenkins/workspace/Lucene-Solr-5.x-Linux/solr/core/src/test-files/solr/collection1/lib/classes/' to classloader
   [junit4]   2> 1490168 INFO  (coreLoadExecutor-5909-thread-1) [    ] o.a.s.c.SolrResourceLoader Adding 'file:/home/jenkins/workspace/Lucene-Solr-5.x-Linux/solr/core/src/test-files/solr/collection1/lib/README' to classloader
   [junit4]   2> 1490181 INFO  (coreLoadExecutor-5909-thread-1) [    ] o.a.s.c.SolrConfig current version of requestparams : -1
   [junit4]   2> 1490182 INFO  (coreLoadExecutor-5909-thread-1) [    ] o.a.s.c.SolrConfig Using Lucene MatchVersion: 5.5.0
   [junit4]   2> 1490185 INFO  (coreLoadExecutor-5909-thread-1) [    ] o.a.s.c.SolrConfig Loaded SolrConfig: solrconfig-basic.xml
   [junit4]   2> 1490187 INFO  (coreLoadExecutor-5909-thread-1) [    ] o.a.s.s.IndexSchema [collection1] Schema name=minimal
   [junit4]   2> 1490187 WARN  (coreLoadExecutor-5909-thread-1) [    ] o.a.s.s.IndexSchema no uniqueKey specified in schema.
   [junit4]   2> 1490189 INFO  (coreLoadExecutor-5909-thread-1) [    ] o.a.s.c.ConfigSetProperties Did not find ConfigSet properties, assuming default properties: Can't find resource 'configsetprops.json' in classpath or '/home/jenkins/workspace/Lucene-Solr-5.x-Linux/solr/core/src/test-files/solr/collection1'
   [junit4]   2> 1490189 INFO  (coreLoadExecutor-5909-thread-1) [    ] o.a.s.c.CoreContainer Creating SolrCore 'collection1' using configuration from instancedir /home/jenkins/workspace/Lucene-Solr-5.x-Linux/solr/core/src/test-files/solr/collection1
   [junit4]   2> 1490189 INFO  (coreLoadExecutor-5909-thread-1) [    x:collection1] o.a.s.c.SolrCore solr.StandardDirectoryFactory
   [junit4]   2> 1490189 INFO  (coreLoadExecutor-5909-thread-1) [    x:collection1] o.a.s.c.SolrCore [[collection1] ] Opening new SolrCore at [/home/jenkins/workspace/Lucene-Solr-5.x-Linux/solr/core/src/test-files/solr/collection1], dataDir=[/home/jenkins/workspace/Lucene-Solr-5.x-Linux/solr/build/solr-core/test/J0/temp/solr.core.TestNRTOpen_7C7BFEA4A5A2D7C0-001/init-core-data-001/]
   [junit4]   2> 1490189 INFO  (coreLoadExecutor-5909-thread-1) [    x:collection1] o.a.s.c.SolrCore JMX monitoring not detected for core: collection1
   [junit4]   2> 1490190 INFO  (coreLoadExecutor-5909-thread-1) [    x:collection1] o.a.s.c.CachingDirectoryFactory return new directory for /home/jenkins/workspace/Lucene-Solr-5.x-Linux/solr/build/solr-core/test/J0/temp/solr.core.TestNRTOpen_7C7BFEA4A5A2D7C0-001/init-core-data-001
   [junit4]   2> 1490190 INFO  (coreLoadExecutor-5909-thread-1) [    x:collection1] o.a.s.c.SolrCore New index directory detected: old=null new=/home/jenkins/workspace/Lucene-Solr-5.x-Linux/solr/build/solr-core/test/J0/temp/solr.core.TestNRTOpen_7C7BFEA4A5A2D7C0-001/init-core-data-001/index/
   [junit4]   2> 1490190 INFO  (OldIndexDirectoryCleanupThreadForCore-collection1) [    x:collection1] o.a.s.c.SolrCore Looking for old index directories to cleanup for core collection1 in /home/jenkins/workspace/Lucene-Solr-5.x-Linux/solr/build/solr-core/test/J0/temp/solr.core.TestNRTOpen_7C7BFEA4A5A2D7C0-001/init-core-data-001/
   [junit4]   2> 1490191 INFO  (coreLoadExecutor-5909-thread-1) [    x:collection1] o.a.s.c.SolrCore no updateRequestProcessorChain defined as default, creating implicit default
   [junit4]   2> 1490192 INFO  (coreLoadExecutor-5909-thread-1) [    x:collection1] o.a.s.h.l.XMLLoader xsltCacheLifetimeSeconds=60
   [junit4]   2> 1490192 INFO  (coreLoadExecutor-5909-thread-1) [    x:collection1] o.a.s.h.l.XMLLoader xsltCacheLifetimeSeconds=60
   [junit4]   2> 1490193 INFO  (coreLoadExecutor-5909-thread-1) [    x:collection1] o.a.s.h.l.XMLLoader xsltCacheLifetimeSeconds=60
   [junit4]   2> 1490194 INFO  (coreLoadExecutor-5909-thread-1) [    x:collection1] o.a.s.h.l.XMLLoader xsltCacheLifetimeSeconds=60
   [junit4]   2> 1490194 INFO  (coreLoadExecutor-5909-thread-1) [    x:collection1] o.a.s.c.RequestHandlers Registered paths: /admin/mbeans,standard,/update/csv,/update/json/docs,/admin/luke,/admin/segments,/get,/admin/system,/replication,/admin/properties,/config,/schema,/admin/plugins,/admin/logging,/update/json,/admin/threads,/admin/ping,/update,/admin/file
   [junit4]   2> 1490194 INFO  (coreLoadExecutor-5909-thread-1) [    x:collection1] o.a.s.c.SolrCore Using default statsCache cache: org.apache.solr.search.stats.LocalStatsCache
   [junit4]   2> 1490194 INFO  (coreLoadExecutor-5909-thread-1) [    x:collection1] o.a.s.u.CommitTracker Hard AutoCommit: disabled
   [junit4]   2> 1490195 INFO  (coreLoadExecutor-5909-thread-1) [    x:collection1] o.a.s.u.CommitTracker Soft AutoCommit: disabled
   [junit4]   2> 1490195 INFO  (coreLoadExecutor-5909-thread-1) [    x:collection1] o.a.s.c.CachingDirectoryFactory return new directory for /home/jenkins/workspace/Lucene-Solr-5.x-Linux/solr/build/solr-core/test/J0/temp/solr.core.TestNRTOpen_7C7BFEA4A5A2D7C0-001/init-core-data-001/index
   [junit4]   2> 1490195 INFO  (coreLoadExecutor-5909-thread-1) [    x:collection1] o.a.s.u.RandomMergePolicy RandomMergePolicy wrapping class org.apache.lucene.index.TieredMergePolicy: [TieredMergePolicy: maxMergeAtOnce=17, maxMergeAtOnceExplicit=45, maxMergedSegmentMB=48.5908203125, floorSegmentMB=1.7138671875, forceMergeDeletesPctAllowed=3.325060102782201, segmentsPerTier=23.0, maxCFSSegmentSizeMB=8.796093022207999E12, noCFSRatio=0.0
   [junit4]   2> 1490196 INFO  (coreLoadExecutor-5909-thread-1) [    x:collection1] o.a.s.c.SolrDeletionPolicy SolrDeletionPolicy.onInit: commits: num=1
   [junit4]   2> 	commit{dir=/home/jenkins/workspace/Lucene-Solr-5.x-Linux/solr/build/solr-core/test/J0/temp/solr.core.TestNRTOpen_7C7BFEA4A5A2D7C0-001/init-core-data-001/index,segFN=segments_2,generation=2}
   [junit4]   2> 1490196 INFO  (coreLoadExecutor-5909-thread-1) [    x:collection1] o.a.s.c.SolrDeletionPolicy newest commit generation = 2
   [junit4]   2> 1490197 INFO  (coreLoadExecutor-5909-thread-1) [    x:collection1] o.a.s.s.SolrIndexSearcher Opening Searcher@248acc[collection1] main
   [junit4]   2> 1490197 WARN  (coreLoadExecutor-5909-thread-1) [    x:collection1] o.a.s.r.ManagedResourceStorage Cannot write to config directory /home/jenkins/workspace/Lucene-Solr-5.x-Linux/solr/core/src/test-files/solr/collection1/conf; switching to use InMemory storage instead.
   [junit4]   2> 1490197 INFO  (coreLoadExecutor-5909-thread-1) [    x:collection1] o.a.s.r.RestManager Initializing RestManager with initArgs: {}
   [junit4]   2> 1490197 INFO  (coreLoadExecutor-5909-thread-1) [    x:collection1] o.a.s.r.ManagedResourceStorage Reading _rest_managed.json using InMemoryStorage
   [junit4]   2> 1490197 INFO  (coreLoadExecutor-5909-thread-1) [    x:collection1] o.a.s.r.RestManager Initializing 0 registered ManagedResources
   [junit4]   2> 1490197 INFO  (coreLoadExecutor-5909-thread-1) [    x:collection1] o.a.s.h.ReplicationHandler Commits will be reserved for  10000
   [junit4]   2> 1490197 INFO  (searcherExecutor-5910-thread-1-processing-x:collection1) [    x:collection1] o.a.s.c.SolrCore [collection1] Registered new searcher Searcher@248acc[collection1] main{ExitableDirectoryReader(UninvertingDirectoryReader(Uninverting(_0(5.5.0):C1)))}
   [junit4]   2> 1490197 INFO  (coreLoadExecutor-5909-thread-1) [    x:collection1] o.a.s.c.CoreContainer registering core: collection1
   [junit4]   2> 1490198 INFO  (SUITE-TestNRTOpen-seed#[7C7BFEA4A5A2D7C0]-worker) [    ] o.a.s.SolrTestCaseJ4 ####initCore end
   [junit4]   2> 1490200 INFO  (TEST-TestNRTOpen.testReaderIsNRT-seed#[7C7BFEA4A5A2D7C0]) [    ] o.a.s.SolrTestCaseJ4 ###Starting testReaderIsNRT
   [junit4]   2> 1490201 INFO  (TEST-TestNRTOpen.testReaderIsNRT-seed#[7C7BFEA4A5A2D7C0]) [    ] o.a.s.u.DirectUpdateHandler2 [collection1] REMOVING ALL DOCUMENTS FROM INDEX
   [junit4]   2> 1490201 INFO  (TEST-TestNRTOpen.testReaderIsNRT-seed#[7C7BFEA4A5A2D7C0]) [    ] o.a.s.u.p.LogUpdateProcessorFactory [collection1]  webapp=null path=null params={}{deleteByQuery=*:*} 0 0
   [junit4]   2> 1490202 INFO  (TEST-TestNRTOpen.testReaderIsNRT-seed#[7C7BFEA4A5A2D7C0]) [    ] o.a.s.u.p.LogUpdateProcessorFactory [collection1]  webapp=null path=null params={}{add=[(null)]} 0 0
   [junit4]   2> 1490202 INFO  (TEST-TestNRTOpen.testReaderIsNRT-seed#[7C7BFEA4A5A2D7C0]) [    ] o.a.s.u.DirectUpdateHandler2 start commit{,optimize=false,openSearcher=true,waitSearcher=true,expungeDeletes=false,softCommit=false,prepareCommit=false}
   [junit4]   2> 1490311 INFO  (TEST-TestNRTOpen.testReaderIsNRT-seed#[7C7BFEA4A5A2D7C0]) [    ] o.a.s.c.SolrDeletionPolicy SolrDeletionPolicy.onCommit: commits: num=2
   [junit4]   2> 	commit{dir=/home/jenkins/workspace/Lucene-Solr-5.x-Linux/solr/build/solr-core/test/J0/temp/solr.core.TestNRTOpen_7C7BFEA4A5A2D7C0-001/init-core-data-001/index,segFN=segments_2,generation=2}
   [junit4]   2> 	commit{dir=/home/jenkins/workspace/Lucene-Solr-5.x-Linux/solr/build/solr-core/test/J0/temp/solr.core.TestNRTOpen_7C7BFEA4A5A2D7C0-001/init-core-data-001/index,segFN=segments_3,generation=3}
   [junit4]   2> 1490311 INFO  (TEST-TestNRTOpen.testReaderIsNRT-seed#[7C7BFEA4A5A2D7C0]) [    ] o.a.s.c.SolrDeletionPolicy newest commit generation = 3
   [junit4]   2> 1490313 INFO  (TEST-TestNRTOpen.testReaderIsNRT-seed#[7C7BFEA4A5A2D7C0]) [    ] o.a.s.s.SolrIndexSearcher Opening Searcher@f20b95[collection1] main
   [junit4]   2> 1490313 INFO  (TEST-TestNRTOpen.testReaderIsNRT-seed#[7C7BFEA4A5A2D7C0]) [    ] o.a.s.u.DirectUpdateHandler2 end_commit_flush
   [junit4]   2> 1490313 INFO  (searcherExecutor-5910-thread-1) [    ] o.a.s.c.SolrCore [collection1] Registered new searcher Searcher@f20b95[collection1] main{ExitableDirectoryReader(UninvertingDirectoryReader(Uninverting(_1(5.5.0):C1)))}
   [junit4]   2> 1490313 INFO  (TEST-TestNRTOpen.testReaderIsNRT-seed#[7C7BFEA4A5A2D7C0]) [    ] o.a.s.u.p.LogUpdateProcessorFactory [collection1]  webapp=null path=null params={}{commit=} 0 111
   [junit4]   2> 1490314 INFO  (TEST-TestNRTOpen.testReaderIsNRT-seed#[7C7BFEA4A5A2D7C0]) [    ] o.a.s.c.SolrResourceLoader new SolrResourceLoader for directory: '/home/jenkins/workspace/Lucene-Solr-5.x-Linux/solr/core/src/test-files/solr/collection1'
   [junit4]   2> 1490314 INFO  (TEST-TestNRTOpen.testReaderIsNRT-seed#[7C7BFEA4A5A2D7C0]) [    ] o.a.s.c.SolrResourceLoader JNDI not configured for solr (NoInitialContextEx)
   [junit4]   2> 1490314 INFO  (TEST-TestNRTOpen.testReaderIsNRT-seed#[7C7BFEA4A5A2D7C0]) [    ] o.a.s.c.SolrResourceLoader using system property solr.solr.home: /home/jenkins/workspace/Lucene-Solr-5.x-Linux/solr/core/src/test-files/solr
   [junit4]   2> 1490314 INFO  (TEST-TestNRTOpen.testReaderIsNRT-seed#[7C7BFEA4A5A2D7C0]) [    ] o.a.s.c.SolrResourceLoader Adding 'file:/home/jenkins/workspace/Lucene-Solr-5.x-Linux/solr/core/src/test-files/solr/collection1/lib/classes/' to classloader
   [junit4]   2> 1490314 INFO  (TEST-TestNRTOpen.testReaderIsNRT-seed#[7C7BFEA4A5A2D7C0]) [    ] o.a.s.c.SolrResourceLoader Adding 'file:/home/jenkins/workspace/Lucene-Solr-5.x-Linux/solr/core/src/test-files/solr/collection1/lib/README' to classloader
   [junit4]   2> 1490328 INFO  (TEST-TestNRTOpen.testReaderIsNRT-seed#[7C7BFEA4A5A2D7C0]) [    ] o.a.s.c.SolrConfig current version of requestparams : -1
   [junit4]   2> 1490329 INFO  (TEST-TestNRTOpen.testReaderIsNRT-seed#[7C7BFEA4A5A2D7C0]) [    ] o.a.s.c.SolrConfig Using Lucene MatchVersion: 5.5.0
   [junit4]   2> 1490332 INFO  (TEST-TestNRTOpen.testReaderIsNRT-seed#[7C7BFEA4A5A2D7C0]) [    ] o.a.s.c.SolrConfig Loaded SolrConfig: solrconfig-basic.xml
   [junit4]   2> 1490333 INFO  (TEST-TestNRTOpen.testReaderIsNRT-seed#[7C7BFEA4A5A2D7C0]) [    ] o.a.s.s.IndexSchema [collection1] Schema name=minimal
   [junit4]   2> 1490335 WARN  (TEST-TestNRTOpen.testReaderIsNRT-seed#[7C7BFEA4A5A2D7C0]) [    ] o.a.s.s.IndexSchema no uniqueKey specified in schema.
   [junit4]   2> 1490336 INFO  (TEST-TestNRTOpen.testReaderIsNRT-seed#[7C7BFEA4A5A2D7C0]) [    ] o.a.s.c.ConfigSetProperties Did not find ConfigSet properties, assuming default properties: Can't find resource 'configsetprops.json' in classpath or '/home/jenkins/workspace/Lucene-Solr-5.x-Linux/solr/core/src/test-files/solr/collection1'
   [junit4]   2> 1490336 INFO  (TEST-TestNRTOpen.testReaderIsNRT-seed#[7C7BFEA4A5A2D7C0]) [    ] o.a.s.c.CoreContainer Reloading SolrCore 'collection1' using configuration from instancedir /home/jenkins/workspace/Lucene-Solr-5.x-Linux/solr/core/src/test-files/solr/collection1
   [junit4]   2> 1490336 INFO  (TEST-TestNRTOpen.testReaderIsNRT-seed#[7C7BFEA4A5A2D7C0]) [    x:collection1] o.a.s.c.SolrCore [[collection1] ] Opening new SolrCore at [/home/jenkins/workspace/Lucene-Solr-5.x-Linux/solr/core/src/test-files/solr/collection1], dataDir=[/home/jenkins/workspace/Lucene-Solr-5.x-Linux/solr/build/solr-core/test/J0/temp/solr.core.TestNRTOpen_7C7BFEA4A5A2D7C0-001/init-core-data-001/]
   [junit4]   2> 1490336 INFO  (TEST-TestNRTOpen.testReaderIsNRT-seed#[7C7BFEA4A5A2D7C0]) [    x:collection1] o.a.s.c.SolrCore JMX monitoring not detected for core: collection1
   [junit4]   2> 1490336 INFO  (TEST-TestNRTOpen.testReaderIsNRT-seed#[7C7BFEA4A5A2D7C0]) [    x:collection1] o.a.s.c.SolrCore New index directory detected: old=null new=/home/jenkins/workspace/Lucene-Solr-5.x-Linux/solr/build/solr-core/test/J0/temp/solr.core.TestNRTOpen_7C7BFEA4A5A2D7C0-001/init-core-data-001/index/
   [junit4]   2> 1490337 INFO  (OldIndexDirectoryCleanupThreadForCore-collection1) [    x:collection1] o.a.s.c.SolrCore Looking for old index directories to cleanup for core collection1 in /home/jenkins/workspace/Lucene-Solr-5.x-Linux/solr/build/solr-core/test/J0/temp/solr.core.TestNRTOpen_7C7BFEA4A5A2D7C0-001/init-core-data-001/
   [junit4]   2> 1490338 INFO  (TEST-TestNRTOpen.testReaderIsNRT-seed#[7C7BFEA4A5A2D7C0]) [    x:collection1] o.a.s.c.SolrCore no updateRequestProcessorChain defined as default, creating implicit default
   [junit4]   2> 1490338 INFO  (TEST-TestNRTOpen.testReaderIsNRT-seed#[7C7BFEA4A5A2D7C0]) [    x:collection1] o.a.s.h.l.XMLLoader xsltCacheLifetimeSeconds=60
   [junit4]   2> 1490339 INFO  (TEST-TestNRTOpen.testReaderIsNRT-seed#[7C7BFEA4A5A2D7C0]) [    x:collection1] o.a.s.h.l.XMLLoader xsltCacheLifetimeSeconds=60
   [junit4]   2> 1490339 INFO  (TEST-TestNRTOpen.testReaderIsNRT-seed#[7C7BFEA4A5A2D7C0]) [    x:collection1] o.a.s.h.l.XMLLoader xsltCacheLifetimeSeconds=60
   [junit4]   2> 1490340 INFO  (TEST-TestNRTOpen.testReaderIsNRT-seed#[7C7BFEA4A5A2D7C0]) [    x:collection1] o.a.s.h.l.XMLLoader xsltCacheLifetimeSeconds=60
   [junit4]   2> 1490340 INFO  (TEST-TestNRTOpen.testReaderIsNRT-seed#[7C7BFEA4A5A2D7C0]) [    x:collection1] o.a.s.c.RequestHandlers Registered paths: /admin/mbeans,standard,/update/csv,/update/json/docs,/admin/luke,/admin/segments,/get,/admin/system,/replication,/admin/properties,/config,/schema,/admin/plugins,/admin/logging,/update/json,/admin/threads,/admin/ping,/update,/admin/file
   [junit4]   2> 1490341 INFO  (TEST-TestNRTOpen.testReaderIsNRT-seed#[7C7BFEA4A5A2D7C0]) [    x:collection1] o.a.s.c.SolrCore Using default statsCache cache: org.apache.solr.search.stats.LocalStatsCache
   [junit4]   2> 1490341 INFO  (TEST-TestNRTOpen.testReaderIsNRT-seed#[7C7BFEA4A5A2D7C0]) [    x:collection1] o.a.s.u.CommitTracker Hard AutoCommit: disabled
   [junit4]   2> 1490341 INFO  (TEST-TestNRTOpen.testReaderIsNRT-seed#[7C7BFEA4A5A2D7C0]) [    x:collection1] o.a.s.u.CommitTracker Soft AutoCommit: disabled
   [junit4]   2> 1490341 INFO  (TEST-TestNRTOpen.testReaderIsNRT-seed#[7C7BFEA4A5A2D7C0]) [    x:collection1] o.a.s.s.SolrIndexSearcher Opening Searcher@1f79a5e[collection1] main
   [junit4]   2> 1490341 WARN  (TEST-TestNRTOpen.testReaderIsNRT-seed#[7C7BFEA4A5A2D7C0]) [    x:collection1] o.a.s.r.ManagedResourceStorage Cannot write to config directory /home/jenkins/workspace/Lucene-Solr-5.x-Linux/solr/core/src/test-files/solr/collection1/conf; switching to use InMemory storage instead.
   [junit4]   2> 1490341 INFO  (TEST-TestNRTOpen.testReaderIsNRT-seed#[7C7BFEA4A5A2D7C0]) [    x:collection1] o.a.s.r.RestManager Initializing RestManager with initArgs: {}
   [junit4]   2> 1490341 INFO  (TEST-TestNRTOpen.testReaderIsNRT-seed#[7C7BFEA4A5A2D7C0]) [    x:collection1] o.a.s.r.ManagedResourceStorage Reading _rest_managed.json using InMemoryStorage
   [junit4]   2> 1490341 INFO  (TEST-TestNRTOpen.testReaderIsNRT-seed#[7C7BFEA4A5A2D7C0]) [    x:collection1] o.a.s.r.RestManager Initializing 0 registered ManagedResources
   [junit4]   2> 1490341 INFO  (TEST-TestNRTOpen.testReaderIsNRT-seed#[7C7BFEA4A5A2D7C0]) [    x:collection1] o.a.s.h.ReplicationHandler Commits will be reserved for  10000
   [junit4]   2> 1490341 INFO  (searcherExecutor-5914-thread-1-processing-x:collection1) [    x:collection1] o.a.s.c.SolrCore [collection1] Registered new searcher Searcher@1f79a5e[collection1] main{ExitableDirectoryReader(UninvertingDirectoryReader(Uninverting(_1(5.5.0):C1)))}
   [junit4]   2> 1490342 INFO  (TEST-TestNRTOpen.testReaderIsNRT-seed#[7C7BFEA4A5A2D7C0]) [    x:collection1] o.a.s.u.DefaultSolrCoreState Closing old IndexWriter... core=collection1
   [junit4]   2> 1490342 INFO  (TEST-TestNRTOpen.testReaderIsNRT-seed#[7C7BFEA4A5A2D7C0]) [    x:collection1] o.a.s.u.RandomMergePolicy RandomMergePolicy wrapping class org.apache.lucene.index.TieredMergePolicy: [TieredMergePolicy: maxMergeAtOnce=46, maxMergeAtOnceExplicit=15, maxMergedSegmentMB=1.1513671875, floorSegmentMB=1.0654296875, forceMergeDeletesPctAllowed=23.065443018908326, segmentsPerTier=30.0, maxCFSSegmentSizeMB=8.796093022207999E12, noCFSRatio=1.0
   [junit4]   2> 1490342 INFO  (TEST-TestNRTOpen.testReaderIsNRT-seed#[7C7BFEA4A5A2D7C0]) [    x:collection1] o.a.s.c.SolrDeletionPolicy SolrDeletionPolicy.onInit: commits: num=1
   [junit4]   2> 	commit{dir=/home/jenkins/workspace/Lucene-Solr-5.x-Linux/solr/build/solr-core/test/J0/temp/solr.core.TestNRTOpen_7C7BFEA4A5A2D7C0-001/init-core-data-001/index,segFN=segments_3,generation=3}
   [junit4]   2> 1490342 INFO  (TEST-TestNRTOpen.testReaderIsNRT-seed#[7C7BFEA4A5A2D7C0]) [    x:collection1] o.a.s.c.SolrDeletionPolicy newest commit generation = 3
   [junit4]   2> 1490343 INFO  (TEST-TestNRTOpen.testReaderIsNRT-seed#[7C7BFEA4A5A2D7C0]) [    x:collection1] o.a.s.u.DefaultSolrCoreState New IndexWriter is ready to be used.
   [junit4]   2> 1490343 INFO  (TEST-TestNRTOpen.testReaderIsNRT-seed#[7C7BFEA4A5A2D7C0]) [    x:collection1] o.a.s.s.SolrIndexSearcher Opening Searcher@520bce[collection1] main
   [junit4]   2> 1490343 INFO  (TEST-TestNRTOpen.testReaderIsNRT-seed#[7C7BFEA4A5A2D7C0]) [    x:collection1] o.a.s.c.CoreContainer replacing core: collection1
   [junit4]   2> 1490343 INFO  (searcherExecutor-5914-thread-1-processing-x:collection1) [    x:collection1] o.a.s.c.SolrCore [collection1] Registered new searcher Searcher@520bce[collection1] main{ExitableDirectoryReader(UninvertingDirectoryReader(Uninverting(_1(5.5.0):C1)))}
   [junit4]   2> 1490343 INFO  (TEST-TestNRTOpen.testReaderIsNRT-seed#[7C7BFEA4A5A2D7C0]) [    x:collection1] o.a.s.c.SolrCore [collection1]  CLOSING SolrCore org.apache.solr.core.SolrCore@1e4b25b
   [junit4]   2> 1490343 INFO  (TEST-TestNRTOpen.testReaderIsNRT-seed#[7C7BFEA4A5A2D7C0]) [    x:collection1] o.a.s.u.DirectUpdateHandler2 closing DirectUpdateHandler2{commits=1,autocommits=0,soft autocommits=0,optimizes=0,rollbacks=0,expungeDeletes=0,docsPending=0,adds=0,deletesById=0,deletesByQuery=0,errors=0,cumulative_adds=1,cumulative_deletesById=0,cumulative_deletesByQuery=1,cumulative_errors=0}
   [junit4]   2> 1490344 INFO  (TEST-TestNRTOpen.testReaderIsNRT-seed#[7C7BFEA4A5A2D7C0]) [    x:collection1] o.a.s.c.SolrCore [collection1] Closing main searcher on request.
   [junit4]   2> 1490344 INFO  (TEST-TestNRTOpen.testReaderIsNRT-seed#[7C7BFEA4A5A2D7C0]) [    x:collection1] o.a.s.u.p.LogUpdateProcessorFactory [collection1]  webapp=null path=null params={}{add=[(null)]} 0 0
   [junit4]   2> 1490344 INFO  (TEST-TestNRTOpen.testReaderIsNRT-seed#[7C7BFEA4A5A2D7C0]) [    x:collection1] o.a.s.u.DirectUpdateHandler2 start commit{,optimize=false,openSearcher=true,waitSearcher=true,expungeDeletes=false,softCommit=true,prepareCommit=false}
   [junit4]   2> 1490347 INFO  (TEST-TestNRTOpen.testReaderIsNRT-seed#[7C7BFEA4A5A2D7C0]) [    x:collection1] o.a.s.s.SolrIndexSearcher Opening Searcher@e4b15a[collection1] main
   [junit4]   2> 1490347 INFO  (TEST-TestNRTOpen.testReaderIsNRT-seed#[7C7BFEA4A5A2D7C0]) [    x:collection1] o.a.s.u.DirectUpdateHandler2 end_commit_flush
   [junit4]   2> 1490347 INFO  (searcherExecutor-5914-thread-1-processing-x:collection1) [    x:collection1] o.a.s.c.SolrCore [collection1] Registered new searcher Searcher@e4b15a[collection1] main{ExitableDirectoryReader(UninvertingDirectoryReader(Uninverting(_1(5.5.0):C1) Uninverting(_2(5.5.0):C1)))}
   [junit4]   2> 1490347 INFO  (TEST-TestNRTOpen.testReaderIsNRT-seed#[7C7BFEA4A5A2D7C0]) [    x:collection1] o.a.s.u.p.LogUpdateProcessorFactory [collection1]  webapp=null path=null params={}{commit=} 0 2
   [junit4]   2> 1490347 INFO  (TEST-TestNRTOpen.testReaderIsNRT-seed#[7C7BFEA4A5A2D7C0]) [    x:collection1] o.a.s.u.p.LogUpdateProcessorFactory [collection1]  webapp=null path=null params={}{add=[(null)]} 0 0
   [junit4]   2> 1490347 INFO  (TEST-TestNRTOpen.testReaderIsNRT-seed#[7C7BFEA4A5A2D7C0]) [    x:collection1] o.a.s.u.DirectUpdateHandler2 start commit{,optimize=false,openSearcher=true,waitSearcher=true,expungeDeletes=false,softCommit=false,prepareCommit=false}
   [junit4]   2> 1490674 INFO  (TEST-TestNRTOpen.testReaderIsNRT-seed#[7C7BFEA4A5A2D7C0]) [    x:collection1] o.a.s.c.SolrDeletionPolicy SolrDeletionPolicy.onCommit: commits: num=2
   [junit4]   2> 	commit{dir=/home/jenkins/workspace/Lucene-Solr-5.x-Linux/solr/build/solr-core/test/J0/temp/solr.core.TestNRTOpen_7C7BFEA4A5A2D7C0-001/init-core-data-001/index,segFN=segments_3,generation=3}
   [junit4]   2> 	commit{dir=/home/jenkins/workspace/Lucene-Solr-5.x-Linux/solr/build/solr-core/test/J0/temp/solr.core.TestNRTOpen_7C7BFEA4A5A2D7C0-001/init-core-data-001/index,segFN=segments_4,generation=4}
   [junit4]   2> 1490674 INFO  (TEST-TestNRTOpen.testReaderIsNRT-seed#[7C7BFEA4A5A2D7C0]) [    x:collection1] o.a.s.c.SolrDeletionPolicy newest commit generation = 4
   [junit4]   2> 1490675 INFO  (TEST-TestNRTOpen.testReaderIsNRT-seed#[7C7BFEA4A5A2D7C0]) [    x:collection1] o.a.s.s.SolrIndexSearcher Opening Searcher@84fdf4[collection1] main
   [junit4]   2> 1490675 INFO  (TEST-TestNRTOpen.testReaderIsNRT-seed#[7C7BFEA4A5A2D7C0]) [    x:collection1] o.a.s.u.DirectUpdateHandler2 end_commit_flush
   [junit4]   2> 1490675 INFO  (searcherExecutor-5914-thread-1-processing-x:collection1) [    x:collection1] o.a.s.c.SolrCore [collection1] Registered new searcher Searcher@84fdf4[collection1] main{ExitableDirectoryReader(UninvertingDirectoryReader(Uninverting(_1(5.5.0):C1) Uninverting(_2(5.5.0):C1) Uninverting(_3(5.5.0):C1)))}
   [junit4]   2> 1490675 INFO  (TEST-TestNRTOpen.testReaderIsNRT-seed#[7C7BFEA4A5A2D7C0]) [    x:collection1] o.a.s.u.p.LogUpdateProcessorFactory [collection1]  webapp=null path=null params={}{commit=} 0 327
   [junit4]   2> 1490675 INFO  (TEST-TestNRTOpen.testReaderIsNRT-seed#[7C7BFEA4A5A2D7C0]) [    x:collection1] o.a.s.u.p.LogUpdateProcessorFactory [collection1]  webapp=null path=null params={}{add=[(null)]} 0 0
   [junit4]   2> 1490676 INFO  (TEST-TestNRTOpen.testReaderIsNRT-seed#[7C7BFEA4A5A2D7C0]) [    x:collection1] o.a.s.c.SolrResourceLoader new SolrResourceLoader for directory: '/home/jenkins/workspace/Lucene-Solr-5.x-Linux/solr/core/src/test-files/solr/collection1'
   [junit4]   2> 1490676 INFO  (TEST-TestNRTOpen.testReaderIsNRT-seed#[7C7BFEA4A5A2D7C0]) [    x:collection1] o.a.s.c.SolrResourceLoader JNDI not configured for solr (NoInitialContextEx)
   [junit4]   2> 1490676 INFO  (TEST-TestNRTOpen.testReaderIsNRT-seed#[7C7BFEA4A5A2D7C0]) [    x:collection1] o.a.s.c.SolrResourceLoader using system property solr.solr.home: /home/jenkins/workspace/Lucene-Solr-5.x-Linux/solr/core/src/test-files/solr
   [junit4]   2> 1490676 INFO  (TEST-TestNRTOpen.testReaderIsNRT-seed#[7C7BFEA4A5A2D7C0]) [    x:collection1] o.a.s.c.SolrResourceLoader Adding 'file:/home/jenkins/workspace/Lucene-Solr-5.x-Linux/solr/core/src/test-files/solr/collection1/lib/classes/' to classloader
   [junit4]   2> 1490676 INFO  (TEST-TestNRTOpen.testReaderIsNRT-seed#[7C7BFEA4A5A2D7C0]) [    x:collection1] o.a.s.c.SolrResourceLoader Adding 'file:/home/jenkins/workspace/Lucene-Solr-5.x-Linux/solr/core/src/test-files/solr/collection1/lib/README' to classloader
   [junit4]   2> 1490689 INFO  (TEST-TestNRTOpen.testReaderIsNRT-seed#[7C7BFEA4A5A2D7C0]) [    x:collection1] o.a.s.c.SolrConfig current version of requestparams : -1
   [junit4]   2> 1490691 INFO  (TEST-TestNRTOpen.testReaderIsNRT-seed#[7C7BFEA4A5A2D7C0]) [    x:collection1] o.a.s.c.SolrConfig Using Lucene MatchVersion: 5.5.0
   [junit4]   2> 1490693 INFO  (TEST-TestNRTOpen.testReaderIsNRT-seed#[7C7BFEA4A5A2D7C0]) [    x:collection1] o.a.s.c.SolrConfig Loaded SolrConfig: solrconfig-basic.xml
   [junit4]   2> 1490695 INFO  (TEST-TestNRTOpen.testReaderIsNRT-seed#[7C7BFEA4A5A2D7C0]) [    x:collection1] o.a.s.s.IndexSchema [collection1] Schema name=minimal
   [junit4]   2> 1490696 WARN  (TEST-TestNRTOpen.testReaderIsNRT-seed#[7C7BFEA4A5A2D7C0]) [    x:collection1] o.a.s.s.IndexSchema no uniqueKey specified in schema.
   [junit4]   2> 1490697 INFO  (TEST-TestNRTOpen.testReaderIsNRT-seed#[7C7BFEA4A5A2D7C0]) [    x:collection1] o.a.s.c.ConfigSetProperties Did not find ConfigSet properties, assuming default properties: Can't find resource 'configsetprops.json' in classpath or '/home/jenkins/workspace/Lucene-Solr-5.x-Linux/solr/core/src/test-files/solr/collection1'
   [junit4]   2> 1490697 INFO  (TEST-TestNRTOpen.testReaderIsNRT-seed#[7C7BFEA4A5A2D7C0]) [    x:collection1] o.a.s.c.CoreContainer Reloading SolrCore 'collection1' using configuration from instancedir /home/jenkins/workspace/Lucene-Solr-5.x-Linux/solr/core/src/test-files/solr/collection1
   [junit4]   2> 1490698 INFO  (TEST-TestNRTOpen.testReaderIsNRT-seed#[7C7BFEA4A5A2D7C0]) [    x:collection1] o.a.s.c.SolrCore [[collection1] ] Opening new SolrCore at [/home/jenkins/workspace/Lucene-Solr-5.x-Linux/solr/core/src/test-files/solr/collection1], dataDir=[/home/jenkins/workspace/Lucene-Solr-5.x-Linux/solr/build/solr-core/test/J0/temp/solr.core.TestNRTOpen_7C7BFEA4A5A2D7C0-001/init-core-data-001/]
   [junit4]   2> 1490698 INFO  (TEST-TestNRTOpen.testReaderIsNRT-seed#[7C7BFEA4A5A2D7C0]) [    x:collection1] o.a.s.c.SolrCore JMX monitoring not detected for core: collection1
   [junit4]   2> 1490698 INFO  (TEST-TestNRTOpen.testReaderIsNRT-seed#[7C7BFEA4A5A2D7C0]) [    x:collection1] o.a.s.c.SolrCore New index directory detected: old=null new=/home/jenkins/workspace/Lucene-Solr-5.x-Linux/solr/build/solr-core/test/J0/temp/solr.core.TestNRTOpen_7C7BFEA4A5A2D7C0-001/init-core-data-001/index/
   [junit4]   2> 1490698 INFO  (OldIndexDirectoryCleanupThreadForCore-collection1) [    x:collection1] o.a.s.c.SolrCore Looking for old index directories to cleanup for core collection1 in /home/jenkins/workspace/Lucene-Solr-5.x-Linux/solr/build/solr-core/test/J0/temp/solr.core.TestNRTOpen_7C7BFEA4A5A2D7C0-001/init-core-data-001/
   [junit4]   2> 1490699 INFO  (TEST-TestNRTOpen.testReaderIsNRT-seed#[7C7BFEA4A5A2D7C0]) [    x:collection1] o.a.s.c.SolrCore no updateRequestProcessorChain defined as default, creating implicit default
   [junit4]   2> 1490700 INFO  (TEST-TestNRTOpen.testReaderIsNRT-seed#[7C7BFEA4A5A2D7C0]) [    x:collection1] o.a.s.h.l.XMLLoader xsltCacheLifetimeSeconds=60
   [junit4]   2> 1490700 INFO  (TEST-TestNRTOpen.testReaderIsNRT-seed#[7C7BFEA4A5A2D7C0]) [    x:collection1] o.a.s.h.l.XMLLoader xsltCacheLifetimeSeconds=60
   [junit4]   2> 1490701 INFO  (TEST-TestNRTOpen.testReaderIsNRT-seed#[7C7BFEA4A5A2D7C0]) [    x:collection1] o.a.s.h.l.XMLLoader xsltCacheLifetimeSeconds=60
   [junit4]   2> 1490701 INFO  (TEST-TestNRTOpen.testReaderIsNRT-seed#[7C7BFEA4A5A2D7C0]) [    x:collection1] o.a.s.h.l.XMLLoader xsltCacheLifetimeSeconds=60
   [junit4]   2> 1490702 INFO  (TEST-TestNRTOpen.testReaderIsNRT-seed#[7C7BFEA4A5A2D7C0]) [    x:collection1] o.a.s.c.RequestHandlers Registered paths: /admin/mbeans,standard,/update/csv,/update/json/docs,/admin/luke,/admin/segments,/get,/admin/system,/replication,/admin/properties,/config,/schema,/admin/plugins,/admin/logging,/update/json,/admin/threads,/admin/ping,/update,/admin/file
   [junit4]   2> 1490702 INFO  (TEST-TestNRTOpen.testReaderIsNRT-seed#[7C7BFEA4A5A2D7C0]) [    x:collection1] o.a.s.c.SolrCore Using default statsCache cache: org.apache.solr.search.stats.LocalStatsCache
   [junit4]   2> 1490702 INFO  (TEST-TestNRTOpen.testReaderIsNRT-seed#[7C7BFEA4A5A2D7C0]) [    x:collection1] o.a.s.u.CommitTracker Hard AutoCommit: disabled
   [junit4]   2> 1490702 INFO  (TEST-TestNRTOpen.testReaderIsNRT-seed#[7C7BFEA4A5A2D7C0]) [    x:collection1] o.a.s.u.CommitTracker Soft AutoCommit: disabled
   [junit4]   2> 1490704 INFO  (TEST-TestNRTOpen.testReaderIsNRT-seed#[7C7BFEA4A5A2D7C0]) [    x:collection1] o.a.s.s.SolrIndexSearcher Opening Searcher@1e5468e[collection1] main
   [junit4]   2> 1490704 WARN  (TEST-TestNRTOpen.testReaderIsNRT-seed#[7C7BFEA4A5A2D7C0]) [    x:collection1] o.a.s.r.ManagedResourceStorage Cannot write to config directory /home/jenkins/workspace/Lucene-Solr-5.x-Linux/solr/core/src/test-files/solr/collection1/conf; switching to use InMemory storage instead.
   [junit4]   2> 1490704 INFO  (TEST-TestNRTOpen.testReaderIsNRT-seed#[7C7BFEA4A5A2D7C0]) [    x:collection1] o.a.s.r.RestManager Initializing RestManager with initArgs: {}
   [junit4]   2> 1490704 INFO  (TEST-TestNRTOpen.testReaderIsNRT-seed#[7C7BFEA4A5A2D7C0]) [    x:collection1] o.a.s.r.ManagedResourceStorage Reading _rest_managed.json using InMemoryStorage
   [junit4]   2> 1490704 INFO  (TEST-TestNRTOpen.testReaderIsNRT-seed#[7C7BFEA4A5A2D7C0]) [    x:collection1] o.a.s.r.RestManager Initializing 0 registered ManagedResources
   [junit4]   2> 1490704 INFO  (TEST-TestNRTOpen.testReaderIsNRT-seed#[7C7BFEA4A5A2D7C0]) [    x:collection1] o.a.s.h.ReplicationHandler Commits will be reserved for  10000
   [junit4]   2> 1490704 INFO  (searcherExecutor-5918-thread-1-processing-x:collection1) [    x:collection1] o.a.s.c.SolrCore [collection1] Registered new searcher Searcher@1e5468e[collection1] main{ExitableDirectoryReader(UninvertingDirectoryReader(Uninverting(_1(5.5.0):C1) Uninverting(_2(5.5.0):C1) Uninverting(_3(5.5.0):C1) Uninverting(_4(5.5.0):C1)))}
   [junit4]   2> 1490705 INFO  (TEST-TestNRTOpen.testReaderIsNRT-seed#[7C7BFEA4A5A2D7C0]) [    x:collection1] o.a.s.u.DefaultSolrCoreState Closing old IndexWriter... core=collection1
   [junit4]   2> 1490820 INFO  (TEST-TestNRTOpen.testReaderIsNRT-seed#[7C7BFEA4A5A2D7C0]) [    x:collection1] o.a.s.c.SolrDeletionPolicy SolrDeletionPolicy.onCommit: commits: num=2
   [junit4]   2> 	commit{dir=/home/jenkins/workspace/Lucene-Solr-5.x-Linux/solr/build/solr-core/test/J0/temp/solr.core.TestNRTOpen_7C7BFEA4A5A2D7C0-001/init-core-data-001/index,segFN=segments_4,generation=4}
   [junit4]   2> 	commit{dir=/home/jenkins/workspace/Lucene-Solr-5.x-Linux/solr/build/solr-core/test/J0/temp/solr.core.TestNRTOpen_7C7BFEA4A5A2D7C0-001/init-core-data-001/index,segFN=segments_5,generation=5}
   [junit4]   2> 1490820 INFO  (TEST-TestNRTOpen.testReaderIsNRT-seed#[7C7BFEA4A5A2D7C0]) [    x:collection1] o.a.s.c.SolrDeletionPolicy newest commit generation = 5
   [junit4]   2> 1490820 INFO  (TEST-TestNRTOpen.testReaderIsNRT-seed#[7C7BFEA4A5A2D7C0]) [    x:collection1] o.a.s.u.RandomMergePolicy RandomMergePolicy wrapping class org.apache.lucene.index.MockRandomMergePolicy: org.apache.lucene.index.MockRandomMergePolicy@181864e
   [junit4]   2> 1490821 INFO  (TEST-TestNRTOpen.testReaderIsNRT-seed#[7C7BFEA4A5A2D7C0]) [    x:collection1] o.a.s.c.SolrDeletionPolicy SolrDeletionPolicy.onInit: commits: num=1
   [junit4]   2> 	commit{dir=/home/jenkins/workspace/Lucene-Solr-5.x-Linux/solr/build/solr-core/test/J0/temp/solr.core.TestNRTOpen_7C7BFEA4A5A2D7C0-001/init-core-data-001/index,segFN=segments_5,generation=5}
   [junit4]   2> 1490821 INFO  (TEST-TestNRTOpen.testReaderIsNRT-seed#[7C7BFEA4A5A2D7C0]) [    x:collection1] o.a.s.c.SolrDeletionPolicy newest commit generation = 5
   [junit4]   2> 1490822 INFO  (TEST-TestNRTOpen.testReaderIsNRT-seed#[7C7BFEA4A5A2D7C0]) [    x:collection1] o.a.s.u.DefaultSolrCoreState New IndexWriter is ready to be used.
   [junit4]   2> 1490824 INFO  (TEST-TestNRTOpen.testReaderIsNRT-seed#[7C7BFEA4A5A2D7C0]) [    x:collection1] o.a.s.s.SolrIndexSearcher Opening Searcher@9ea993[collection1] main
   [junit4]   2> 1490824 INFO  (TEST-TestNRTOpen.testReaderIsNRT-seed#[7C7BFEA4A5A2D7C0]) [    x:collection1] o.a.s.c.CoreContainer replacing core: collection1
   [junit4]   2> 1490824 INFO  (searcherExecutor-5918-thread-1-processing-x:collection1) [    x:collection1] o.a.s.c.SolrCore [collection1] Registered new searcher Searcher@9ea993[collection1] main{ExitableDirectoryReader(UninvertingDirectoryReader(Uninverting(_1(5.5.0):C1) Uninverting(_2(5.5.0):C1) Uninverting(_3(5.5.0):C1) Uninverting(_4(5.5.0):C1)))}
   [junit4]   2> 1490824 INFO  (TEST-TestNRTOpen.testReaderIsNRT-seed#[7C7BFEA4A5A2D7C0]) [    x:collection1] o.a.s.c.SolrCore [collection1]  CLOSING SolrCore org.apache.solr.core.SolrCore@15ea4c2
   [junit4]   2> 1490824 INFO  (TEST-TestNRTOpen.testReaderIsNRT-seed#[7C7BFEA4A5A2D7C0]) [    x:collection1] o.a.s.u.DirectUpdateHandler2 closing DirectUpdateHandler2{commits=2,autocommits=0,soft autocommits=0,optimizes=0,rollbacks=0,expungeDeletes=0,docsPending=1,adds=1,deletesById=0,deletesByQuery=0,errors=0,cumulative_adds=3,cumulative_deletesById=0,cumulative_deletesByQuery=0,cumulative_errors=0}
   [junit4]   2> 1490824 INFO  (TEST-TestNRTOpen.testReaderIsNRT-seed#[7C7BFEA4A5A2D7C0]) [    x:collection1] o.a.s.c.SolrCore [collection1] Closing main searcher on request.
   [junit4]   2> 1490824 INFO  (TEST-TestNRTOpen.testReaderIsNRT-seed#[7C7BFEA4A5A2D7C0]) [    x:collection1] o.a.s.SolrTestCaseJ4 ###Ending testReaderIsNRT
   [junit4]   2> 1490826 INFO  (TEST-TestNRTOpen.testSharedCores-seed#[7C7BFEA4A5A2D7C0]) [    x:collection1] o.a.s.SolrTestCaseJ4 ###Starting testSharedCores
   [junit4]   2> 1490826 INFO  (TEST-TestNRTOpen.testSharedCores-seed#[7C7BFEA4A5A2D7C0]) [    x:collection1] o.a.s.u.DirectUpdateHandler2 [collection1] REMOVING ALL DOCUMENTS FROM INDEX
   [junit4]   2> 1490826 INFO  (TEST-TestNRTOpen.testSharedCores-seed#[7C7BFEA4A5A2D7C0]) [    x:collection1] o.a.s.u.p.LogUpdateProcessorFactory [collection1]  webapp=null path=null params={}{deleteByQuery=*:*} 0 0
   [junit4]   2> 1490827 INFO  (TEST-TestNRTOpen.testSharedCores-seed#[7C7BFEA4A5A2D7C0]) [    x:collection1] o.a.s.u.p.LogUpdateProcessorFactory [collection1]  webapp=null path=null params={}{add=[(null)]} 0 0
   [junit4]   2> 1490827 INFO  (TEST-TestNRTOpen.testSharedCores-seed#[7C7BFEA4A5A2D7C0]) [    x:collection1] o.a.s.u.DirectUpdateHandler2 start commit{,optimize=false,openSearcher=true,waitSearcher=true,expungeDeletes=false,softCommit=false,prepareCommit=false}
   [junit4]   2> 1491025 INFO  (TEST-TestNRTOpen.testSharedCores-seed#[7C7BFEA4A5A2D7C0]) [    x:collection1] o.a.s.c.SolrDeletionPolicy SolrDeletionPolicy.onCommit: commits: num=2
   [junit4]   2> 	commit{dir=/home/jenkins/workspace/Lucene-Solr-5.x-Linux/solr/build/solr-core/test/J0/temp/solr.core.TestNRTOpen_7C7BFEA4A5A2D7C0-001/init-core-data-001/index,segFN=segments_5,generation=5}
   [junit4]   2> 	commit{dir=/home/jenkins/workspace/Lucene-Solr-5.x-Linux/solr/build/solr-core/test/J0/temp/solr.core.TestNRTOpen_7C7BFEA4A5A2D7C0-001/init-core-data-001/index,segFN=segments_6,generation=6}
   [junit4]   2> 1491025 INFO  (TEST-TestNRTOpen.testSharedCores-seed#[7C7BFEA4A5A2D7C0]) [    x:collection1] o.a.s.c.SolrDeletionPolicy newest commit generation = 6
   [junit4]   2> 1491026 INFO  (TEST-TestNRTOpen.testSharedCores-seed#[7C7BFEA4A5A2D7C0]) [    x:collection1] o.a.s.s.SolrIndexSearcher Opening Searcher@df68a0[collection1] main
   [junit4]   2> 1491026 INFO  (TEST-TestNRTOpen.testSharedCores-seed#[7C7BFEA4A5A2D7C0]) [    x:collection1] o.a.s.u.DirectUpdateHandler2 end_commit_flush
   [junit4]   2> 1491026 INFO  (searcherExecutor-5918-thread-1-processing-x:collection1) [    x:collection1] o.a.s.c.SolrCore [collection1] Registered new searcher Searcher@df68a0[collection1] main{ExitableDirectoryReader(UninvertingDirectoryReader(Uninverting(_5(5.5.0):C1)))}
   [junit4]   2> 1491027 INFO  (TEST-TestNRTOpen.testSharedCores-seed#[7C7BFEA4A5A2D7C0]) [    x:collection1] o.a.s.u.p.LogUpdateProcessorFactory [collection1]  webapp=null path=null params={}{commit=} 0 200
   [junit4]   2> 1491028 INFO  (TEST-TestNRTOpen.testSharedCores-seed#[7C7BFEA4A5A2D7C0]) [    x:collection1] o.a.s.u.DirectUpdateHandler2 start commit{,optimize=true,openSearcher=true,waitSearcher=true,expungeDeletes=false,softCommit=false,prepareCommit=false}
   [junit4]   2> 1491028 INFO  (TEST-TestNRTOpen.testSharedCores-seed#[7C7BFEA4A5A2D7C0]) [    x:collection1] o.a.s.u.DirectUpdateHandler2 No uncommitted changes. Skipping IW.commit.
   [junit4]   2> 1491028 INFO  (TEST-TestNRTOpen.testSharedCores-seed#[7C7BFEA4A5A2D7C0]) [    x:collection1] o.a.s.c.SolrCore SolrIndexSearcher has not changed - not re-opening: org.apache.solr.search.SolrIndexSearcher
   [junit4]   2> 1491028 INFO  (TEST-TestNRTOpen.testSharedCores-seed#[7C7BFEA4A5A2D7C0]) [    x:collection1] o.a.s.u.DirectUpdateHandler2 end_commit_flush
   [junit4]   2> 1491028 INFO  (TEST-TestNRTOpen.testSharedCores-seed#[7C7BFEA4A5A2D7C0]) [    x:collection1] o.a.s.u.p.LogUpdateProcessorFactory [collection1]  webapp=null path=null params={}{optimize=} 0 0
   [junit4]   2> 1491029 INFO  (TEST-TestNRTOpen.testSharedCores-seed#[7C7BFEA4A5A2D7C0]) [    x:collection1] o.a.s.u.p.LogUpdateProcessorFactory [collection1]  webapp=null path=null params={}{add=[(null)]} 0 0
   [junit4]   2> 1491029 INFO  (TEST-TestNRTOpen.testSharedCores-seed#[7C7BFEA4A5A2D7C0]) [    x:collection1] o.a.s.u.DirectUpdateHandler2 start commit{,optimize=false,openSearcher=true,waitSearcher=true,expungeDeletes=false,softCommit=true,prepareCommit=false}
   [junit4]   2> 1491035 INFO  (TEST-TestNRTOpen.testSharedCores-seed#[7C7BFEA4A5A2D7C0]) [    x:collection1] o.a.s.s.SolrIndexSearcher Opening Searcher@1ef9de1[collection1] main
   [junit4]   2> 1491035 INFO  (TEST-TestNRTOpen.testSharedCores-seed#[7C7BFEA4A5A2D7C0]) [    x:collection1] o.a.s.u.DirectUpdateHandler2 end_commit_flush
   [junit4]   2> 1491035 INFO  (searcherExecutor-5918-thread-1-processing-x:collection1) [    x:collection1] o.a.s.c.SolrCore [collection1] Registered new searcher Searcher@1ef9de1[collection1] main{ExitableDirectoryReader(UninvertingDirectoryReader(Uninverting(_5(5.5.0):C1) Uninverting(_6(5.5.0):C1)))}
   [junit4]   2> 1491036 INFO  (TEST-TestNRTOpen.testSharedCores-seed#[7C7BFEA4A5A2D7C0]) [    x:collection1] o.a.s.u.p.LogUpdateProcessorFactory [collection1]  webapp=null path=null params={}{commit=} 0 6
   [junit4]   2> 1491036 INFO  (TEST-TestNRTOpen.testSharedCores-seed#[7C7BFEA4A5A2D7C0]) [    x:collection1] o.a.s.u.p.LogUpdateProcessorFactory [collection1]  webapp=null path=null params={}{add=[(null)]} 0 0
   [junit4]   2> 1491036 INFO  (TEST-TestNRTOpen.testSharedCores-seed#[7C7BFEA4A5A2D7C0]) [    x:collection1] o.a.s.u.p.LogUpdateProcessorFactory [collection1]  webapp=null path=null params={}{add=[(null)]} 0 0
   [junit4]   2> 1491037 INFO  (TEST-TestNRTOpen.testSharedCores-seed#[7C7BFEA4A5A2D7C0]) [    x:collection1] o.a.s.u.DirectUpdateHandler2 start commit{,optimize=false,openSearcher=true,waitSearcher=true,expungeDeletes=false,softCommit=false,prepareCommit=false}
   [junit4]   2> 1491249 INFO  (TEST-TestNRTOpen.testSharedCores-seed#[7C7BFEA4A5A2D7C0]) [    x:collection1] o.a.s.c.SolrDeletionPolicy SolrDeletionPolicy.onCommit: commits: num=2
   [junit4]   2> 	commit{dir=/home/jenkins/workspace/Lucene-Solr-5.x-Linux/solr/build/solr-core/test/J0/temp/solr.core.TestNRTOpen_7C7BFEA4A5A2D7C0-001/init-core-data-001/index,segFN=segments_6,generation=6}
   [junit4]   2> 	commit{dir=/home/jenkins/workspace/Lucene-Solr-5.x-Linux/solr/build/solr-core/test/J0/temp/solr.core.TestNRTOpen_7C7BFEA4A5A2D7C0-001/init-core-data-001/index,segFN=segments_7,generation=7}
   [junit4]   2> 1491249 INFO  (TEST-TestNRTOpen.testSharedCores-seed#[7C7BFEA4A5A2D7C0]) [    x:collection1] o.a.s.c.SolrDeletionPolicy newest commit generation = 7
   [junit4]   2> 1491250 INFO  (TEST-TestNRTOpen.testSharedCores-seed#[7C7BFEA4A5A2D7C0]) [    x:collection1] o.a.s.s.SolrIndexSearcher Opening Searcher@1646c4c[collection1] main
   [junit4]   2> 1491250 INFO  (TEST-TestNRTOpen.testSharedCores-seed#[7C7BFEA4A5A2D7C0]) [    x:collection1] o.a.s.u.DirectUpdateHandler2 end_commit_flush
   [junit4]   2> 1491250 INFO  (searcherExecutor-5918-thread-1-processing-x:collection1) [    x:collection1] o.a.s.c.SolrCore [collection1] Registered new searcher Searcher@1646c4c[collection1] main{ExitableDirectoryReader(UninvertingDirectoryReader(Uninverting(_7(5.5.0):c2) Uninverting(_8(5.5.0):C2)))}
   [junit4]   2> 1491251 INFO  (TEST-TestNRTOpen.testSharedCores-seed#[7C7BFEA4A5A2D7C0]) [    x:collection1] o.a.s.u.p.LogUpdateProcessorFactory [collection1]  webapp=null path=null params={}{commit=} 0 214
   [junit4]   2> 1491251 INFO  (TEST-TestNRTOpen.testSharedCores-seed#[7C7BFEA4A5A2D7C0]) [    x:collection1] o.a.s.SolrTestCaseJ4 ###Ending testSharedCores
   [junit4]   2> NOTE: reproduce with: ant test  -Dtestcase=TestNRTOpen -Dtests.method=testSharedCores -Dtests.seed=7C7BFEA4A5A2D7C0 -Dtests.multiplier=3 -Dtests.slow=true -Dtests.locale=sr-Latn-RS -Dtests.timezone=Africa/Monrovia -Dtests.asserts=true -Dtests.file.encoding=US-ASCII
   [junit4] FAILURE 0.43s J0 | TestNRTOpen.testSharedCores <<<
   [junit4]    > Throwable #1: java.lang.AssertionError: expected:<3> but was:<2>
   [junit4]    > 	at __randomizedtesting.SeedInfo.seed([7C7BFEA4A5A2D7C0:9A78B4EB2D54FACF]:0)
   [junit4]    > 	at org.apache.solr.core.TestNRTOpen.testSharedCores(TestNRTOpen.java:116)
   [junit4]    > 	at java.lang.Thread.run(Thread.java:745)
   [junit4]   2> 1491253 INFO  (SUITE-TestNRTOpen-seed#[7C7BFEA4A5A2D7C0]-worker) [    x:collection1] o.a.s.SolrTestCaseJ4 ###deleteCore
   [junit4]   2> 1491253 INFO  (SUITE-TestNRTOpen-seed#[7C7BFEA4A5A2D7C0]-worker) [    x:collection1] o.a.s.c.CoreContainer Shutting down CoreContainer instance=3094077
   [junit4]   2> 1491253 INFO  (coreCloseExecutor-5922-thread-1-processing-x:collection1) [    x:collection1] o.a.s.c.SolrCore [collection1]  CLOSING SolrCore org.apache.solr.core.SolrCore@12e6c5b
   [junit4]   2> 1491253 INFO  (coreCloseExecutor-5922-thread-1-processing-x:collection1) [    x:collection1] o.a.s.u.DirectUpdateHandler2 closing DirectUpdateHandler2{commits=3,autocommits=0,soft autocommits=0,optimizes=1,rollbacks=0,expungeDeletes=0,docsPending=0,adds=0,deletesById=0,deletesByQuery=0,errors=0,cumulative_adds=4,cumulative_deletesById=0,cumulative_deletesByQuery=1,cumulative_errors=0}
   [junit4]   2> 1491253 INFO  (coreCloseExecutor-5922-thread-1-processing-x:collection1) [    x:collection1] o.a.s.u.SolrCoreState Closing SolrCoreState
   [junit4]   2> 1491253 INFO  (coreCloseExecutor-5922-thread-1-processing-x:collection1) [    x:collection1] o.a.s.u.DefaultSolrCoreState SolrCoreState ref count has reached 0 - closing IndexWriter
   [junit4]   2> 1491253 INFO  (coreCloseExecutor-5922-thread-1-processing-x:collection1) [    x:collection1] o.a.s.u.DefaultSolrCoreState closing IndexWriter with IndexWriterCloser
   [junit4]   2> 1491254 INFO  (coreCloseExecutor-5922-thread-1-processing-x:collection1) [    x:collection1] o.a.s.c.SolrCore [collection1] Closing main searcher on request.
   [junit4]   2> 1491254 INFO  (coreCloseExecutor-5922-thread-1-processing-x:collection1) [    x:collection1] o.a.s.c.CachingDirectoryFactory Closing StandardDirectoryFactory - 2 directories currently being tracked
   [junit4]   2> 1491254 INFO  (coreCloseExecutor-5922-thread-1-processing-x:collection1) [    x:collection1] o.a.s.c.CachingDirectoryFactory looking to close /home/jenkins/workspace/Lucene-Solr-5.x-Linux/solr/build/solr-core/test/J0/temp/solr.core.TestNRTOpen_7C7BFEA4A5A2D7C0-001/init-core-data-001/index [CachedDir<<refCount=0;path=/home/jenkins/workspace/Lucene-Solr-5.x-Linux/solr/build/solr-core/test/J0/temp/solr.core.TestNRTOpen_7C7BFEA4A5A2D7C0-001/init-core-data-001/index;done=false>>]
   [junit4]   2> 1491254 INFO  (coreCloseExecutor-5922-thread-1-processing-x:collection1) [    x:collection1] o.a.s.c.CachingDirectoryFactory Closing directory: /home/jenkins/workspace/Lucene-Solr-5.x-Linux/solr/build/solr-core/test/J0/temp/solr.core.TestNRTOpen_7C7BFEA4A5A2D7C0-001/init-core-data-001/index
   [junit4]   2> 1491254 INFO  (coreCloseExecutor-5922-thread-1-processing-x:collection1) [    x:collection1] o.a.s.c.CachingDirectoryFactory looking to close /home/jenkins/workspace/Lucene-Solr-5.x-Linux/solr/build/solr-core/test/J0/temp/solr.core.TestNRTOpen_7C7BFEA4A5A2D7C0-001/init-core-data-001 [CachedDir<<refCount=0;path=/home/jenkins/workspace/Lucene-Solr-5.x-Linux/solr/build/solr-core/test/J0/temp/solr.core.TestNRTOpen_7C7BFEA4A5A2D7C0-001/init-core-data-001;done=false>>]
   [junit4]   2> 1491255 INFO  (coreCloseExecutor-5922-thread-1-processing-x:collection1) [    x:collection1] o.a.s.c.CachingDirectoryFactory Closing directory: /home/jenkins/workspace/Lucene-Solr-5.x-Linux/solr/build/solr-core/test/J0/temp/solr.core.TestNRTOpen_7C7BFEA4A5A2D7C0-001/init-core-data-001
   [junit4]   2> NOTE: leaving temporary files on disk at: /home/jenkins/workspace/Lucene-Solr-5.x-Linux/solr/build/solr-core/test/J0/temp/solr.core.TestNRTOpen_7C7BFEA4A5A2D7C0-001
   [junit4]   2> NOTE: test params are: codec=Asserting(Lucene54): {bazz=PostingsFormat(name=LuceneFixedGap), foo=PostingsFormat(name=LuceneVarGapFixedInterval), bazzz=PostingsFormat(name=LuceneFixedGap), baz=PostingsFormat(name=LuceneFixedGap), foo2=PostingsFormat(name=Memory doPackFST= false)}, docValues:{}, sim=RandomSimilarity(queryNorm=true,coord=crazy): {}, locale=sr-Latn-RS, timezone=Africa/Monrovia
   [junit4]   2> NOTE: Linux 3.19.0-47-generic i386/Oracle Corporation 1.8.0_72 (32-bit)/cpus=12,threads=1,free=119612880,total=466354176
   [junit4]   2> NOTE: All tests run in this JVM: [DateFieldTest, TestCustomDocTransformer, TestDynamicLoading, TestLazyCores, BlockJoinFacetRandomTest, CursorPagingTest, TestSortByMinMaxFunction, DefaultValueUpdateProcessorTest, TestDefaultStatsCache, ZkNodePropsTest, TestExceedMaxTermLength, TestScoreJoinQPScore, SystemInfoHandlerTest, DistanceUnitsTest, DistributedFacetPivotLongTailTest, TestNoOpRegenerator, ReturnFieldsTest, TestDistribDocBasedVersion, TestAnalyzedSuggestions, TestFieldResource, IndexSchemaTest, BasicZkTest, EchoParamsTest, InfoHandlerTest, TestConfigSetsAPIExclusivity, TestCloudManagedSchema, TestConfig, TestCrossCoreJoin, TestExpandComponent, TestRemoteStreaming, SynonymTokenizerTest, TestRangeQuery, SolrCoreTest, DisMaxRequestHandlerTest, SaslZkACLProviderTest, TestJsonFacets, JSONWriterTest, DistributedQueryElevationComponentTest, XsltUpdateRequestHandlerTest, TestCSVLoader, ResponseLogComponentTest, TestFileDictionaryLookup, QueryElevationComponentTest, TestSolrQueryParserDefaultOperatorResource, JavabinLoaderTest, TestCloudPivotFacet, TestManagedStopFilterFactory, RAMDirectoryFactoryTest, URLClassifyProcessorTest, TestRandomRequestDistribution, CopyFieldTest, AsyncCallRequestStatusResponseTest, UUIDFieldTest, TestDynamicFieldCollectionResource, AnalysisAfterCoreReloadTest, TestPhraseSuggestions, TestStressLucene, TestSolrQueryResponse, TestOmitPositions, TestInitQParser, SolrRequestParserTest, TestFunctionQuery, TestNonDefinedSimilarityFactory, CacheHeaderTest, StandardRequestHandlerTest, ExternalFileFieldSortTest, ActionThrottleTest, TestSchemaSimilarityResource, TestDistributedSearch, RequiredFieldsTest, TestFastOutputStream, BasicDistributedZkTest, TestMergePolicyConfig, CurrencyFieldOpenExchangeTest, CollectionStateFormat2Test, TestExactStatsCache, TestBadConfig, AddSchemaFieldsUpdateProcessorFactoryTest, DocumentAnalysisRequestHandlerTest, SolrXmlInZkTest, HdfsRestartWhileUpdatingTest, EnumFieldTest, PreAnalyzedFieldTest, IndexSchemaRuntimeFieldTest, TestMiniSolrCloudClusterBase, LeaderInitiatedRecoveryOnShardRestartTest, TestInitParams, OverseerRolesTest, FullHLLTest, FileBasedSpellCheckerTest, SharedFSAutoReplicaFailoverUtilsTest, CoreAdminCreateDiscoverTest, ChaosMonkeySafeLeaderTest, BasicDistributedZk2Test, SyncSliceTest, OverseerTest, FullSolrCloudDistribCmdsTest, TestZkChroot, TestRandomDVFaceting, ZkCLITest, TestRecovery, DistributedSpellCheckComponentTest, TestStressVersions, SimpleFacetsTest, PeerSyncTest, TestFiltering, QueryEqualityTest, TestSurroundQueryParser, TestQueryUtils, TestQueryTypes, RequestHandlersTest, MoreLikeThisHandlerTest, TestArbitraryIndexDir, MBeansHandlerTest, PingRequestHandlerTest, TestSearchPerf, OutputWriterTest, TestSolrCoreProperties, SpellPossibilityIteratorTest, TestXIncludeConfig, TestLMDirichletSimilarityFactory, TestBM25SimilarityFactory, TestFastLRUCache, ChaosMonkeyNothingIsSafeTest, CloudExitableDirectoryReaderTest, ConcurrentDeleteAndCreateCollectionTest, ConfigSetsAPITest, CustomCollectionTest, DistribCursorPagingTest, DistributedVersionInfoTest, MultiThreadedOCPTest, RecoveryAfterSoftCommitTest, SharedFSAutoReplicaFailoverTest, SimpleCollectionCreateDeleteTest, TestCryptoKeys, TestLeaderElectionZkExpiry, TestLeaderInitiatedRecoveryThread, TestRequestForwarding, TestShortCircuitedRequests, TestSolrCloudWithKerberosAlt, VMParamsZkACLAndCredentialsProvidersTest, HdfsBasicDistributedZkTest, HdfsChaosMonkeyNothingIsSafeTest, HdfsChaosMonkeySafeLeaderTest, HdfsNNFailoverTest, HdfsSyncSliceTest, HdfsThreadLeakTest, HdfsTlogReplayBufferedWhileIndexingTest, HdfsUnloadDistributedZkTest, StressHdfsTest, TestClusterStateMutator, ZkStateReaderTest, DirectoryFactoryTest, ExitableDirectoryReaderTest, HdfsDirectoryFactoryTest, TestConfigOverlay, TestConfigSetImmutable, TestConfigSetProperties, TestConfigSets, TestNRTOpen]
   [junit4] Completed [465/568 (1!)] on J0 in 1.41s, 2 tests, 1 failure <<< FAILURES!

[...truncated 330 lines...]
BUILD FAILED
/home/jenkins/workspace/Lucene-Solr-5.x-Linux/build.xml:750: The following error occurred while executing this line:
/home/jenkins/workspace/Lucene-Solr-5.x-Linux/build.xml:694: The following error occurred while executing this line:
/home/jenkins/workspace/Lucene-Solr-5.x-Linux/build.xml:59: The following error occurred while executing this line:
/home/jenkins/workspace/Lucene-Solr-5.x-Linux/solr/build.xml:233: The following error occurred while executing this line:
/home/jenkins/workspace/Lucene-Solr-5.x-Linux/solr/common-build.xml:534: The following error occurred while executing this line:
/home/jenkins/workspace/Lucene-Solr-5.x-Linux/lucene/common-build.xml:1477: The following error occurred while executing this line:
/home/jenkins/workspace/Lucene-Solr-5.x-Linux/lucene/common-build.xml:1033: There were test failures: 568 suites (7 ignored), 2273 tests, 1 failure, 85 ignored (41 assumptions) [seed: 7C7BFEA4A5A2D7C0]

Total time: 53 minutes 15 seconds
Build step 'Invoke Ant' marked build as failure
Archiving artifacts
[WARNINGS] Skipping publisher since build result is FAILURE
Recording test results
Email was triggered for: Failure - Any
Sending email for trigger: Failure - Any



Mime
View raw message