lucene-dev mailing list archives

Site index · List index
Message view « Date » · « Thread »
Top « Date » · « Thread »
From Policeman Jenkins Server <jenk...@thetaphi.de>
Subject [JENKINS-EA] Lucene-Solr-trunk-Linux (64bit/jdk-9-ea+105) - Build # 15954 - Still Failing!
Date Mon, 22 Feb 2016 04:56:53 GMT
Build: http://jenkins.thetaphi.de/job/Lucene-Solr-trunk-Linux/15954/
Java: 64bit/jdk-9-ea+105 -XX:+UseCompressedOops -XX:+UseParallelGC -XX:-UseSuperWord

2 tests failed.
FAILED:  org.apache.lucene.index.TestDuelingCodecs.testEquals

Error Message:
source=3 is out of bounds (maxState is 2)

Stack Trace:
java.lang.IllegalArgumentException: source=3 is out of bounds (maxState is 2)
	at __randomizedtesting.SeedInfo.seed([A955C7D059B30D47:AD3A944B978A5D45]:0)
	at org.apache.lucene.util.automaton.Automaton.addTransition(Automaton.java:165)
	at org.apache.lucene.util.automaton.MinimizationOperations.minimize(MinimizationOperations.java:245)
	at org.apache.lucene.util.automaton.RegExp.toAutomatonInternal(RegExp.java:537)
	at org.apache.lucene.util.automaton.RegExp.findLeaves(RegExp.java:617)
	at org.apache.lucene.util.automaton.RegExp.findLeaves(RegExp.java:612)
	at org.apache.lucene.util.automaton.RegExp.toAutomatonInternal(RegExp.java:521)
	at org.apache.lucene.util.automaton.RegExp.toAutomaton(RegExp.java:495)
	at org.apache.lucene.util.automaton.RegExp.toAutomaton(RegExp.java:426)
	at org.apache.lucene.util.LuceneTestCase.assertTermsEquals(LuceneTestCase.java:1997)
	at org.apache.lucene.util.LuceneTestCase.assertFieldsEquals(LuceneTestCase.java:1959)
	at org.apache.lucene.util.LuceneTestCase.assertReaderEquals(LuceneTestCase.java:1919)
	at org.apache.lucene.index.TestDuelingCodecs.testEquals(TestDuelingCodecs.java:157)
	at sun.reflect.NativeMethodAccessorImpl.invoke0(Native Method)
	at sun.reflect.NativeMethodAccessorImpl.invoke(NativeMethodAccessorImpl.java:62)
	at sun.reflect.DelegatingMethodAccessorImpl.invoke(DelegatingMethodAccessorImpl.java:43)
	at java.lang.reflect.Method.invoke(Method.java:520)
	at com.carrotsearch.randomizedtesting.RandomizedRunner.invoke(RandomizedRunner.java:1764)
	at com.carrotsearch.randomizedtesting.RandomizedRunner$8.evaluate(RandomizedRunner.java:871)
	at com.carrotsearch.randomizedtesting.RandomizedRunner$9.evaluate(RandomizedRunner.java:907)
	at com.carrotsearch.randomizedtesting.RandomizedRunner$10.evaluate(RandomizedRunner.java:921)
	at org.apache.lucene.util.TestRuleSetupTeardownChained$1.evaluate(TestRuleSetupTeardownChained.java:49)
	at org.apache.lucene.util.AbstractBeforeAfterRule$1.evaluate(AbstractBeforeAfterRule.java:45)
	at org.apache.lucene.util.TestRuleThreadAndTestName$1.evaluate(TestRuleThreadAndTestName.java:48)
	at org.apache.lucene.util.TestRuleIgnoreAfterMaxFailures$1.evaluate(TestRuleIgnoreAfterMaxFailures.java:64)
	at org.apache.lucene.util.TestRuleMarkFailure$1.evaluate(TestRuleMarkFailure.java:47)
	at com.carrotsearch.randomizedtesting.rules.StatementAdapter.evaluate(StatementAdapter.java:36)
	at com.carrotsearch.randomizedtesting.ThreadLeakControl$StatementRunner.run(ThreadLeakControl.java:367)
	at com.carrotsearch.randomizedtesting.ThreadLeakControl.forkTimeoutingTask(ThreadLeakControl.java:809)
	at com.carrotsearch.randomizedtesting.ThreadLeakControl$3.evaluate(ThreadLeakControl.java:460)
	at com.carrotsearch.randomizedtesting.RandomizedRunner.runSingleTest(RandomizedRunner.java:880)
	at com.carrotsearch.randomizedtesting.RandomizedRunner$5.evaluate(RandomizedRunner.java:781)
	at com.carrotsearch.randomizedtesting.RandomizedRunner$6.evaluate(RandomizedRunner.java:816)
	at com.carrotsearch.randomizedtesting.RandomizedRunner$7.evaluate(RandomizedRunner.java:827)
	at org.apache.lucene.util.AbstractBeforeAfterRule$1.evaluate(AbstractBeforeAfterRule.java:45)
	at com.carrotsearch.randomizedtesting.rules.StatementAdapter.evaluate(StatementAdapter.java:36)
	at org.apache.lucene.util.TestRuleStoreClassName$1.evaluate(TestRuleStoreClassName.java:41)
	at com.carrotsearch.randomizedtesting.rules.NoShadowingOrOverridesOnMethodsRule$1.evaluate(NoShadowingOrOverridesOnMethodsRule.java:40)
	at com.carrotsearch.randomizedtesting.rules.NoShadowingOrOverridesOnMethodsRule$1.evaluate(NoShadowingOrOverridesOnMethodsRule.java:40)
	at com.carrotsearch.randomizedtesting.rules.StatementAdapter.evaluate(StatementAdapter.java:36)
	at com.carrotsearch.randomizedtesting.rules.StatementAdapter.evaluate(StatementAdapter.java:36)
	at com.carrotsearch.randomizedtesting.rules.StatementAdapter.evaluate(StatementAdapter.java:36)
	at org.apache.lucene.util.TestRuleAssertionsRequired$1.evaluate(TestRuleAssertionsRequired.java:53)
	at org.apache.lucene.util.TestRuleMarkFailure$1.evaluate(TestRuleMarkFailure.java:47)
	at org.apache.lucene.util.TestRuleIgnoreAfterMaxFailures$1.evaluate(TestRuleIgnoreAfterMaxFailures.java:64)
	at org.apache.lucene.util.TestRuleIgnoreTestSuites$1.evaluate(TestRuleIgnoreTestSuites.java:54)
	at com.carrotsearch.randomizedtesting.rules.StatementAdapter.evaluate(StatementAdapter.java:36)
	at com.carrotsearch.randomizedtesting.ThreadLeakControl$StatementRunner.run(ThreadLeakControl.java:367)
	at java.lang.Thread.run(Thread.java:804)


FAILED:  org.apache.lucene.index.TestDuelingCodecs.testCrazyReaderEquals

Error Message:
6

Stack Trace:
java.lang.ArrayIndexOutOfBoundsException: 6
	at __randomizedtesting.SeedInfo.seed([A955C7D059B30D47:1D6F1DEC55FAD044]:0)
	at org.apache.lucene.util.automaton.MinimizationOperations.minimize(MinimizationOperations.java:235)
	at org.apache.lucene.util.automaton.RegExp.toAutomatonInternal(RegExp.java:524)
	at org.apache.lucene.util.automaton.RegExp.toAutomatonInternal(RegExp.java:546)
	at org.apache.lucene.util.automaton.RegExp.toAutomatonInternal(RegExp.java:540)
	at org.apache.lucene.util.automaton.RegExp.findLeaves(RegExp.java:617)
	at org.apache.lucene.util.automaton.RegExp.toAutomatonInternal(RegExp.java:521)
	at org.apache.lucene.util.automaton.RegExp.findLeaves(RegExp.java:617)
	at org.apache.lucene.util.automaton.RegExp.toAutomatonInternal(RegExp.java:510)
	at org.apache.lucene.util.automaton.RegExp.toAutomaton(RegExp.java:495)
	at org.apache.lucene.util.automaton.RegExp.toAutomaton(RegExp.java:426)
	at org.apache.lucene.util.LuceneTestCase.assertTermsEquals(LuceneTestCase.java:1997)
	at org.apache.lucene.util.LuceneTestCase.assertFieldsEquals(LuceneTestCase.java:1959)
	at org.apache.lucene.util.LuceneTestCase.assertReaderEquals(LuceneTestCase.java:1919)
	at org.apache.lucene.index.TestDuelingCodecs.testCrazyReaderEquals(TestDuelingCodecs.java:172)
	at sun.reflect.NativeMethodAccessorImpl.invoke0(Native Method)
	at sun.reflect.NativeMethodAccessorImpl.invoke(NativeMethodAccessorImpl.java:62)
	at sun.reflect.DelegatingMethodAccessorImpl.invoke(DelegatingMethodAccessorImpl.java:43)
	at java.lang.reflect.Method.invoke(Method.java:520)
	at com.carrotsearch.randomizedtesting.RandomizedRunner.invoke(RandomizedRunner.java:1764)
	at com.carrotsearch.randomizedtesting.RandomizedRunner$8.evaluate(RandomizedRunner.java:871)
	at com.carrotsearch.randomizedtesting.RandomizedRunner$9.evaluate(RandomizedRunner.java:907)
	at com.carrotsearch.randomizedtesting.RandomizedRunner$10.evaluate(RandomizedRunner.java:921)
	at org.apache.lucene.util.TestRuleSetupTeardownChained$1.evaluate(TestRuleSetupTeardownChained.java:49)
	at org.apache.lucene.util.AbstractBeforeAfterRule$1.evaluate(AbstractBeforeAfterRule.java:45)
	at org.apache.lucene.util.TestRuleThreadAndTestName$1.evaluate(TestRuleThreadAndTestName.java:48)
	at org.apache.lucene.util.TestRuleIgnoreAfterMaxFailures$1.evaluate(TestRuleIgnoreAfterMaxFailures.java:64)
	at org.apache.lucene.util.TestRuleMarkFailure$1.evaluate(TestRuleMarkFailure.java:47)
	at com.carrotsearch.randomizedtesting.rules.StatementAdapter.evaluate(StatementAdapter.java:36)
	at com.carrotsearch.randomizedtesting.ThreadLeakControl$StatementRunner.run(ThreadLeakControl.java:367)
	at com.carrotsearch.randomizedtesting.ThreadLeakControl.forkTimeoutingTask(ThreadLeakControl.java:809)
	at com.carrotsearch.randomizedtesting.ThreadLeakControl$3.evaluate(ThreadLeakControl.java:460)
	at com.carrotsearch.randomizedtesting.RandomizedRunner.runSingleTest(RandomizedRunner.java:880)
	at com.carrotsearch.randomizedtesting.RandomizedRunner$5.evaluate(RandomizedRunner.java:781)
	at com.carrotsearch.randomizedtesting.RandomizedRunner$6.evaluate(RandomizedRunner.java:816)
	at com.carrotsearch.randomizedtesting.RandomizedRunner$7.evaluate(RandomizedRunner.java:827)
	at org.apache.lucene.util.AbstractBeforeAfterRule$1.evaluate(AbstractBeforeAfterRule.java:45)
	at com.carrotsearch.randomizedtesting.rules.StatementAdapter.evaluate(StatementAdapter.java:36)
	at org.apache.lucene.util.TestRuleStoreClassName$1.evaluate(TestRuleStoreClassName.java:41)
	at com.carrotsearch.randomizedtesting.rules.NoShadowingOrOverridesOnMethodsRule$1.evaluate(NoShadowingOrOverridesOnMethodsRule.java:40)
	at com.carrotsearch.randomizedtesting.rules.NoShadowingOrOverridesOnMethodsRule$1.evaluate(NoShadowingOrOverridesOnMethodsRule.java:40)
	at com.carrotsearch.randomizedtesting.rules.StatementAdapter.evaluate(StatementAdapter.java:36)
	at com.carrotsearch.randomizedtesting.rules.StatementAdapter.evaluate(StatementAdapter.java:36)
	at com.carrotsearch.randomizedtesting.rules.StatementAdapter.evaluate(StatementAdapter.java:36)
	at org.apache.lucene.util.TestRuleAssertionsRequired$1.evaluate(TestRuleAssertionsRequired.java:53)
	at org.apache.lucene.util.TestRuleMarkFailure$1.evaluate(TestRuleMarkFailure.java:47)
	at org.apache.lucene.util.TestRuleIgnoreAfterMaxFailures$1.evaluate(TestRuleIgnoreAfterMaxFailures.java:64)
	at org.apache.lucene.util.TestRuleIgnoreTestSuites$1.evaluate(TestRuleIgnoreTestSuites.java:54)
	at com.carrotsearch.randomizedtesting.rules.StatementAdapter.evaluate(StatementAdapter.java:36)
	at com.carrotsearch.randomizedtesting.ThreadLeakControl$StatementRunner.run(ThreadLeakControl.java:367)
	at java.lang.Thread.run(Thread.java:804)




Build Log:
[...truncated 984 lines...]
   [junit4] Suite: org.apache.lucene.index.TestDuelingCodecs
   [junit4]   2> NOTE: reproduce with: ant test  -Dtestcase=TestDuelingCodecs -Dtests.method=testEquals
-Dtests.seed=A955C7D059B30D47 -Dtests.multiplier=3 -Dtests.slow=true -Dtests.locale=dyo -Dtests.timezone=Chile/Continental
-Dtests.asserts=true -Dtests.file.encoding=US-ASCII
   [junit4] ERROR   6.13s J1 | TestDuelingCodecs.testEquals <<<
   [junit4]    > Throwable #1: java.lang.IllegalArgumentException: source=3 is out of bounds
(maxState is 2)
   [junit4]    > 	at __randomizedtesting.SeedInfo.seed([A955C7D059B30D47:AD3A944B978A5D45]:0)
   [junit4]    > 	at org.apache.lucene.util.automaton.Automaton.addTransition(Automaton.java:165)
   [junit4]    > 	at org.apache.lucene.util.automaton.MinimizationOperations.minimize(MinimizationOperations.java:245)
   [junit4]    > 	at org.apache.lucene.util.automaton.RegExp.toAutomatonInternal(RegExp.java:537)
   [junit4]    > 	at org.apache.lucene.util.automaton.RegExp.findLeaves(RegExp.java:617)
   [junit4]    > 	at org.apache.lucene.util.automaton.RegExp.findLeaves(RegExp.java:612)
   [junit4]    > 	at org.apache.lucene.util.automaton.RegExp.toAutomatonInternal(RegExp.java:521)
   [junit4]    > 	at org.apache.lucene.util.automaton.RegExp.toAutomaton(RegExp.java:495)
   [junit4]    > 	at org.apache.lucene.util.automaton.RegExp.toAutomaton(RegExp.java:426)
   [junit4]    > 	at org.apache.lucene.util.LuceneTestCase.assertTermsEquals(LuceneTestCase.java:1997)
   [junit4]    > 	at org.apache.lucene.util.LuceneTestCase.assertFieldsEquals(LuceneTestCase.java:1959)
   [junit4]    > 	at org.apache.lucene.util.LuceneTestCase.assertReaderEquals(LuceneTestCase.java:1919)
   [junit4]    > 	at org.apache.lucene.index.TestDuelingCodecs.testEquals(TestDuelingCodecs.java:157)
   [junit4]    > 	at java.lang.Thread.run(Thread.java:804)
   [junit4]   2> NOTE: reproduce with: ant test  -Dtestcase=TestDuelingCodecs -Dtests.method=testCrazyReaderEquals
-Dtests.seed=A955C7D059B30D47 -Dtests.multiplier=3 -Dtests.slow=true -Dtests.locale=dyo -Dtests.timezone=Chile/Continental
-Dtests.asserts=true -Dtests.file.encoding=US-ASCII
   [junit4] ERROR   6.13s J1 | TestDuelingCodecs.testCrazyReaderEquals <<<
   [junit4]    > Throwable #1: java.lang.ArrayIndexOutOfBoundsException: 6
   [junit4]    > 	at __randomizedtesting.SeedInfo.seed([A955C7D059B30D47:1D6F1DEC55FAD044]:0)
   [junit4]    > 	at org.apache.lucene.util.automaton.MinimizationOperations.minimize(MinimizationOperations.java:235)
   [junit4]    > 	at org.apache.lucene.util.automaton.RegExp.toAutomatonInternal(RegExp.java:524)
   [junit4]    > 	at org.apache.lucene.util.automaton.RegExp.toAutomatonInternal(RegExp.java:546)
   [junit4]    > 	at org.apache.lucene.util.automaton.RegExp.toAutomatonInternal(RegExp.java:540)
   [junit4]    > 	at org.apache.lucene.util.automaton.RegExp.findLeaves(RegExp.java:617)
   [junit4]    > 	at org.apache.lucene.util.automaton.RegExp.toAutomatonInternal(RegExp.java:521)
   [junit4]    > 	at org.apache.lucene.util.automaton.RegExp.findLeaves(RegExp.java:617)
   [junit4]    > 	at org.apache.lucene.util.automaton.RegExp.toAutomatonInternal(RegExp.java:510)
   [junit4]    > 	at org.apache.lucene.util.automaton.RegExp.toAutomaton(RegExp.java:495)
   [junit4]    > 	at org.apache.lucene.util.automaton.RegExp.toAutomaton(RegExp.java:426)
   [junit4]    > 	at org.apache.lucene.util.LuceneTestCase.assertTermsEquals(LuceneTestCase.java:1997)
   [junit4]    > 	at org.apache.lucene.util.LuceneTestCase.assertFieldsEquals(LuceneTestCase.java:1959)
   [junit4]    > 	at org.apache.lucene.util.LuceneTestCase.assertReaderEquals(LuceneTestCase.java:1919)
   [junit4]    > 	at org.apache.lucene.index.TestDuelingCodecs.testCrazyReaderEquals(TestDuelingCodecs.java:172)
   [junit4]    > 	at java.lang.Thread.run(Thread.java:804)
   [junit4]   2> NOTE: leaving temporary files on disk at: /home/jenkins/workspace/Lucene-Solr-trunk-Linux/lucene/build/core/test/J1/temp/lucene.index.TestDuelingCodecs_A955C7D059B30D47-001
   [junit4]   2> NOTE: test params are: codec=Asserting(Lucene60): {}, docValues:{}, sim=RandomSimilarity(queryNorm=false,coord=crazy):
{titleTokenized=DFI(Standardized), body=DFR GBZ(0.3)}, locale=dyo, timezone=Chile/Continental
   [junit4]   2> NOTE: Linux 3.19.0-47-generic amd64/Oracle Corporation 9-ea (64-bit)/cpus=12,threads=1,free=287818016,total=495976448
   [junit4]   2> NOTE: All tests run in this JVM: [TestStressIndexing, TestPrefixRandom,
TestFieldCacheRewriteMethod, TestSpanMultiTermQueryWrapper, TestAllFilesDetectTruncation,
TestSegmentMerger, TestScoreCachingWrappingScorer, TestSynonymQuery, TestLucene50StoredFieldsFormatHighCompression,
TestExitableDirectoryReader, TestParallelTermEnum, TestSimilarity, TestDocsAndPositions, TestPositionIncrement,
TestWildcardRandom, TestNRTReaderWithThreads, TestNeedsScores, FuzzyTermOnShortTermsTest,
TestReaderWrapperDVTypeCheck, TestSpanSearchEquivalence, TestTragicIndexWriterDeadlock, TestByteArrayDataInput,
TestSortedNumericSortField, TestTimSorter, TestLucene54DocValuesFormat, TestSimilarityBase,
TestPayloads, TestByteBlockPool, TestDocumentsWriterDeleteQueue, TestCollectionUtil, TestRAMDirectory,
TestStressNRT, TestBoolean2, TestFieldMaskingSpanQuery, TestOmitTf, TestParallelLeafReader,
LimitedFiniteStringsIteratorTest, TestRamUsageEstimator, TestLucene50FieldInfoFormat, TestPositiveScoresOnlyCollector,
TestFSTs, TestIndexWriterFromReader, TestSegmentTermDocs, TestIndexReaderClose, TestIndexWriterOnJRECrash,
TestEarlyTermination, TestBasics, TestVersion, TestMmapDirectory, TestCodecUtil, TestByteSlices,
TestAddIndexes, TestBlockPostingsFormat3, TestDuelingCodecs]
   [junit4] Completed [231/411 (1!)] on J1 in 12.26s, 2 tests, 2 errors <<< FAILURES!

[...truncated 596 lines...]
BUILD FAILED
/home/jenkins/workspace/Lucene-Solr-trunk-Linux/build.xml:740: The following error occurred
while executing this line:
/home/jenkins/workspace/Lucene-Solr-trunk-Linux/build.xml:684: The following error occurred
while executing this line:
/home/jenkins/workspace/Lucene-Solr-trunk-Linux/build.xml:59: The following error occurred
while executing this line:
/home/jenkins/workspace/Lucene-Solr-trunk-Linux/lucene/build.xml:50: The following error occurred
while executing this line:
/home/jenkins/workspace/Lucene-Solr-trunk-Linux/lucene/common-build.xml:1457: The following
error occurred while executing this line:
/home/jenkins/workspace/Lucene-Solr-trunk-Linux/lucene/common-build.xml:1014: There were test
failures: 411 suites (1 ignored), 3395 tests, 2 errors, 62 ignored (58 assumptions) [seed:
A955C7D059B30D47]

Total time: 5 minutes 28 seconds
Build step 'Invoke Ant' marked build as failure
Archiving artifacts
[WARNINGS] Skipping publisher since build result is FAILURE
Recording test results
Email was triggered for: Failure - Any
Sending email for trigger: Failure - Any



Mime
View raw message