lucene-dev mailing list archives

Site index · List index
Message view « Date » · « Thread »
Top « Date » · « Thread »
From Policeman Jenkins Server <jenk...@thetaphi.de>
Subject [JENKINS-EA] Lucene-Solr-trunk-Linux (64bit/jdk-9-ea+105) - Build # 15947 - Still Failing!
Date Sun, 21 Feb 2016 17:42:53 GMT
Build: http://jenkins.thetaphi.de/job/Lucene-Solr-trunk-Linux/15947/
Java: 64bit/jdk-9-ea+105 -XX:+UseCompressedOops -XX:+UseSerialGC -XX:-UseSuperWord

3 tests failed.
FAILED:  org.apache.lucene.util.automaton.TestAutomaton.testMakeBinaryIntervalFiniteCasesRandom

Error Message:
automaton was not minimal

Stack Trace:
java.lang.AssertionError: automaton was not minimal
	at __randomizedtesting.SeedInfo.seed([BE3364F41E117920:C632740CBDF94771]:0)
	at org.junit.Assert.fail(Assert.java:93)
	at org.apache.lucene.util.automaton.TestAutomaton.makeBinaryInterval(TestAutomaton.java:1167)
	at org.apache.lucene.util.automaton.TestAutomaton.testMakeBinaryIntervalFiniteCasesRandom(TestAutomaton.java:1243)
	at sun.reflect.NativeMethodAccessorImpl.invoke0(Native Method)
	at sun.reflect.NativeMethodAccessorImpl.invoke(NativeMethodAccessorImpl.java:62)
	at sun.reflect.DelegatingMethodAccessorImpl.invoke(DelegatingMethodAccessorImpl.java:43)
	at java.lang.reflect.Method.invoke(Method.java:520)
	at com.carrotsearch.randomizedtesting.RandomizedRunner.invoke(RandomizedRunner.java:1764)
	at com.carrotsearch.randomizedtesting.RandomizedRunner$8.evaluate(RandomizedRunner.java:871)
	at com.carrotsearch.randomizedtesting.RandomizedRunner$9.evaluate(RandomizedRunner.java:907)
	at com.carrotsearch.randomizedtesting.RandomizedRunner$10.evaluate(RandomizedRunner.java:921)
	at org.apache.lucene.util.TestRuleSetupTeardownChained$1.evaluate(TestRuleSetupTeardownChained.java:49)
	at org.apache.lucene.util.AbstractBeforeAfterRule$1.evaluate(AbstractBeforeAfterRule.java:45)
	at org.apache.lucene.util.TestRuleThreadAndTestName$1.evaluate(TestRuleThreadAndTestName.java:48)
	at org.apache.lucene.util.TestRuleIgnoreAfterMaxFailures$1.evaluate(TestRuleIgnoreAfterMaxFailures.java:64)
	at org.apache.lucene.util.TestRuleMarkFailure$1.evaluate(TestRuleMarkFailure.java:47)
	at com.carrotsearch.randomizedtesting.rules.StatementAdapter.evaluate(StatementAdapter.java:36)
	at com.carrotsearch.randomizedtesting.ThreadLeakControl$StatementRunner.run(ThreadLeakControl.java:367)
	at com.carrotsearch.randomizedtesting.ThreadLeakControl.forkTimeoutingTask(ThreadLeakControl.java:809)
	at com.carrotsearch.randomizedtesting.ThreadLeakControl$3.evaluate(ThreadLeakControl.java:460)
	at com.carrotsearch.randomizedtesting.RandomizedRunner.runSingleTest(RandomizedRunner.java:880)
	at com.carrotsearch.randomizedtesting.RandomizedRunner$5.evaluate(RandomizedRunner.java:781)
	at com.carrotsearch.randomizedtesting.RandomizedRunner$6.evaluate(RandomizedRunner.java:816)
	at com.carrotsearch.randomizedtesting.RandomizedRunner$7.evaluate(RandomizedRunner.java:827)
	at org.apache.lucene.util.AbstractBeforeAfterRule$1.evaluate(AbstractBeforeAfterRule.java:45)
	at com.carrotsearch.randomizedtesting.rules.StatementAdapter.evaluate(StatementAdapter.java:36)
	at org.apache.lucene.util.TestRuleStoreClassName$1.evaluate(TestRuleStoreClassName.java:41)
	at com.carrotsearch.randomizedtesting.rules.NoShadowingOrOverridesOnMethodsRule$1.evaluate(NoShadowingOrOverridesOnMethodsRule.java:40)
	at com.carrotsearch.randomizedtesting.rules.NoShadowingOrOverridesOnMethodsRule$1.evaluate(NoShadowingOrOverridesOnMethodsRule.java:40)
	at com.carrotsearch.randomizedtesting.rules.StatementAdapter.evaluate(StatementAdapter.java:36)
	at com.carrotsearch.randomizedtesting.rules.StatementAdapter.evaluate(StatementAdapter.java:36)
	at com.carrotsearch.randomizedtesting.rules.StatementAdapter.evaluate(StatementAdapter.java:36)
	at org.apache.lucene.util.TestRuleAssertionsRequired$1.evaluate(TestRuleAssertionsRequired.java:53)
	at org.apache.lucene.util.TestRuleMarkFailure$1.evaluate(TestRuleMarkFailure.java:47)
	at org.apache.lucene.util.TestRuleIgnoreAfterMaxFailures$1.evaluate(TestRuleIgnoreAfterMaxFailures.java:64)
	at org.apache.lucene.util.TestRuleIgnoreTestSuites$1.evaluate(TestRuleIgnoreTestSuites.java:54)
	at com.carrotsearch.randomizedtesting.rules.StatementAdapter.evaluate(StatementAdapter.java:36)
	at com.carrotsearch.randomizedtesting.ThreadLeakControl$StatementRunner.run(ThreadLeakControl.java:367)
	at java.lang.Thread.run(Thread.java:804)


FAILED:  org.apache.lucene.util.automaton.TestAutomaton.testIntervalRandom

Error Message:


Stack Trace:
java.lang.AssertionError
	at __randomizedtesting.SeedInfo.seed([BE3364F41E117920:EF7F7B944F127627]:0)
	at org.junit.Assert.fail(Assert.java:92)
	at org.junit.Assert.assertTrue(Assert.java:43)
	at org.junit.Assert.assertTrue(Assert.java:54)
	at org.apache.lucene.util.automaton.TestAutomaton.testIntervalRandom(TestAutomaton.java:473)
	at sun.reflect.NativeMethodAccessorImpl.invoke0(Native Method)
	at sun.reflect.NativeMethodAccessorImpl.invoke(NativeMethodAccessorImpl.java:62)
	at sun.reflect.DelegatingMethodAccessorImpl.invoke(DelegatingMethodAccessorImpl.java:43)
	at java.lang.reflect.Method.invoke(Method.java:520)
	at com.carrotsearch.randomizedtesting.RandomizedRunner.invoke(RandomizedRunner.java:1764)
	at com.carrotsearch.randomizedtesting.RandomizedRunner$8.evaluate(RandomizedRunner.java:871)
	at com.carrotsearch.randomizedtesting.RandomizedRunner$9.evaluate(RandomizedRunner.java:907)
	at com.carrotsearch.randomizedtesting.RandomizedRunner$10.evaluate(RandomizedRunner.java:921)
	at org.apache.lucene.util.TestRuleSetupTeardownChained$1.evaluate(TestRuleSetupTeardownChained.java:49)
	at org.apache.lucene.util.AbstractBeforeAfterRule$1.evaluate(AbstractBeforeAfterRule.java:45)
	at org.apache.lucene.util.TestRuleThreadAndTestName$1.evaluate(TestRuleThreadAndTestName.java:48)
	at org.apache.lucene.util.TestRuleIgnoreAfterMaxFailures$1.evaluate(TestRuleIgnoreAfterMaxFailures.java:64)
	at org.apache.lucene.util.TestRuleMarkFailure$1.evaluate(TestRuleMarkFailure.java:47)
	at com.carrotsearch.randomizedtesting.rules.StatementAdapter.evaluate(StatementAdapter.java:36)
	at com.carrotsearch.randomizedtesting.ThreadLeakControl$StatementRunner.run(ThreadLeakControl.java:367)
	at com.carrotsearch.randomizedtesting.ThreadLeakControl.forkTimeoutingTask(ThreadLeakControl.java:809)
	at com.carrotsearch.randomizedtesting.ThreadLeakControl$3.evaluate(ThreadLeakControl.java:460)
	at com.carrotsearch.randomizedtesting.RandomizedRunner.runSingleTest(RandomizedRunner.java:880)
	at com.carrotsearch.randomizedtesting.RandomizedRunner$5.evaluate(RandomizedRunner.java:781)
	at com.carrotsearch.randomizedtesting.RandomizedRunner$6.evaluate(RandomizedRunner.java:816)
	at com.carrotsearch.randomizedtesting.RandomizedRunner$7.evaluate(RandomizedRunner.java:827)
	at org.apache.lucene.util.AbstractBeforeAfterRule$1.evaluate(AbstractBeforeAfterRule.java:45)
	at com.carrotsearch.randomizedtesting.rules.StatementAdapter.evaluate(StatementAdapter.java:36)
	at org.apache.lucene.util.TestRuleStoreClassName$1.evaluate(TestRuleStoreClassName.java:41)
	at com.carrotsearch.randomizedtesting.rules.NoShadowingOrOverridesOnMethodsRule$1.evaluate(NoShadowingOrOverridesOnMethodsRule.java:40)
	at com.carrotsearch.randomizedtesting.rules.NoShadowingOrOverridesOnMethodsRule$1.evaluate(NoShadowingOrOverridesOnMethodsRule.java:40)
	at com.carrotsearch.randomizedtesting.rules.StatementAdapter.evaluate(StatementAdapter.java:36)
	at com.carrotsearch.randomizedtesting.rules.StatementAdapter.evaluate(StatementAdapter.java:36)
	at com.carrotsearch.randomizedtesting.rules.StatementAdapter.evaluate(StatementAdapter.java:36)
	at org.apache.lucene.util.TestRuleAssertionsRequired$1.evaluate(TestRuleAssertionsRequired.java:53)
	at org.apache.lucene.util.TestRuleMarkFailure$1.evaluate(TestRuleMarkFailure.java:47)
	at org.apache.lucene.util.TestRuleIgnoreAfterMaxFailures$1.evaluate(TestRuleIgnoreAfterMaxFailures.java:64)
	at org.apache.lucene.util.TestRuleIgnoreTestSuites$1.evaluate(TestRuleIgnoreTestSuites.java:54)
	at com.carrotsearch.randomizedtesting.rules.StatementAdapter.evaluate(StatementAdapter.java:36)
	at com.carrotsearch.randomizedtesting.ThreadLeakControl$StatementRunner.run(ThreadLeakControl.java:367)
	at java.lang.Thread.run(Thread.java:804)


FAILED:  org.apache.lucene.util.automaton.TestAutomaton.testReverseRandom1

Error Message:
9

Stack Trace:
java.lang.ArrayIndexOutOfBoundsException: 9
	at __randomizedtesting.SeedInfo.seed([BE3364F41E117920:A5FB651578D3F38A]:0)
	at org.apache.lucene.util.automaton.MinimizationOperations.minimize(MinimizationOperations.java:235)
	at org.apache.lucene.util.automaton.RegExp.toAutomatonInternal(RegExp.java:524)
	at org.apache.lucene.util.automaton.RegExp.findLeaves(RegExp.java:617)
	at org.apache.lucene.util.automaton.RegExp.toAutomatonInternal(RegExp.java:512)
	at org.apache.lucene.util.automaton.RegExp.toAutomaton(RegExp.java:495)
	at org.apache.lucene.util.automaton.RegExp.toAutomaton(RegExp.java:426)
	at org.apache.lucene.util.automaton.AutomatonTestUtil.randomSingleAutomaton(AutomatonTestUtil.java:262)
	at org.apache.lucene.util.automaton.AutomatonTestUtil.randomAutomaton(AutomatonTestUtil.java:277)
	at org.apache.lucene.util.automaton.TestAutomaton.testReverseRandom1(TestAutomaton.java:259)
	at sun.reflect.NativeMethodAccessorImpl.invoke0(Native Method)
	at sun.reflect.NativeMethodAccessorImpl.invoke(NativeMethodAccessorImpl.java:62)
	at sun.reflect.DelegatingMethodAccessorImpl.invoke(DelegatingMethodAccessorImpl.java:43)
	at java.lang.reflect.Method.invoke(Method.java:520)
	at com.carrotsearch.randomizedtesting.RandomizedRunner.invoke(RandomizedRunner.java:1764)
	at com.carrotsearch.randomizedtesting.RandomizedRunner$8.evaluate(RandomizedRunner.java:871)
	at com.carrotsearch.randomizedtesting.RandomizedRunner$9.evaluate(RandomizedRunner.java:907)
	at com.carrotsearch.randomizedtesting.RandomizedRunner$10.evaluate(RandomizedRunner.java:921)
	at org.apache.lucene.util.TestRuleSetupTeardownChained$1.evaluate(TestRuleSetupTeardownChained.java:49)
	at org.apache.lucene.util.AbstractBeforeAfterRule$1.evaluate(AbstractBeforeAfterRule.java:45)
	at org.apache.lucene.util.TestRuleThreadAndTestName$1.evaluate(TestRuleThreadAndTestName.java:48)
	at org.apache.lucene.util.TestRuleIgnoreAfterMaxFailures$1.evaluate(TestRuleIgnoreAfterMaxFailures.java:64)
	at org.apache.lucene.util.TestRuleMarkFailure$1.evaluate(TestRuleMarkFailure.java:47)
	at com.carrotsearch.randomizedtesting.rules.StatementAdapter.evaluate(StatementAdapter.java:36)
	at com.carrotsearch.randomizedtesting.ThreadLeakControl$StatementRunner.run(ThreadLeakControl.java:367)
	at com.carrotsearch.randomizedtesting.ThreadLeakControl.forkTimeoutingTask(ThreadLeakControl.java:809)
	at com.carrotsearch.randomizedtesting.ThreadLeakControl$3.evaluate(ThreadLeakControl.java:460)
	at com.carrotsearch.randomizedtesting.RandomizedRunner.runSingleTest(RandomizedRunner.java:880)
	at com.carrotsearch.randomizedtesting.RandomizedRunner$5.evaluate(RandomizedRunner.java:781)
	at com.carrotsearch.randomizedtesting.RandomizedRunner$6.evaluate(RandomizedRunner.java:816)
	at com.carrotsearch.randomizedtesting.RandomizedRunner$7.evaluate(RandomizedRunner.java:827)
	at org.apache.lucene.util.AbstractBeforeAfterRule$1.evaluate(AbstractBeforeAfterRule.java:45)
	at com.carrotsearch.randomizedtesting.rules.StatementAdapter.evaluate(StatementAdapter.java:36)
	at org.apache.lucene.util.TestRuleStoreClassName$1.evaluate(TestRuleStoreClassName.java:41)
	at com.carrotsearch.randomizedtesting.rules.NoShadowingOrOverridesOnMethodsRule$1.evaluate(NoShadowingOrOverridesOnMethodsRule.java:40)
	at com.carrotsearch.randomizedtesting.rules.NoShadowingOrOverridesOnMethodsRule$1.evaluate(NoShadowingOrOverridesOnMethodsRule.java:40)
	at com.carrotsearch.randomizedtesting.rules.StatementAdapter.evaluate(StatementAdapter.java:36)
	at com.carrotsearch.randomizedtesting.rules.StatementAdapter.evaluate(StatementAdapter.java:36)
	at com.carrotsearch.randomizedtesting.rules.StatementAdapter.evaluate(StatementAdapter.java:36)
	at org.apache.lucene.util.TestRuleAssertionsRequired$1.evaluate(TestRuleAssertionsRequired.java:53)
	at org.apache.lucene.util.TestRuleMarkFailure$1.evaluate(TestRuleMarkFailure.java:47)
	at org.apache.lucene.util.TestRuleIgnoreAfterMaxFailures$1.evaluate(TestRuleIgnoreAfterMaxFailures.java:64)
	at org.apache.lucene.util.TestRuleIgnoreTestSuites$1.evaluate(TestRuleIgnoreTestSuites.java:54)
	at com.carrotsearch.randomizedtesting.rules.StatementAdapter.evaluate(StatementAdapter.java:36)
	at com.carrotsearch.randomizedtesting.ThreadLeakControl$StatementRunner.run(ThreadLeakControl.java:367)
	at java.lang.Thread.run(Thread.java:804)




Build Log:
[...truncated 1532 lines...]
   [junit4] Suite: org.apache.lucene.util.automaton.TestAutomaton
   [junit4]   1> Original was not minimal:
   [junit4]   1> Original:
   [junit4]   1> digraph Automaton {
   [junit4]   1>   rankdir = LR
   [junit4]   1>   initial [shape=plaintext,label="0"]
   [junit4]   1>   initial -> 0
   [junit4]   1>   0 [shape=circle,label="0"]
   [junit4]   1>   0 -> 1 [label="\\U000000e2"]
   [junit4]   1>   1 [shape=circle,label="1"]
   [junit4]   1>   1 -> 2 [label="\\U00000091"]
   [junit4]   1>   2 [shape=circle,label="2"]
   [junit4]   1>   2 -> 3 [label="\\U00000099"]
   [junit4]   1>   3 [shape=circle,label="3"]
   [junit4]   1>   3 -> 4 [label="\\U000000e2"]
   [junit4]   1>   4 [shape=circle,label="4"]
   [junit4]   1>   4 -> 5 [label="\\U00000091"]
   [junit4]   1>   5 [shape=circle,label="5"]
   [junit4]   1>   5 -> 6 [label="\\U0000008b"]
   [junit4]   1>   6 [shape=circle,label="6"]
   [junit4]   1>   6 -> 7 [label="\\U000000e2"]
   [junit4]   1>   7 [shape=circle,label="7"]
   [junit4]   1>   7 -> 8 [label="\\U00000091"]
   [junit4]   1>   8 [shape=circle,label="8"]
   [junit4]   1>   8 -> 9 [label="\\U00000093"]
   [junit4]   1>   9 [shape=circle,label="9"]
   [junit4]   1>   9 -> 10 [label="\\U000000e2"]
   [junit4]   1>   10 [shape=circle,label="10"]
   [junit4]   1>   10 -> 11 [label="\\U00000091"]
   [junit4]   1>   11 [shape=circle,label="11"]
   [junit4]   1>   11 -> 12 [label="\\U00000088"]
   [junit4]   1>   12 [shape=circle,label="12"]
   [junit4]   1>   12 -> 13 [label="\\U000000e2"]
   [junit4]   1>   13 [shape=circle,label="13"]
   [junit4]   1>   13 -> 14 [label="\\U00000091"]
   [junit4]   1>   14 [shape=circle,label="14"]
   [junit4]   1>   14 -> 15 [label="\\U0000008f"]
   [junit4]   1>   15 [shape=circle,label="15"]
   [junit4]   1>   15 -> 16 [label="\\U000000e2"]
   [junit4]   1>   16 [shape=circle,label="16"]
   [junit4]   1>   16 -> 17 [label="\\U00000091"]
   [junit4]   1>   17 [shape=circle,label="17"]
   [junit4]   1>   17 -> 18 [label="\\U00000096"]
   [junit4]   1>   18 [shape=circle,label="18"]
   [junit4]   1>   18 -> 19 [label="\\U000000e2"]
   [junit4]   1>   19 [shape=circle,label="19"]
   [junit4]   1>   19 -> 20 [label="\\U00000091"]
   [junit4]   1>   20 [shape=circle,label="20"]
   [junit4]   1>   20 -> 21 [label="\\U00000082"]
   [junit4]   1>   21 [shape=circle,label="21"]
   [junit4]   1>   21 -> 22 [label="\\U000000e2"]
   [junit4]   1>   22 [shape=circle,label="22"]
   [junit4]   1>   22 -> 23 [label="\\U00000091"]
   [junit4]   1>   23 [shape=circle,label="23"]
   [junit4]   1>   23 -> 24 [label="\\U0000009c"]
   [junit4]   1>   24 [shape=circle,label="24"]
   [junit4]   1>   24 -> 25 [label="\\U000000e2"]
   [junit4]   1>   25 [shape=circle,label="25"]
   [junit4]   1>   25 -> 26 [label="\\U00000091"]
   [junit4]   1>   26 [shape=circle,label="26"]
   [junit4]   1>   26 -> 27 [label="\\U00000097"]
   [junit4]   1>   27 [shape=circle,label="27"]
   [junit4]   1>   27 -> 28 [label="\\U000000e2"]
   [junit4]   1>   28 [shape=circle,label="28"]
   [junit4]   1>   28 -> 29 [label="\\U00000091"]
   [junit4]   1>   29 [shape=circle,label="29"]
   [junit4]   1>   29 -> 30 [label="\\U00000083"]
   [junit4]   1>   30 [shape=doublecircle,label="30"]
   [junit4]   1>   30 -> 31 [label="\\U00000000"]
   [junit4]   1>   31 [shape=doublecircle,label="31"]
   [junit4]   1>   31 -> 32 [label="\\U00000000"]
   [junit4]   1>   32 [shape=doublecircle,label="32"]
   [junit4]   1>   32 -> 33 [label="\\U00000000"]
   [junit4]   1>   33 [shape=doublecircle,label="33"]
   [junit4]   1>   33 -> 34 [label="\\U00000000"]
   [junit4]   1>   34 [shape=doublecircle,label="34"]
   [junit4]   1>   34 -> 35 [label="\\U00000000"]
   [junit4]   1>   35 [shape=doublecircle,label="35"]
   [junit4]   1> }
   [junit4]   1> Minimized:
   [junit4]   1> digraph Automaton {
   [junit4]   1>   rankdir = LR
   [junit4]   1>   initial [shape=plaintext,label="0"]
   [junit4]   1>   initial -> 0
   [junit4]   1>   0 [shape=circle,label="0"]
   [junit4]   1>   0 -> 4 [label="\\U00000000-\\U000000e1"]
   [junit4]   1>   0 -> 3 [label="\\U000000e2"]
   [junit4]   1>   0 -> 4 [label="\\U000000e3-\\U0010ffff"]
   [junit4]   1>   1 [shape=circle,label="1"]
   [junit4]   1>   1 -> 4 [label="\\U00000000-\\U00000082"]
   [junit4]   1>   1 -> 2 [label="\\U00000083"]
   [junit4]   1>   1 -> 4 [label="\\U00000084-\\U0010ffff"]
   [junit4]   1>   2 [shape=doublecircle,label="2"]
   [junit4]   1>   2 -> 4 [label="\\U00000000-\\U00000090"]
   [junit4]   1>   2 -> 1 [label="\\U00000091"]
   [junit4]   1>   2 -> 4 [label="\\U00000092-\\U0010ffff"]
   [junit4]   1>   3 [shape=circle,label="3"]
   [junit4]   1>   3 -> 4 [label="\\U00000000-\\U00000090"]
   [junit4]   1>   3 -> 1 [label="\\U00000091"]
   [junit4]   1>   3 -> 4 [label="\\U00000092-\\U0010ffff"]
   [junit4]   1>   4 [shape=circle,label="4"]
   [junit4]   1>   4 -> 4 [label="\\U00000000-\\U00000090"]
   [junit4]   1>   4 -> 1 [label="\\U00000091"]
   [junit4]   1>   4 -> 4 [label="\\U00000092-\\U0010ffff"]
   [junit4]   1> }
   [junit4]   1> minTerm=[e2 91 99 e2 91 8b e2 91 93 e2 91 88 e2 91 8f e2 91 96 e2 91 82
e2 91 9c e2 91 97 e2 91 83] minInclusive=true
   [junit4]   1> maxTerm=[e2 91 99 e2 91 8b e2 91 93 e2 91 88 e2 91 8f e2 91 96 e2 91 82
e2 91 9c e2 91 97 e2 91 83 0 0 0 0 0 0] maxInclusive=false
   [junit4]   2> NOTE: reproduce with: ant test  -Dtestcase=TestAutomaton -Dtests.method=testMakeBinaryIntervalFiniteCasesRandom
-Dtests.seed=BE3364F41E117920 -Dtests.multiplier=3 -Dtests.slow=true -Dtests.locale=zh-CN
-Dtests.timezone=Asia/Ashgabat -Dtests.asserts=true -Dtests.file.encoding=ISO-8859-1
   [junit4] FAILURE 0.15s J2 | TestAutomaton.testMakeBinaryIntervalFiniteCasesRandom <<<
   [junit4]    > Throwable #1: java.lang.AssertionError: automaton was not minimal
   [junit4]    > 	at __randomizedtesting.SeedInfo.seed([BE3364F41E117920:C632740CBDF94771]:0)
   [junit4]    > 	at org.apache.lucene.util.automaton.TestAutomaton.makeBinaryInterval(TestAutomaton.java:1167)
   [junit4]    > 	at org.apache.lucene.util.automaton.TestAutomaton.testMakeBinaryIntervalFiniteCasesRandom(TestAutomaton.java:1243)
   [junit4]    > 	at java.lang.Thread.run(Thread.java:804)
   [junit4]   2> NOTE: reproduce with: ant test  -Dtestcase=TestAutomaton -Dtests.method=testIntervalRandom
-Dtests.seed=BE3364F41E117920 -Dtests.multiplier=3 -Dtests.slow=true -Dtests.locale=zh-CN
-Dtests.timezone=Asia/Ashgabat -Dtests.asserts=true -Dtests.file.encoding=ISO-8859-1
   [junit4] FAILURE 0.01s J2 | TestAutomaton.testIntervalRandom <<<
   [junit4]    > Throwable #1: java.lang.AssertionError
   [junit4]    > 	at __randomizedtesting.SeedInfo.seed([BE3364F41E117920:EF7F7B944F127627]:0)
   [junit4]    > 	at org.apache.lucene.util.automaton.TestAutomaton.testIntervalRandom(TestAutomaton.java:473)
   [junit4]    > 	at java.lang.Thread.run(Thread.java:804)
   [junit4]   2> NOTE: reproduce with: ant test  -Dtestcase=TestAutomaton -Dtests.method=testReverseRandom1
-Dtests.seed=BE3364F41E117920 -Dtests.multiplier=3 -Dtests.slow=true -Dtests.locale=zh-CN
-Dtests.timezone=Asia/Ashgabat -Dtests.asserts=true -Dtests.file.encoding=ISO-8859-1
   [junit4] ERROR   0.18s J2 | TestAutomaton.testReverseRandom1 <<<
   [junit4]    > Throwable #1: java.lang.ArrayIndexOutOfBoundsException: 9
   [junit4]    > 	at __randomizedtesting.SeedInfo.seed([BE3364F41E117920:A5FB651578D3F38A]:0)
   [junit4]    > 	at org.apache.lucene.util.automaton.MinimizationOperations.minimize(MinimizationOperations.java:235)
   [junit4]    > 	at org.apache.lucene.util.automaton.RegExp.toAutomatonInternal(RegExp.java:524)
   [junit4]    > 	at org.apache.lucene.util.automaton.RegExp.findLeaves(RegExp.java:617)
   [junit4]    > 	at org.apache.lucene.util.automaton.RegExp.toAutomatonInternal(RegExp.java:512)
   [junit4]    > 	at org.apache.lucene.util.automaton.RegExp.toAutomaton(RegExp.java:495)
   [junit4]    > 	at org.apache.lucene.util.automaton.RegExp.toAutomaton(RegExp.java:426)
   [junit4]    > 	at org.apache.lucene.util.automaton.AutomatonTestUtil.randomSingleAutomaton(AutomatonTestUtil.java:262)
   [junit4]    > 	at org.apache.lucene.util.automaton.AutomatonTestUtil.randomAutomaton(AutomatonTestUtil.java:277)
   [junit4]    > 	at org.apache.lucene.util.automaton.TestAutomaton.testReverseRandom1(TestAutomaton.java:259)
   [junit4]    > 	at java.lang.Thread.run(Thread.java:804)
   [junit4]   2> NOTE: test params are: codec=Asserting(Lucene60), sim=ClassicSimilarity,
locale=zh-CN, timezone=Asia/Ashgabat
   [junit4]   2> NOTE: Linux 3.19.0-47-generic amd64/Oracle Corporation 9-ea (64-bit)/cpus=12,threads=1,free=327047808,total=508952576
   [junit4]   2> NOTE: All tests run in this JVM: [TestComplexExplanations, TestBytesRefHash,
TestDuelingCodecsAtNight, TestTotalHitCountCollector, TestWildcard, TestBlockPostingsFormat,
TestSleepingLockWrapper, TestSparseFixedBitSet, TestFrequencyTrackingRingBuffer, Test2BSortedDocValuesOrds,
TestNoMergeScheduler, TestNot, TestNRTReaderCleanup, TestUsageTrackingFilterCachingPolicy,
TestDirectoryReader, TestNearSpansOrdered, TestDirectPacked, TestExternalCodecs, TestReqExclBulkScorer,
TestLazyProxSkipping, TestMultiPhraseEnum, TestFilterSpans, TestConcurrentMergeScheduler,
TestRegexpRandom2, TestMultiLevelSkipList, TestFastDecompressionMode, Test2BPagedBytes, TestTermsEnum2,
Test2BBinaryDocValues, TestMultiThreadTermVectors, TestTimSorterWorstCase, TestDocValuesScoring,
TestMathUtil, TestMixedCodecs, TestCharsRef, TestSimpleFSDirectory, TestSpanExplanationsOfNonMatches,
TestCachingCollector, TestElevationComparator, TestNumericTokenStream, TestPrefixCodedTerms,
TestIndexWriterOnDiskFull, TestIndexWriterMerging, TestSortedSetSelector, TestIndexWriterMaxDocs,
TestParallelReaderEmptyIndex, Test2BPositions, TestCrashCausesCorruptIndex, TestLiveFieldValues,
TestTermVectorsReader, TestMultiMMap, TestApproximationSearchEquivalence, TestBagOfPositions,
TestAttributeSource, TestBooleanOr, TestSearch, TestOfflineSorter, TestSort, TestTransactions,
TestSegmentInfos, TestDateTools, Test2BNumericDocValues, TestArrayUtil, TestMergeSchedulerExternal,
TestDemoParallelLeafReader, TestTermVectors, TestCharTermAttributeImpl, TestComplexExplanationsOfNonMatches,
TestCharsRefBuilder, TestIndexWriterReader, TestBytesStore, TestNumericRangeQuery32, TestAddIndexes,
TestSearcherManager, TestDeletionPolicy, TestBasics, TestSloppyPhraseQuery, TestIndexWriterMergePolicy,
TestNRTThreads, TestStressAdvance, TestNorms, TestDirectoryReaderReopen, TestSearchWithThreads,
TestTopDocsMerge, TestLongPostings, TestStressIndexing, TestSnapshotDeletionPolicy, TestLevenshteinAutomata,
TestBufferedIndexInput, TestTermsEnum, TestLucene60PointFormat, TestIndexWriterDeleteByQuery,
TestIndexWriterOnVMError, TestIndexWriterThreadsToSegments, TestInfoStream, TestLogMergePolicy,
TestManyFields, TestMergeRateLimiter, TestOrdinalMap, TestReadOnlyIndex, TestStressDeletes,
TestTragicIndexWriterDeadlock, FuzzyTermOnShortTermsTest, TestBooleanRewrites, TestConjunctionDISI,
TestMatchNoDocsQuery, TestMultiCollector, TestPointQueries, TestMmapDirectory, TestNIOFSDirectory,
TestSingleInstanceLockFactory, TestTrackingDirectoryWrapper, TestDocIdSetBuilder, TestFixedBitDocIdSet,
TestInPlaceMergeSorter, TestIntArrayDocIdSet, TestIntroSorter, TestSPIClassIterator, FiniteStringsIteratorTest,
LimitedFiniteStringsIteratorTest, TestAutomaton]
   [junit4] Completed [409/411 (1!)] on J2 in 2.48s, 56 tests, 2 failures, 1 error <<<
FAILURES!

[...truncated 22 lines...]
BUILD FAILED
/home/jenkins/workspace/Lucene-Solr-trunk-Linux/build.xml:740: The following error occurred
while executing this line:
/home/jenkins/workspace/Lucene-Solr-trunk-Linux/build.xml:684: The following error occurred
while executing this line:
/home/jenkins/workspace/Lucene-Solr-trunk-Linux/build.xml:59: The following error occurred
while executing this line:
/home/jenkins/workspace/Lucene-Solr-trunk-Linux/lucene/build.xml:50: The following error occurred
while executing this line:
/home/jenkins/workspace/Lucene-Solr-trunk-Linux/lucene/common-build.xml:1457: The following
error occurred while executing this line:
/home/jenkins/workspace/Lucene-Solr-trunk-Linux/lucene/common-build.xml:1014: There were test
failures: 411 suites (1 ignored), 3395 tests, 1 error, 2 failures, 60 ignored (56 assumptions)
[seed: BE3364F41E117920]

Total time: 5 minutes 40 seconds
Build step 'Invoke Ant' marked build as failure
Archiving artifacts
[WARNINGS] Skipping publisher since build result is FAILURE
Recording test results
Email was triggered for: Failure - Any
Sending email for trigger: Failure - Any



Mime
View raw message