lucene-dev mailing list archives

Site index · List index
Message view « Date » · « Thread »
Top « Date » · « Thread »
From Apache Jenkins Server <jenk...@builds.apache.org>
Subject [JENKINS] Lucene-Solr-Tests-5.5-Java7 - Build # 7 - Failure
Date Mon, 15 Feb 2016 07:36:37 GMT
Build: https://builds.apache.org/job/Lucene-Solr-Tests-5.5-Java7/7/

1 tests failed.
FAILED:  org.apache.solr.update.DirectUpdateHandlerTest.testExpungeDeletes

Error Message:
expected:<5> but was:<4>

Stack Trace:
java.lang.AssertionError: expected:<5> but was:<4>
	at __randomizedtesting.SeedInfo.seed([7AE6C28A821C56DC:569F860FF7A59E79]:0)
	at org.junit.Assert.fail(Assert.java:93)
	at org.junit.Assert.failNotEquals(Assert.java:647)
	at org.junit.Assert.assertEquals(Assert.java:128)
	at org.junit.Assert.assertEquals(Assert.java:472)
	at org.junit.Assert.assertEquals(Assert.java:456)
	at org.apache.solr.update.DirectUpdateHandlerTest.testExpungeDeletes(DirectUpdateHandlerTest.java:299)
	at sun.reflect.NativeMethodAccessorImpl.invoke0(Native Method)
	at sun.reflect.NativeMethodAccessorImpl.invoke(NativeMethodAccessorImpl.java:57)
	at sun.reflect.DelegatingMethodAccessorImpl.invoke(DelegatingMethodAccessorImpl.java:43)
	at java.lang.reflect.Method.invoke(Method.java:606)
	at com.carrotsearch.randomizedtesting.RandomizedRunner.invoke(RandomizedRunner.java:1764)
	at com.carrotsearch.randomizedtesting.RandomizedRunner$8.evaluate(RandomizedRunner.java:871)
	at com.carrotsearch.randomizedtesting.RandomizedRunner$9.evaluate(RandomizedRunner.java:907)
	at com.carrotsearch.randomizedtesting.RandomizedRunner$10.evaluate(RandomizedRunner.java:921)
	at com.carrotsearch.randomizedtesting.rules.SystemPropertiesRestoreRule$1.evaluate(SystemPropertiesRestoreRule.java:57)
	at org.apache.lucene.util.TestRuleSetupTeardownChained$1.evaluate(TestRuleSetupTeardownChained.java:49)
	at org.apache.lucene.util.AbstractBeforeAfterRule$1.evaluate(AbstractBeforeAfterRule.java:45)
	at org.apache.lucene.util.TestRuleThreadAndTestName$1.evaluate(TestRuleThreadAndTestName.java:48)
	at org.apache.lucene.util.TestRuleIgnoreAfterMaxFailures$1.evaluate(TestRuleIgnoreAfterMaxFailures.java:64)
	at org.apache.lucene.util.TestRuleMarkFailure$1.evaluate(TestRuleMarkFailure.java:47)
	at com.carrotsearch.randomizedtesting.rules.StatementAdapter.evaluate(StatementAdapter.java:36)
	at com.carrotsearch.randomizedtesting.ThreadLeakControl$StatementRunner.run(ThreadLeakControl.java:367)
	at com.carrotsearch.randomizedtesting.ThreadLeakControl.forkTimeoutingTask(ThreadLeakControl.java:809)
	at com.carrotsearch.randomizedtesting.ThreadLeakControl$3.evaluate(ThreadLeakControl.java:460)
	at com.carrotsearch.randomizedtesting.RandomizedRunner.runSingleTest(RandomizedRunner.java:880)
	at com.carrotsearch.randomizedtesting.RandomizedRunner$5.evaluate(RandomizedRunner.java:781)
	at com.carrotsearch.randomizedtesting.RandomizedRunner$6.evaluate(RandomizedRunner.java:816)
	at com.carrotsearch.randomizedtesting.RandomizedRunner$7.evaluate(RandomizedRunner.java:827)
	at com.carrotsearch.randomizedtesting.rules.StatementAdapter.evaluate(StatementAdapter.java:36)
	at com.carrotsearch.randomizedtesting.rules.SystemPropertiesRestoreRule$1.evaluate(SystemPropertiesRestoreRule.java:57)
	at org.apache.lucene.util.AbstractBeforeAfterRule$1.evaluate(AbstractBeforeAfterRule.java:45)
	at com.carrotsearch.randomizedtesting.rules.StatementAdapter.evaluate(StatementAdapter.java:36)
	at org.apache.lucene.util.TestRuleStoreClassName$1.evaluate(TestRuleStoreClassName.java:41)
	at com.carrotsearch.randomizedtesting.rules.NoShadowingOrOverridesOnMethodsRule$1.evaluate(NoShadowingOrOverridesOnMethodsRule.java:40)
	at com.carrotsearch.randomizedtesting.rules.NoShadowingOrOverridesOnMethodsRule$1.evaluate(NoShadowingOrOverridesOnMethodsRule.java:40)
	at com.carrotsearch.randomizedtesting.rules.StatementAdapter.evaluate(StatementAdapter.java:36)
	at com.carrotsearch.randomizedtesting.rules.StatementAdapter.evaluate(StatementAdapter.java:36)
	at com.carrotsearch.randomizedtesting.rules.StatementAdapter.evaluate(StatementAdapter.java:36)
	at org.apache.lucene.util.TestRuleAssertionsRequired$1.evaluate(TestRuleAssertionsRequired.java:53)
	at org.apache.lucene.util.TestRuleMarkFailure$1.evaluate(TestRuleMarkFailure.java:47)
	at org.apache.lucene.util.TestRuleIgnoreAfterMaxFailures$1.evaluate(TestRuleIgnoreAfterMaxFailures.java:64)
	at org.apache.lucene.util.TestRuleIgnoreTestSuites$1.evaluate(TestRuleIgnoreTestSuites.java:54)
	at com.carrotsearch.randomizedtesting.rules.StatementAdapter.evaluate(StatementAdapter.java:36)
	at com.carrotsearch.randomizedtesting.ThreadLeakControl$StatementRunner.run(ThreadLeakControl.java:367)
	at java.lang.Thread.run(Thread.java:745)




Build Log:
[...truncated 10780 lines...]
   [junit4] Suite: org.apache.solr.update.DirectUpdateHandlerTest
   [junit4]   2> Creating dataDir: /x1/jenkins/jenkins-slave/workspace/Lucene-Solr-Tests-5.5-Java7/solr/build/solr-core/test/J2/temp/solr.update.DirectUpdateHandlerTest_7AE6C28A821C56DC-001/init-core-data-001
   [junit4]   2> 382593 INFO  (SUITE-DirectUpdateHandlerTest-seed#[7AE6C28A821C56DC]-worker) [    ] o.a.s.SolrTestCaseJ4 Randomized ssl (false) and clientAuth (false)
   [junit4]   2> 382594 INFO  (SUITE-DirectUpdateHandlerTest-seed#[7AE6C28A821C56DC]-worker) [    ] o.a.s.SolrTestCaseJ4 ####initCore
   [junit4]   2> 382594 INFO  (SUITE-DirectUpdateHandlerTest-seed#[7AE6C28A821C56DC]-worker) [    ] o.a.s.c.SolrResourceLoader new SolrResourceLoader for directory: '/x1/jenkins/jenkins-slave/workspace/Lucene-Solr-Tests-5.5-Java7/solr/core/src/test-files/solr/collection1'
   [junit4]   2> 382594 INFO  (SUITE-DirectUpdateHandlerTest-seed#[7AE6C28A821C56DC]-worker) [    ] o.a.s.c.SolrResourceLoader JNDI not configured for solr (NoInitialContextEx)
   [junit4]   2> 382594 INFO  (SUITE-DirectUpdateHandlerTest-seed#[7AE6C28A821C56DC]-worker) [    ] o.a.s.c.SolrResourceLoader using system property solr.solr.home: /x1/jenkins/jenkins-slave/workspace/Lucene-Solr-Tests-5.5-Java7/solr/core/src/test-files/solr
   [junit4]   2> 382594 INFO  (SUITE-DirectUpdateHandlerTest-seed#[7AE6C28A821C56DC]-worker) [    ] o.a.s.c.SolrResourceLoader Adding 'file:/x1/jenkins/jenkins-slave/workspace/Lucene-Solr-Tests-5.5-Java7/solr/core/src/test-files/solr/collection1/lib/classes/' to classloader
   [junit4]   2> 382594 INFO  (SUITE-DirectUpdateHandlerTest-seed#[7AE6C28A821C56DC]-worker) [    ] o.a.s.c.SolrResourceLoader Adding 'file:/x1/jenkins/jenkins-slave/workspace/Lucene-Solr-Tests-5.5-Java7/solr/core/src/test-files/solr/collection1/lib/README' to classloader
   [junit4]   2> 382628 INFO  (SUITE-DirectUpdateHandlerTest-seed#[7AE6C28A821C56DC]-worker) [    ] o.a.s.c.SolrConfig current version of requestparams : -1
   [junit4]   2> 382648 INFO  (SUITE-DirectUpdateHandlerTest-seed#[7AE6C28A821C56DC]-worker) [    ] o.a.s.c.SolrConfig Using Lucene MatchVersion: 5.5.0
   [junit4]   2> 382688 INFO  (SUITE-DirectUpdateHandlerTest-seed#[7AE6C28A821C56DC]-worker) [    ] o.a.s.c.SolrConfig Loaded SolrConfig: solrconfig.xml
   [junit4]   2> 382695 INFO  (SUITE-DirectUpdateHandlerTest-seed#[7AE6C28A821C56DC]-worker) [    ] o.a.s.s.IndexSchema [null] Schema name=test
   [junit4]   2> 382898 INFO  (SUITE-DirectUpdateHandlerTest-seed#[7AE6C28A821C56DC]-worker) [    ] o.a.s.s.IndexSchema default search field in schema is text
   [junit4]   2> 382900 INFO  (SUITE-DirectUpdateHandlerTest-seed#[7AE6C28A821C56DC]-worker) [    ] o.a.s.s.IndexSchema unique key field: id
   [junit4]   2> 382901 WARN  (SUITE-DirectUpdateHandlerTest-seed#[7AE6C28A821C56DC]-worker) [    ] o.a.s.s.IndexSchema Field text is not multivalued and destination for multiple copyFields (2)
   [junit4]   2> 382908 INFO  (SUITE-DirectUpdateHandlerTest-seed#[7AE6C28A821C56DC]-worker) [    ] o.a.s.s.FileExchangeRateProvider Reloading exchange rates from file currency.xml
   [junit4]   2> 382911 INFO  (SUITE-DirectUpdateHandlerTest-seed#[7AE6C28A821C56DC]-worker) [    ] o.a.s.s.FileExchangeRateProvider Reloading exchange rates from file currency.xml
   [junit4]   2> 382914 INFO  (SUITE-DirectUpdateHandlerTest-seed#[7AE6C28A821C56DC]-worker) [    ] o.a.s.c.SolrResourceLoader JNDI not configured for solr (NoInitialContextEx)
   [junit4]   2> 382914 INFO  (SUITE-DirectUpdateHandlerTest-seed#[7AE6C28A821C56DC]-worker) [    ] o.a.s.c.SolrResourceLoader using system property solr.solr.home: /x1/jenkins/jenkins-slave/workspace/Lucene-Solr-Tests-5.5-Java7/solr/core/src/test-files/solr
   [junit4]   2> 382914 INFO  (SUITE-DirectUpdateHandlerTest-seed#[7AE6C28A821C56DC]-worker) [    ] o.a.s.c.SolrResourceLoader new SolrResourceLoader for directory: '/x1/jenkins/jenkins-slave/workspace/Lucene-Solr-Tests-5.5-Java7/solr/core/src/test-files/solr'
   [junit4]   2> 382914 INFO  (SUITE-DirectUpdateHandlerTest-seed#[7AE6C28A821C56DC]-worker) [    ] o.a.s.c.SolrResourceLoader JNDI not configured for solr (NoInitialContextEx)
   [junit4]   2> 382914 INFO  (SUITE-DirectUpdateHandlerTest-seed#[7AE6C28A821C56DC]-worker) [    ] o.a.s.c.SolrResourceLoader using system property solr.solr.home: /x1/jenkins/jenkins-slave/workspace/Lucene-Solr-Tests-5.5-Java7/solr/core/src/test-files/solr
   [junit4]   2> 382914 INFO  (SUITE-DirectUpdateHandlerTest-seed#[7AE6C28A821C56DC]-worker) [    ] o.a.s.c.CoreContainer New CoreContainer 960476621
   [junit4]   2> 382914 INFO  (SUITE-DirectUpdateHandlerTest-seed#[7AE6C28A821C56DC]-worker) [    ] o.a.s.c.CoreContainer Loading cores into CoreContainer [instanceDir=/x1/jenkins/jenkins-slave/workspace/Lucene-Solr-Tests-5.5-Java7/solr/core/src/test-files/solr]
   [junit4]   2> 382915 WARN  (SUITE-DirectUpdateHandlerTest-seed#[7AE6C28A821C56DC]-worker) [    ] o.a.s.c.CoreContainer Couldn't add files from /x1/jenkins/jenkins-slave/workspace/Lucene-Solr-Tests-5.5-Java7/solr/core/src/test-files/solr/lib to classpath: /x1/jenkins/jenkins-slave/workspace/Lucene-Solr-Tests-5.5-Java7/solr/core/src/test-files/solr/lib
   [junit4]   2> 382915 INFO  (SUITE-DirectUpdateHandlerTest-seed#[7AE6C28A821C56DC]-worker) [    ] o.a.s.h.c.HttpShardHandlerFactory created with socketTimeout : 600000,connTimeout : 60000,maxConnectionsPerHost : 20,maxConnections : 10000,corePoolSize : 0,maximumPoolSize : 2147483647,maxThreadIdleTime : 5,sizeOfQueue : -1,fairnessPolicy : false,useRetries : false,
   [junit4]   2> 382917 INFO  (SUITE-DirectUpdateHandlerTest-seed#[7AE6C28A821C56DC]-worker) [    ] o.a.s.u.UpdateShardHandler Creating UpdateShardHandler HTTP client with params: socketTimeout=30000&connTimeout=30000&retry=true
   [junit4]   2> 382918 INFO  (SUITE-DirectUpdateHandlerTest-seed#[7AE6C28A821C56DC]-worker) [    ] o.a.s.l.LogWatcher SLF4J impl is org.slf4j.impl.Log4jLoggerFactory
   [junit4]   2> 382918 INFO  (SUITE-DirectUpdateHandlerTest-seed#[7AE6C28A821C56DC]-worker) [    ] o.a.s.l.LogWatcher Registering Log Listener [Log4j (org.slf4j.impl.Log4jLoggerFactory)]
   [junit4]   2> 382918 INFO  (SUITE-DirectUpdateHandlerTest-seed#[7AE6C28A821C56DC]-worker) [    ] o.a.s.c.CoreContainer Security conf doesn't exist. Skipping setup for authorization module.
   [junit4]   2> 382918 INFO  (SUITE-DirectUpdateHandlerTest-seed#[7AE6C28A821C56DC]-worker) [    ] o.a.s.c.CoreContainer No authentication plugin used.
   [junit4]   2> 382919 INFO  (SUITE-DirectUpdateHandlerTest-seed#[7AE6C28A821C56DC]-worker) [    ] o.a.s.c.CoreDescriptor Created CoreDescriptor: {shard=shard1, config=solrconfig.xml, name=collection1, transient=false, configSetProperties=configsetprops.json, collection=collection1, dataDir=/x1/jenkins/jenkins-slave/workspace/Lucene-Solr-Tests-5.5-Java7/solr/build/solr-core/test/J2/temp/solr.update.DirectUpdateHandlerTest_7AE6C28A821C56DC-001/init-core-data-001, loadOnStartup=true, schema=schema12.xml}
   [junit4]   2> 382920 INFO  (coreLoadExecutor-729-thread-1) [    ] o.a.s.c.SolrResourceLoader new SolrResourceLoader for directory: '/x1/jenkins/jenkins-slave/workspace/Lucene-Solr-Tests-5.5-Java7/solr/core/src/test-files/solr/collection1'
   [junit4]   2> 382920 INFO  (coreLoadExecutor-729-thread-1) [    ] o.a.s.c.SolrResourceLoader JNDI not configured for solr (NoInitialContextEx)
   [junit4]   2> 382920 INFO  (coreLoadExecutor-729-thread-1) [    ] o.a.s.c.SolrResourceLoader using system property solr.solr.home: /x1/jenkins/jenkins-slave/workspace/Lucene-Solr-Tests-5.5-Java7/solr/core/src/test-files/solr
   [junit4]   2> 382921 INFO  (coreLoadExecutor-729-thread-1) [    ] o.a.s.c.SolrResourceLoader Adding 'file:/x1/jenkins/jenkins-slave/workspace/Lucene-Solr-Tests-5.5-Java7/solr/core/src/test-files/solr/collection1/lib/classes/' to classloader
   [junit4]   2> 382921 INFO  (coreLoadExecutor-729-thread-1) [    ] o.a.s.c.SolrResourceLoader Adding 'file:/x1/jenkins/jenkins-slave/workspace/Lucene-Solr-Tests-5.5-Java7/solr/core/src/test-files/solr/collection1/lib/README' to classloader
   [junit4]   2> 382954 INFO  (coreLoadExecutor-729-thread-1) [    ] o.a.s.c.SolrConfig current version of requestparams : -1
   [junit4]   2> 382973 INFO  (coreLoadExecutor-729-thread-1) [    ] o.a.s.c.SolrConfig Using Lucene MatchVersion: 5.5.0
   [junit4]   2> 383014 INFO  (coreLoadExecutor-729-thread-1) [    ] o.a.s.c.SolrConfig Loaded SolrConfig: solrconfig.xml
   [junit4]   2> 383021 INFO  (coreLoadExecutor-729-thread-1) [    ] o.a.s.s.IndexSchema [collection1] Schema name=test
   [junit4]   2> 383219 INFO  (coreLoadExecutor-729-thread-1) [    ] o.a.s.s.IndexSchema default search field in schema is text
   [junit4]   2> 383221 INFO  (coreLoadExecutor-729-thread-1) [    ] o.a.s.s.IndexSchema unique key field: id
   [junit4]   2> 383221 WARN  (coreLoadExecutor-729-thread-1) [    ] o.a.s.s.IndexSchema Field text is not multivalued and destination for multiple copyFields (2)
   [junit4]   2> 383228 INFO  (coreLoadExecutor-729-thread-1) [    ] o.a.s.s.FileExchangeRateProvider Reloading exchange rates from file currency.xml
   [junit4]   2> 383231 INFO  (coreLoadExecutor-729-thread-1) [    ] o.a.s.s.FileExchangeRateProvider Reloading exchange rates from file currency.xml
   [junit4]   2> 383234 INFO  (coreLoadExecutor-729-thread-1) [    ] o.a.s.c.ConfigSetProperties Did not find ConfigSet properties, assuming default properties: Can't find resource 'configsetprops.json' in classpath or '/x1/jenkins/jenkins-slave/workspace/Lucene-Solr-Tests-5.5-Java7/solr/core/src/test-files/solr/collection1'
   [junit4]   2> 383234 INFO  (coreLoadExecutor-729-thread-1) [    ] o.a.s.c.CoreContainer Creating SolrCore 'collection1' using configuration from instancedir /x1/jenkins/jenkins-slave/workspace/Lucene-Solr-Tests-5.5-Java7/solr/core/src/test-files/solr/collection1
   [junit4]   2> 383235 INFO  (coreLoadExecutor-729-thread-1) [    x:collection1] o.a.s.c.SolrCore org.apache.solr.core.MockFSDirectoryFactory
   [junit4]   2> 383236 INFO  (coreLoadExecutor-729-thread-1) [    x:collection1] o.a.s.c.SolrCore [[collection1] ] Opening new SolrCore at [/x1/jenkins/jenkins-slave/workspace/Lucene-Solr-Tests-5.5-Java7/solr/core/src/test-files/solr/collection1], dataDir=[/x1/jenkins/jenkins-slave/workspace/Lucene-Solr-Tests-5.5-Java7/solr/build/solr-core/test/J2/temp/solr.update.DirectUpdateHandlerTest_7AE6C28A821C56DC-001/init-core-data-001/]
   [junit4]   2> 383236 INFO  (coreLoadExecutor-729-thread-1) [    x:collection1] o.a.s.c.JmxMonitoredMap JMX monitoring is enabled. Adding Solr mbeans to JMX Server: com.sun.jmx.mbeanserver.JmxMBeanServer@4ced1dfe
   [junit4]   2> 383239 INFO  (coreLoadExecutor-729-thread-1) [    x:collection1] o.a.s.c.CachingDirectoryFactory return new directory for /x1/jenkins/jenkins-slave/workspace/Lucene-Solr-Tests-5.5-Java7/solr/build/solr-core/test/J2/temp/solr.update.DirectUpdateHandlerTest_7AE6C28A821C56DC-001/init-core-data-001
   [junit4]   2> 383239 INFO  (coreLoadExecutor-729-thread-1) [    x:collection1] o.a.s.c.SolrCore New index directory detected: old=null new=/x1/jenkins/jenkins-slave/workspace/Lucene-Solr-Tests-5.5-Java7/solr/build/solr-core/test/J2/temp/solr.update.DirectUpdateHandlerTest_7AE6C28A821C56DC-001/init-core-data-001/index/
   [junit4]   2> 383239 WARN  (coreLoadExecutor-729-thread-1) [    x:collection1] o.a.s.c.SolrCore [collection1] Solr index directory '/x1/jenkins/jenkins-slave/workspace/Lucene-Solr-Tests-5.5-Java7/solr/build/solr-core/test/J2/temp/solr.update.DirectUpdateHandlerTest_7AE6C28A821C56DC-001/init-core-data-001/index' doesn't exist. Creating new index...
   [junit4]   2> 383240 INFO  (coreLoadExecutor-729-thread-1) [    x:collection1] o.a.s.c.CachingDirectoryFactory return new directory for /x1/jenkins/jenkins-slave/workspace/Lucene-Solr-Tests-5.5-Java7/solr/build/solr-core/test/J2/temp/solr.update.DirectUpdateHandlerTest_7AE6C28A821C56DC-001/init-core-data-001/index
   [junit4]   2> 383240 INFO  (coreLoadExecutor-729-thread-1) [    x:collection1] o.a.s.u.RandomMergePolicy RandomMergePolicy wrapping class org.apache.lucene.index.TieredMergePolicy: [TieredMergePolicy: maxMergeAtOnce=30, maxMergeAtOnceExplicit=31, maxMergedSegmentMB=97.7197265625, floorSegmentMB=2.0830078125, forceMergeDeletesPctAllowed=3.1405841883709917, segmentsPerTier=24.0, maxCFSSegmentSizeMB=8.796093022207999E12, noCFSRatio=0.79009928097331
   [junit4]   2> 383248 INFO  (coreLoadExecutor-729-thread-1) [    x:collection1] o.a.s.c.SolrDeletionPolicy SolrDeletionPolicy.onCommit: commits: num=1
   [junit4]   2> 	commit{dir=MockDirectoryWrapper(NIOFSDirectory@/x1/jenkins/jenkins-slave/workspace/Lucene-Solr-Tests-5.5-Java7/solr/build/solr-core/test/J2/temp/solr.update.DirectUpdateHandlerTest_7AE6C28A821C56DC-001/init-core-data-001/index lockFactory=org.apache.lucene.store.SingleInstanceLockFactory@2100e09d),segFN=segments_1,generation=1}
   [junit4]   2> 383248 INFO  (coreLoadExecutor-729-thread-1) [    x:collection1] o.a.s.c.SolrDeletionPolicy newest commit generation = 1
   [junit4]   2> 383249 INFO  (OldIndexDirectoryCleanupThreadForCore-collection1) [    x:collection1] o.a.s.c.SolrCore Looking for old index directories to cleanup for core collection1 in /x1/jenkins/jenkins-slave/workspace/Lucene-Solr-Tests-5.5-Java7/solr/build/solr-core/test/J2/temp/solr.update.DirectUpdateHandlerTest_7AE6C28A821C56DC-001/init-core-data-001/
   [junit4]   2> 383255 INFO  (coreLoadExecutor-729-thread-1) [    x:collection1] o.a.s.u.p.UpdateRequestProcessorChain creating updateRequestProcessorChain "dedupe"
   [junit4]   2> 383255 INFO  (coreLoadExecutor-729-thread-1) [    x:collection1] o.a.s.u.p.UpdateRequestProcessorChain inserting DistributedUpdateProcessorFactory into updateRequestProcessorChain "dedupe"
   [junit4]   2> 383255 INFO  (coreLoadExecutor-729-thread-1) [    x:collection1] o.a.s.u.p.UpdateRequestProcessorChain creating updateRequestProcessorChain "dedupe-allfields"
   [junit4]   2> 383256 INFO  (coreLoadExecutor-729-thread-1) [    x:collection1] o.a.s.u.p.UpdateRequestProcessorChain inserting DistributedUpdateProcessorFactory into updateRequestProcessorChain "dedupe-allfields"
   [junit4]   2> 383256 INFO  (coreLoadExecutor-729-thread-1) [    x:collection1] o.a.s.u.p.UpdateRequestProcessorChain creating updateRequestProcessorChain "stored_sig"
   [junit4]   2> 383256 INFO  (coreLoadExecutor-729-thread-1) [    x:collection1] o.a.s.u.p.UpdateRequestProcessorChain inserting DistributedUpdateProcessorFactory into updateRequestProcessorChain "stored_sig"
   [junit4]   2> 383256 INFO  (coreLoadExecutor-729-thread-1) [    x:collection1] o.a.s.u.p.UpdateRequestProcessorChain creating updateRequestProcessorChain "uniq-fields"
   [junit4]   2> 383256 INFO  (coreLoadExecutor-729-thread-1) [    x:collection1] o.a.s.u.p.UpdateRequestProcessorChain inserting DistributedUpdateProcessorFactory into updateRequestProcessorChain "uniq-fields"
   [junit4]   2> 383256 INFO  (coreLoadExecutor-729-thread-1) [    x:collection1] o.a.s.u.p.UpdateRequestProcessorChain creating updateRequestProcessorChain "distrib-dup-test-chain-explicit"
   [junit4]   2> 383257 INFO  (coreLoadExecutor-729-thread-1) [    x:collection1] o.a.s.u.p.UpdateRequestProcessorChain creating updateRequestProcessorChain "distrib-dup-test-chain-implicit"
   [junit4]   2> 383257 INFO  (coreLoadExecutor-729-thread-1) [    x:collection1] o.a.s.u.p.UpdateRequestProcessorChain inserting DistributedUpdateProcessorFactory into updateRequestProcessorChain "distrib-dup-test-chain-implicit"
   [junit4]   2> 383257 INFO  (coreLoadExecutor-729-thread-1) [    x:collection1] o.a.s.c.SolrCore no updateRequestProcessorChain defined as default, creating implicit default
   [junit4]   2> 383262 INFO  (coreLoadExecutor-729-thread-1) [    x:collection1] o.a.s.h.l.XMLLoader xsltCacheLifetimeSeconds=60
   [junit4]   2> 383264 INFO  (coreLoadExecutor-729-thread-1) [    x:collection1] o.a.s.h.l.XMLLoader xsltCacheLifetimeSeconds=60
   [junit4]   2> 383265 INFO  (coreLoadExecutor-729-thread-1) [    x:collection1] o.a.s.h.l.XMLLoader xsltCacheLifetimeSeconds=60
   [junit4]   2> 383266 INFO  (coreLoadExecutor-729-thread-1) [    x:collection1] o.a.s.h.l.XMLLoader xsltCacheLifetimeSeconds=60
   [junit4]   2> 383272 INFO  (coreLoadExecutor-729-thread-1) [    x:collection1] o.a.s.c.PluginBag requestHandler : 'lazy' created with startup=lazy 
   [junit4]   2> 383274 INFO  (coreLoadExecutor-729-thread-1) [    x:collection1] o.a.s.c.RequestHandlers Registered paths: /admin/properties,/terms,lazy,/admin/mbeans,spellCheckCompRH1,mltrh,defaults,/config,spellCheckCompRH,/admin/file,spellCheckCompRH_Direct,dismax,/admin/system,/update/csv,tvrh,spellCheckWithWordbreak_Direct,/admin/segments,mock,/admin/ping,/get,/admin/logging,/admin/plugins,/update,/admin/threads,/replication,/admin/luke,/mlt,/search-facet-invariants,/search-facet-def,/update/json/docs,spellCheckWithWordbreak,/debug/dump,standard,/schema,/update/json
   [junit4]   2> 383275 WARN  (coreLoadExecutor-729-thread-1) [    x:collection1] o.a.s.c.SolrCore solrconfig.xml uses deprecated <admin/gettableFiles>, Please update your config to use the ShowFileRequestHandler.
   [junit4]   2> 383276 INFO  (coreLoadExecutor-729-thread-1) [    x:collection1] o.a.s.c.SolrCore Using default statsCache cache: org.apache.solr.search.stats.LocalStatsCache
   [junit4]   2> 383277 INFO  (coreLoadExecutor-729-thread-1) [    x:collection1] o.a.s.u.CommitTracker Hard AutoCommit: disabled
   [junit4]   2> 383277 INFO  (coreLoadExecutor-729-thread-1) [    x:collection1] o.a.s.u.CommitTracker Soft AutoCommit: disabled
   [junit4]   2> 383278 INFO  (coreLoadExecutor-729-thread-1) [    x:collection1] o.a.s.u.RandomMergePolicy RandomMergePolicy wrapping class org.apache.lucene.index.LogDocMergePolicy: [LogDocMergePolicy: minMergeSize=1000, mergeFactor=30, maxMergeSize=9223372036854775807, maxMergeSizeForForcedMerge=9223372036854775807, calibrateSizeByDeletes=true, maxMergeDocs=2147483647, maxCFSSegmentSizeMB=8.796093022207999E12, noCFSRatio=1.0]
   [junit4]   2> 383282 INFO  (coreLoadExecutor-729-thread-1) [    x:collection1] o.a.s.c.SolrDeletionPolicy SolrDeletionPolicy.onInit: commits: num=1
   [junit4]   2> 	commit{dir=MockDirectoryWrapper(NIOFSDirectory@/x1/jenkins/jenkins-slave/workspace/Lucene-Solr-Tests-5.5-Java7/solr/build/solr-core/test/J2/temp/solr.update.DirectUpdateHandlerTest_7AE6C28A821C56DC-001/init-core-data-001/index lockFactory=org.apache.lucene.store.SingleInstanceLockFactory@2100e09d),segFN=segments_1,generation=1}
   [junit4]   2> 383282 INFO  (coreLoadExecutor-729-thread-1) [    x:collection1] o.a.s.c.SolrDeletionPolicy newest commit generation = 1
   [junit4]   2> 383282 INFO  (coreLoadExecutor-729-thread-1) [    x:collection1] o.a.s.s.SolrIndexSearcher Opening Searcher@3feaaa9b[collection1] main
   [junit4]   2> 383283 INFO  (coreLoadExecutor-729-thread-1) [    x:collection1] o.a.s.r.RestManager Initializing RestManager with initArgs: {storageIO=org.apache.solr.rest.ManagedResourceStorage$InMemoryStorageIO}
   [junit4]   2> 383283 INFO  (coreLoadExecutor-729-thread-1) [    x:collection1] o.a.s.r.ManagedResourceStorage Reading _rest_managed.json using InMemoryStorage
   [junit4]   2> 383283 INFO  (coreLoadExecutor-729-thread-1) [    x:collection1] o.a.s.r.RestManager Initializing 0 registered ManagedResources
   [junit4]   2> 383283 INFO  (coreLoadExecutor-729-thread-1) [    x:collection1] o.a.s.h.c.SpellCheckComponent Initializing spell checkers
   [junit4]   2> 383290 INFO  (coreLoadExecutor-729-thread-1) [    x:collection1] o.a.s.s.DirectSolrSpellChecker init: {name=direct,classname=DirectSolrSpellChecker,field=lowerfilt,minQueryLength=3}
   [junit4]   2> 383325 INFO  (coreLoadExecutor-729-thread-1) [    x:collection1] o.a.s.h.ReplicationHandler Commits will be reserved for  10000
   [junit4]   2> 383326 INFO  (searcherExecutor-730-thread-1-processing-x:collection1) [    x:collection1] o.a.s.h.c.SpellCheckComponent Loading spell index for spellchecker: default
   [junit4]   2> 383327 INFO  (searcherExecutor-730-thread-1-processing-x:collection1) [    x:collection1] o.a.s.h.c.SpellCheckComponent Loading spell index for spellchecker: direct
   [junit4]   2> 383327 INFO  (searcherExecutor-730-thread-1-processing-x:collection1) [    x:collection1] o.a.s.h.c.SpellCheckComponent Loading spell index for spellchecker: wordbreak
   [junit4]   2> 383327 INFO  (searcherExecutor-730-thread-1-processing-x:collection1) [    x:collection1] o.a.s.h.c.SpellCheckComponent Loading spell index for spellchecker: multipleFields
   [junit4]   2> 383327 INFO  (searcherExecutor-730-thread-1-processing-x:collection1) [    x:collection1] o.a.s.h.c.SpellCheckComponent Loading spell index for spellchecker: jarowinkler
   [junit4]   2> 383327 INFO  (coreLoadExecutor-729-thread-1) [    x:collection1] o.a.s.c.CoreContainer registering core: collection1
   [junit4]   2> 383328 INFO  (searcherExecutor-730-thread-1-processing-x:collection1) [    x:collection1] o.a.s.h.c.SpellCheckComponent Loading spell index for spellchecker: external
   [junit4]   2> 383328 INFO  (searcherExecutor-730-thread-1-processing-x:collection1) [    x:collection1] o.a.s.h.c.SpellCheckComponent Loading spell index for spellchecker: freq
   [junit4]   2> 383329 INFO  (searcherExecutor-730-thread-1-processing-x:collection1) [    x:collection1] o.a.s.h.c.SpellCheckComponent Loading spell index for spellchecker: fqcn
   [junit4]   2> 383329 INFO  (SUITE-DirectUpdateHandlerTest-seed#[7AE6C28A821C56DC]-worker) [    ] o.a.s.SolrTestCaseJ4 ####initCore end
   [junit4]   2> 383329 INFO  (searcherExecutor-730-thread-1-processing-x:collection1) [    x:collection1] o.a.s.h.c.SpellCheckComponent Loading spell index for spellchecker: perDict
   [junit4]   2> 383330 INFO  (searcherExecutor-730-thread-1-processing-x:collection1) [    x:collection1] o.a.s.c.SolrCore [collection1] Registered new searcher Searcher@3feaaa9b[collection1] main{ExitableDirectoryReader(UninvertingDirectoryReader())}
   [junit4]   2> 383334 INFO  (TEST-DirectUpdateHandlerTest.testPrepareCommit-seed#[7AE6C28A821C56DC]) [    ] o.a.s.SolrTestCaseJ4 ###Starting testPrepareCommit
   [junit4]   2> 383334 INFO  (TEST-DirectUpdateHandlerTest.testPrepareCommit-seed#[7AE6C28A821C56DC]) [    ] o.a.s.u.DirectUpdateHandler2 [collection1] REMOVING ALL DOCUMENTS FROM INDEX
   [junit4]   2> 383335 INFO  (TEST-DirectUpdateHandlerTest.testPrepareCommit-seed#[7AE6C28A821C56DC]) [    ] o.a.s.u.p.LogUpdateProcessorFactory [collection1]  webapp=null path=null params={}{deleteByQuery=*:*} 0 1
   [junit4]   2> 383338 INFO  (TEST-DirectUpdateHandlerTest.testPrepareCommit-seed#[7AE6C28A821C56DC]) [    ] o.a.s.u.DirectUpdateHandler2 start commit{,optimize=false,openSearcher=true,waitSearcher=true,expungeDeletes=false,softCommit=false,prepareCommit=false}
   [junit4]   2> 383346 INFO  (TEST-DirectUpdateHandlerTest.testPrepareCommit-seed#[7AE6C28A821C56DC]) [    ] o.a.s.c.SolrDeletionPolicy SolrDeletionPolicy.onCommit: commits: num=2
   [junit4]   2> 	commit{dir=MockDirectoryWrapper(NIOFSDirectory@/x1/jenkins/jenkins-slave/workspace/Lucene-Solr-Tests-5.5-Java7/solr/build/solr-core/test/J2/temp/solr.update.DirectUpdateHandlerTest_7AE6C28A821C56DC-001/init-core-data-001/index lockFactory=org.apache.lucene.store.SingleInstanceLockFactory@2100e09d),segFN=segments_1,generation=1}
   [junit4]   2> 	commit{dir=MockDirectoryWrapper(NIOFSDirectory@/x1/jenkins/jenkins-slave/workspace/Lucene-Solr-Tests-5.5-Java7/solr/build/solr-core/test/J2/temp/solr.update.DirectUpdateHandlerTest_7AE6C28A821C56DC-001/init-core-data-001/index lockFactory=org.apache.lucene.store.SingleInstanceLockFactory@2100e09d),segFN=segments_2,generation=2}
   [junit4]   2> 383347 INFO  (TEST-DirectUpdateHandlerTest.testPrepareCommit-seed#[7AE6C28A821C56DC]) [    ] o.a.s.c.SolrDeletionPolicy newest commit generation = 2
   [junit4]   2> 383348 INFO  (TEST-DirectUpdateHandlerTest.testPrepareCommit-seed#[7AE6C28A821C56DC]) [    ] o.a.s.s.SolrIndexSearcher Opening Searcher@6802b6dd[collection1] main
   [junit4]   2> 383348 INFO  (TEST-DirectUpdateHandlerTest.testPrepareCommit-seed#[7AE6C28A821C56DC]) [    ] o.a.s.u.DirectUpdateHandler2 end_commit_flush
   [junit4]   2> 383350 INFO  (searcherExecutor-730-thread-1) [    ] o.a.s.c.SolrCore [collection1] Registered new searcher Searcher@6802b6dd[collection1] main{ExitableDirectoryReader(UninvertingDirectoryReader())}
   [junit4]   2> 383350 INFO  (TEST-DirectUpdateHandlerTest.testPrepareCommit-seed#[7AE6C28A821C56DC]) [    ] o.a.s.u.p.LogUpdateProcessorFactory [collection1]  webapp=null path=null params={}{commit=} 0 11
   [junit4]   2> 383352 INFO  (TEST-DirectUpdateHandlerTest.testPrepareCommit-seed#[7AE6C28A821C56DC]) [    ] o.a.s.u.p.LogUpdateProcessorFactory [collection1]  webapp=null path=null params={}{add=[999]} 0 1
   [junit4]   2> 383353 INFO  (TEST-DirectUpdateHandlerTest.testPrepareCommit-seed#[7AE6C28A821C56DC]) [    ] o.a.s.u.DirectUpdateHandler2 start commit{,optimize=true,openSearcher=true,waitSearcher=true,expungeDeletes=false,softCommit=false,prepareCommit=false}
   [junit4]   2> 383353 WARN  (TEST-DirectUpdateHandlerTest.testPrepareCommit-seed#[7AE6C28A821C56DC]) [    ] o.a.s.u.DirectUpdateHandler2 Starting optimize... Reading and rewriting the entire index! Use with care.
   [junit4]   2> 383368 INFO  (TEST-DirectUpdateHandlerTest.testPrepareCommit-seed#[7AE6C28A821C56DC]) [    ] o.a.s.c.SolrDeletionPolicy SolrDeletionPolicy.onCommit: commits: num=2
   [junit4]   2> 	commit{dir=MockDirectoryWrapper(NIOFSDirectory@/x1/jenkins/jenkins-slave/workspace/Lucene-Solr-Tests-5.5-Java7/solr/build/solr-core/test/J2/temp/solr.update.DirectUpdateHandlerTest_7AE6C28A821C56DC-001/init-core-data-001/index lockFactory=org.apache.lucene.store.SingleInstanceLockFactory@2100e09d),segFN=segments_2,generation=2}
   [junit4]   2> 	commit{dir=MockDirectoryWrapper(NIOFSDirectory@/x1/jenkins/jenkins-slave/workspace/Lucene-Solr-Tests-5.5-Java7/solr/build/solr-core/test/J2/temp/solr.update.DirectUpdateHandlerTest_7AE6C28A821C56DC-001/init-core-data-001/index lockFactory=org.apache.lucene.store.SingleInstanceLockFactory@2100e09d),segFN=segments_3,generation=3}
   [junit4]   2> 383368 INFO  (TEST-DirectUpdateHandlerTest.testPrepareCommit-seed#[7AE6C28A821C56DC]) [    ] o.a.s.c.SolrDeletionPolicy newest commit generation = 3
   [junit4]   2> 383374 INFO  (TEST-DirectUpdateHandlerTest.testPrepareCommit-seed#[7AE6C28A821C56DC]) [    ] o.a.s.s.SolrIndexSearcher Opening Searcher@76ca21f6[collection1] main
   [junit4]   2> 383374 INFO  (TEST-DirectUpdateHandlerTest.testPrepareCommit-seed#[7AE6C28A821C56DC]) [    ] o.a.s.u.DirectUpdateHandler2 end_commit_flush
   [junit4]   2> 383376 INFO  (searcherExecutor-730-thread-1) [    ] o.a.s.c.SolrCore [collection1] Registered new searcher Searcher@76ca21f6[collection1] main{ExitableDirectoryReader(UninvertingDirectoryReader(Uninverting(_0(5.5.0):c1)))}
   [junit4]   2> 383376 INFO  (TEST-DirectUpdateHandlerTest.testPrepareCommit-seed#[7AE6C28A821C56DC]) [    ] o.a.s.u.p.LogUpdateProcessorFactory [collection1]  webapp=null path=null params={}{optimize=} 0 22
   [junit4]   2> 383378 INFO  (TEST-DirectUpdateHandlerTest.testPrepareCommit-seed#[7AE6C28A821C56DC]) [    ] o.a.s.u.DirectUpdateHandler2 start commit{,optimize=false,openSearcher=true,waitSearcher=true,expungeDeletes=false,softCommit=false,prepareCommit=false}
   [junit4]   2> 383378 INFO  (TEST-DirectUpdateHandlerTest.testPrepareCommit-seed#[7AE6C28A821C56DC]) [    ] o.a.s.u.DirectUpdateHandler2 No uncommitted changes. Skipping IW.commit.
   [junit4]   2> 383378 INFO  (TEST-DirectUpdateHandlerTest.testPrepareCommit-seed#[7AE6C28A821C56DC]) [    ] o.a.s.c.SolrCore SolrIndexSearcher has not changed - not re-opening: org.apache.solr.search.SolrIndexSearcher
   [junit4]   2> 383378 INFO  (TEST-DirectUpdateHandlerTest.testPrepareCommit-seed#[7AE6C28A821C56DC]) [    ] o.a.s.u.DirectUpdateHandler2 end_commit_flush
   [junit4]   2> 383378 INFO  (TEST-DirectUpdateHandlerTest.testPrepareCommit-seed#[7AE6C28A821C56DC]) [    ] o.a.s.u.p.LogUpdateProcessorFactory [collection1]  webapp=null path=null params={}{commit=} 0 0
   [junit4]   2> 383379 INFO  (TEST-DirectUpdateHandlerTest.testPrepareCommit-seed#[7AE6C28A821C56DC]) [    ] o.a.s.u.DirectUpdateHandlerTest FILES before addDoc=[_0.si, segments_3, _0.cfs, _0.cfe]
   [junit4]   2> 383381 INFO  (TEST-DirectUpdateHandlerTest.testPrepareCommit-seed#[7AE6C28A821C56DC]) [    ] o.a.s.u.p.LogUpdateProcessorFactory [collection1]  webapp=null path=null params={}{add=[1]} 0 1
   [junit4]   2> 383382 INFO  (TEST-DirectUpdateHandlerTest.testPrepareCommit-seed#[7AE6C28A821C56DC]) [    ] o.a.s.u.DirectUpdateHandlerTest FILES before prepareCommit=[_0.si, segments_3, _1.fdx, _0.cfs, _1.fdt, _0.cfe]
   [junit4]   2> 383382 INFO  (TEST-DirectUpdateHandlerTest.testPrepareCommit-seed#[7AE6C28A821C56DC]) [    ] o.a.s.u.DirectUpdateHandler2 start commit{,optimize=false,openSearcher=true,waitSearcher=true,expungeDeletes=false,softCommit=false,prepareCommit=true}
   [junit4]   2> 383415 INFO  (TEST-DirectUpdateHandlerTest.testPrepareCommit-seed#[7AE6C28A821C56DC]) [    ] o.a.s.u.DirectUpdateHandler2 end_prepareCommit
   [junit4]   2> 383416 INFO  (TEST-DirectUpdateHandlerTest.testPrepareCommit-seed#[7AE6C28A821C56DC]) [    ] o.a.s.u.p.LogUpdateProcessorFactory [collection1]  webapp=null path=null params={prepareCommit=true&wt=json&indent=true}{commit=} 0 33
   [junit4]   2> 383416 INFO  (TEST-DirectUpdateHandlerTest.testPrepareCommit-seed#[7AE6C28A821C56DC]) [    ] o.a.s.u.DirectUpdateHandlerTest FILES after prepareCommit=[_1.si, _0.si, segments_3, _1.cfe, _0.cfs, _1.cfs, pending_segments_4, _0.cfe]
   [junit4]   2> 383417 INFO  (TEST-DirectUpdateHandlerTest.testPrepareCommit-seed#[7AE6C28A821C56DC]) [    ] o.a.s.c.S.Request [collection1]  webapp=null path=null params={wt=xml&q=id:1} hits=0 status=0 QTime=1
   [junit4]   2> 383418 INFO  (TEST-DirectUpdateHandlerTest.testPrepareCommit-seed#[7AE6C28A821C56DC]) [    ] o.a.s.u.DirectUpdateHandler2 start rollback{}
   [junit4]   2> 383418 INFO  (TEST-DirectUpdateHandlerTest.testPrepareCommit-seed#[7AE6C28A821C56DC]) [    ] o.a.s.u.DefaultSolrCoreState Rollback old IndexWriter... core=collection1
   [junit4]   2> 383419 INFO  (TEST-DirectUpdateHandlerTest.testPrepareCommit-seed#[7AE6C28A821C56DC]) [    ] o.a.s.u.RandomMergePolicy RandomMergePolicy wrapping class org.apache.lucene.index.TieredMergePolicy: [TieredMergePolicy: maxMergeAtOnce=20, maxMergeAtOnceExplicit=40, maxMergedSegmentMB=47.134765625, floorSegmentMB=1.6669921875, forceMergeDeletesPctAllowed=20.918829024725884, segmentsPerTier=25.0, maxCFSSegmentSizeMB=8.796093022207999E12, noCFSRatio=0.589653337110517
   [junit4]   2> 383422 INFO  (TEST-DirectUpdateHandlerTest.testPrepareCommit-seed#[7AE6C28A821C56DC]) [    ] o.a.s.c.SolrDeletionPolicy SolrDeletionPolicy.onInit: commits: num=1
   [junit4]   2> 	commit{dir=MockDirectoryWrapper(NIOFSDirectory@/x1/jenkins/jenkins-slave/workspace/Lucene-Solr-Tests-5.5-Java7/solr/build/solr-core/test/J2/temp/solr.update.DirectUpdateHandlerTest_7AE6C28A821C56DC-001/init-core-data-001/index lockFactory=org.apache.lucene.store.SingleInstanceLockFactory@2100e09d),segFN=segments_3,generation=3}
   [junit4]   2> 383422 INFO  (TEST-DirectUpdateHandlerTest.testPrepareCommit-seed#[7AE6C28A821C56DC]) [    ] o.a.s.c.SolrDeletionPolicy newest commit generation = 3
   [junit4]   2> 383422 INFO  (TEST-DirectUpdateHandlerTest.testPrepareCommit-seed#[7AE6C28A821C56DC]) [    ] o.a.s.u.DefaultSolrCoreState New IndexWriter is ready to be used.
   [junit4]   2> 383422 INFO  (TEST-DirectUpdateHandlerTest.testPrepareCommit-seed#[7AE6C28A821C56DC]) [    ] o.a.s.u.DirectUpdateHandler2 end_rollback
   [junit4]   2> 383422 INFO  (TEST-DirectUpdateHandlerTest.testPrepareCommit-seed#[7AE6C28A821C56DC]) [    ] o.a.s.u.p.LogUpdateProcessorFactory [collection1]  webapp=null path=null params={rollback=true&wt=json&indent=true}{rollback=} 0 5
   [junit4]   2> 383423 INFO  (TEST-DirectUpdateHandlerTest.testPrepareCommit-seed#[7AE6C28A821C56DC]) [    ] o.a.s.u.DirectUpdateHandler2 start commit{,optimize=false,openSearcher=true,waitSearcher=true,expungeDeletes=false,softCommit=false,prepareCommit=false}
   [junit4]   2> 383423 INFO  (TEST-DirectUpdateHandlerTest.testPrepareCommit-seed#[7AE6C28A821C56DC]) [    ] o.a.s.u.DirectUpdateHandler2 No uncommitted changes. Skipping IW.commit.
   [junit4]   2> 383425 INFO  (TEST-DirectUpdateHandlerTest.testPrepareCommit-seed#[7AE6C28A821C56DC]) [    ] o.a.s.s.SolrIndexSearcher Opening Searcher@6d9da84f[collection1] main
   [junit4]   2> 383425 INFO  (TEST-DirectUpdateHandlerTest.testPrepareCommit-seed#[7AE6C28A821C56DC]) [    ] o.a.s.u.DirectUpdateHandler2 end_commit_flush
   [junit4]   2> 383428 INFO  (searcherExecutor-730-thread-1) [    ] o.a.s.c.SolrCore [collection1] Registered new searcher Searcher@6d9da84f[collection1] main{ExitableDirectoryReader(UninvertingDirectoryReader(Uninverting(_0(5.5.0):c1)))}
   [junit4]   2> 383428 INFO  (TEST-DirectUpdateHandlerTest.testPrepareCommit-seed#[7AE6C28A821C56DC]) [    ] o.a.s.u.p.LogUpdateProcessorFactory [collection1]  webapp=null path=null params={}{commit=} 0 5
   [junit4]   2> 383430 INFO  (TEST-DirectUpdateHandlerTest.testPrepareCommit-seed#[7AE6C28A821C56DC]) [    ] o.a.s.c.S.Request [collection1]  webapp=null path=null params={wt=xml&q=id:1} hits=0 status=0 QTime=0
   [junit4]   2> 383431 INFO  (TEST-DirectUpdateHandlerTest.testPrepareCommit-seed#[7AE6C28A821C56DC]) [    ] o.a.s.u.p.LogUpdateProcessorFactory [collection1]  webapp=null path=null params={}{add=[1]} 0 1
   [junit4]   2> 383432 INFO  (TEST-DirectUpdateHandlerTest.testPrepareCommit-seed#[7AE6C28A821C56DC]) [    ] o.a.s.u.DirectUpdateHandler2 start commit{,optimize=false,openSearcher=true,waitSearcher=true,expungeDeletes=false,softCommit=false,prepareCommit=true}
   [junit4]   2> 383451 INFO  (TEST-DirectUpdateHandlerTest.testPrepareCommit-seed#[7AE6C28A821C56DC]) [    ] o.a.s.u.DirectUpdateHandler2 end_prepareCommit
   [junit4]   2> 383451 INFO  (TEST-DirectUpdateHandlerTest.testPrepareCommit-seed#[7AE6C28A821C56DC]) [    ] o.a.s.u.p.LogUpdateProcessorFactory [collection1]  webapp=null path=null params={prepareCommit=true&wt=json&indent=true}{commit=} 0 19
   [junit4]   2> 383452 INFO  (TEST-DirectUpdateHandlerTest.testPrepareCommit-seed#[7AE6C28A821C56DC]) [    ] o.a.s.c.S.Request [collection1]  webapp=null path=null params={wt=xml&q=id:1} hits=0 status=0 QTime=0
   [junit4]   2> 383452 INFO  (TEST-DirectUpdateHandlerTest.testPrepareCommit-seed#[7AE6C28A821C56DC]) [    ] o.a.s.u.DirectUpdateHandler2 start commit{,optimize=false,openSearcher=true,waitSearcher=true,expungeDeletes=false,softCommit=false,prepareCommit=false}
   [junit4]   2> 383453 INFO  (TEST-DirectUpdateHandlerTest.testPrepareCommit-seed#[7AE6C28A821C56DC]) [    ] o.a.s.c.SolrDeletionPolicy SolrDeletionPolicy.onCommit: commits: num=2
   [junit4]   2> 	commit{dir=MockDirectoryWrapper(NIOFSDirectory@/x1/jenkins/jenkins-slave/workspace/Lucene-Solr-Tests-5.5-Java7/solr/build/solr-core/test/J2/temp/solr.update.DirectUpdateHandlerTest_7AE6C28A821C56DC-001/init-core-data-001/index lockFactory=org.apache.lucene.store.SingleInstanceLockFactory@2100e09d),segFN=segments_3,generation=3}
   [junit4]   2> 	commit{dir=MockDirectoryWrapper(NIOFSDirectory@/x1/jenkins/jenkins-slave/workspace/Lucene-Solr-Tests-5.5-Java7/solr/build/solr-core/test/J2/temp/solr.update.DirectUpdateHandlerTest_7AE6C28A821C56DC-001/init-core-data-001/index lockFactory=org.apache.lucene.store.SingleInstanceLockFactory@2100e09d),segFN=segments_4,generation=4}
   [junit4]   2> 383453 INFO  (TEST-DirectUpdateHandlerTest.testPrepareCommit-seed#[7AE6C28A821C56DC]) [    ] o.a.s.c.SolrDeletionPolicy newest commit generation = 4
   [junit4]   2> 383454 INFO  (TEST-DirectUpdateHandlerTest.testPrepareCommit-seed#[7AE6C28A821C56DC]) [    ] o.a.s.s.SolrIndexSearcher Opening Searcher@75644f62[collection1] main
   [junit4]   2> 383454 INFO  (TEST-DirectUpdateHandlerTest.testPrepareCommit-seed#[7AE6C28A821C56DC]) [    ] o.a.s.u.DirectUpdateHandler2 end_commit_flush
   [junit4]   2> 383459 INFO  (searcherExecutor-730-thread-1) [    ] o.a.s.c.SolrCore [collection1] Registered new searcher Searcher@75644f62[collection1] main{ExitableDirectoryReader(UninvertingDirectoryReader(Uninverting(_0(5.5.0):c1) Uninverting(_1(5.5.0):c1)))}
   [junit4]   2> 383460 INFO  (TEST-DirectUpdateHandlerTest.testPrepareCommit-seed#[7AE6C28A821C56DC]) [    ] o.a.s.u.p.LogUpdateProcessorFactory [collection1]  webapp=null path=null params={}{commit=} 0 7
   [junit4]   2> 383462 INFO  (TEST-DirectUpdateHandlerTest.testPrepareCommit-seed#[7AE6C28A821C56DC]) [    ] o.a.s.c.S.Request [collection1]  webapp=null path=null params={wt=xml&q=id:1} hits=1 status=0 QTime=0
   [junit4]   2> 383463 INFO  (TEST-DirectUpdateHandlerTest.testPrepareCommit-seed#[7AE6C28A821C56DC]) [    ] o.a.s.SolrTestCaseJ4 ###Ending testPrepareCommit
   [junit4]   2> 383468 INFO  (TEST-DirectUpdateHandlerTest.testAddRollback-seed#[7AE6C28A821C56DC]) [    ] o.a.s.SolrTestCaseJ4 ###Starting testAddRollback
   [junit4]   2> 383468 INFO  (TEST-DirectUpdateHandlerTest.testAddRollback-seed#[7AE6C28A821C56DC]) [    ] o.a.s.u.DirectUpdateHandler2 [collection1] REMOVING ALL DOCUMENTS FROM INDEX
   [junit4]   2> 383469 INFO  (TEST-DirectUpdateHandlerTest.testAddRollback-seed#[7AE6C28A821C56DC]) [    ] o.a.s.u.p.LogUpdateProcessorFactory [collection1]  webapp=null path=null params={}{deleteByQuery=*:*} 0 0
   [junit4]   2> 383470 INFO  (TEST-DirectUpdateHandlerTest.testAddRollback-seed#[7AE6C28A821C56DC]) [    ] o.a.s.u.DirectUpdateHandler2 start commit{,optimize=false,openSearcher=true,waitSearcher=true,expungeDeletes=false,softCommit=false,prepareCommit=false}
   [junit4]   2> 383474 INFO  (TEST-DirectUpdateHandlerTest.testAddRollback-seed#[7AE6C28A821C56DC]) [    ] o.a.s.c.SolrDeletionPolicy SolrDeletionPolicy.onCommit: commits: num=2
   [junit4]   2> 	commit{dir=MockDirectoryWrapper(NIOFSDirectory@/x1/jenkins/jenkins-slave/workspace/Lucene-Solr-Tests-5.5-Java7/solr/build/solr-core/test/J2/temp/solr.update.DirectUpdateHandlerTest_7AE6C28A821C56DC-001/init-core-data-001/index lockFactory=org.apache.lucene.store.SingleInstanceLockFactory@2100e09d),segFN=segments_4,generation=4}
   [junit4]   2> 	commit{dir=MockDirectoryWrapper(NIOFSDirectory@/x1/jenkins/jenkins-slave/workspace/Lucene-Solr-Tests-5.5-Java7/solr/build/solr-core/test/J2/temp/solr.update.DirectUpdateHandlerTest_7AE6C28A821C56DC-001/init-core-data-001/index lockFactory=org.apache.lucene.store.SingleInstanceLockFactory@2100e09d),segFN=segments_5,generation=5}
   [junit4]   2> 383474 INFO  (TEST-DirectUpdateHandlerTest.testAddRollback-seed#[7AE6C28A821C56DC]) [    ] o.a.s.c.SolrDeletionPolicy newest commit generation = 5
   [junit4]   2> 383475 INFO  (TEST-DirectUpdateHandlerTest.testAddRollback-seed#[7AE6C28A821C56DC]) [    ] o.a.s.s.SolrIndexSearcher Opening Searcher@c96bb3a[collection1] main
   [junit4]   2> 383475 INFO  (TEST-DirectUpdateHandlerTest.testAddRollback-seed#[7AE6C28A821C56DC]) [    ] o.a.s.u.DirectUpdateHandler2 end_commit_flush
   [junit4]   2> 383478 INFO  (searcherExecutor-730-thread-1) [    ] o.a.s.c.SolrCore [collection1] Registered new searcher Searcher@c96bb3a[collection1] main{ExitableDirectoryReader(UninvertingDirectoryReader())}
   [junit4]   2> 383479 INFO  (TEST-DirectUpdateHandlerTest.testAddRollback-seed#[7AE6C28A821C56DC]) [    ] o.a.s.u.p.LogUpdateProcessorFactory [collection1]  webapp=null path=null params={}{commit=} 0 9
   [junit4]   2> 383480 INFO  (TEST-DirectUpdateHandlerTest.testAddRollback-seed#[7AE6C28A821C56DC]) [    ] o.a.s.SolrTestCaseJ4 ###deleteCore
   [junit4]   2> 383480 INFO  (TEST-DirectUpdateHandlerTest.testAddRollback-seed#[7AE6C28A821C56DC]) [    ] o.a.s.c.CoreContainer Shutting down CoreContainer instance=960476621
   [junit4]   2> 383481 INFO  (coreCloseExecutor-734-thread-1) [    x:collection1] o.a.s.c.SolrCore [collection1]  CLOSING SolrCore org.apache.solr.core.SolrCore@5fedc6e8
   [junit4]   2> 383481 INFO  (coreCloseExecutor-734-thread-1) [    x:collection1] o.a.s.u.DirectUpdateHandler2 closing DirectUpdateHandler2{commits=5,autocommits=0,soft autocommits=0,optimizes=1,rollbacks=1,expungeDeletes=0,docsPending=0,adds=0,deletesById=0,deletesByQuery=0,errors=0,cumulative_adds=2,cumulative_deletesById=0,cumulative_deletesByQuery=2,cumulative_errors=0}
   [junit4]   2> 383482 INFO  (coreCloseExecutor-734-thread-1) [    x:collection1] o.a.s.u.SolrCoreState Closing SolrCoreState
   [junit4]   2> 383482 INFO  (coreCloseExecutor-734-thread-1) [    x:collection1] o.a.s.u.DefaultSolrCoreState SolrCoreState ref count has reached 0 - closing IndexWriter
   [junit4]   2> 383482 INFO  (coreCloseExecutor-734-thread-1) [    x:collection1] o.a.s.u.DefaultSolrCoreState closing IndexWriter with IndexWriterCloser
   [junit4]   2> 383484 INFO  (coreCloseExecutor-734-thread-1) [    x:collection1] o.a.s.c.SolrCore [collection1] Closing main searcher on request.
   [junit4]   2> 383500 INFO  (coreCloseExecutor-734-thread-1) [    x:collection1] o.a.s.c.CachingDirectoryFactory Closing MockFSDirectoryFactory - 2 directories currently being tracked
   [junit4]   2> 383500 INFO  (coreCloseExecutor-734-thread-1) [    x:collection1] o.a.s.c.CachingDirectoryFactory looking to close /x1/jenkins/jenkins-slave/workspace/Lucene-Solr-Tests-5.5-Java7/solr/build/solr-core/test/J2/temp/solr.update.DirectUpdateHandlerTest_7AE6C28A821C56DC-001/init-core-data-001 [CachedDir<<refCount=0;path=/x1/jenkins/jenkins-slave/workspace/Lucene-Solr-Tests-5.5-Java7/solr/build/solr-core/test/J2/temp/solr.update.DirectUpdateHandlerTest_7AE6C28A821C56DC-001/init-core-data-001;done=false>>]
   [junit4]   2> 383500 INFO  (coreCloseExecutor-734-thread-1) [    x:collection1] o.a.s.c.CachingDirectoryFactory Closing directory: /x1/jenkins/jenkins-slave/workspace/Lucene-Solr-Tests-5.5-Java7/solr/build/solr-core/test/J2/temp/solr.update.DirectUpdateHandlerTest_7AE6C28A821C56DC-001/init-core-data-001
   [junit4]   2> 383500 INFO  (coreCloseExecutor-734-thread-1) [    x:collection1] o.a.s.c.CachingDirectoryFactory looking to close /x1/jenkins/jenkins-slave/workspace/Lucene-Solr-Tests-5.5-Java7/solr/build/solr-core/test/J2/temp/solr.update.DirectUpdateHandlerTest_7AE6C28A821C56DC-001/init-core-data-001/index [CachedDir<<refCount=0;path=/x1/jenkins/jenkins-slave/workspace/Lucene-Solr-Tests-5.5-Java7/solr/build/solr-core/test/J2/temp/solr.update.DirectUpdateHandlerTest_7AE6C28A821C56DC-001/init-core-data-001/index;done=false>>]
   [junit4]   2> 383500 INFO  (coreCloseExecutor-734-thread-1) [    x:collection1] o.a.s.c.CachingDirectoryFactory Closing directory: /x1/jenkins/jenkins-slave/workspace/Lucene-Solr-Tests-5.5-Java7/solr/build/solr-core/test/J2/temp/solr.update.DirectUpdateHandlerTest_7AE6C28A821C56DC-001/init-core-data-001/index
   [junit4]   2> 383511 INFO  (TEST-DirectUpdateHandlerTest.testAddRollback-seed#[7AE6C28A821C56DC]) [    ] o.a.s.SolrTestCaseJ4 ####initCore
   [junit4]   2> 383511 INFO  (TEST-DirectUpdateHandlerTest.testAddRollback-seed#[7AE6C28A821C56DC]) [    ] o.a.s.c.SolrResourceLoader new SolrResourceLoader for directory: '/x1/jenkins/jenkins-slave/workspace/Lucene-Solr-Tests-5.5-Java7/solr/core/src/test-files/solr/collection1'
   [junit4]   2> 383511 INFO  (TEST-DirectUpdateHandlerTest.testAddRollback-seed#[7AE6C28A821C56DC]) [    ] o.a.s.c.SolrResourceLoader JNDI not configured for solr (NoInitialContextEx)
   [junit4]   2> 383511 INFO  (TEST-DirectUpdateHandlerTest.testAddRollback-seed#[7AE6C28A821C56DC]) [    ] o.a.s.c.SolrResourceLoader using system property solr.solr.home: /x1/jenkins/jenkins-slave/workspace/Lucene-Solr-Tests-5.5-Java7/solr/core/src/test-files/solr
   [junit4]   2> 383511 INFO  (TEST-DirectUpdateHandlerTest.testAddRollback-seed#[7AE6C28A821C56DC]) [    ] o.a.s.c.SolrResourceLoader Adding 'file:/x1/jenkins/jenkins-slave/workspace/Lucene-Solr-Tests-5.5-Java7/solr/core/src/test-files/solr/collection1/lib/classes/' to classloader
   [junit4]   2> 383512 INFO  (TEST-DirectUpdateHandlerTest.testAddRollback-seed#[7AE6C28A821C56DC]) [    ] o.a.s.c.SolrResourceLoader Adding 'file:/x1/jenkins/jenkins-slave/workspace/Lucene-Solr-Tests-5.5-Java7/solr/core/src/test-files/solr/collection1/lib/README' to classloader
   [junit4]   2> 383553 INFO  (TEST-DirectUpdateHandlerTest.testAddRollback-seed#[7AE6C28A821C56DC]) [    ] o.a.s.c.SolrConfig current version of requestparams : -1
   [junit4]   2> 383572 INFO  (TEST-DirectUpdateHandlerTest.testAddRollback-seed#[7AE6C28A821C56DC]) [    ] o.a.s.c.SolrConfig Using Lucene MatchVersion: 5.5.0
   [junit4]   2> 383617 INFO  (TEST-DirectUpdateHandlerTest.testAddRollback-seed#[7AE6C28A821C56DC]) [    ] o.a.s.c.SolrConfig Loaded SolrConfig: solrconfig.xml
   [junit4]   2> 383625 INFO  (TEST-DirectUpdateHandlerTest.testAddRollback-seed#[7AE6C28A821C56DC]) [    ] o.a.s.s.IndexSchema [null] Schema name=test
   [junit4]   2> 383821 INFO  (TEST-DirectUpdateHandlerTest.testAddRollback-seed#[7AE6C28A821C56DC]) [    ] o.a.s.s.IndexSchema default search field in schema is text
   [junit4]   2> 383822 INFO  (TEST-DirectUpdateHandlerTest.testAddRollback-seed#[7AE6C28A821C56DC]) [    ] o.a.s.s.IndexSchema unique key field: id
   [junit4]   2> 383823 WARN  (TEST-DirectUpdateHandlerTest.testAddRollback-seed#[7AE6C28A821C56DC]) [    ] o.a.s.s.IndexSchema Field text is not multivalued and destination for multiple copyFields (2)
   [junit4]   2> 383831 INFO  (TEST-DirectUpdateHandlerTest.testAddRollback-seed#[7AE6C28A821C56DC]) [    ] o.a.s.s.FileExchangeRateProvider Reloading exchange rates from file currency.xml
   [junit4]   2> 383834 INFO  (TEST-DirectUpdateHandlerTest.testAddRollback-seed#[7AE6C28A821C56DC]) [    ] o.a.s.s.FileExchangeRateProvider Reloading exchange rates from file currency.xml
   [junit4]   2> 383836 INFO  (TEST-DirectUpdateHandlerTest.testAddRollback-seed#[7AE6C28A821C56DC]) [    ] o.a.s.c.SolrResourceLoader JNDI not configured for solr (NoInitialContextEx)
   [junit4]   2> 383836 INFO  (TEST-DirectUpdateHandlerTest.testAddRollback-seed#[7AE6C28A821C56DC]) [    ] o.a.s.c.SolrResourceLoader using system property solr.solr.home: /x1/jenkins/jenkins-slave/workspace/Lucene-Solr-Tests-5.5-Java7/solr/core/src/test-files/solr
   [junit4]   2> 383836 INFO  (TEST-DirectUpdateHandlerTest.testAddRollback-seed#[7AE6C28A821C56DC]) [    ] o.a.s.c.SolrResourceLoader new SolrResourceLoader for directory: '/x1/jenkins/jenkins-slave/workspace/Lucene-Solr-Tests-5.5-Java7/solr/core/src/test-files/solr'
   [junit4]   2> 383836 INFO  (TEST-DirectUpdateHandlerTest.testAddRollback-seed#[7AE6C28A821C56DC]) [    ] o.a.s.c.SolrResourceLoader JNDI not configured for solr (NoInitialContextEx)
   [junit4]   2> 383836 INFO  (TEST-DirectUpdateHandlerTest.testAddRollback-seed#[7AE6C28A821C56DC]) [    ] o.a.s.c.SolrResourceLoader using system property solr.solr.home: /x1/jenkins/jenkins-slave/workspace/Lucene-Solr-Tests-5.5-Java7/solr/core/src/test-files/solr
   [junit4]   2> 383836 INFO  (TEST-DirectUpdateHandlerTest.testAddRollback-seed#[7AE6C28A821C56DC]) [    ] o.a.s.c.CoreContainer New CoreContainer 1401258726
   [junit4]   2> 383836 INFO  (TEST-DirectUpdateHandlerTest.testAddRollback-seed#[7AE6C28A821C56DC]) [    ] o.a.s.c.CoreContainer Loading cores into CoreContainer [instanceDir=/x1/jenkins/jenkins-slave/workspace/Lucene-Solr-Tests-5.5-Java7/solr/core/src/test-files/solr]
   [junit4]   2> 383837 WARN  (TEST-DirectUpdateHandlerTest.testAddRollback-seed#[7AE6C28A821C56DC]) [    ] o.a.s.c.CoreContainer Couldn't add files from /x1/jenkins/jenkins-slave/workspace/Lucene-Solr-Tests-5.5-Java7/solr/core/src/test-files/solr/lib to classpath: /x1/jenkins/jenkins-slave/workspace/Lucene-Solr-Tests-5.5-Java7/solr/core/src/test-files/solr/lib
   [junit4]   2> 383837 INFO  (TEST-DirectUpdateHandlerTest.testAddRollback-seed#[7AE6C28A821C56DC]) [    ] o.a.s.h.c.HttpShardHandlerFactory created with socketTimeout : 600000,connTimeout : 60000,maxConnectionsPerHost : 20,maxConnections : 10000,corePoolSize : 0,maximumPoolSize : 2147483647,maxThreadIdleTime : 5,sizeOfQueue : -1,fairnessPolicy : false,useRetries : false,
   [junit4]   2> 383838 INFO  (TEST-DirectUpdateHandlerTest.testAddRollback-seed#[7AE6C28A821C56DC]) [    ] o.a.s.u.UpdateShardHandler Creating UpdateShardHandler HTTP client with params: socketTimeout=30000&connTimeout=30000&retry=true
   [junit4]   2> 383839 INFO  (TEST-DirectUpdateHandlerTest.testAddRollback-seed#[7AE6C28A821C56DC]) [    ] o.a.s.l.LogWatcher SLF4J impl is org.slf4j.impl.Log4jLoggerFactory
   [junit4]   2> 383839 INFO  (TEST-DirectUpdateHandlerTest.testAddRollback-seed#[7AE6C28A821C56DC]) [    ] o.a.s.l.LogWatcher Registering Log Listener [Log4j (org.slf4j.impl.Log4jLoggerFactory)]
   [junit4]   2> 383839 INFO  (TEST-DirectUpdateHandlerTest.testAddRollback-seed#[7AE6C28A821C56DC]) [    ] o.a.s.c.CoreContainer Security conf doesn't exist. Skipping setup for authorization module.
   [junit4]   2> 383839 INFO  (TEST-DirectUpdateHandlerTest.testAddRollback-seed#[7AE6C28A821C56DC]) [    ] o.a.s.c.CoreContainer No authentication plugin used.
   [junit4]   2> 383840 INFO  (TEST-DirectUpdateHandlerTest.testAddRollback-seed#[7AE6C28A821C56DC]) [    ] o.a.s.c.CoreDescriptor Created CoreDescriptor: {transient=false, collection=collection1, name=collection1, schema=schema12.xml, configSetProperties=configsetprops.json, config=solrconfig.xml, dataDir=/x1/jenkins/jenkins-slave/workspace/Lucene-Solr-Tests-5.5-Java7/solr/build/solr-core/test/J2/temp/solr.update.DirectUpdateHandlerTest_7AE6C28A821C56DC-001/init-core-data-001, loadOnStartup=true, shard=shard1}
   [junit4]   2> 383841 INFO  (coreLoadExecutor-740-thread-1) [    ] o.a.s.c.SolrResourceLoader new SolrResourceLoader for directory: '/x1/jenkins/jenkins-slave/workspace/Lucene-Solr-Tests-5.5-Java7/solr/core/src/test-files/solr/collection1'
   [junit4]   2> 383841 INFO  (coreLoadExecutor-740-thread-1) [    ] o.a.s.c.SolrResourceLoader JNDI not configured for solr (NoInitialContextEx)
   [junit4]   2> 383841 INFO  (coreLoadExecutor-740-thread-1) [    ] o.a.s.c.SolrResourceLoader using system property solr.solr.home: /x1/jenkins/jenkins-slave/workspace/Lucene-Solr-Tests-5.5-Java7/solr/core/src/test-files/solr
   [junit4]   2> 383841 INFO  (coreLoadExecutor-740-thread-1) [    ] o.a.s.c.SolrResourceLoader Adding 'file:/x1/jenkins/jenkins-slave/workspace/Lucene-Solr-Tests-5.5-Java7/solr/core/src/test-files/solr/collection1/lib/classes/' to classloader
   [junit4]   2> 383841 INFO  (coreLoadExecutor-740-thread-1) [    ] o.a.s.c.SolrResourceLoader Adding 'file:/x1/jenkins/jenkins-slave/workspace/Lucene-Solr-Tests-5.5-Java7/solr/core/src/test-files/solr/collection1/lib/README' to classloader
   [junit4]   2> 383876 INFO  (coreLoadExecutor-740-thread-1) [    ] o.a.s.c.SolrConfig current version of requestparams : -1
   [junit4]   2> 383895 INFO  (coreLoadExecutor-740-thread-1) [    ] o.a.s.c.SolrConfig Using Lucene MatchVersion: 5.5.0
   [junit4]   2> 383940 INFO  (coreLoadExecutor-740-thread-1) [    ] o.a.s.c.SolrConfig Loaded SolrConfig: solrconfig.xml
   [junit4]   2> 383947 INFO  (coreLoadExecutor-740-thread-1) [    ] o.a.s.s.IndexSchema [collection1] Schema name=test
   [junit4]   2> 384164 INFO  (coreLoadExecutor-740-thread-1) [    ] o.a.s.s.IndexSchema default search field in schema is text
   [junit4]   2> 384166 INFO  (coreLoadExecutor-740-thread-1) [    ] o.a.s.s.IndexSchema unique key field: id
   [junit4]   2> 384167 WARN  (coreLoadExecutor-740-thread-1) [    ] o.a.s.s.IndexSchema Field text is not multivalued and destination for multiple copyFields (2)
   [junit4]   2> 384174 INFO  (coreLoadExecutor-740-thread-1) [    ] o.a.s.s.FileExchangeRateProvider Reloading exchange rates from file currency.xml
   [junit4]   2> 384176 INFO  (coreLoadExecutor-740-thread-1) [    ] o.a.s.s.FileExchangeRateProvider Reloading exchange rates from file currency.xml
   [junit4]   2> 384180 INFO  (coreLoadExecutor-740-thread-1) [    ] o.a.s.c.ConfigSetProperties Did not find ConfigSet properties, assuming default properties: Can't find resource 'configsetprops.json' in classpath or '/x1/jenkins/jenkins-slave/workspace/Lucene-Solr-Tests-5.5-Java7/solr/core/src/test-files/solr/collection1'
   [junit4]   2> 384180 INFO  (coreLoadExecutor-740-thread-1) [    ] o.a.s.c.CoreContainer Creating SolrCore 'collection1' using configuration from instancedir /x1/jenkins/jenkins-slave/workspace/Lucene-Solr-Tests-5.5-Java7/solr/core/src/test-files/solr/collection1
   [junit4]   2> 384180 INFO  (coreLoadExecutor-740-thread-1) [    x:collection1] o.a.s.c.SolrCore org.apache.solr.core.MockFSDirectoryFactory
   [junit4]   2> 384181 INFO  (coreLoadExecutor-740-thread-1) [    x:collection1] o.a.s.c.SolrCore [[collection1] ] Opening new SolrCore at [/x1/jenkins/jenkins-slave/workspace/Lucene-Solr-Tests-5.5-Java7/solr/core/src/test-files/solr/collection1], dataDir=[/x1/jenkins/jenkins-slave/workspace/Lucene-Solr-Tests-5.5-Java7/solr/build/solr-core/test/J2/temp/solr.update.DirectUpdateHandlerTest_7AE6C28A821C56DC-001/init-core-data-001/]
   [junit4]   2> 384181 INFO  (coreLoadExecutor-740-thread-1) [    x:collection1] o.a.s.c.JmxMonitoredMap JMX monitoring is enabled. Adding Solr mbeans to JMX Server: com.sun.jmx.mbeanserver.JmxMBeanServer@4ced1dfe
   [junit4]   2> 384181 INFO  (coreLoadExecutor-740-thread-1) [    x:collection1] o.a.s.c.CachingDirectoryFactory return new directory for /x1/jenkins/jenkins-slave/workspace/Lucene-Solr-Tests-5.5-Java7/solr/build/solr-core/test/J2/temp/solr.update.DirectUpdateHandlerTest_7AE6C28A821C56DC-001/init-core-data-001
   [junit4]   2> 384182 INFO  (coreLoadExecutor-740-thread-1) [    x:collection1] o.a.s.c.SolrCore New index directory detected: old=null new=/x1/jenkins/jenkins-slave/workspace/Lucene-Solr-Tests-5.5-Java7/solr/build/solr-core/test/J2/temp/solr.update.DirectUpdateHandlerTest_7AE6C28A821C56DC-001/init-core-data-001/index/
   [junit4]   2> 384182 INFO  (OldIndexDirectoryCleanupThreadForCore-collection1) [    x:collection1] o.a.s.c.SolrCore Looking for old index directories to cleanup for core collection1 in /x1/jenkins/jenkins-slave/workspace/Lucene-Solr-Tests-5.5-Java7/solr/build/solr-core/test/J2/temp/solr.update.DirectUpdateHandlerTest_7AE6C28A821C56DC-001/init-core-data-001/
   [junit4]   2> 384189 INFO  (coreLoadExecutor-740-thread-1) [    x:collection1] o.a.s.u.p.UpdateRequestProcessorChain creating updateRequestProcessorChain "dedupe"
   [junit4]   2> 384189 INFO  (coreLoadExecutor-740-thread-1) [    x:collection1] o.a.s.u.p.UpdateRequestProcessorChain inserting DistributedUpdateProcessorFactory into updateRequestProcessorChain "dedupe"
   [junit4]   2> 384189 INFO  (coreLoadExecutor-740-thread-1) [    x:collection1] o.a.s.u.p.UpdateRequestProcessorChain creating updateRequestProcessorChain "dedupe-allfields"
   [junit4]   2> 384189 INFO  (coreLoadExecutor-740-thread-1) [    x:collection1] o.a.s.u.p.UpdateRequestProcessorChain inserting DistributedUpdateProcessorFactory into updateRequestProcessorChain "dedupe-allfields"
   [junit4]   2> 384189 INFO  (coreLoadExecutor-740-thread-1) [    x:collection1] o.a.s.u.p.UpdateRequestProcessorChain creating updateRequestProcessorChain "stored_sig"
   [junit4]   2> 384190 INFO  (coreLoadExecutor-740-thread-1) [    x:collection1] o.a.s.u.p.UpdateRequestProcessorChain inserting DistributedUpdateProcessorFactory into updateRequestProcessorChain "stored_sig"
   [junit4]   2> 384190 INFO  (coreLoadExecutor-740-thread-1) [    x:collection1] o.a.s.u.p.UpdateRequestProcessorChain creating updateRequestProcessorChain "uniq-fields"
   [junit4]   2> 384190 INFO  (coreLoadExecutor-740-thread-1) [    x:collection1] o.a.s.u.p.UpdateRequestProcessorChain inserting DistributedUpdateProcessorFactory into updateRequestProcessorChain "uniq-fields"
   [junit4]   2> 384190 INFO  (coreLoadExecutor-740-thread-1) [    x:collection1] o.a.s.u.p.UpdateRequestProcessorChain creating updateRequestProcessorChain "distrib-dup-test-chain-explicit"
   [junit4]   2> 384190 INFO  (coreLoadExecutor-740-thread-1) [    x:collection1] o.a.s.u.p.UpdateRequestProcessorChain creating updateRequestProcessorChain "distrib-dup-test-chain-implicit"
   [junit4]   2> 384190 INFO  (coreLoadExecutor-740-thread-1) [    x:collection1] o.a.s.u.p.UpdateRequestProcessorChain inserting DistributedUpdateProcessorFactory into updateRequestProcessorChain "distrib-dup-test-chain-implicit"
   [junit4]   2> 384190 INFO  (coreLoadExecutor-740-thread-1) [    x:collection1] o.a.s.c.SolrCore no updateRequestProcessorChain defined as default, creating implicit default
   [junit4]   2> 384194 INFO  (coreLoadExecutor-740-thread-1) [    x:collection1] o.a.s.h.l.XMLLoader xsltCacheLifetimeSeconds=60
   [junit4]   2> 384195 INFO  (coreLoadExecutor-740-thread-1) [    x:collection1] o.a.s.h.l.XMLLoader xsltCacheLifetimeSeconds=60
   [junit4]   2> 384196 INFO  (coreLoadExecutor-740-thread-1) [    x:collection1] o.a.s.h.l.XMLLoader xsltCacheLifetimeSeconds=60
   [junit4]   2> 384198 INFO  (coreLoadExecutor-740-thread-1) [    x:collection1] o.a.s.h.l.XMLLoader xsltCacheLifetimeSeconds=60
   [junit4]   2> 384203 INFO  (coreLoadExecutor-740-thread-1) [    x:collection1] o.a.s.c.PluginBag requestHandler : 'lazy' created with startup=lazy 
   [junit4]   2> 384206 INFO  (coreLoadExecutor-740-thread-1) [    x:collection1] o.a.s.c.RequestHandlers Registered paths: /admin/properties,/terms,lazy,/admin/mbeans,spellCheckCompRH1,mltrh,defaults,/config,spellCheckCompRH,/admin/file,spellCheckCompRH_Direct,dismax,/admin/system,/update/csv,tvrh,spellCheckWithWordbreak_Direct,/admin/segments,mock,/admin/ping,/get,/admin/logging,/admin/plugins,/update,/admin/threads,/replication,/admin/luke,/mlt,/search-facet-invariants,/search-facet-def,/update/json/docs,spellCheckWithWordbreak,/debug/dump,standard,/schema,/update/json
   [junit4]   2> 384207 WARN  (coreLoadExecutor-740-thread-1) [    x:collection1] o.a.s.c.SolrCore solrconfig.xml uses deprecated <admin/gettableFiles>, Please update your config to use the ShowFileRequestHandler.
   [junit4]   2> 384208 INFO  (coreLoadExecutor-740-thread-1) [    x:collection1] o.a.s.c.SolrCore Using default statsCache cache: org.apache.solr.search.stats.LocalStatsCache
   [junit4]   2> 384209 INFO  (coreLoadExecutor-740-thread-1) [    x:collection1] o.a.s.u.CommitTracker Hard AutoCommit: disabled
   [junit4]   2> 384209 INFO  (coreLoadExecutor-740-thread-1) [    x:collection1] o.a.s.u.CommitTracker Soft AutoCommit: disabled
   [junit4]   2> 384210 INFO  (coreLoadExecutor-740-thread-1) [    x:collection1] o.a.s.c.CachingDirectoryFactory return new directory for /x1/jenkins/jenkins-slave/workspace/Lucene-Solr-Tests-5.5-Java7/solr/build/solr-core/test/J2/temp/solr.update.DirectUpdateHandlerTest_7AE6C28A821C56DC-001/init-core-data-001/index
   [junit4]   2> 384210 INFO  (coreLoadExecutor-740-thread-1) [    x:collection1] o.a.s.u.RandomMergePolicy RandomMergePolicy wrapping class org.apache.lucene.index.TieredMergePolicy: [TieredMergePolicy: maxMergeAtOnce=30, maxMergeAtOnceExplicit=31, maxMergedSegmentMB=97.7197265625, floorSegmentMB=2.0830078125, forceMergeDeletesPctAllowed=3.1405841883709917, segmentsPerTier=24.0, maxCFSSegmentSizeMB=8.796093022207999E12, noCFSRatio=0.79009928097331
   [junit4]   2> 384211 INFO  (coreLoadExecutor-740-thread-1) [    x:collection1] o.a.s.c.SolrDeletionPolicy SolrDeletionPolicy.onInit: commits: num=1
   [junit4]   2> 	commit{dir=MockDirectoryWrapper(NIOFSDirectory@/x1/jenkins/jenkins-slave/workspace/Lucene-Solr-Tests-5.5-Java7/solr/build/solr-core/test/J2/temp/solr.update.DirectUpdateHandlerTest_7AE6C28A821C56DC-001/init-core-data-001/index lockFactory=org.apache.lucene.store.SingleInstanceLockFactory@6f77c770),segFN=segments_5,generation=5}
   [junit4]   2> 384211 INFO  (coreLoadExecutor-740-thread-1) [    x:collection1] o.a.s.c.SolrDeletionPolicy newest commit generation = 5
   [junit4]   2> 384211 INFO  (coreLoadExecutor-740-thread-1) [    x:collection1] o.a.s.s.SolrIndexSearcher Opening Searcher@593ba8f3[collection1] main
   [junit4]   2> 384212 INFO  (coreLoadExecutor-740-thread-1) [    x:collection1] o.a.s.r.RestManager Initializing RestManager with initArgs: {storageIO=org.apache.solr.rest.ManagedResourceStorage$InMemoryStorageIO}
   [junit4]   2> 384212 INFO  (coreLoadExecutor-740-thread-1) [    x:collection1] o.a.s.r.ManagedResourceStorage Reading _rest_managed.json using InMemoryStorage
   [junit4]   2> 384212 INFO  (coreLoadExecutor-740-thread-1) [    x:collection1] o.a.s.r.RestManager Initializing 0 registered ManagedResources
   [junit4]   2> 384212 INFO  (coreLoadExecutor-740-thread-1) [    x:collection1] o.a.s.h.c.SpellCheckComponent Initializing spell checkers
   [junit4]   2> 384213 INFO  (coreLoadExecutor-740-thread-1) [    x:collection1] o.a.s.s.DirectSolrSpellChecker init: {name=direct,classname=DirectSolrSpellChecker,field=lowerfilt,minQueryLength=3}
   [junit4]   2> 384217 INFO  (coreLoadExecutor-740-thread-1) [    x:collection1] o.a.s.h.ReplicationHandler Commits will be reserved for  10000
   [junit4]   2> 384217 INFO  (searcherExecutor-741-thread-1-processing-x:collection1) [    x:collection1] o.a.s.h.c.SpellCheckComponent Loading spell index for spellchecker: default
   [junit4]   2> 384218 INFO  (searcherExecutor-741-thread-1-processing-x:collection1) [    x:collection1] o.a.s.h.c.SpellCheckComponent Loading spell index for spellchecker: direct
   [junit4]   2> 384218 INFO  (searcherExecutor-741-thread-1-processing-x:collection1) [    x:collection1] o.a.s.h.c.SpellCheckComponent Loading spell index for spellchecker: wordbreak
   [junit4]   2> 384218 INFO  (searcherExecutor-741-thread-1-processing-x:collection1) [    x:collection1] o.a.s.h.c.SpellCheckComponent Loading spell index for spellchecker: multipleFields
   [junit4]   2> 384219 INFO  (searcherExecutor-741-thread-1-processing-x:collection1) [    x:collection1] o.a.s.h.c.SpellCheckComponent Loading spell index for spellchecker: jarowinkler
   [junit4]   2> 384219 INFO  (coreLoadExecutor-740-thread-1) [    x:collection1] o.a.s.c.CoreContainer registering core: collection1
   [junit4]   2> 384219 INFO  (searcherExecutor-741-thread-1-processing-x:collection1) [    x:collection1] o.a.s.h.c.SpellCheckComponent Loading spell index for spellchecker: external
   [junit4]   2> 384220 INFO  (searcherExecutor-741-thread-1-processing-x:collection1) [    x:collection1] o.a.s.h.c.SpellCheckComponent Loading spell index for spellchecker: freq
   [junit4]   2> 384220 INFO  (searcherExecutor-741-thread-1-processing-x:collection1) [    x:collection1] o.a.s.h.c.SpellCheckComponent Loading spell index for spellchecker: fqcn
   [junit4]   2> 384221 INFO  (TEST-DirectUpdateHandlerTest.testAddRollback-seed#[7AE6C28A821C56DC]) [    ] o.a.s.SolrTestCaseJ4 ####initCore end
   [junit4]   2> 384221 INFO  (searcherExecutor-741-thread-1-processing-x:collection1) [    x:collection1] o.a.s.h.c.SpellCheckComponent Loading spell index for spellchecker: perDict
   [junit4]   2> 384223 INFO  (searcherExecutor-741-thread-1-processing-x:collection1) [    x:collection1] o.a.s.c.SolrCore [collection1] Registered new searcher Searcher@593ba8f3[collection1] main{ExitableDirectoryReader(UninvertingDirectoryReader())}
   [junit4]   2> 384223 INFO  (TEST-DirectUpdateHandlerTest.testAddRollback-seed#[7AE6C28A821C56DC]) [    ] o.a.s.u.p.LogUpdateProcessorFactory [collection1]  webapp=null path=null params={}{add=[A]} 0 2
   [junit4]   2> 384224 INFO  (TEST-DirectUpdateHandlerTest.testAddRollback-seed#[7AE6C28A821C56DC]) [    ] o.a.s.u.DirectUpdateHandler2 start commit{,optimize=false,openSearcher=true,waitSearcher=true,expungeDeletes=false,softCommit=false,prepareCommit=false}
   [junit4]   2> 384245 INFO  (TEST-DirectUpdateHandlerTest.testAddRollback-seed#[7AE6C28A821C56DC]) [    ] o.a.s.c.SolrDeletionPolicy SolrDeletionPolicy.onCommit: commits: num=2
   [junit4]   2> 	commit{dir=MockDirectoryWrapper(NIOFSDirectory@/x1/jenkins/jenkins-slave/workspace/Lucene-Solr-Tests-5.5-Java7/solr/build/solr-core/test/J2/temp/solr.update.DirectUpdateHandlerTest_7AE6C28A821C56DC-001/init-core-data-001/index lockFactory=org.apache.lucene.store.SingleInstanceLockFactory@6f77c770),segFN=segments_5,generation=5}
   [junit4]   2> 	commit{dir=MockDirectoryWrapper(NIOFSDirectory@/x1/jenkins/jenkins-slave/workspace/Lucene-Solr-Tests-5.5-Java7/solr/build/solr-core/test/J2/temp/solr.update.DirectUpdateHandlerTest_7AE6C28A821C56DC-001/init-core-data-001/index lockFactory=org.apache.lucene.store.SingleInstanceLockFactory@6f77c770),segFN=segments_6,generation=6}
   [junit4]   2> 384245 INFO  (TEST-DirectUpdateHandlerTest.testAddRollback-seed#[7AE6C28A821C56DC]) [    ] o.a.s.c.SolrDeletionPolicy newest commit generation = 6
   [junit4]   2> 384248 INFO  (TEST-DirectUpdateHandlerTest.testAddRollback-seed#[7AE6C28A821C56DC]) [    ] o.a.s.s.SolrIndexSearcher Opening Searcher@2bb7924c[collection1] main
   [junit4]   2> 384248 INFO  (TEST-DirectUpdateHandlerTest.testAddRollback-seed#[7AE6C28A821C56DC]) [    ] o.a.s.u.DirectUpdateHandler2 end_commit_flush
   [junit4]   2> 384250 INFO  (searcherExecutor-741-thread-1) [    ] o.a.s.c.SolrCore [collection1] Registered new searcher Searcher@2bb7924c[collection1] main{ExitableDirectoryReader(UninvertingDirectoryReader(Uninverting(_2(5.5.0):c1)))}
   [junit4]   2> 384252 INFO  (TEST-DirectUpdateHandlerTest.testAddRollback-seed#[7AE6C28A821C56DC]) [    ] o.a.s.u.p.LogUpdateProcessorFactory [collection1]  webapp=null path=null params={}{add=[B]} 0 1
   [junit4]   2> 384253 INFO  (TEST-DirectUpdateHandlerTest.testAddRollback-seed#[7AE6C28A821C56DC]) [    ] o.a.s.u.DirectUpdateHandler2 start rollback{}
   [junit4]   2> 384253 INFO  (TEST-DirectUpdateHandlerTest.testAddRollback-seed#[7AE6C28A821C56DC]) [    ] o.a.s.u.DefaultSolrCoreState Rollback old IndexWriter... core=collection1
   [junit4]   2> 384254 INFO  (TEST-DirectUpdateHandlerTest.testAddRollback-seed#[7AE6C28A821C56DC]) [    ] o.a.s.u.RandomMergePolicy RandomMergePolicy wrapping class org.apache.lucene.index.TieredMergePolicy: [TieredMergePolicy: maxMergeAtOnce=43, maxMergeAtOnceExplicit=27, maxMergedSegmentMB=82.2890625, floorSegmentMB=0.498046875, forceMergeDeletesPctAllowed=23.08047497092765, segmentsPerTier=35.0, maxCFSSegmentSizeMB=8.796093022207999E12, noCFSRatio=0.0
   [junit4]   2> 384256 INFO  (TEST-DirectUpdateHandlerTest.testAddRollback-seed#[7AE6C28A821C56DC]) [    ] o.a.s.c.SolrDeletionPolicy SolrDeletionPolicy.onInit: commits: num=1
   [junit4]   2> 	commit{dir=MockDirectoryWrapper(NIOFSDirectory@/x1/jenkins/jenkins-slave/workspace/Lucene-Solr-Tests-5.5-Java7/solr/build/solr-core/test/J2/temp/solr.update.DirectUpdateHandlerTest_7AE6C28A821C56DC-001/init-core-data-001/index lockFactory=org.apache.lucene.store.SingleInstanceLockFactory@6f77c770),segFN=segments_6,generation=6}
   [junit4]   2> 384256 INFO  (TEST-DirectUpdateHandlerTest.testAddRollback-seed#[7AE6C28A821C56DC]) [    ] o.a.s.c.SolrDeletionPolicy newest commit generation = 6
   [junit4]   2> 384257 INFO  (TEST-DirectUpdateHandlerTest.testAddRollback-seed#[7AE6C28A821C56DC]) [    ] o.a.s.u.DefaultSolrCoreState New IndexWriter is ready to be used.
   [junit4]   2> 384257 INFO  (TEST-DirectUpdateHandlerTest.testAddRollback-seed#[7AE6C28A821C56DC]) [    ] o.a.s.u.DirectUpdateHandler2 end_rollback
   [junit4]   2> 384260 INFO  (TEST-DirectUpdateHandlerTest.testAddRollback-seed#[7AE6C28A821C56DC]) [    ] o.a.s.c.S.Request [collection1]  webapp=null path=null params={indent=true&q=id:A+OR+id:B} hits=1 status=0 QTime=2
   [junit4]   2> 384263 INFO  (TEST-DirectUpdateHandlerTest.testAddRollback-seed#[7AE6C28A821C56DC]) [    ] o.a.s.u.p.LogUpdateProcessorFactory [collection1]  webapp=null path=null params={}{add=[ZZZ]} 0 1
   [junit4]   2> 384264 INFO  (TEST-DirectUpdateHandlerTest.testAddRollback-seed#[7AE6C28A821C56DC]) [    ] o.a.s.u.DirectUpdateHandler2 start commit{,optimize=false,openSearcher=true,waitSearcher=true,expungeDeletes=false,softCommit=false,prepareCommit=false}
   [junit4]   2> 384283 INFO  (TEST-DirectUpdateHandlerTest.testAddRollback-seed#[7AE6C28A821C56DC]) [    ] o.a.s.c.SolrDeletionPolicy SolrDeletionPolicy.onCommit: commits: num=2
   [junit4]   2> 	commit{dir=MockDirectoryWrapper(NIOFSDirectory@/x1/jenkins/jenkins-slave/workspace/Lucene-Solr-Tests-5.5-Java7/solr/build/solr-core/test/J2/temp/solr.update.DirectUpdateHandlerTest_7AE6C28A821C56DC-001/init-core-data-001/index lockFactory=org.apache.lucene.store.SingleInstanceLockFactory@6f77c770),segFN=segments_6,generation=6}
   [junit4]   2> 	commit{dir=MockDirectoryWrapper(NIOFSDirectory@/x1/jenkins/jenkins-slave/workspace/Lucene-Solr-Tests-5.5-Java7/solr/build/solr-core/test/J2/temp/solr.update.DirectUpdateHandlerTest_7AE6C28A821C56DC-001/init-core-data-001/index lockFactory=org.apache.lucene.store.SingleInstanceLockFactory@6f77c770),segFN=segments_7,generation=7}
   [junit4]   2> 384283 INFO  (TEST-DirectUpdateHandlerTest.testAddRollback-seed#[7AE6C28A821C56DC]) [    ] o.a.s.c.SolrDeletionPolicy newest commit generation = 7
   [junit4]   2> 384287 INFO  (TEST-DirectUpdateHandlerTest.testAddRollback-seed#[7AE6C28A821C56DC]) [    ] o.a.s.s.SolrIndexSearcher Opening Searcher@6f8f31f6[collection1] main
   [junit4]   2> 384287 INFO  (TEST-DirectUpdateHandlerTest.testAddRollback-seed#[7AE6C28A821C56DC]) [    ] o.a.s.u.DirectUpdateHandler2 end_commit_flush
   [junit4]   2> 384290 INFO  (searcherExecutor-741-thread-1) [    ] o.a.s.c.SolrCore [collection1] Registered new searcher Searcher@6f8f31f6[collection1] main{ExitableDirectoryReader(UninvertingDirectoryReader(Uninverting(_2(5.5.0):c1) Uninverting(_3(5.5.0):c1)))}
   [junit4]   2> 384292 INFO  (TEST-DirectUpdateHandlerTest.testAddRollback-seed#[7AE6C28A821C56DC]) [    ] o.a.s.u.p.LogUpdateProcessorFactory [collection1]  webapp=null path=null params={}{commit=} 0 27
   [junit4]   2> 384294 INFO  (TEST-DirectUpdateHandlerTest.testAddRollback-seed#[7AE6C28A821C56DC]) [    ] o.a.s.c.S.Request [collection1]  webapp=null path=null params={wt=xml&q=id:ZZZ} hits=1 status=0 QTime=1
   [junit4]   2> 384296 INFO  (TEST-DirectUpdateHandlerTest.testAddRollback-seed#[7AE6C28A821C56DC]) [    ] o.a.s.SolrTestCaseJ4 ###Ending testAddRollback
   [junit4]   2> 384301 INFO  (TEST-DirectUpdateHandlerTest.testDeleteRollback-seed#[7AE6C28A821C56DC]) [    ] o.a.s.SolrTestCaseJ4 ###Starting testDeleteRollback
   [junit4]   2> 384302 INFO  (TEST-DirectUpdateHandlerTest.testDeleteRollback-seed#[7AE6C28A821C56DC]) [    ] o.a.s.u.DirectUpdateHandler2 [collection1] REMOVING ALL DOCUMENTS FROM INDEX
   [junit4]   2> 384302 INFO  (TEST-DirectUpdateHandlerTest.testDeleteRollback-seed#[7AE6C28A821C56DC]) [    ] o.a.s.u.p.LogUpdateProcessorFactory [collection1]  webapp=null path=null params={}{deleteByQuery=*:*} 0 0
   [junit4]   2> 384303 INFO  (TEST-DirectUpdateHandlerTest.testDeleteRollback-seed#[7AE6C28A821C56DC]) [    ] o.a.s.u.DirectUpdateHandler2 start commit{,optimize=false,openSearcher=true,waitSearcher=true,expungeDeletes=false,softCommit=false,prepareCommit=false}
   [junit4]   2> 384307 INFO  (TEST-DirectUpdateHandlerTest.testDeleteRollback-seed#[7AE6C28A821C56DC]) [    ] o.a.s.c.SolrDeletionPolicy SolrDeletionPolicy.onCommit: commits: num=2
   [junit4]   2> 	commit{dir=MockDirectoryWrapper(NIOFSDirectory@/x1/jenkins/jenkins-slave/workspace/Lucene-Solr-Tests-5.5-Java7/solr/build/solr-core/test/J2/temp/solr.update.DirectUpdateHandlerTest_7AE6C28A821C56DC-001/init-core-data-001/index lockFactory=org.apache.lucene.store.SingleInstanceLockFactory@6f77c770),segFN=segments_7,generation=7}
   [junit4]   2> 	commit{dir=MockDirectoryWrapper(NIOFSDirectory@/x1/jenkins/jenkins-slave/workspace/Lucene-Solr-Tests-5.5-Java7/solr/build/solr-core/test/J2/temp/solr.update.DirectUpdateHandlerTest_7AE6C28A821C56DC-001/init-core-data-001/index lockFactory=org.apache.lucene.store.SingleInstanceLockFactory@6f77c770),segFN=segments_8,generation=8}
   [junit4]   2> 384307 INFO  (TEST-DirectUpdateHandlerTest.testDeleteRollback-seed#[7AE6C28A821C56DC]) [    ] o.a.s.c.SolrDeletionPolicy newest commit generation = 8
   [junit4]   2> 384308 INFO  (TEST-DirectUpdateHandlerTest.testDeleteRollback-seed#[7AE6C28A821C56DC]) [    ] o.a.s.s.SolrIndexSearcher Opening Searcher@735b5bbe[collection1] main
   [junit4]   2> 384308 INFO  (TEST-DirectUpdateHandlerTest.testDeleteRollback-seed#[7AE6C28A821C56DC]) [    ] o.a.s.u.DirectUpdateHandler2 end_commit_flush
   [junit4]   2> 384310 INFO  (searcherExecutor-741-thread-1) [    ] o.a.s.c.SolrCore [collection1] Registered new searcher Searcher@735b5bbe[collection1] main{ExitableDirectoryReader(UninvertingDirectoryReader())}
   [junit4]   2> 384311 INFO  (TEST-DirectUpdateHandlerTest.testDeleteRollback-seed#[7AE6C28A821C56DC]) [    ] o.a.s.u.p.LogUpdateProcessorFactory [collection1]  webapp=null path=null params={}{commit=} 0 7
   [junit4]   2> 384312 INFO  (TEST-DirectUpdateHandlerTest.testDeleteRollback-seed#[7AE6C28A821C56DC]) [    ] o.a.s.SolrTestCaseJ4 ###deleteCore
   [junit4]   2> 384312 INFO  (TEST-DirectUpdateHandlerTest.testDeleteRollback-seed#[7AE6C28A821C56DC]) [    ] o.a.s.c.CoreContainer Shutting down CoreContainer instance=1401258726
   [junit4]   2> 384313 INFO  (coreCloseExecutor-745-thread-1) [    x:collection1] o.a.s.c.SolrCore [collection1]  CLOSING SolrCore org.apache.solr.core.SolrCore@3da4ed38
   [junit4]   2> 384313 INFO  (coreCloseExecutor-745-thread-1) [    x:collection1] o.a.s.u.DirectUpdateHandler2 closing DirectUpdateHandler2{commits=3,autocommits=0,soft autocommits=0,optimizes=0,rollbacks=1,expungeDeletes=0,docsPending=0,adds=0,deletesById=0,deletesByQuery=0,errors=0,cumulative_adds=2,cumulative_deletesById=0,cumulative_deletesByQuery=1,cumulative_errors=0}
   [junit4]   2> 384314 INFO  (coreCloseExecutor-745-thread-1) [    x:collection1] o.a.s.u.SolrCoreState Closing SolrCoreState
   [junit4]   2> 384314 INFO  (coreCloseExecutor-745-thread-1) [    x:collection1] o.a.s.u.DefaultSolrCoreState SolrCoreState ref count has reached 0 - closing IndexWriter
   [junit4]   2> 384314 INFO  (coreCloseExecutor-745-thread-1) [    x:collection1] o.a.s.u.DefaultSolrCoreState closing IndexWriter with IndexWriterCloser
   [junit4]   2> 384316 INFO  (coreCloseExecutor-745-thread-1) [    x:collection1] o.a.s.c.SolrCore [collection1] Closing main searcher on request.
   [junit4]   2> 384330 INFO  (coreCloseExecutor-745-thread-1) [    x:collection1] o.a.s.c.CachingDirectoryFactory Closing MockFSDirectoryFactory - 2 directories currently being tracked
   [junit4]   2> 384330 INFO  (coreCloseExecutor-745-thread-1) [    x:collection1] o.a.s.c.CachingDirectoryFactory looking to close /x1/jenkins/jenkins-slave/workspace/Lucene-Solr-Tests-5.5-Java7/solr/build/solr-core/test/J2/temp/solr.update.DirectUpdateHandlerTest_7AE6C28A821C56DC-001/init-core-data-001/index [CachedDir<<refCount=0;path=/x1/jenkins/jenkins-slave/workspace/Lucene-Solr-Tests-5.5-Java7/solr/build/solr-core/test/J2/temp/solr.update.DirectUpdateHandlerTest_7AE6C28A821C56DC-001/init-core-data-001/index;done=false>>]
   [junit4]   2> 384331 INFO  (coreCloseExecutor-745-thread-1) [    x:collection1] o.a.s.c.CachingDirectoryFactory Closing directory: /x1/jenkins/jenkins-slave/workspace/Lucene-Solr-Tests-5.5-Java7/solr/build/solr-core/test/J2/temp/solr.update.DirectUpdateHandlerTest_7AE6C28A821C56DC-001/init-core-data-001/index
   [junit4]   2> 384332 INFO  (coreCloseExecutor-745-thread-1) [    x:collection1] o.a.s.c.CachingDirectoryFactory looking to close /x1/jenkins/jenkins-slave/workspace/Lucene-Solr-Tests-5.5-Java7/solr/build/solr-core/test/J2/temp/solr.update.DirectUpdateHandlerTest_7AE6C28A821C56DC-001/init-core-data-001 [CachedDir<<refCount=0;path=/x1/jenkins/jenkins-slave/workspace/Lucene-Solr-Tests-5.5-Java7/solr/build/solr-core/test/J2/temp/solr.update.DirectUpdateHandlerTest_7AE6C28A821C56DC-001/init-core-data-001;done=false>>]
   [junit4]   2> 384332 INFO  (coreCloseExecutor-745-thread-1) [    x:collection1] o.a.s.c.CachingDirectoryFactory Closing directory: /x1/jenkins/jenkins-slave/workspace/Lucene-Solr-Tests-5.5-Java7/solr/build/solr-core/test/J2/temp/solr.update.DirectUpdateHandlerTest_7AE6C28A821C56DC-001/init-core-data-001
   [junit4]   2> 384333 INFO  (TEST-DirectUpdateHandlerTest.testDeleteRollback-seed#[7AE6C28A821C56DC]) [    ] o.a.s.SolrTestCaseJ4 ####initCore
   [junit4]   2> 384333 INFO  (TEST-DirectUpdateHandlerTest.testDeleteRollback-seed#[7AE6C28A821C56DC]) [    ] o.a.s.c.SolrResourceLoader new SolrResourceLoader for directory: '/x1/jenkins/jenkins-slave/workspace/Lucene-Solr-Tests-5.5-Java7/solr/core/src/test-files/solr/collection1'
   [junit4]   2> 384333 INFO  (TEST-DirectUpdateHandlerTest.testDeleteRollback-seed#[7AE6C28A821C56DC]) [    ] o.a.s.c.SolrResourceLoader JNDI not configured for solr (NoInitialContextEx)
   [junit4]   2> 384333 INFO  (TEST-DirectUpdateHandlerTest.testDeleteRollback-seed#[7AE6C28A821C56DC]) [    ] o.a.s.c.SolrResourceLoader using system property solr.solr.home: /x1/jenkins/jenkins-slave/workspace/Lucene-Solr-Tests-5.5-Java7/solr/core/src/test-files/solr
   [junit4]   2> 384334 INFO  (TEST-DirectUpdateHandlerTest.testDeleteRollback-seed#[7AE6C28A821C56DC]) [    ] o.a.s.c.SolrResourceLoader Adding 'file:/x1/jenkins/jenkins-slave/workspace/Lucene-Solr-Tests-5.5-Java7/solr/core/src/test-files/solr/collection1/lib/classes/' to classloader
   [junit4]   2> 384334 INFO  (TEST-DirectUpdateHandlerTest.testDeleteRollback-seed#[7AE6C28A821C56DC]) [    ] o.a.s.c.SolrResourceLoader Adding 'file:/x1/jenkins/jenkins-slave/workspace/Lucene-Solr-Tests-5.5-Java7/solr/core/src/test-files/solr/collection1/lib/README' to classloader
   [junit4]   2> 384368 INFO  (TEST-DirectUpdateHandlerTest.testDeleteRollback-seed#[7AE6C28A821C56DC]) [    ] o.a.s.c.SolrConfig current version of requestparams : -1
   [junit4]   2> 384388 INFO  (TEST-DirectUpdateHandlerTest.testDeleteRollback-seed#[7AE6C28A821C56DC]) [    ] o.a.s.c.SolrConfig Using Lucene MatchVersion: 5.5.0
   [junit4]   2> 384430 INFO  (TEST-DirectUpdateHandlerTest.testDeleteRollback-seed#[7AE6C28A821C56DC]) [    ] o.a.s.c.SolrConfig Loaded SolrConfig: solrconfig.xml
   [junit4]   2> 384438 INFO  (TEST-DirectUpdateHandlerTest.testDeleteRollback-seed#[7AE6C28A821C56DC]) [    ] o.a.s.s.IndexSchema [null] Schema name=test
   [junit4]   2> 384644 INFO  (TEST-DirectUpdateHandlerTest.testDeleteRollback-seed#[7AE6C28A821C56DC]) [    ] o.a.s.s.IndexSchema default search field in schema is text
   [junit4]   2> 384646 INFO  (TEST-DirectUpdateHandlerTest.testDeleteRollback-seed#[7AE6C28A821C56DC]) [    ] o.a.s.s.IndexSchema unique key field: id
   [junit4]   2> 384647 WARN  (TEST-DirectUpdateHandlerTest.testDeleteRollback-seed#[7AE6C28A821C56DC]) [    ] o.a.s.s.IndexSchema Field text is not multivalued and destination for multiple copyFields (2)
   [junit4]   2> 384654 INFO  (TEST-DirectUpdateHandlerTest.testDeleteRollback-seed#[7AE6C28A821C56DC]) [    ] o.a.s.s.FileExchangeRateProvider Reloading exchange rates from file currency.xml
   [junit4]   2> 384657 INFO  (TEST-DirectUpdateHandlerTest.testDeleteRollback-seed#[7AE6C28A821C56DC]) [    ] o.a.s.s.FileExchangeRateProvider Reloading exchange rates from file currency.xml
   [junit4]   2> 384659 INFO  (TEST-DirectUpdateHandlerTest.testDeleteRollback-seed#[7AE6C28A821C56DC]) [    ] o.a.s.c.SolrResourceLoader JNDI not configured for solr (NoInitialContextEx)
   [junit4]   2> 384659 INFO  (TEST-DirectUpdateHandlerTest.testDeleteRollback-seed#[7AE6C28A821C56DC]) [    ] o.a.s.c.SolrResourceLoader using system property solr.solr.home: /x1/jenkins/jenkins-slave/workspace/Lucene-Solr-Tests-5.5-Java7/solr/core/src/test-files/solr
   [junit4]   2> 384659 INFO  (TEST-DirectUpdateHandlerTest.testDeleteRollback-seed#[7AE6C28A821C56DC]) [    ] o.a.s.c.SolrResourceLoader new SolrResourceLoader for directory: '/x1/jenkins/jenkins-slave/workspace/Lucene-Solr-Tests-5.5-Java7/solr/core/src/test-files/solr'
   [junit4]   2> 384659 INFO  (TEST-DirectUpdateHandlerTest.testDeleteRollback-seed#[7AE6C28A821C56DC]) [    ] o.a.s.c.SolrResourceLoader JNDI not configured for solr (NoInitialContextEx)
   [junit4]   2> 384659 INFO  (TEST-DirectUpdateHandlerTest.testDeleteRollback-seed#[7AE6C28A821C56DC]) [    ] o.a.s.c.SolrResourceLoader using system property solr.solr.home: /x1/jenkins/jenkins-slave/workspace/Lucene-Solr-Tests-5.5-Java7/solr/core/src/test-files/solr
   [junit4]   2> 384660 INFO  (TEST-DirectUpdateHandlerTest.testDeleteRollback-seed#[7AE6C28A821C56DC]) [    ] o.a.s.c.CoreContainer New CoreContainer 1997686601
   [junit4]   2> 384660 INFO  (TEST-DirectUpdateHandlerTest.testDeleteRollback-seed#[7AE6C28A821C56DC]) [    ] o.a.s.c.CoreContainer Loading cores into CoreContainer [instanceDir=/x1/jenkins/jenkins-slave/workspace/Lucene-Solr-Tests-5.5-Java7/solr/core/src/test-files/solr]
   [junit4]   2> 384660 WARN  (TEST-DirectUpdateHandlerTest.testDeleteRollback-seed#[7AE6C28A821C56DC]) [    ] o.a.s.c.CoreContainer Couldn't add files from /x1/jenkins/jenkins-slave/workspace/Lucene-Solr-Tests-5.5-Java7/solr/core/src/test-files/solr/lib to classpath: /x1/jenkins/jenkins-slave/workspace/Lucene-Solr-Tests-5.5-Java7/solr/core/src/test-files/solr/lib
   [junit4]   2> 384660 INFO  (TEST-DirectUpdateHandlerTest.testDeleteRollback-seed#[7AE6C28A821C56DC]) [    ] o.a.s.h.c.HttpShardHandlerFactory created with socketTimeout : 600000,connTimeout : 60000,maxConnectionsPerHost : 20,maxConnections : 10000,corePoolSize : 0,maximumPoolSize : 2147483647,maxThreadIdleTime : 5,sizeOfQueue : -1,fairnessPolicy : false,useRetries : false,
   [junit4]   2> 384661 INFO  (TEST-DirectUpdateHandlerTest.testDeleteRollback-seed#[7AE6C28A821C56DC]) [    ] o.a.s.u.UpdateShardHandler Creating UpdateShardHandler HTTP client with params: socketTimeout=30000&connTimeout=30000&retry=true
   [junit4]   2> 384662 INFO  (TEST-DirectUpdateHandlerTest.testDeleteRollback-seed#[7AE6C28A821C56DC]) [    ] o.a.s.l.LogWatcher SLF4J impl is org.slf4j.impl.Log4jLoggerFactory
   [junit4]   2> 384662 INFO  (TEST-DirectUpdateHandlerTest.testDeleteRollback-seed#[7AE6C28A821C56DC]) [    ] o.a.s.l.LogWatcher Registering Log Listener [Log4j (org.slf4j.impl.Log4jLoggerFactory)]
   [junit4]   2> 384662 INFO  (TEST-DirectUpdateHandlerTest.testDeleteRollback-seed#[7AE6C28A821C56DC]) [    ] o.a.s.c.CoreContainer Security conf doesn't exist. Skipping setup for authorization module.
   [junit4]   2> 384662 INFO  (TEST-DirectUpdateHandlerTest.testDeleteRollback-seed#[7AE6C28A821C56DC]) [    ] o.a.s.c.CoreContainer No authentication plugin used.
   [junit4]   2> 384663 INFO  (TEST-DirectUpdateHandlerTest.testDeleteRollback-seed#[7AE6C28A821C56DC]) [    ] o.a.s.c.CoreDescriptor Created CoreDescriptor: {transient=false, shard=shard1, schema=schema12.xml, configSetProperties=configsetprops.json, config=solrconfig.xml, dataDir=/x1/jenkins/jenkins-slave/workspace/Lucene-Solr-Tests-5.5-Java7/solr/build/solr-core/test/J2/temp/solr.update.DirectUpdateHandlerTest_7AE6C28A821C56DC-001/init-core-data-001, name=collection1, loadOnStartup=true, collection=collection1}
   [junit4]   2> 384664 INFO  (coreLoadExecutor-751-thread-1) [    ] o.a.s.c.SolrResourceLoader new SolrResourceLoader for directory: '/x1/jenkins/jenkins-slave/workspace/Lucene-Solr-Tests-5.5-Java7/solr/core/src/test-files/solr/collection1'
   [junit4]   2> 384664 INFO  (coreLoadExecutor-751-thread-1) [    ] o.a.s.c.SolrResourceLoader JNDI not configured for solr (NoInitialContextEx)
   [junit4]   2> 384664 INFO  (coreLoadExecutor-751-thread-1) [    ] o.a.s.c.SolrResourceLoader using system property solr.solr.home: /x1/jenkins/jenkins-slave/workspace/Lucene-Solr-Tests-5.5-Java7/solr/core/src/test-files/solr
   [junit4]   2> 384664 INFO  (coreLoadExecutor-751-thread-1) [    ] o.a.s.c.SolrResourceLoader Adding 'file:/x1/jenkins/jenkins-slave/workspace/Lucene-Solr-Tests-5.5-Java7/solr/core/src/test-files/solr/collection1/lib/classes/' to classloader
   [junit4]   2> 384664 INFO  (coreLoadExecutor-751-thread-1) [    ] o.a.s.c.SolrResourceLoader Adding 'file:/x1/jenkins/jenkins-slave/workspace/Lucene-Solr-Tests-5.5-Java7/solr/core/src/test-files/solr/collection1/lib/README' to classloader
   [junit4]   2> 384698 INFO  (coreLoadExecutor-751-thread-1) [    ] o.a.s.c.SolrConfig current version of requestparams : -1
   [junit4]   2> 384717 INFO  (coreLoadExecutor-751-thread-1) [    ] o.a.s.c.SolrConfig Using Lucene MatchVersion: 5.5.0
   [junit4]   2> 384758 INFO  (coreLoadExecutor-751-thread-1) [    ] o.a.s.c.SolrConfig Loaded SolrConfig: solrconfig.xml
   [junit4]   2> 384765 INFO  (coreLoadExecutor-751-thread-1) [    ] o.a.s.s.IndexSchema [collection1] Schema name=test
   [junit4]   2> 384983 INFO  (coreLoadExecutor-751-thread-1) [    ] o.a.s.s.IndexSchema default search field in schema is text
   [junit4]   2> 384984 INFO  (coreLoadExecutor-751-thread-1) [    ] o.a.s.s.IndexSchema unique key field: id
   [junit4]   2> 384985 WARN  (coreLoadExecutor-751-thread-1) [    ] o.a.s.s.IndexSchema Field text is not multivalued and destination for multiple copyFields (2)
   [junit4]   2> 384992 INFO  (coreLoadExecutor-751-thread-1) [    ] o.a.s.s.FileExchangeRateProvider Reloading exchange rates from file currency.xml
   [junit4]   2> 384995 INFO  (c

[...truncated too long message...]

ins-slave/workspace/Lucene-Solr-Tests-5.5-Java7/solr/build/solr-core/test/J2/temp/solr.update.DirectUpdateHandlerTest_7AE6C28A821C56DC-001/init-core-data-001/index lockFactory=org.apache.lucene.store.SingleInstanceLockFactory@4a0996b7),segFN=segments_j,generation=19}
   [junit4]   2> 385330 INFO  (TEST-DirectUpdateHandlerTest.testBasics-seed#[7AE6C28A821C56DC]) [    ] o.a.s.c.SolrDeletionPolicy newest commit generation = 19
   [junit4]   2> 385330 INFO  (TEST-DirectUpdateHandlerTest.testBasics-seed#[7AE6C28A821C56DC]) [    ] o.a.s.s.SolrIndexSearcher Opening Searcher@36dc6d88[collection1] main
   [junit4]   2> 385330 INFO  (TEST-DirectUpdateHandlerTest.testBasics-seed#[7AE6C28A821C56DC]) [    ] o.a.s.u.DirectUpdateHandler2 end_commit_flush
   [junit4]   2> 385332 INFO  (searcherExecutor-752-thread-1) [    ] o.a.s.c.SolrCore [collection1] Registered new searcher Searcher@36dc6d88[collection1] main{ExitableDirectoryReader(UninvertingDirectoryReader())}
   [junit4]   2> 385334 INFO  (TEST-DirectUpdateHandlerTest.testBasics-seed#[7AE6C28A821C56DC]) [    ] o.a.s.u.p.LogUpdateProcessorFactory [collection1]  webapp=null path=null params={}{commit=} 0 9
   [junit4]   2> 385335 INFO  (TEST-DirectUpdateHandlerTest.testBasics-seed#[7AE6C28A821C56DC]) [    ] o.a.s.c.S.Request [collection1]  webapp=null path=null params={wt=xml&q=id:6} hits=0 status=0 QTime=0
   [junit4]   2> 385336 INFO  (TEST-DirectUpdateHandlerTest.testBasics-seed#[7AE6C28A821C56DC]) [    ] o.a.s.SolrTestCaseJ4 ###Ending testBasics
   [junit4]   2> 385336 INFO  (SUITE-DirectUpdateHandlerTest-seed#[7AE6C28A821C56DC]-worker) [    ] o.a.s.SolrTestCaseJ4 ###deleteCore
   [junit4]   2> 385337 INFO  (SUITE-DirectUpdateHandlerTest-seed#[7AE6C28A821C56DC]-worker) [    ] o.a.s.c.CoreContainer Shutting down CoreContainer instance=1997686601
   [junit4]   2> 385337 INFO  (coreCloseExecutor-756-thread-1) [    x:collection1] o.a.s.c.SolrCore [collection1]  CLOSING SolrCore org.apache.solr.core.SolrCore@79b9d133
   [junit4]   2> 385337 INFO  (coreCloseExecutor-756-thread-1) [    x:collection1] o.a.s.u.DirectUpdateHandler2 closing DirectUpdateHandler2{commits=13,autocommits=0,soft autocommits=0,optimizes=0,rollbacks=1,expungeDeletes=1,docsPending=0,adds=0,deletesById=0,deletesByQuery=0,errors=0,cumulative_adds=12,cumulative_deletesById=1,cumulative_deletesByQuery=5,cumulative_errors=0}
   [junit4]   2> 385338 INFO  (coreCloseExecutor-756-thread-1) [    x:collection1] o.a.s.u.SolrCoreState Closing SolrCoreState
   [junit4]   2> 385338 INFO  (coreCloseExecutor-756-thread-1) [    x:collection1] o.a.s.u.DefaultSolrCoreState SolrCoreState ref count has reached 0 - closing IndexWriter
   [junit4]   2> 385338 INFO  (coreCloseExecutor-756-thread-1) [    x:collection1] o.a.s.u.DefaultSolrCoreState closing IndexWriter with IndexWriterCloser
   [junit4]   2> 385340 INFO  (coreCloseExecutor-756-thread-1) [    x:collection1] o.a.s.c.SolrCore [collection1] Closing main searcher on request.
   [junit4]   2> 385357 INFO  (coreCloseExecutor-756-thread-1) [    x:collection1] o.a.s.c.CachingDirectoryFactory Closing MockFSDirectoryFactory - 2 directories currently being tracked
   [junit4]   2> 397470 ERROR (coreCloseExecutor-756-thread-1) [    x:collection1] o.a.s.c.CachingDirectoryFactory Timeout waiting for all directory ref counts to be released - gave up waiting on CachedDir<<refCount=1;path=/x1/jenkins/jenkins-slave/workspace/Lucene-Solr-Tests-5.5-Java7/solr/build/solr-core/test/J2/temp/solr.update.DirectUpdateHandlerTest_7AE6C28A821C56DC-001/init-core-data-001/index;done=false>>
   [junit4]   2> 397471 ERROR (coreCloseExecutor-756-thread-1) [    x:collection1] o.a.s.c.CachingDirectoryFactory Error closing directory:org.apache.solr.common.SolrException: Timeout waiting for all directory ref counts to be released - gave up waiting on CachedDir<<refCount=1;path=/x1/jenkins/jenkins-slave/workspace/Lucene-Solr-Tests-5.5-Java7/solr/build/solr-core/test/J2/temp/solr.update.DirectUpdateHandlerTest_7AE6C28A821C56DC-001/init-core-data-001/index;done=false>>
   [junit4]   2> 	at org.apache.solr.core.CachingDirectoryFactory.close(CachingDirectoryFactory.java:187)
   [junit4]   2> 	at org.apache.solr.core.SolrCore.close(SolrCore.java:1275)
   [junit4]   2> 	at org.apache.solr.core.SolrCores$2.call(SolrCores.java:134)
   [junit4]   2> 	at org.apache.solr.core.SolrCores$2.call(SolrCores.java:129)
   [junit4]   2> 	at java.util.concurrent.FutureTask.run(FutureTask.java:262)
   [junit4]   2> 	at org.apache.solr.common.util.ExecutorUtil$MDCAwareThreadPoolExecutor$1.run(ExecutorUtil.java:231)
   [junit4]   2> 	at java.util.concurrent.ThreadPoolExecutor.runWorker(ThreadPoolExecutor.java:1145)
   [junit4]   2> 	at java.util.concurrent.ThreadPoolExecutor$Worker.run(ThreadPoolExecutor.java:615)
   [junit4]   2> 	at java.lang.Thread.run(Thread.java:745)
   [junit4]   2> 
   [junit4]   2> 397471 INFO  (coreCloseExecutor-756-thread-1) [    x:collection1] o.a.s.c.CachingDirectoryFactory looking to close /x1/jenkins/jenkins-slave/workspace/Lucene-Solr-Tests-5.5-Java7/solr/build/solr-core/test/J2/temp/solr.update.DirectUpdateHandlerTest_7AE6C28A821C56DC-001/init-core-data-001 [CachedDir<<refCount=0;path=/x1/jenkins/jenkins-slave/workspace/Lucene-Solr-Tests-5.5-Java7/solr/build/solr-core/test/J2/temp/solr.update.DirectUpdateHandlerTest_7AE6C28A821C56DC-001/init-core-data-001;done=false>>]
   [junit4]   2> 397471 INFO  (coreCloseExecutor-756-thread-1) [    x:collection1] o.a.s.c.CachingDirectoryFactory Closing directory: /x1/jenkins/jenkins-slave/workspace/Lucene-Solr-Tests-5.5-Java7/solr/build/solr-core/test/J2/temp/solr.update.DirectUpdateHandlerTest_7AE6C28A821C56DC-001/init-core-data-001
   [junit4]   2> 397471 ERROR (coreCloseExecutor-756-thread-1) [    x:collection1] o.a.s.c.SolrCore java.lang.AssertionError: 1
   [junit4]   2> 	at org.apache.solr.core.CachingDirectoryFactory.close(CachingDirectoryFactory.java:201)
   [junit4]   2> 	at org.apache.solr.core.SolrCore.close(SolrCore.java:1275)
   [junit4]   2> 	at org.apache.solr.core.SolrCores$2.call(SolrCores.java:134)
   [junit4]   2> 	at org.apache.solr.core.SolrCores$2.call(SolrCores.java:129)
   [junit4]   2> 	at java.util.concurrent.FutureTask.run(FutureTask.java:262)
   [junit4]   2> 	at org.apache.solr.common.util.ExecutorUtil$MDCAwareThreadPoolExecutor$1.run(ExecutorUtil.java:231)
   [junit4]   2> 	at java.util.concurrent.ThreadPoolExecutor.runWorker(ThreadPoolExecutor.java:1145)
   [junit4]   2> 	at java.util.concurrent.ThreadPoolExecutor$Worker.run(ThreadPoolExecutor.java:615)
   [junit4]   2> 	at java.lang.Thread.run(Thread.java:745)
   [junit4]   2> 
   [junit4]   2> 397472 ERROR (coreCloseExecutor-756-thread-1) [    x:collection1] o.a.s.c.SolrCores Error shutting down core:java.lang.AssertionError: 1
   [junit4]   2> 	at org.apache.solr.core.CachingDirectoryFactory.close(CachingDirectoryFactory.java:201)
   [junit4]   2> 	at org.apache.solr.core.SolrCore.close(SolrCore.java:1275)
   [junit4]   2> 	at org.apache.solr.core.SolrCores$2.call(SolrCores.java:134)
   [junit4]   2> 	at org.apache.solr.core.SolrCores$2.call(SolrCores.java:129)
   [junit4]   2> 	at java.util.concurrent.FutureTask.run(FutureTask.java:262)
   [junit4]   2> 	at org.apache.solr.common.util.ExecutorUtil$MDCAwareThreadPoolExecutor$1.run(ExecutorUtil.java:231)
   [junit4]   2> 	at java.util.concurrent.ThreadPoolExecutor.runWorker(ThreadPoolExecutor.java:1145)
   [junit4]   2> 	at java.util.concurrent.ThreadPoolExecutor$Worker.run(ThreadPoolExecutor.java:615)
   [junit4]   2> 	at java.lang.Thread.run(Thread.java:745)
   [junit4]   2> 
   [junit4]   2> NOTE: leaving temporary files on disk at: /x1/jenkins/jenkins-slave/workspace/Lucene-Solr-Tests-5.5-Java7/solr/build/solr-core/test/J2/temp/solr.update.DirectUpdateHandlerTest_7AE6C28A821C56DC-001
   [junit4]   2> NOTE: test params are: codec=Asserting(Lucene54): {id=PostingsFormat(name=Asserting)}, docValues:{}, sim=DefaultSimilarity, locale=ko, timezone=Europe/Madrid
   [junit4]   2> NOTE: Linux 3.13.0-52-generic amd64/Oracle Corporation 1.7.0_80 (64-bit)/cpus=4,threads=1,free=154528888,total=448266240
   [junit4]   2> NOTE: All tests run in this JVM: [TestConfigSetsAPI, TestFreeTextSuggestions, ReplicationFactorTest, HighlighterMaxOffsetTest, TestCSVResponseWriter, DistribJoinFromCollectionTest, TestTestInjection, TestClassicSimilarityFactory, SpatialRPTFieldTypeTest, SolrCloudExampleTest, TestCloudManagedSchemaConcurrent, TestElisionMultitermQuery, TestSha256AuthenticationProvider, PrimitiveFieldTypeTest, TestShortCircuitedRequests, DirectUpdateHandlerTest]
   [junit4] Completed [61/566 (1!)] on J2 in 14.90s, 7 tests, 1 failure <<< FAILURES!

[...truncated 1595 lines...]
BUILD FAILED
/x1/jenkins/jenkins-slave/workspace/Lucene-Solr-Tests-5.5-Java7/build.xml:750: The following error occurred while executing this line:
/x1/jenkins/jenkins-slave/workspace/Lucene-Solr-Tests-5.5-Java7/build.xml:694: The following error occurred while executing this line:
/x1/jenkins/jenkins-slave/workspace/Lucene-Solr-Tests-5.5-Java7/build.xml:59: The following error occurred while executing this line:
/x1/jenkins/jenkins-slave/workspace/Lucene-Solr-Tests-5.5-Java7/solr/build.xml:233: The following error occurred while executing this line:
/x1/jenkins/jenkins-slave/workspace/Lucene-Solr-Tests-5.5-Java7/solr/common-build.xml:534: The following error occurred while executing this line:
/x1/jenkins/jenkins-slave/workspace/Lucene-Solr-Tests-5.5-Java7/lucene/common-build.xml:1477: The following error occurred while executing this line:
/x1/jenkins/jenkins-slave/workspace/Lucene-Solr-Tests-5.5-Java7/lucene/common-build.xml:1033: There were test failures: 566 suites (7 ignored), 2275 tests, 1 failure, 55 ignored (39 assumptions) [seed: 7AE6C28A821C56DC]

Total time: 63 minutes 1 second
Build step 'Invoke Ant' marked build as failure
Archiving artifacts
Recording test results
Email was triggered for: Failure - Any
Sending email for trigger: Failure - Any



Mime
View raw message