lucene-dev mailing list archives

Site index · List index
Message view « Date » · « Thread »
Top « Date » · « Thread »
From Policeman Jenkins Server <jenk...@thetaphi.de>
Subject [JENKINS-EA] Lucene-Solr-5.x-Linux (64bit/jdk-9-ea+105) - Build # 15600 - Still Failing!
Date Wed, 17 Feb 2016 06:44:35 GMT
Build: http://jenkins.thetaphi.de/job/Lucene-Solr-5.x-Linux/15600/
Java: 64bit/jdk-9-ea+105 -XX:-UseCompressedOops -XX:+UseConcMarkSweepGC -XX:-CompactStrings
-XX:-UseSuperWord

3 tests failed.
FAILED:  org.apache.lucene.codecs.lucene50.TestBlockPostingsFormat3.test

Error Message:
9

Stack Trace:
java.lang.ArrayIndexOutOfBoundsException: 9
	at __randomizedtesting.SeedInfo.seed([700097738256FA74:F854A8A92CAA978C]:0)
	at org.apache.lucene.util.automaton.MinimizationOperations.minimize(MinimizationOperations.java:235)
	at org.apache.lucene.util.automaton.RegExp.toAutomatonInternal(RegExp.java:524)
	at org.apache.lucene.util.automaton.RegExp.toAutomaton(RegExp.java:495)
	at org.apache.lucene.util.automaton.RegExp.toAutomaton(RegExp.java:426)
	at org.apache.lucene.codecs.lucene50.TestBlockPostingsFormat3.assertTerms(TestBlockPostingsFormat3.java:186)
	at org.apache.lucene.codecs.lucene50.TestBlockPostingsFormat3.verify(TestBlockPostingsFormat3.java:153)
	at org.apache.lucene.codecs.lucene50.TestBlockPostingsFormat3.test(TestBlockPostingsFormat3.java:137)
	at sun.reflect.NativeMethodAccessorImpl.invoke0(Native Method)
	at sun.reflect.NativeMethodAccessorImpl.invoke(NativeMethodAccessorImpl.java:62)
	at sun.reflect.DelegatingMethodAccessorImpl.invoke(DelegatingMethodAccessorImpl.java:43)
	at java.lang.reflect.Method.invoke(Method.java:520)
	at com.carrotsearch.randomizedtesting.RandomizedRunner.invoke(RandomizedRunner.java:1764)
	at com.carrotsearch.randomizedtesting.RandomizedRunner$8.evaluate(RandomizedRunner.java:871)
	at com.carrotsearch.randomizedtesting.RandomizedRunner$9.evaluate(RandomizedRunner.java:907)
	at com.carrotsearch.randomizedtesting.RandomizedRunner$10.evaluate(RandomizedRunner.java:921)
	at org.apache.lucene.util.TestRuleSetupTeardownChained$1.evaluate(TestRuleSetupTeardownChained.java:49)
	at org.apache.lucene.util.AbstractBeforeAfterRule$1.evaluate(AbstractBeforeAfterRule.java:45)
	at org.apache.lucene.util.TestRuleThreadAndTestName$1.evaluate(TestRuleThreadAndTestName.java:48)
	at org.apache.lucene.util.TestRuleIgnoreAfterMaxFailures$1.evaluate(TestRuleIgnoreAfterMaxFailures.java:64)
	at org.apache.lucene.util.TestRuleMarkFailure$1.evaluate(TestRuleMarkFailure.java:47)
	at com.carrotsearch.randomizedtesting.rules.StatementAdapter.evaluate(StatementAdapter.java:36)
	at com.carrotsearch.randomizedtesting.ThreadLeakControl$StatementRunner.run(ThreadLeakControl.java:367)
	at com.carrotsearch.randomizedtesting.ThreadLeakControl.forkTimeoutingTask(ThreadLeakControl.java:809)
	at com.carrotsearch.randomizedtesting.ThreadLeakControl$3.evaluate(ThreadLeakControl.java:460)
	at com.carrotsearch.randomizedtesting.RandomizedRunner.runSingleTest(RandomizedRunner.java:880)
	at com.carrotsearch.randomizedtesting.RandomizedRunner$5.evaluate(RandomizedRunner.java:781)
	at com.carrotsearch.randomizedtesting.RandomizedRunner$6.evaluate(RandomizedRunner.java:816)
	at com.carrotsearch.randomizedtesting.RandomizedRunner$7.evaluate(RandomizedRunner.java:827)
	at org.apache.lucene.util.AbstractBeforeAfterRule$1.evaluate(AbstractBeforeAfterRule.java:45)
	at com.carrotsearch.randomizedtesting.rules.StatementAdapter.evaluate(StatementAdapter.java:36)
	at org.apache.lucene.util.TestRuleStoreClassName$1.evaluate(TestRuleStoreClassName.java:41)
	at com.carrotsearch.randomizedtesting.rules.NoShadowingOrOverridesOnMethodsRule$1.evaluate(NoShadowingOrOverridesOnMethodsRule.java:40)
	at com.carrotsearch.randomizedtesting.rules.NoShadowingOrOverridesOnMethodsRule$1.evaluate(NoShadowingOrOverridesOnMethodsRule.java:40)
	at com.carrotsearch.randomizedtesting.rules.StatementAdapter.evaluate(StatementAdapter.java:36)
	at com.carrotsearch.randomizedtesting.rules.StatementAdapter.evaluate(StatementAdapter.java:36)
	at com.carrotsearch.randomizedtesting.rules.StatementAdapter.evaluate(StatementAdapter.java:36)
	at org.apache.lucene.util.TestRuleAssertionsRequired$1.evaluate(TestRuleAssertionsRequired.java:53)
	at org.apache.lucene.util.TestRuleMarkFailure$1.evaluate(TestRuleMarkFailure.java:47)
	at org.apache.lucene.util.TestRuleIgnoreAfterMaxFailures$1.evaluate(TestRuleIgnoreAfterMaxFailures.java:64)
	at org.apache.lucene.util.TestRuleIgnoreTestSuites$1.evaluate(TestRuleIgnoreTestSuites.java:54)
	at com.carrotsearch.randomizedtesting.rules.StatementAdapter.evaluate(StatementAdapter.java:36)
	at com.carrotsearch.randomizedtesting.ThreadLeakControl$StatementRunner.run(ThreadLeakControl.java:367)
	at java.lang.Thread.run(Thread.java:804)


FAILED:  org.apache.lucene.util.automaton.TestLevenshteinAutomata.testLev2

Error Message:


Stack Trace:
java.lang.AssertionError
	at __randomizedtesting.SeedInfo.seed([700097738256FA74:DF87B108618DEC15]:0)
	at org.junit.Assert.fail(Assert.java:92)
	at org.junit.Assert.assertTrue(Assert.java:43)
	at org.junit.Assert.assertTrue(Assert.java:54)
	at org.apache.lucene.util.automaton.TestLevenshteinAutomata.assertLev(TestLevenshteinAutomata.java:108)
	at org.apache.lucene.util.automaton.TestLevenshteinAutomata.assertCharVectors(TestLevenshteinAutomata.java:60)
	at org.apache.lucene.util.automaton.TestLevenshteinAutomata.testLev2(TestLevenshteinAutomata.java:41)
	at sun.reflect.NativeMethodAccessorImpl.invoke0(Native Method)
	at sun.reflect.NativeMethodAccessorImpl.invoke(NativeMethodAccessorImpl.java:62)
	at sun.reflect.DelegatingMethodAccessorImpl.invoke(DelegatingMethodAccessorImpl.java:43)
	at java.lang.reflect.Method.invoke(Method.java:520)
	at com.carrotsearch.randomizedtesting.RandomizedRunner.invoke(RandomizedRunner.java:1764)
	at com.carrotsearch.randomizedtesting.RandomizedRunner$8.evaluate(RandomizedRunner.java:871)
	at com.carrotsearch.randomizedtesting.RandomizedRunner$9.evaluate(RandomizedRunner.java:907)
	at com.carrotsearch.randomizedtesting.RandomizedRunner$10.evaluate(RandomizedRunner.java:921)
	at org.apache.lucene.util.TestRuleSetupTeardownChained$1.evaluate(TestRuleSetupTeardownChained.java:49)
	at org.apache.lucene.util.AbstractBeforeAfterRule$1.evaluate(AbstractBeforeAfterRule.java:45)
	at org.apache.lucene.util.TestRuleThreadAndTestName$1.evaluate(TestRuleThreadAndTestName.java:48)
	at org.apache.lucene.util.TestRuleIgnoreAfterMaxFailures$1.evaluate(TestRuleIgnoreAfterMaxFailures.java:64)
	at org.apache.lucene.util.TestRuleMarkFailure$1.evaluate(TestRuleMarkFailure.java:47)
	at com.carrotsearch.randomizedtesting.rules.StatementAdapter.evaluate(StatementAdapter.java:36)
	at com.carrotsearch.randomizedtesting.ThreadLeakControl$StatementRunner.run(ThreadLeakControl.java:367)
	at com.carrotsearch.randomizedtesting.ThreadLeakControl.forkTimeoutingTask(ThreadLeakControl.java:809)
	at com.carrotsearch.randomizedtesting.ThreadLeakControl$3.evaluate(ThreadLeakControl.java:460)
	at com.carrotsearch.randomizedtesting.RandomizedRunner.runSingleTest(RandomizedRunner.java:880)
	at com.carrotsearch.randomizedtesting.RandomizedRunner$5.evaluate(RandomizedRunner.java:781)
	at com.carrotsearch.randomizedtesting.RandomizedRunner$6.evaluate(RandomizedRunner.java:816)
	at com.carrotsearch.randomizedtesting.RandomizedRunner$7.evaluate(RandomizedRunner.java:827)
	at org.apache.lucene.util.AbstractBeforeAfterRule$1.evaluate(AbstractBeforeAfterRule.java:45)
	at com.carrotsearch.randomizedtesting.rules.StatementAdapter.evaluate(StatementAdapter.java:36)
	at org.apache.lucene.util.TestRuleStoreClassName$1.evaluate(TestRuleStoreClassName.java:41)
	at com.carrotsearch.randomizedtesting.rules.NoShadowingOrOverridesOnMethodsRule$1.evaluate(NoShadowingOrOverridesOnMethodsRule.java:40)
	at com.carrotsearch.randomizedtesting.rules.NoShadowingOrOverridesOnMethodsRule$1.evaluate(NoShadowingOrOverridesOnMethodsRule.java:40)
	at com.carrotsearch.randomizedtesting.rules.StatementAdapter.evaluate(StatementAdapter.java:36)
	at com.carrotsearch.randomizedtesting.rules.StatementAdapter.evaluate(StatementAdapter.java:36)
	at com.carrotsearch.randomizedtesting.rules.StatementAdapter.evaluate(StatementAdapter.java:36)
	at org.apache.lucene.util.TestRuleAssertionsRequired$1.evaluate(TestRuleAssertionsRequired.java:53)
	at org.apache.lucene.util.TestRuleMarkFailure$1.evaluate(TestRuleMarkFailure.java:47)
	at org.apache.lucene.util.TestRuleIgnoreAfterMaxFailures$1.evaluate(TestRuleIgnoreAfterMaxFailures.java:64)
	at org.apache.lucene.util.TestRuleIgnoreTestSuites$1.evaluate(TestRuleIgnoreTestSuites.java:54)
	at com.carrotsearch.randomizedtesting.rules.StatementAdapter.evaluate(StatementAdapter.java:36)
	at com.carrotsearch.randomizedtesting.ThreadLeakControl$StatementRunner.run(ThreadLeakControl.java:367)
	at java.lang.Thread.run(Thread.java:804)


FAILED:  org.apache.lucene.util.automaton.TestLevenshteinAutomata.testLev1

Error Message:


Stack Trace:
java.lang.AssertionError
	at __randomizedtesting.SeedInfo.seed([700097738256FA74:A711859A59137487]:0)
	at org.junit.Assert.fail(Assert.java:92)
	at org.junit.Assert.assertTrue(Assert.java:43)
	at org.junit.Assert.assertTrue(Assert.java:54)
	at org.apache.lucene.util.automaton.TestLevenshteinAutomata.assertLev(TestLevenshteinAutomata.java:108)
	at org.apache.lucene.util.automaton.TestLevenshteinAutomata.assertCharVectors(TestLevenshteinAutomata.java:60)
	at org.apache.lucene.util.automaton.TestLevenshteinAutomata.testLev1(TestLevenshteinAutomata.java:36)
	at sun.reflect.NativeMethodAccessorImpl.invoke0(Native Method)
	at sun.reflect.NativeMethodAccessorImpl.invoke(NativeMethodAccessorImpl.java:62)
	at sun.reflect.DelegatingMethodAccessorImpl.invoke(DelegatingMethodAccessorImpl.java:43)
	at java.lang.reflect.Method.invoke(Method.java:520)
	at com.carrotsearch.randomizedtesting.RandomizedRunner.invoke(RandomizedRunner.java:1764)
	at com.carrotsearch.randomizedtesting.RandomizedRunner$8.evaluate(RandomizedRunner.java:871)
	at com.carrotsearch.randomizedtesting.RandomizedRunner$9.evaluate(RandomizedRunner.java:907)
	at com.carrotsearch.randomizedtesting.RandomizedRunner$10.evaluate(RandomizedRunner.java:921)
	at org.apache.lucene.util.TestRuleSetupTeardownChained$1.evaluate(TestRuleSetupTeardownChained.java:49)
	at org.apache.lucene.util.AbstractBeforeAfterRule$1.evaluate(AbstractBeforeAfterRule.java:45)
	at org.apache.lucene.util.TestRuleThreadAndTestName$1.evaluate(TestRuleThreadAndTestName.java:48)
	at org.apache.lucene.util.TestRuleIgnoreAfterMaxFailures$1.evaluate(TestRuleIgnoreAfterMaxFailures.java:64)
	at org.apache.lucene.util.TestRuleMarkFailure$1.evaluate(TestRuleMarkFailure.java:47)
	at com.carrotsearch.randomizedtesting.rules.StatementAdapter.evaluate(StatementAdapter.java:36)
	at com.carrotsearch.randomizedtesting.ThreadLeakControl$StatementRunner.run(ThreadLeakControl.java:367)
	at com.carrotsearch.randomizedtesting.ThreadLeakControl.forkTimeoutingTask(ThreadLeakControl.java:809)
	at com.carrotsearch.randomizedtesting.ThreadLeakControl$3.evaluate(ThreadLeakControl.java:460)
	at com.carrotsearch.randomizedtesting.RandomizedRunner.runSingleTest(RandomizedRunner.java:880)
	at com.carrotsearch.randomizedtesting.RandomizedRunner$5.evaluate(RandomizedRunner.java:781)
	at com.carrotsearch.randomizedtesting.RandomizedRunner$6.evaluate(RandomizedRunner.java:816)
	at com.carrotsearch.randomizedtesting.RandomizedRunner$7.evaluate(RandomizedRunner.java:827)
	at org.apache.lucene.util.AbstractBeforeAfterRule$1.evaluate(AbstractBeforeAfterRule.java:45)
	at com.carrotsearch.randomizedtesting.rules.StatementAdapter.evaluate(StatementAdapter.java:36)
	at org.apache.lucene.util.TestRuleStoreClassName$1.evaluate(TestRuleStoreClassName.java:41)
	at com.carrotsearch.randomizedtesting.rules.NoShadowingOrOverridesOnMethodsRule$1.evaluate(NoShadowingOrOverridesOnMethodsRule.java:40)
	at com.carrotsearch.randomizedtesting.rules.NoShadowingOrOverridesOnMethodsRule$1.evaluate(NoShadowingOrOverridesOnMethodsRule.java:40)
	at com.carrotsearch.randomizedtesting.rules.StatementAdapter.evaluate(StatementAdapter.java:36)
	at com.carrotsearch.randomizedtesting.rules.StatementAdapter.evaluate(StatementAdapter.java:36)
	at com.carrotsearch.randomizedtesting.rules.StatementAdapter.evaluate(StatementAdapter.java:36)
	at org.apache.lucene.util.TestRuleAssertionsRequired$1.evaluate(TestRuleAssertionsRequired.java:53)
	at org.apache.lucene.util.TestRuleMarkFailure$1.evaluate(TestRuleMarkFailure.java:47)
	at org.apache.lucene.util.TestRuleIgnoreAfterMaxFailures$1.evaluate(TestRuleIgnoreAfterMaxFailures.java:64)
	at org.apache.lucene.util.TestRuleIgnoreTestSuites$1.evaluate(TestRuleIgnoreTestSuites.java:54)
	at com.carrotsearch.randomizedtesting.rules.StatementAdapter.evaluate(StatementAdapter.java:36)
	at com.carrotsearch.randomizedtesting.ThreadLeakControl$StatementRunner.run(ThreadLeakControl.java:367)
	at java.lang.Thread.run(Thread.java:804)




Build Log:
[...truncated 920 lines...]
   [junit4] Suite: org.apache.lucene.util.automaton.TestLevenshteinAutomata
   [junit4]   2> NOTE: reproduce with: ant test  -Dtestcase=TestLevenshteinAutomata -Dtests.method=testLev2
-Dtests.seed=700097738256FA74 -Dtests.multiplier=3 -Dtests.slow=true -Dtests.locale=fr-SC
-Dtests.timezone=Asia/Ust-Nera -Dtests.asserts=true -Dtests.file.encoding=US-ASCII
   [junit4] FAILURE 0.02s J2 | TestLevenshteinAutomata.testLev2 <<<
   [junit4]    > Throwable #1: java.lang.AssertionError
   [junit4]    > 	at __randomizedtesting.SeedInfo.seed([700097738256FA74:DF87B108618DEC15]:0)
   [junit4]    > 	at org.apache.lucene.util.automaton.TestLevenshteinAutomata.assertLev(TestLevenshteinAutomata.java:108)
   [junit4]    > 	at org.apache.lucene.util.automaton.TestLevenshteinAutomata.assertCharVectors(TestLevenshteinAutomata.java:60)
   [junit4]    > 	at org.apache.lucene.util.automaton.TestLevenshteinAutomata.testLev2(TestLevenshteinAutomata.java:41)
   [junit4]    > 	at java.lang.Thread.run(Thread.java:804)
   [junit4]   2> NOTE: reproduce with: ant test  -Dtestcase=TestLevenshteinAutomata -Dtests.method=testLev1
-Dtests.seed=700097738256FA74 -Dtests.multiplier=3 -Dtests.slow=true -Dtests.locale=fr-SC
-Dtests.timezone=Asia/Ust-Nera -Dtests.asserts=true -Dtests.file.encoding=US-ASCII
   [junit4] FAILURE 0.01s J2 | TestLevenshteinAutomata.testLev1 <<<
   [junit4]    > Throwable #1: java.lang.AssertionError
   [junit4]    > 	at __randomizedtesting.SeedInfo.seed([700097738256FA74:A711859A59137487]:0)
   [junit4]    > 	at org.apache.lucene.util.automaton.TestLevenshteinAutomata.assertLev(TestLevenshteinAutomata.java:108)
   [junit4]    > 	at org.apache.lucene.util.automaton.TestLevenshteinAutomata.assertCharVectors(TestLevenshteinAutomata.java:60)
   [junit4]    > 	at org.apache.lucene.util.automaton.TestLevenshteinAutomata.testLev1(TestLevenshteinAutomata.java:36)
   [junit4]    > 	at java.lang.Thread.run(Thread.java:804)
   [junit4]   2> NOTE: test params are: codec=Asserting(Lucene54): {}, docValues:{}, sim=RandomSimilarity(queryNorm=true,coord=no):
{}, locale=fr-SC, timezone=Asia/Ust-Nera
   [junit4]   2> NOTE: Linux 3.19.0-47-generic amd64/Oracle Corporation 9-ea (64-bit)/cpus=12,threads=1,free=448123024,total=518979584
   [junit4]   2> NOTE: All tests run in this JVM: [TestCloseableThreadLocal, TestIndexWriterOnVMError,
TestDefaultSimilarity, TestLucene50SegmentInfoFormat, FiniteStringsIteratorTest, TestComplexExplanations,
TestStringHelper, TestQueryBuilder, TestThreadedForceMerge, TestIndexWriterLockRelease, FuzzyTermOnShortTermsTest,
TestCrashCausesCorruptIndex, TestTermdocPerf, TestDirectMonotonic, TestNRTThreads, TestLiveFieldValues,
TestFilteredSearch, TestFilterIterator, TestExceedMaxTermLength, TestAutomatonQuery, TestMatchNoDocsQuery,
TestPositiveScoresOnlyCollector, TestSortRescorer, TestWildcardRandom, TestIndexWriterMerging,
TestSpanExplanationsOfNonMatches, TestIndexableField, TestSpanFirstQuery, TestCompiledAutomaton,
TestFastCompressionMode, TestCachingWrapperFilter, TestMaxTermFrequency, TestIndexWriterReader,
TestCharFilter, TestSloppyMath, TestIndexWriterConfig, TestDeterminism, TestRateLimiter, TestSameTokenSamePosition,
TestSloppyPhraseQuery, TestBooleanOr, TestSpansEnum, TestNumericDocValuesUpdates, TestBytesStore,
TestConsistentFieldNumbers, TestMixedDocValuesUpdates, TestByteArrayDataInput, TestBufferedIndexInput,
TestPackedTokenAttributeImpl, TestMultiValuedNumericRangeQuery, TestFuzzyQuery, TestPerFieldPostingsFormat,
TestNumericRangeQuery32, TestBitDocIdSetBuilder, TestMaxPosition, TestOmitNorms, TestRegexpRandom,
TestReaderWrapperDVTypeCheck, TestExternalCodecs, TestDocumentWriter, TestQueryWrapperFilter,
TestComplexExplanationsOfNonMatches, TestIndexWriterExceptions2, TestSpans, TestSimpleExplanations,
TestBooleanQueryVisitSubscorers, TestFilterDirectoryReader, TestDeterminizeLexicon, TestSortedSetSortField,
TestDocCount, TestFSTs, TestNumericRangeQuery64, TestAddIndexes, TestShardSearching, TestMultiMMap,
TestDeletionPolicy, TestBasics, TestFlushByRamOrCountsPolicy, TestIndexWriterMergePolicy,
TestPersistentSnapshotDeletionPolicy, TestAtomicUpdate, TestStressAdvance, TestNorms, TestIndexWriterCommit,
TestSearchWithThreads, TestSearchAfter, TestConcurrentMergeScheduler, TestNeverDelete, TestTopDocsMerge,
TestLongPostings, TestRollingUpdates, TestSnapshotDeletionPolicy, TestIndexWriterUnicode,
TestNRTReaderWithThreads, TestTieredMergePolicy, TestLevenshteinAutomata]
   [junit4] Completed [189/421 (1!)] on J2 in 0.06s, 4 tests, 2 failures <<< FAILURES!

[...truncated 390 lines...]
   [junit4] Suite: org.apache.lucene.codecs.lucene50.TestBlockPostingsFormat3
   [junit4]   2> NOTE: reproduce with: ant test  -Dtestcase=TestBlockPostingsFormat3 -Dtests.method=test
-Dtests.seed=700097738256FA74 -Dtests.multiplier=3 -Dtests.slow=true -Dtests.locale=my -Dtests.timezone=Europe/Zagreb
-Dtests.asserts=true -Dtests.file.encoding=US-ASCII
   [junit4] ERROR   0.12s J2 | TestBlockPostingsFormat3.test <<<
   [junit4]    > Throwable #1: java.lang.ArrayIndexOutOfBoundsException: 9
   [junit4]    > 	at __randomizedtesting.SeedInfo.seed([700097738256FA74:F854A8A92CAA978C]:0)
   [junit4]    > 	at org.apache.lucene.util.automaton.MinimizationOperations.minimize(MinimizationOperations.java:235)
   [junit4]    > 	at org.apache.lucene.util.automaton.RegExp.toAutomatonInternal(RegExp.java:524)
   [junit4]    > 	at org.apache.lucene.util.automaton.RegExp.toAutomaton(RegExp.java:495)
   [junit4]    > 	at org.apache.lucene.util.automaton.RegExp.toAutomaton(RegExp.java:426)
   [junit4]    > 	at org.apache.lucene.codecs.lucene50.TestBlockPostingsFormat3.assertTerms(TestBlockPostingsFormat3.java:186)
   [junit4]    > 	at org.apache.lucene.codecs.lucene50.TestBlockPostingsFormat3.verify(TestBlockPostingsFormat3.java:153)
   [junit4]    > 	at org.apache.lucene.codecs.lucene50.TestBlockPostingsFormat3.test(TestBlockPostingsFormat3.java:137)
   [junit4]    > 	at java.lang.Thread.run(Thread.java:804)
   [junit4]   2> NOTE: test params are: codec=Asserting(Lucene54): {}, docValues:{}, sim=DefaultSimilarity,
locale=my, timezone=Europe/Zagreb
   [junit4]   2> NOTE: Linux 3.19.0-47-generic amd64/Oracle Corporation 9-ea (64-bit)/cpus=12,threads=1,free=356115016,total=518979584
   [junit4]   2> NOTE: All tests run in this JVM: [TestCloseableThreadLocal, TestIndexWriterOnVMError,
TestDefaultSimilarity, TestLucene50SegmentInfoFormat, FiniteStringsIteratorTest, TestComplexExplanations,
TestStringHelper, TestQueryBuilder, TestThreadedForceMerge, TestIndexWriterLockRelease, FuzzyTermOnShortTermsTest,
TestCrashCausesCorruptIndex, TestTermdocPerf, TestDirectMonotonic, TestNRTThreads, TestLiveFieldValues,
TestFilteredSearch, TestFilterIterator, TestExceedMaxTermLength, TestAutomatonQuery, TestMatchNoDocsQuery,
TestPositiveScoresOnlyCollector, TestSortRescorer, TestWildcardRandom, TestIndexWriterMerging,
TestSpanExplanationsOfNonMatches, TestIndexableField, TestSpanFirstQuery, TestCompiledAutomaton,
TestFastCompressionMode, TestCachingWrapperFilter, TestMaxTermFrequency, TestIndexWriterReader,
TestCharFilter, TestSloppyMath, TestIndexWriterConfig, TestDeterminism, TestRateLimiter, TestSameTokenSamePosition,
TestSloppyPhraseQuery, TestBooleanOr, TestSpansEnum, TestNumericDocValuesUpdates, TestBytesStore,
TestConsistentFieldNumbers, TestMixedDocValuesUpdates, TestByteArrayDataInput, TestBufferedIndexInput,
TestPackedTokenAttributeImpl, TestMultiValuedNumericRangeQuery, TestFuzzyQuery, TestPerFieldPostingsFormat,
TestNumericRangeQuery32, TestBitDocIdSetBuilder, TestMaxPosition, TestOmitNorms, TestRegexpRandom,
TestReaderWrapperDVTypeCheck, TestExternalCodecs, TestDocumentWriter, TestQueryWrapperFilter,
TestComplexExplanationsOfNonMatches, TestIndexWriterExceptions2, TestSpans, TestSimpleExplanations,
TestBooleanQueryVisitSubscorers, TestFilterDirectoryReader, TestDeterminizeLexicon, TestSortedSetSortField,
TestDocCount, TestFSTs, TestNumericRangeQuery64, TestAddIndexes, TestShardSearching, TestMultiMMap,
TestDeletionPolicy, TestBasics, TestFlushByRamOrCountsPolicy, TestIndexWriterMergePolicy,
TestPersistentSnapshotDeletionPolicy, TestAtomicUpdate, TestStressAdvance, TestNorms, TestIndexWriterCommit,
TestSearchWithThreads, TestSearchAfter, TestConcurrentMergeScheduler, TestNeverDelete, TestTopDocsMerge,
TestLongPostings, TestRollingUpdates, TestSnapshotDeletionPolicy, TestIndexWriterUnicode,
TestNRTReaderWithThreads, TestTieredMergePolicy, TestLevenshteinAutomata, TestDirectoryReader,
TestPhraseQuery, TestCollectionUtil, TestFieldCacheRewriteMethod, TestTransactions, TestPerFieldPostingsFormat2,
TestNumericUtils, TestIndexWriterOnDiskFull, TestPostingsOffsets, TestSpanExplanations, TestStressIndexing2,
TestMultiPhraseQuery, TestBagOfPostings, TestMultiFields, TestSpanSearchEquivalence, TestPrefixInBooleanQuery,
TestSegmentTermEnum, TestSortRandom, TestAllFilesHaveCodecHeader, TestTermScorer, TestSumDocFreq,
TestMultiLevelSkipList, TestSearchForDuplicates, TestIndexFileDeleter, TestMatchAllDocsQuery,
TestDocIdSet, TestBinaryTerms, TestConjunctions, TestField, TestRollingBuffer, TestFilterLeafReader,
TestCachingTokenFilter, TestCharsRef, TestBinaryDocument, TestAttributeSource, TestRecyclingByteBlockAllocator,
TestRamUsageEstimator, TestNoMergeScheduler, TestNamedSPILoader, TestBytesRef, TestDemo, TestRollback,
TestTwoPhaseCommitTool, TestPrefixFilter, Test4GBStoredFields, TestReaderClosed, TestScoreCachingWrappingScorer,
Test2BPositions, Test2BPostingsBytes, TestNewestSegment, Test2BBinaryDocValues, TestReusableStringReader,
TestBlockPostingsFormat3]
   [junit4] Completed [314/421 (2!)] on J2 in 0.13s, 1 test, 1 error <<< FAILURES!

[...truncated 449 lines...]
BUILD FAILED
/home/jenkins/workspace/Lucene-Solr-5.x-Linux/build.xml:750: The following error occurred
while executing this line:
/home/jenkins/workspace/Lucene-Solr-5.x-Linux/build.xml:694: The following error occurred
while executing this line:
/home/jenkins/workspace/Lucene-Solr-5.x-Linux/build.xml:59: The following error occurred while
executing this line:
/home/jenkins/workspace/Lucene-Solr-5.x-Linux/lucene/build.xml:50: The following error occurred
while executing this line:
/home/jenkins/workspace/Lucene-Solr-5.x-Linux/lucene/common-build.xml:1477: The following
error occurred while executing this line:
/home/jenkins/workspace/Lucene-Solr-5.x-Linux/lucene/common-build.xml:1033: There were test
failures: 421 suites (1 ignored), 3386 tests, 1 error, 2 failures, 147 ignored (143 assumptions)
[seed: 700097738256FA74]

Total time: 6 minutes 59 seconds
Build step 'Invoke Ant' marked build as failure
Archiving artifacts
[WARNINGS] Skipping publisher since build result is FAILURE
Recording test results
Email was triggered for: Failure - Any
Sending email for trigger: Failure - Any



Mime
View raw message