lucene-dev mailing list archives

Site index · List index
Message view « Date » · « Thread »
Top « Date » · « Thread »
From Policeman Jenkins Server <jenk...@thetaphi.de>
Subject [JENKINS-EA] Lucene-Solr-trunk-Linux (32bit/jdk-9-ea+105) - Build # 15913 - Still Failing!
Date Wed, 17 Feb 2016 16:59:42 GMT
Build: http://jenkins.thetaphi.de/job/Lucene-Solr-trunk-Linux/15913/
Java: 32bit/jdk-9-ea+105 -server -XX:+UseParallelGC -XX:-UseSuperWord

4 tests failed.
FAILED:  junit.framework.TestSuite.org.apache.solr.cloud.SaslZkACLProviderTest

Error Message:
5 threads leaked from SUITE scope at org.apache.solr.cloud.SaslZkACLProviderTest:     1) Thread[id=12045, name=changePwdReplayCache.data, state=TIMED_WAITING, group=TGRP-SaslZkACLProviderTest]         at jdk.internal.misc.Unsafe.park(Native Method)         at java.util.concurrent.locks.LockSupport.parkNanos(LockSupport.java:230)         at java.util.concurrent.locks.AbstractQueuedSynchronizer$ConditionObject.awaitNanos(AbstractQueuedSynchronizer.java:2106)         at java.util.concurrent.ScheduledThreadPoolExecutor$DelayedWorkQueue.take(ScheduledThreadPoolExecutor.java:1131)         at java.util.concurrent.ScheduledThreadPoolExecutor$DelayedWorkQueue.take(ScheduledThreadPoolExecutor.java:848)         at java.util.concurrent.ThreadPoolExecutor.getTask(ThreadPoolExecutor.java:1083)         at java.util.concurrent.ThreadPoolExecutor.runWorker(ThreadPoolExecutor.java:1143)         at java.util.concurrent.ThreadPoolExecutor$Worker.run(ThreadPoolExecutor.java:632)         at java.lang.Thread.run(Thread.java:804)    2) Thread[id=12043, name=apacheds, state=WAITING, group=TGRP-SaslZkACLProviderTest]         at java.lang.Object.wait(Native Method)         at java.lang.Object.wait(Object.java:516)         at java.util.TimerThread.mainLoop(Timer.java:526)         at java.util.TimerThread.run(Timer.java:505)    3) Thread[id=12047, name=ou=system.data, state=TIMED_WAITING, group=TGRP-SaslZkACLProviderTest]         at jdk.internal.misc.Unsafe.park(Native Method)         at java.util.concurrent.locks.LockSupport.parkNanos(LockSupport.java:230)         at java.util.concurrent.locks.AbstractQueuedSynchronizer$ConditionObject.awaitNanos(AbstractQueuedSynchronizer.java:2106)         at java.util.concurrent.ScheduledThreadPoolExecutor$DelayedWorkQueue.take(ScheduledThreadPoolExecutor.java:1131)         at java.util.concurrent.ScheduledThreadPoolExecutor$DelayedWorkQueue.take(ScheduledThreadPoolExecutor.java:848)         at java.util.concurrent.ThreadPoolExecutor.getTask(ThreadPoolExecutor.java:1083)         at java.util.concurrent.ThreadPoolExecutor.runWorker(ThreadPoolExecutor.java:1143)         at java.util.concurrent.ThreadPoolExecutor$Worker.run(ThreadPoolExecutor.java:632)         at java.lang.Thread.run(Thread.java:804)    4) Thread[id=12044, name=groupCache.data, state=TIMED_WAITING, group=TGRP-SaslZkACLProviderTest]         at jdk.internal.misc.Unsafe.park(Native Method)         at java.util.concurrent.locks.LockSupport.parkNanos(LockSupport.java:230)         at java.util.concurrent.locks.AbstractQueuedSynchronizer$ConditionObject.awaitNanos(AbstractQueuedSynchronizer.java:2106)         at java.util.concurrent.ScheduledThreadPoolExecutor$DelayedWorkQueue.take(ScheduledThreadPoolExecutor.java:1131)         at java.util.concurrent.ScheduledThreadPoolExecutor$DelayedWorkQueue.take(ScheduledThreadPoolExecutor.java:848)         at java.util.concurrent.ThreadPoolExecutor.getTask(ThreadPoolExecutor.java:1083)         at java.util.concurrent.ThreadPoolExecutor.runWorker(ThreadPoolExecutor.java:1143)         at java.util.concurrent.ThreadPoolExecutor$Worker.run(ThreadPoolExecutor.java:632)         at java.lang.Thread.run(Thread.java:804)    5) Thread[id=12046, name=kdcReplayCache.data, state=TIMED_WAITING, group=TGRP-SaslZkACLProviderTest]         at jdk.internal.misc.Unsafe.park(Native Method)         at java.util.concurrent.locks.LockSupport.parkNanos(LockSupport.java:230)         at java.util.concurrent.locks.AbstractQueuedSynchronizer$ConditionObject.awaitNanos(AbstractQueuedSynchronizer.java:2106)         at java.util.concurrent.ScheduledThreadPoolExecutor$DelayedWorkQueue.take(ScheduledThreadPoolExecutor.java:1131)         at java.util.concurrent.ScheduledThreadPoolExecutor$DelayedWorkQueue.take(ScheduledThreadPoolExecutor.java:848)         at java.util.concurrent.ThreadPoolExecutor.getTask(ThreadPoolExecutor.java:1083)         at java.util.concurrent.ThreadPoolExecutor.runWorker(ThreadPoolExecutor.java:1143)         at java.util.concurrent.ThreadPoolExecutor$Worker.run(ThreadPoolExecutor.java:632)         at java.lang.Thread.run(Thread.java:804)

Stack Trace:
com.carrotsearch.randomizedtesting.ThreadLeakError: 5 threads leaked from SUITE scope at org.apache.solr.cloud.SaslZkACLProviderTest: 
   1) Thread[id=12045, name=changePwdReplayCache.data, state=TIMED_WAITING, group=TGRP-SaslZkACLProviderTest]
        at jdk.internal.misc.Unsafe.park(Native Method)
        at java.util.concurrent.locks.LockSupport.parkNanos(LockSupport.java:230)
        at java.util.concurrent.locks.AbstractQueuedSynchronizer$ConditionObject.awaitNanos(AbstractQueuedSynchronizer.java:2106)
        at java.util.concurrent.ScheduledThreadPoolExecutor$DelayedWorkQueue.take(ScheduledThreadPoolExecutor.java:1131)
        at java.util.concurrent.ScheduledThreadPoolExecutor$DelayedWorkQueue.take(ScheduledThreadPoolExecutor.java:848)
        at java.util.concurrent.ThreadPoolExecutor.getTask(ThreadPoolExecutor.java:1083)
        at java.util.concurrent.ThreadPoolExecutor.runWorker(ThreadPoolExecutor.java:1143)
        at java.util.concurrent.ThreadPoolExecutor$Worker.run(ThreadPoolExecutor.java:632)
        at java.lang.Thread.run(Thread.java:804)
   2) Thread[id=12043, name=apacheds, state=WAITING, group=TGRP-SaslZkACLProviderTest]
        at java.lang.Object.wait(Native Method)
        at java.lang.Object.wait(Object.java:516)
        at java.util.TimerThread.mainLoop(Timer.java:526)
        at java.util.TimerThread.run(Timer.java:505)
   3) Thread[id=12047, name=ou=system.data, state=TIMED_WAITING, group=TGRP-SaslZkACLProviderTest]
        at jdk.internal.misc.Unsafe.park(Native Method)
        at java.util.concurrent.locks.LockSupport.parkNanos(LockSupport.java:230)
        at java.util.concurrent.locks.AbstractQueuedSynchronizer$ConditionObject.awaitNanos(AbstractQueuedSynchronizer.java:2106)
        at java.util.concurrent.ScheduledThreadPoolExecutor$DelayedWorkQueue.take(ScheduledThreadPoolExecutor.java:1131)
        at java.util.concurrent.ScheduledThreadPoolExecutor$DelayedWorkQueue.take(ScheduledThreadPoolExecutor.java:848)
        at java.util.concurrent.ThreadPoolExecutor.getTask(ThreadPoolExecutor.java:1083)
        at java.util.concurrent.ThreadPoolExecutor.runWorker(ThreadPoolExecutor.java:1143)
        at java.util.concurrent.ThreadPoolExecutor$Worker.run(ThreadPoolExecutor.java:632)
        at java.lang.Thread.run(Thread.java:804)
   4) Thread[id=12044, name=groupCache.data, state=TIMED_WAITING, group=TGRP-SaslZkACLProviderTest]
        at jdk.internal.misc.Unsafe.park(Native Method)
        at java.util.concurrent.locks.LockSupport.parkNanos(LockSupport.java:230)
        at java.util.concurrent.locks.AbstractQueuedSynchronizer$ConditionObject.awaitNanos(AbstractQueuedSynchronizer.java:2106)
        at java.util.concurrent.ScheduledThreadPoolExecutor$DelayedWorkQueue.take(ScheduledThreadPoolExecutor.java:1131)
        at java.util.concurrent.ScheduledThreadPoolExecutor$DelayedWorkQueue.take(ScheduledThreadPoolExecutor.java:848)
        at java.util.concurrent.ThreadPoolExecutor.getTask(ThreadPoolExecutor.java:1083)
        at java.util.concurrent.ThreadPoolExecutor.runWorker(ThreadPoolExecutor.java:1143)
        at java.util.concurrent.ThreadPoolExecutor$Worker.run(ThreadPoolExecutor.java:632)
        at java.lang.Thread.run(Thread.java:804)
   5) Thread[id=12046, name=kdcReplayCache.data, state=TIMED_WAITING, group=TGRP-SaslZkACLProviderTest]
        at jdk.internal.misc.Unsafe.park(Native Method)
        at java.util.concurrent.locks.LockSupport.parkNanos(LockSupport.java:230)
        at java.util.concurrent.locks.AbstractQueuedSynchronizer$ConditionObject.awaitNanos(AbstractQueuedSynchronizer.java:2106)
        at java.util.concurrent.ScheduledThreadPoolExecutor$DelayedWorkQueue.take(ScheduledThreadPoolExecutor.java:1131)
        at java.util.concurrent.ScheduledThreadPoolExecutor$DelayedWorkQueue.take(ScheduledThreadPoolExecutor.java:848)
        at java.util.concurrent.ThreadPoolExecutor.getTask(ThreadPoolExecutor.java:1083)
        at java.util.concurrent.ThreadPoolExecutor.runWorker(ThreadPoolExecutor.java:1143)
        at java.util.concurrent.ThreadPoolExecutor$Worker.run(ThreadPoolExecutor.java:632)
        at java.lang.Thread.run(Thread.java:804)
	at __randomizedtesting.SeedInfo.seed([68CD79A836F2F5A3]:0)


FAILED:  junit.framework.TestSuite.org.apache.solr.cloud.SaslZkACLProviderTest

Error Message:
There are still zombie threads that couldn't be terminated:    1) Thread[id=12045, name=changePwdReplayCache.data, state=TIMED_WAITING, group=TGRP-SaslZkACLProviderTest]         at jdk.internal.misc.Unsafe.park(Native Method)         at java.util.concurrent.locks.LockSupport.parkNanos(LockSupport.java:230)         at java.util.concurrent.locks.AbstractQueuedSynchronizer$ConditionObject.awaitNanos(AbstractQueuedSynchronizer.java:2106)         at java.util.concurrent.ScheduledThreadPoolExecutor$DelayedWorkQueue.take(ScheduledThreadPoolExecutor.java:1131)         at java.util.concurrent.ScheduledThreadPoolExecutor$DelayedWorkQueue.take(ScheduledThreadPoolExecutor.java:848)         at java.util.concurrent.ThreadPoolExecutor.getTask(ThreadPoolExecutor.java:1083)         at java.util.concurrent.ThreadPoolExecutor.runWorker(ThreadPoolExecutor.java:1143)         at java.util.concurrent.ThreadPoolExecutor$Worker.run(ThreadPoolExecutor.java:632)         at java.lang.Thread.run(Thread.java:804)    2) Thread[id=12043, name=apacheds, state=WAITING, group=TGRP-SaslZkACLProviderTest]         at java.lang.Object.wait(Native Method)         at java.lang.Object.wait(Object.java:516)         at java.util.TimerThread.mainLoop(Timer.java:526)         at java.util.TimerThread.run(Timer.java:505)    3) Thread[id=12047, name=ou=system.data, state=TIMED_WAITING, group=TGRP-SaslZkACLProviderTest]         at jdk.internal.misc.Unsafe.park(Native Method)         at java.util.concurrent.locks.LockSupport.parkNanos(LockSupport.java:230)         at java.util.concurrent.locks.AbstractQueuedSynchronizer$ConditionObject.awaitNanos(AbstractQueuedSynchronizer.java:2106)         at java.util.concurrent.ScheduledThreadPoolExecutor$DelayedWorkQueue.take(ScheduledThreadPoolExecutor.java:1131)         at java.util.concurrent.ScheduledThreadPoolExecutor$DelayedWorkQueue.take(ScheduledThreadPoolExecutor.java:848)         at java.util.concurrent.ThreadPoolExecutor.getTask(ThreadPoolExecutor.java:1083)         at java.util.concurrent.ThreadPoolExecutor.runWorker(ThreadPoolExecutor.java:1143)         at java.util.concurrent.ThreadPoolExecutor$Worker.run(ThreadPoolExecutor.java:632)         at java.lang.Thread.run(Thread.java:804)    4) Thread[id=12044, name=groupCache.data, state=TIMED_WAITING, group=TGRP-SaslZkACLProviderTest]         at jdk.internal.misc.Unsafe.park(Native Method)         at java.util.concurrent.locks.LockSupport.parkNanos(LockSupport.java:230)         at java.util.concurrent.locks.AbstractQueuedSynchronizer$ConditionObject.awaitNanos(AbstractQueuedSynchronizer.java:2106)         at java.util.concurrent.ScheduledThreadPoolExecutor$DelayedWorkQueue.take(ScheduledThreadPoolExecutor.java:1131)         at java.util.concurrent.ScheduledThreadPoolExecutor$DelayedWorkQueue.take(ScheduledThreadPoolExecutor.java:848)         at java.util.concurrent.ThreadPoolExecutor.getTask(ThreadPoolExecutor.java:1083)         at java.util.concurrent.ThreadPoolExecutor.runWorker(ThreadPoolExecutor.java:1143)         at java.util.concurrent.ThreadPoolExecutor$Worker.run(ThreadPoolExecutor.java:632)         at java.lang.Thread.run(Thread.java:804)    5) Thread[id=12046, name=kdcReplayCache.data, state=TIMED_WAITING, group=TGRP-SaslZkACLProviderTest]         at jdk.internal.misc.Unsafe.park(Native Method)         at java.util.concurrent.locks.LockSupport.parkNanos(LockSupport.java:230)         at java.util.concurrent.locks.AbstractQueuedSynchronizer$ConditionObject.awaitNanos(AbstractQueuedSynchronizer.java:2106)         at java.util.concurrent.ScheduledThreadPoolExecutor$DelayedWorkQueue.take(ScheduledThreadPoolExecutor.java:1131)         at java.util.concurrent.ScheduledThreadPoolExecutor$DelayedWorkQueue.take(ScheduledThreadPoolExecutor.java:848)         at java.util.concurrent.ThreadPoolExecutor.getTask(ThreadPoolExecutor.java:1083)         at java.util.concurrent.ThreadPoolExecutor.runWorker(ThreadPoolExecutor.java:1143)         at java.util.concurrent.ThreadPoolExecutor$Worker.run(ThreadPoolExecutor.java:632)         at java.lang.Thread.run(Thread.java:804)

Stack Trace:
com.carrotsearch.randomizedtesting.ThreadLeakError: There are still zombie threads that couldn't be terminated:
   1) Thread[id=12045, name=changePwdReplayCache.data, state=TIMED_WAITING, group=TGRP-SaslZkACLProviderTest]
        at jdk.internal.misc.Unsafe.park(Native Method)
        at java.util.concurrent.locks.LockSupport.parkNanos(LockSupport.java:230)
        at java.util.concurrent.locks.AbstractQueuedSynchronizer$ConditionObject.awaitNanos(AbstractQueuedSynchronizer.java:2106)
        at java.util.concurrent.ScheduledThreadPoolExecutor$DelayedWorkQueue.take(ScheduledThreadPoolExecutor.java:1131)
        at java.util.concurrent.ScheduledThreadPoolExecutor$DelayedWorkQueue.take(ScheduledThreadPoolExecutor.java:848)
        at java.util.concurrent.ThreadPoolExecutor.getTask(ThreadPoolExecutor.java:1083)
        at java.util.concurrent.ThreadPoolExecutor.runWorker(ThreadPoolExecutor.java:1143)
        at java.util.concurrent.ThreadPoolExecutor$Worker.run(ThreadPoolExecutor.java:632)
        at java.lang.Thread.run(Thread.java:804)
   2) Thread[id=12043, name=apacheds, state=WAITING, group=TGRP-SaslZkACLProviderTest]
        at java.lang.Object.wait(Native Method)
        at java.lang.Object.wait(Object.java:516)
        at java.util.TimerThread.mainLoop(Timer.java:526)
        at java.util.TimerThread.run(Timer.java:505)
   3) Thread[id=12047, name=ou=system.data, state=TIMED_WAITING, group=TGRP-SaslZkACLProviderTest]
        at jdk.internal.misc.Unsafe.park(Native Method)
        at java.util.concurrent.locks.LockSupport.parkNanos(LockSupport.java:230)
        at java.util.concurrent.locks.AbstractQueuedSynchronizer$ConditionObject.awaitNanos(AbstractQueuedSynchronizer.java:2106)
        at java.util.concurrent.ScheduledThreadPoolExecutor$DelayedWorkQueue.take(ScheduledThreadPoolExecutor.java:1131)
        at java.util.concurrent.ScheduledThreadPoolExecutor$DelayedWorkQueue.take(ScheduledThreadPoolExecutor.java:848)
        at java.util.concurrent.ThreadPoolExecutor.getTask(ThreadPoolExecutor.java:1083)
        at java.util.concurrent.ThreadPoolExecutor.runWorker(ThreadPoolExecutor.java:1143)
        at java.util.concurrent.ThreadPoolExecutor$Worker.run(ThreadPoolExecutor.java:632)
        at java.lang.Thread.run(Thread.java:804)
   4) Thread[id=12044, name=groupCache.data, state=TIMED_WAITING, group=TGRP-SaslZkACLProviderTest]
        at jdk.internal.misc.Unsafe.park(Native Method)
        at java.util.concurrent.locks.LockSupport.parkNanos(LockSupport.java:230)
        at java.util.concurrent.locks.AbstractQueuedSynchronizer$ConditionObject.awaitNanos(AbstractQueuedSynchronizer.java:2106)
        at java.util.concurrent.ScheduledThreadPoolExecutor$DelayedWorkQueue.take(ScheduledThreadPoolExecutor.java:1131)
        at java.util.concurrent.ScheduledThreadPoolExecutor$DelayedWorkQueue.take(ScheduledThreadPoolExecutor.java:848)
        at java.util.concurrent.ThreadPoolExecutor.getTask(ThreadPoolExecutor.java:1083)
        at java.util.concurrent.ThreadPoolExecutor.runWorker(ThreadPoolExecutor.java:1143)
        at java.util.concurrent.ThreadPoolExecutor$Worker.run(ThreadPoolExecutor.java:632)
        at java.lang.Thread.run(Thread.java:804)
   5) Thread[id=12046, name=kdcReplayCache.data, state=TIMED_WAITING, group=TGRP-SaslZkACLProviderTest]
        at jdk.internal.misc.Unsafe.park(Native Method)
        at java.util.concurrent.locks.LockSupport.parkNanos(LockSupport.java:230)
        at java.util.concurrent.locks.AbstractQueuedSynchronizer$ConditionObject.awaitNanos(AbstractQueuedSynchronizer.java:2106)
        at java.util.concurrent.ScheduledThreadPoolExecutor$DelayedWorkQueue.take(ScheduledThreadPoolExecutor.java:1131)
        at java.util.concurrent.ScheduledThreadPoolExecutor$DelayedWorkQueue.take(ScheduledThreadPoolExecutor.java:848)
        at java.util.concurrent.ThreadPoolExecutor.getTask(ThreadPoolExecutor.java:1083)
        at java.util.concurrent.ThreadPoolExecutor.runWorker(ThreadPoolExecutor.java:1143)
        at java.util.concurrent.ThreadPoolExecutor$Worker.run(ThreadPoolExecutor.java:632)
        at java.lang.Thread.run(Thread.java:804)
	at __randomizedtesting.SeedInfo.seed([68CD79A836F2F5A3]:0)


FAILED:  org.apache.solr.cloud.ChaosMonkeyNothingIsSafeTest.test

Error Message:
document count mismatch.  control=426 sum(shards)=425 cloudClient=425

Stack Trace:
java.lang.AssertionError: document count mismatch.  control=426 sum(shards)=425 cloudClient=425
	at __randomizedtesting.SeedInfo.seed([68CD79A836F2F5A3:E0994672980E985B]:0)
	at org.junit.Assert.fail(Assert.java:93)
	at org.apache.solr.cloud.AbstractFullDistribZkTestBase.checkShardConsistency(AbstractFullDistribZkTestBase.java:1317)
	at org.apache.solr.cloud.ChaosMonkeyNothingIsSafeTest.test(ChaosMonkeyNothingIsSafeTest.java:226)
	at sun.reflect.NativeMethodAccessorImpl.invoke0(Native Method)
	at sun.reflect.NativeMethodAccessorImpl.invoke(NativeMethodAccessorImpl.java:62)
	at sun.reflect.DelegatingMethodAccessorImpl.invoke(DelegatingMethodAccessorImpl.java:43)
	at java.lang.reflect.Method.invoke(Method.java:520)
	at com.carrotsearch.randomizedtesting.RandomizedRunner.invoke(RandomizedRunner.java:1764)
	at com.carrotsearch.randomizedtesting.RandomizedRunner$8.evaluate(RandomizedRunner.java:871)
	at com.carrotsearch.randomizedtesting.RandomizedRunner$9.evaluate(RandomizedRunner.java:907)
	at com.carrotsearch.randomizedtesting.RandomizedRunner$10.evaluate(RandomizedRunner.java:921)
	at org.apache.solr.BaseDistributedSearchTestCase$ShardsRepeatRule$ShardsFixedStatement.callStatement(BaseDistributedSearchTestCase.java:964)
	at org.apache.solr.BaseDistributedSearchTestCase$ShardsRepeatRule$ShardsStatement.evaluate(BaseDistributedSearchTestCase.java:939)
	at com.carrotsearch.randomizedtesting.rules.SystemPropertiesRestoreRule$1.evaluate(SystemPropertiesRestoreRule.java:57)
	at org.apache.lucene.util.TestRuleSetupTeardownChained$1.evaluate(TestRuleSetupTeardownChained.java:49)
	at org.apache.lucene.util.AbstractBeforeAfterRule$1.evaluate(AbstractBeforeAfterRule.java:45)
	at org.apache.lucene.util.TestRuleThreadAndTestName$1.evaluate(TestRuleThreadAndTestName.java:48)
	at org.apache.lucene.util.TestRuleIgnoreAfterMaxFailures$1.evaluate(TestRuleIgnoreAfterMaxFailures.java:64)
	at org.apache.lucene.util.TestRuleMarkFailure$1.evaluate(TestRuleMarkFailure.java:47)
	at com.carrotsearch.randomizedtesting.rules.StatementAdapter.evaluate(StatementAdapter.java:36)
	at com.carrotsearch.randomizedtesting.ThreadLeakControl$StatementRunner.run(ThreadLeakControl.java:367)
	at com.carrotsearch.randomizedtesting.ThreadLeakControl.forkTimeoutingTask(ThreadLeakControl.java:809)
	at com.carrotsearch.randomizedtesting.ThreadLeakControl$3.evaluate(ThreadLeakControl.java:460)
	at com.carrotsearch.randomizedtesting.RandomizedRunner.runSingleTest(RandomizedRunner.java:880)
	at com.carrotsearch.randomizedtesting.RandomizedRunner$5.evaluate(RandomizedRunner.java:781)
	at com.carrotsearch.randomizedtesting.RandomizedRunner$6.evaluate(RandomizedRunner.java:816)
	at com.carrotsearch.randomizedtesting.RandomizedRunner$7.evaluate(RandomizedRunner.java:827)
	at com.carrotsearch.randomizedtesting.rules.StatementAdapter.evaluate(StatementAdapter.java:36)
	at com.carrotsearch.randomizedtesting.rules.SystemPropertiesRestoreRule$1.evaluate(SystemPropertiesRestoreRule.java:57)
	at org.apache.lucene.util.AbstractBeforeAfterRule$1.evaluate(AbstractBeforeAfterRule.java:45)
	at com.carrotsearch.randomizedtesting.rules.StatementAdapter.evaluate(StatementAdapter.java:36)
	at org.apache.lucene.util.TestRuleStoreClassName$1.evaluate(TestRuleStoreClassName.java:41)
	at com.carrotsearch.randomizedtesting.rules.NoShadowingOrOverridesOnMethodsRule$1.evaluate(NoShadowingOrOverridesOnMethodsRule.java:40)
	at com.carrotsearch.randomizedtesting.rules.NoShadowingOrOverridesOnMethodsRule$1.evaluate(NoShadowingOrOverridesOnMethodsRule.java:40)
	at com.carrotsearch.randomizedtesting.rules.StatementAdapter.evaluate(StatementAdapter.java:36)
	at com.carrotsearch.randomizedtesting.rules.StatementAdapter.evaluate(StatementAdapter.java:36)
	at com.carrotsearch.randomizedtesting.rules.StatementAdapter.evaluate(StatementAdapter.java:36)
	at org.apache.lucene.util.TestRuleAssertionsRequired$1.evaluate(TestRuleAssertionsRequired.java:53)
	at org.apache.lucene.util.TestRuleMarkFailure$1.evaluate(TestRuleMarkFailure.java:47)
	at org.apache.lucene.util.TestRuleIgnoreAfterMaxFailures$1.evaluate(TestRuleIgnoreAfterMaxFailures.java:64)
	at org.apache.lucene.util.TestRuleIgnoreTestSuites$1.evaluate(TestRuleIgnoreTestSuites.java:54)
	at com.carrotsearch.randomizedtesting.rules.StatementAdapter.evaluate(StatementAdapter.java:36)
	at com.carrotsearch.randomizedtesting.ThreadLeakControl$StatementRunner.run(ThreadLeakControl.java:367)
	at java.lang.Thread.run(Thread.java:804)


FAILED:  org.apache.solr.cloud.SaslZkACLProviderTest.testSaslZkACLProvider

Error Message:
org.apache.directory.api.ldap.model.exception.LdapOtherException: org.apache.directory.api.ldap.model.exception.LdapOtherException: ERR_04447_CANNOT_NORMALIZE_VALUE Cannot normalize the wrapped value ERR_04473_NOT_VALID_VALUE Not a valid value '20090818022733Z' for the AttributeType 'ATTRIBUTE_TYPE ( 1.3.6.1.4.1.18060.0.4.1.2.35  NAME 'schemaModifyTimestamp'  DESC time which schema was modified  SUP modifyTimestamp  EQUALITY generalizedTimeMatch  ORDERING generalizedTimeOrderingMatch  SYNTAX 1.3.6.1.4.1.1466.115.121.1.24  USAGE directoryOperation  ) '

Stack Trace:
java.lang.RuntimeException: org.apache.directory.api.ldap.model.exception.LdapOtherException: org.apache.directory.api.ldap.model.exception.LdapOtherException: ERR_04447_CANNOT_NORMALIZE_VALUE Cannot normalize the wrapped value ERR_04473_NOT_VALID_VALUE Not a valid value '20090818022733Z' for the AttributeType 'ATTRIBUTE_TYPE ( 1.3.6.1.4.1.18060.0.4.1.2.35
 NAME 'schemaModifyTimestamp'
 DESC time which schema was modified
 SUP modifyTimestamp
 EQUALITY generalizedTimeMatch
 ORDERING generalizedTimeOrderingMatch
 SYNTAX 1.3.6.1.4.1.1466.115.121.1.24
 USAGE directoryOperation
 )
'
	at org.apache.solr.cloud.SaslZkACLProviderTest$SaslZkTestServer.run(SaslZkACLProviderTest.java:210)
	at org.apache.solr.cloud.SaslZkACLProviderTest.setUp(SaslZkACLProviderTest.java:80)
	at sun.reflect.GeneratedMethodAccessor2.invoke(Unknown Source)
	at sun.reflect.DelegatingMethodAccessorImpl.invoke(DelegatingMethodAccessorImpl.java:43)
	at java.lang.reflect.Method.invoke(Method.java:520)
	at com.carrotsearch.randomizedtesting.RandomizedRunner.invoke(RandomizedRunner.java:1764)
	at com.carrotsearch.randomizedtesting.RandomizedRunner$9.evaluate(RandomizedRunner.java:905)
	at com.carrotsearch.randomizedtesting.RandomizedRunner$10.evaluate(RandomizedRunner.java:921)
	at com.carrotsearch.randomizedtesting.rules.SystemPropertiesRestoreRule$1.evaluate(SystemPropertiesRestoreRule.java:57)
	at org.apache.lucene.util.TestRuleSetupTeardownChained$1.evaluate(TestRuleSetupTeardownChained.java:49)
	at org.apache.lucene.util.AbstractBeforeAfterRule$1.evaluate(AbstractBeforeAfterRule.java:45)
	at org.apache.lucene.util.TestRuleThreadAndTestName$1.evaluate(TestRuleThreadAndTestName.java:48)
	at org.apache.lucene.util.TestRuleIgnoreAfterMaxFailures$1.evaluate(TestRuleIgnoreAfterMaxFailures.java:64)
	at org.apache.lucene.util.TestRuleMarkFailure$1.evaluate(TestRuleMarkFailure.java:47)
	at com.carrotsearch.randomizedtesting.rules.StatementAdapter.evaluate(StatementAdapter.java:36)
	at com.carrotsearch.randomizedtesting.ThreadLeakControl$StatementRunner.run(ThreadLeakControl.java:367)
	at com.carrotsearch.randomizedtesting.ThreadLeakControl.forkTimeoutingTask(ThreadLeakControl.java:809)
	at com.carrotsearch.randomizedtesting.ThreadLeakControl$3.evaluate(ThreadLeakControl.java:460)
	at com.carrotsearch.randomizedtesting.RandomizedRunner.runSingleTest(RandomizedRunner.java:880)
	at com.carrotsearch.randomizedtesting.RandomizedRunner$5.evaluate(RandomizedRunner.java:781)
	at com.carrotsearch.randomizedtesting.RandomizedRunner$6.evaluate(RandomizedRunner.java:816)
	at com.carrotsearch.randomizedtesting.RandomizedRunner$7.evaluate(RandomizedRunner.java:827)
	at com.carrotsearch.randomizedtesting.rules.StatementAdapter.evaluate(StatementAdapter.java:36)
	at com.carrotsearch.randomizedtesting.rules.SystemPropertiesRestoreRule$1.evaluate(SystemPropertiesRestoreRule.java:57)
	at org.apache.lucene.util.AbstractBeforeAfterRule$1.evaluate(AbstractBeforeAfterRule.java:45)
	at com.carrotsearch.randomizedtesting.rules.StatementAdapter.evaluate(StatementAdapter.java:36)
	at org.apache.lucene.util.TestRuleStoreClassName$1.evaluate(TestRuleStoreClassName.java:41)
	at com.carrotsearch.randomizedtesting.rules.NoShadowingOrOverridesOnMethodsRule$1.evaluate(NoShadowingOrOverridesOnMethodsRule.java:40)
	at com.carrotsearch.randomizedtesting.rules.NoShadowingOrOverridesOnMethodsRule$1.evaluate(NoShadowingOrOverridesOnMethodsRule.java:40)
	at com.carrotsearch.randomizedtesting.rules.StatementAdapter.evaluate(StatementAdapter.java:36)
	at com.carrotsearch.randomizedtesting.rules.StatementAdapter.evaluate(StatementAdapter.java:36)
	at com.carrotsearch.randomizedtesting.rules.StatementAdapter.evaluate(StatementAdapter.java:36)
	at org.apache.lucene.util.TestRuleAssertionsRequired$1.evaluate(TestRuleAssertionsRequired.java:53)
	at org.apache.lucene.util.TestRuleMarkFailure$1.evaluate(TestRuleMarkFailure.java:47)
	at org.apache.lucene.util.TestRuleIgnoreAfterMaxFailures$1.evaluate(TestRuleIgnoreAfterMaxFailures.java:64)
	at org.apache.lucene.util.TestRuleIgnoreTestSuites$1.evaluate(TestRuleIgnoreTestSuites.java:54)
	at com.carrotsearch.randomizedtesting.rules.StatementAdapter.evaluate(StatementAdapter.java:36)
	at com.carrotsearch.randomizedtesting.ThreadLeakControl$StatementRunner.run(ThreadLeakControl.java:367)
	at java.lang.Thread.run(Thread.java:804)
Caused by: org.apache.directory.api.ldap.model.exception.LdapOtherException: org.apache.directory.api.ldap.model.exception.LdapOtherException: ERR_04447_CANNOT_NORMALIZE_VALUE Cannot normalize the wrapped value ERR_04473_NOT_VALID_VALUE Not a valid value '20090818022733Z' for the AttributeType 'ATTRIBUTE_TYPE ( 1.3.6.1.4.1.18060.0.4.1.2.35
 NAME 'schemaModifyTimestamp'
 DESC time which schema was modified
 SUP modifyTimestamp
 EQUALITY generalizedTimeMatch
 ORDERING generalizedTimeOrderingMatch
 SYNTAX 1.3.6.1.4.1.1466.115.121.1.24
 USAGE directoryOperation
 )
'
	at org.apache.directory.server.core.api.partition.AbstractPartition.initialize(AbstractPartition.java:84)
	at org.apache.directory.server.core.DefaultDirectoryService.initialize(DefaultDirectoryService.java:1808)
	at org.apache.directory.server.core.DefaultDirectoryService.startup(DefaultDirectoryService.java:1248)
	at org.apache.hadoop.minikdc.MiniKdc.initDirectoryService(MiniKdc.java:383)
	at org.apache.hadoop.minikdc.MiniKdc.start(MiniKdc.java:319)
	at org.apache.solr.cloud.SaslZkACLProviderTest$SaslZkTestServer.run(SaslZkACLProviderTest.java:203)
	... 38 more
Caused by: java.lang.RuntimeException: org.apache.directory.api.ldap.model.exception.LdapOtherException: ERR_04447_CANNOT_NORMALIZE_VALUE Cannot normalize the wrapped value ERR_04473_NOT_VALID_VALUE Not a valid value '20090818022733Z' for the AttributeType 'ATTRIBUTE_TYPE ( 1.3.6.1.4.1.18060.0.4.1.2.35
 NAME 'schemaModifyTimestamp'
 DESC time which schema was modified
 SUP modifyTimestamp
 EQUALITY generalizedTimeMatch
 ORDERING generalizedTimeOrderingMatch
 SYNTAX 1.3.6.1.4.1.1466.115.121.1.24
 USAGE directoryOperation
 )
'
	at org.apache.directory.server.core.api.schema.SchemaPartition.doInit(SchemaPartition.java:226)
	at org.apache.directory.server.core.api.partition.AbstractPartition.initialize(AbstractPartition.java:79)
	... 43 more
Caused by: org.apache.directory.api.ldap.model.exception.LdapOtherException: ERR_04447_CANNOT_NORMALIZE_VALUE Cannot normalize the wrapped value ERR_04473_NOT_VALID_VALUE Not a valid value '20090818022733Z' for the AttributeType 'ATTRIBUTE_TYPE ( 1.3.6.1.4.1.18060.0.4.1.2.35
 NAME 'schemaModifyTimestamp'
 DESC time which schema was modified
 SUP modifyTimestamp
 EQUALITY generalizedTimeMatch
 ORDERING generalizedTimeOrderingMatch
 SYNTAX 1.3.6.1.4.1.1466.115.121.1.24
 USAGE directoryOperation
 )
'
	at org.apache.directory.server.core.api.partition.AbstractPartition.initialize(AbstractPartition.java:84)
	at org.apache.directory.server.core.api.schema.SchemaPartition.doInit(SchemaPartition.java:219)
	... 44 more
Caused by: org.apache.directory.api.ldap.model.exception.LdapInvalidAttributeValueException: ERR_04447_CANNOT_NORMALIZE_VALUE Cannot normalize the wrapped value ERR_04473_NOT_VALID_VALUE Not a valid value '20090818022733Z' for the AttributeType 'ATTRIBUTE_TYPE ( 1.3.6.1.4.1.18060.0.4.1.2.35
 NAME 'schemaModifyTimestamp'
 DESC time which schema was modified
 SUP modifyTimestamp
 EQUALITY generalizedTimeMatch
 ORDERING generalizedTimeOrderingMatch
 SYNTAX 1.3.6.1.4.1.1466.115.121.1.24
 USAGE directoryOperation
 )
'
	at org.apache.directory.api.ldap.model.entry.AbstractValue.apply(AbstractValue.java:211)
	at org.apache.directory.api.ldap.model.entry.StringValue.<init>(StringValue.java:107)
	at org.apache.directory.api.ldap.model.entry.DefaultAttribute.<init>(DefaultAttribute.java:468)
	at org.apache.directory.api.ldap.model.entry.DefaultEntry.<init>(DefaultEntry.java:315)
	at org.apache.directory.server.core.partition.ldif.LdifPartition.loadEntries(LdifPartition.java:517)
	at org.apache.directory.server.core.partition.ldif.LdifPartition.loadEntries(LdifPartition.java:549)
	at org.apache.directory.server.core.partition.ldif.LdifPartition.doInit(LdifPartition.java:164)
	at org.apache.directory.server.core.api.partition.AbstractPartition.initialize(AbstractPartition.java:79)
	... 45 more
Caused by: org.apache.directory.api.ldap.model.exception.LdapInvalidAttributeValueException: ERR_04473_NOT_VALID_VALUE Not a valid value '20090818022733Z' for the AttributeType 'ATTRIBUTE_TYPE ( 1.3.6.1.4.1.18060.0.4.1.2.35
 NAME 'schemaModifyTimestamp'
 DESC time which schema was modified
 SUP modifyTimestamp
 EQUALITY generalizedTimeMatch
 ORDERING generalizedTimeOrderingMatch
 SYNTAX 1.3.6.1.4.1.1466.115.121.1.24
 USAGE directoryOperation
 )
'
	at org.apache.directory.api.ldap.model.entry.AbstractValue.apply(AbstractValue.java:204)
	... 52 more




Build Log:
[...truncated 10492 lines...]
   [junit4] Suite: org.apache.solr.cloud.ChaosMonkeyNothingIsSafeTest
   [junit4]   2> Creating dataDir: /home/jenkins/workspace/Lucene-Solr-trunk-Linux/solr/build/solr-core/test/J1/temp/solr.cloud.ChaosMonkeyNothingIsSafeTest_68CD79A836F2F5A3-001/init-core-data-001
   [junit4]   2> 13495 INFO  (SUITE-ChaosMonkeyNothingIsSafeTest-seed#[68CD79A836F2F5A3]-worker) [    ] o.a.s.BaseDistributedSearchTestCase Setting hostContext system property: /e_sax/np
   [junit4]   2> 13504 INFO  (TEST-ChaosMonkeyNothingIsSafeTest.test-seed#[68CD79A836F2F5A3]) [    ] o.a.s.c.ZkTestServer STARTING ZK TEST SERVER
   [junit4]   2> 13506 INFO  (Thread-61) [    ] o.a.s.c.ZkTestServer client port:0.0.0.0/0.0.0.0:0
   [junit4]   2> 13506 INFO  (Thread-61) [    ] o.a.s.c.ZkTestServer Starting server
   [junit4]   2> 13606 INFO  (TEST-ChaosMonkeyNothingIsSafeTest.test-seed#[68CD79A836F2F5A3]) [    ] o.a.s.c.ZkTestServer start zk server on port:56725
   [junit4]   2> 13617 INFO  (TEST-ChaosMonkeyNothingIsSafeTest.test-seed#[68CD79A836F2F5A3]) [    ] o.a.s.c.c.SolrZkClient Using default ZkCredentialsProvider
   [junit4]   2> 13652 INFO  (TEST-ChaosMonkeyNothingIsSafeTest.test-seed#[68CD79A836F2F5A3]) [    ] o.a.s.c.c.ConnectionManager Waiting for client to connect to ZooKeeper
   [junit4]   2> 13676 INFO  (zkCallback-19-thread-1) [    ] o.a.s.c.c.ConnectionManager Watcher org.apache.solr.common.cloud.ConnectionManager@139c614 name:ZooKeeperConnection Watcher:127.0.0.1:56725 got event WatchedEvent state:SyncConnected type:None path:null path:null type:None
   [junit4]   2> 13676 INFO  (TEST-ChaosMonkeyNothingIsSafeTest.test-seed#[68CD79A836F2F5A3]) [    ] o.a.s.c.c.ConnectionManager Client is connected to ZooKeeper
   [junit4]   2> 13676 INFO  (TEST-ChaosMonkeyNothingIsSafeTest.test-seed#[68CD79A836F2F5A3]) [    ] o.a.s.c.c.SolrZkClient Using default ZkACLProvider
   [junit4]   2> 13677 INFO  (TEST-ChaosMonkeyNothingIsSafeTest.test-seed#[68CD79A836F2F5A3]) [    ] o.a.s.c.c.SolrZkClient makePath: /solr
   [junit4]   2> 13694 INFO  (TEST-ChaosMonkeyNothingIsSafeTest.test-seed#[68CD79A836F2F5A3]) [    ] o.a.s.c.c.SolrZkClient Using default ZkCredentialsProvider
   [junit4]   2> 13695 INFO  (TEST-ChaosMonkeyNothingIsSafeTest.test-seed#[68CD79A836F2F5A3]) [    ] o.a.s.c.c.ConnectionManager Waiting for client to connect to ZooKeeper
   [junit4]   2> 13696 INFO  (zkCallback-20-thread-1) [    ] o.a.s.c.c.ConnectionManager Watcher org.apache.solr.common.cloud.ConnectionManager@31ca96 name:ZooKeeperConnection Watcher:127.0.0.1:56725/solr got event WatchedEvent state:SyncConnected type:None path:null path:null type:None
   [junit4]   2> 13696 INFO  (TEST-ChaosMonkeyNothingIsSafeTest.test-seed#[68CD79A836F2F5A3]) [    ] o.a.s.c.c.ConnectionManager Client is connected to ZooKeeper
   [junit4]   2> 13696 INFO  (TEST-ChaosMonkeyNothingIsSafeTest.test-seed#[68CD79A836F2F5A3]) [    ] o.a.s.c.c.SolrZkClient Using default ZkACLProvider
   [junit4]   2> 13697 INFO  (TEST-ChaosMonkeyNothingIsSafeTest.test-seed#[68CD79A836F2F5A3]) [    ] o.a.s.c.c.SolrZkClient makePath: /collections/collection1
   [junit4]   2> 13707 INFO  (TEST-ChaosMonkeyNothingIsSafeTest.test-seed#[68CD79A836F2F5A3]) [    ] o.a.s.c.c.SolrZkClient makePath: /collections/collection1/shards
   [junit4]   2> 13709 INFO  (TEST-ChaosMonkeyNothingIsSafeTest.test-seed#[68CD79A836F2F5A3]) [    ] o.a.s.c.c.SolrZkClient makePath: /collections/control_collection
   [junit4]   2> 13710 INFO  (TEST-ChaosMonkeyNothingIsSafeTest.test-seed#[68CD79A836F2F5A3]) [    ] o.a.s.c.c.SolrZkClient makePath: /collections/control_collection/shards
   [junit4]   2> 13712 INFO  (TEST-ChaosMonkeyNothingIsSafeTest.test-seed#[68CD79A836F2F5A3]) [    ] o.a.s.c.AbstractZkTestCase put /home/jenkins/workspace/Lucene-Solr-trunk-Linux/solr/core/src/test-files/solr/collection1/conf/solrconfig-tlog.xml to /configs/conf1/solrconfig.xml
   [junit4]   2> 13717 INFO  (TEST-ChaosMonkeyNothingIsSafeTest.test-seed#[68CD79A836F2F5A3]) [    ] o.a.s.c.c.SolrZkClient makePath: /configs/conf1/solrconfig.xml
   [junit4]   2> 13729 INFO  (TEST-ChaosMonkeyNothingIsSafeTest.test-seed#[68CD79A836F2F5A3]) [    ] o.a.s.c.AbstractZkTestCase put /home/jenkins/workspace/Lucene-Solr-trunk-Linux/solr/core/src/test-files/solr/collection1/conf/schema15.xml to /configs/conf1/schema.xml
   [junit4]   2> 13729 INFO  (TEST-ChaosMonkeyNothingIsSafeTest.test-seed#[68CD79A836F2F5A3]) [    ] o.a.s.c.c.SolrZkClient makePath: /configs/conf1/schema.xml
   [junit4]   2> 13731 INFO  (TEST-ChaosMonkeyNothingIsSafeTest.test-seed#[68CD79A836F2F5A3]) [    ] o.a.s.c.AbstractZkTestCase put /home/jenkins/workspace/Lucene-Solr-trunk-Linux/solr/core/src/test-files/solr/collection1/conf/solrconfig.snippet.randomindexconfig.xml to /configs/conf1/solrconfig.snippet.randomindexconfig.xml
   [junit4]   2> 13731 INFO  (TEST-ChaosMonkeyNothingIsSafeTest.test-seed#[68CD79A836F2F5A3]) [    ] o.a.s.c.c.SolrZkClient makePath: /configs/conf1/solrconfig.snippet.randomindexconfig.xml
   [junit4]   2> 13733 INFO  (TEST-ChaosMonkeyNothingIsSafeTest.test-seed#[68CD79A836F2F5A3]) [    ] o.a.s.c.AbstractZkTestCase put /home/jenkins/workspace/Lucene-Solr-trunk-Linux/solr/core/src/test-files/solr/collection1/conf/stopwords.txt to /configs/conf1/stopwords.txt
   [junit4]   2> 13733 INFO  (TEST-ChaosMonkeyNothingIsSafeTest.test-seed#[68CD79A836F2F5A3]) [    ] o.a.s.c.c.SolrZkClient makePath: /configs/conf1/stopwords.txt
   [junit4]   2> 13735 INFO  (TEST-ChaosMonkeyNothingIsSafeTest.test-seed#[68CD79A836F2F5A3]) [    ] o.a.s.c.AbstractZkTestCase put /home/jenkins/workspace/Lucene-Solr-trunk-Linux/solr/core/src/test-files/solr/collection1/conf/protwords.txt to /configs/conf1/protwords.txt
   [junit4]   2> 13735 INFO  (TEST-ChaosMonkeyNothingIsSafeTest.test-seed#[68CD79A836F2F5A3]) [    ] o.a.s.c.c.SolrZkClient makePath: /configs/conf1/protwords.txt
   [junit4]   2> 13737 INFO  (TEST-ChaosMonkeyNothingIsSafeTest.test-seed#[68CD79A836F2F5A3]) [    ] o.a.s.c.AbstractZkTestCase put /home/jenkins/workspace/Lucene-Solr-trunk-Linux/solr/core/src/test-files/solr/collection1/conf/currency.xml to /configs/conf1/currency.xml
   [junit4]   2> 13737 INFO  (TEST-ChaosMonkeyNothingIsSafeTest.test-seed#[68CD79A836F2F5A3]) [    ] o.a.s.c.c.SolrZkClient makePath: /configs/conf1/currency.xml
   [junit4]   2> 13740 INFO  (TEST-ChaosMonkeyNothingIsSafeTest.test-seed#[68CD79A836F2F5A3]) [    ] o.a.s.c.AbstractZkTestCase put /home/jenkins/workspace/Lucene-Solr-trunk-Linux/solr/core/src/test-files/solr/collection1/conf/enumsConfig.xml to /configs/conf1/enumsConfig.xml
   [junit4]   2> 13740 INFO  (TEST-ChaosMonkeyNothingIsSafeTest.test-seed#[68CD79A836F2F5A3]) [    ] o.a.s.c.c.SolrZkClient makePath: /configs/conf1/enumsConfig.xml
   [junit4]   2> 13742 INFO  (TEST-ChaosMonkeyNothingIsSafeTest.test-seed#[68CD79A836F2F5A3]) [    ] o.a.s.c.AbstractZkTestCase put /home/jenkins/workspace/Lucene-Solr-trunk-Linux/solr/core/src/test-files/solr/collection1/conf/open-exchange-rates.json to /configs/conf1/open-exchange-rates.json
   [junit4]   2> 13742 INFO  (TEST-ChaosMonkeyNothingIsSafeTest.test-seed#[68CD79A836F2F5A3]) [    ] o.a.s.c.c.SolrZkClient makePath: /configs/conf1/open-exchange-rates.json
   [junit4]   2> 13743 INFO  (TEST-ChaosMonkeyNothingIsSafeTest.test-seed#[68CD79A836F2F5A3]) [    ] o.a.s.c.AbstractZkTestCase put /home/jenkins/workspace/Lucene-Solr-trunk-Linux/solr/core/src/test-files/solr/collection1/conf/mapping-ISOLatin1Accent.txt to /configs/conf1/mapping-ISOLatin1Accent.txt
   [junit4]   2> 13743 INFO  (TEST-ChaosMonkeyNothingIsSafeTest.test-seed#[68CD79A836F2F5A3]) [    ] o.a.s.c.c.SolrZkClient makePath: /configs/conf1/mapping-ISOLatin1Accent.txt
   [junit4]   2> 13745 INFO  (TEST-ChaosMonkeyNothingIsSafeTest.test-seed#[68CD79A836F2F5A3]) [    ] o.a.s.c.AbstractZkTestCase put /home/jenkins/workspace/Lucene-Solr-trunk-Linux/solr/core/src/test-files/solr/collection1/conf/old_synonyms.txt to /configs/conf1/old_synonyms.txt
   [junit4]   2> 13745 INFO  (TEST-ChaosMonkeyNothingIsSafeTest.test-seed#[68CD79A836F2F5A3]) [    ] o.a.s.c.c.SolrZkClient makePath: /configs/conf1/old_synonyms.txt
   [junit4]   2> 13747 INFO  (TEST-ChaosMonkeyNothingIsSafeTest.test-seed#[68CD79A836F2F5A3]) [    ] o.a.s.c.AbstractZkTestCase put /home/jenkins/workspace/Lucene-Solr-trunk-Linux/solr/core/src/test-files/solr/collection1/conf/synonyms.txt to /configs/conf1/synonyms.txt
   [junit4]   2> 13747 INFO  (TEST-ChaosMonkeyNothingIsSafeTest.test-seed#[68CD79A836F2F5A3]) [    ] o.a.s.c.c.SolrZkClient makePath: /configs/conf1/synonyms.txt
   [junit4]   2> 13835 INFO  (TEST-ChaosMonkeyNothingIsSafeTest.test-seed#[68CD79A836F2F5A3]) [    ] o.a.s.SolrTestCaseJ4 Writing core.properties file to /home/jenkins/workspace/Lucene-Solr-trunk-Linux/solr/build/solr-core/test/J1/temp/solr.cloud.ChaosMonkeyNothingIsSafeTest_68CD79A836F2F5A3-001/control-001/cores/collection1
   [junit4]   2> 13837 INFO  (TEST-ChaosMonkeyNothingIsSafeTest.test-seed#[68CD79A836F2F5A3]) [    ] o.e.j.s.Server jetty-9.3.6.v20151106
   [junit4]   2> 13838 INFO  (TEST-ChaosMonkeyNothingIsSafeTest.test-seed#[68CD79A836F2F5A3]) [    ] o.e.j.s.h.ContextHandler Started o.e.j.s.ServletContextHandler@421238{/e_sax/np,null,AVAILABLE}
   [junit4]   2> 13840 INFO  (TEST-ChaosMonkeyNothingIsSafeTest.test-seed#[68CD79A836F2F5A3]) [    ] o.e.j.s.ServerConnector Started ServerConnector@38ab57{HTTP/1.1,[http/1.1]}{127.0.0.1:42737}
   [junit4]   2> 13840 INFO  (TEST-ChaosMonkeyNothingIsSafeTest.test-seed#[68CD79A836F2F5A3]) [    ] o.e.j.s.Server Started @15633ms
   [junit4]   2> 13840 INFO  (TEST-ChaosMonkeyNothingIsSafeTest.test-seed#[68CD79A836F2F5A3]) [    ] o.a.s.c.s.e.JettySolrRunner Jetty properties: {solr.data.dir=/home/jenkins/workspace/Lucene-Solr-trunk-Linux/solr/build/solr-core/test/J1/temp/solr.cloud.ChaosMonkeyNothingIsSafeTest_68CD79A836F2F5A3-001/tempDir-001/control/data, hostContext=/e_sax/np, hostPort=42737, coreRootDirectory=/home/jenkins/workspace/Lucene-Solr-trunk-Linux/solr/build/solr-core/test/J1/../../../../../../../../../home/jenkins/workspace/Lucene-Solr-trunk-Linux/solr/build/solr-core/test/J1/temp/solr.cloud.ChaosMonkeyNothingIsSafeTest_68CD79A836F2F5A3-001/control-001/cores}
   [junit4]   2> 13841 INFO  (TEST-ChaosMonkeyNothingIsSafeTest.test-seed#[68CD79A836F2F5A3]) [    ] o.a.s.s.SolrDispatchFilter SolrDispatchFilter.init(): sun.misc.Launcher$AppClassLoader@8102c8
   [junit4]   2> 13841 INFO  (TEST-ChaosMonkeyNothingIsSafeTest.test-seed#[68CD79A836F2F5A3]) [    ] o.a.s.c.SolrResourceLoader new SolrResourceLoader for directory: '/home/jenkins/workspace/Lucene-Solr-trunk-Linux/solr/build/solr-core/test/J1/temp/solr.cloud.ChaosMonkeyNothingIsSafeTest_68CD79A836F2F5A3-001/control-001'
   [junit4]   2> 13841 INFO  (TEST-ChaosMonkeyNothingIsSafeTest.test-seed#[68CD79A836F2F5A3]) [    ] o.a.s.c.SolrResourceLoader JNDI not configured for solr (NoInitialContextEx)
   [junit4]   2> 13841 INFO  (TEST-ChaosMonkeyNothingIsSafeTest.test-seed#[68CD79A836F2F5A3]) [    ] o.a.s.c.SolrResourceLoader solr home defaulted to 'solr/' (could not find system property or JNDI)
   [junit4]   2> 13841 INFO  (TEST-ChaosMonkeyNothingIsSafeTest.test-seed#[68CD79A836F2F5A3]) [    ] o.a.s.c.c.SolrZkClient Using default ZkCredentialsProvider
   [junit4]   2> 13842 INFO  (TEST-ChaosMonkeyNothingIsSafeTest.test-seed#[68CD79A836F2F5A3]) [    ] o.a.s.c.c.ConnectionManager Waiting for client to connect to ZooKeeper
   [junit4]   2> 13843 INFO  (zkCallback-21-thread-1) [    ] o.a.s.c.c.ConnectionManager Watcher org.apache.solr.common.cloud.ConnectionManager@1de2000 name:ZooKeeperConnection Watcher:127.0.0.1:56725/solr got event WatchedEvent state:SyncConnected type:None path:null path:null type:None
   [junit4]   2> 13843 INFO  (TEST-ChaosMonkeyNothingIsSafeTest.test-seed#[68CD79A836F2F5A3]) [    ] o.a.s.c.c.ConnectionManager Client is connected to ZooKeeper
   [junit4]   2> 13843 INFO  (TEST-ChaosMonkeyNothingIsSafeTest.test-seed#[68CD79A836F2F5A3]) [    ] o.a.s.c.c.SolrZkClient Using default ZkACLProvider
   [junit4]   2> 13844 INFO  (TEST-ChaosMonkeyNothingIsSafeTest.test-seed#[68CD79A836F2F5A3]) [    ] o.a.s.s.SolrDispatchFilter Loading solr.xml from SolrHome (not found in ZooKeeper)
   [junit4]   2> 13844 INFO  (TEST-ChaosMonkeyNothingIsSafeTest.test-seed#[68CD79A836F2F5A3]) [    ] o.a.s.c.SolrXmlConfig Loading container configuration from /home/jenkins/workspace/Lucene-Solr-trunk-Linux/solr/build/solr-core/test/J1/temp/solr.cloud.ChaosMonkeyNothingIsSafeTest_68CD79A836F2F5A3-001/control-001/solr.xml
   [junit4]   2> 13850 INFO  (TEST-ChaosMonkeyNothingIsSafeTest.test-seed#[68CD79A836F2F5A3]) [    ] o.a.s.c.CorePropertiesLocator Config-defined core root directory: /home/jenkins/workspace/Lucene-Solr-trunk-Linux/solr/build/solr-core/test/J1/../../../../../../../../../home/jenkins/workspace/Lucene-Solr-trunk-Linux/solr/build/solr-core/test/J1/temp/solr.cloud.ChaosMonkeyNothingIsSafeTest_68CD79A836F2F5A3-001/control-001/cores
   [junit4]   2> 13850 INFO  (TEST-ChaosMonkeyNothingIsSafeTest.test-seed#[68CD79A836F2F5A3]) [    ] o.a.s.c.CoreContainer New CoreContainer 7611410
   [junit4]   2> 13850 INFO  (TEST-ChaosMonkeyNothingIsSafeTest.test-seed#[68CD79A836F2F5A3]) [    ] o.a.s.c.CoreContainer Loading cores into CoreContainer [instanceDir=/home/jenkins/workspace/Lucene-Solr-trunk-Linux/solr/build/solr-core/test/J1/temp/solr.cloud.ChaosMonkeyNothingIsSafeTest_68CD79A836F2F5A3-001/control-001]
   [junit4]   2> 13850 WARN  (TEST-ChaosMonkeyNothingIsSafeTest.test-seed#[68CD79A836F2F5A3]) [    ] o.a.s.c.CoreContainer Couldn't add files from /home/jenkins/workspace/Lucene-Solr-trunk-Linux/solr/build/solr-core/test/J1/temp/solr.cloud.ChaosMonkeyNothingIsSafeTest_68CD79A836F2F5A3-001/control-001/lib to classpath: /home/jenkins/workspace/Lucene-Solr-trunk-Linux/solr/build/solr-core/test/J1/temp/solr.cloud.ChaosMonkeyNothingIsSafeTest_68CD79A836F2F5A3-001/control-001/lib
   [junit4]   2> 13850 INFO  (TEST-ChaosMonkeyNothingIsSafeTest.test-seed#[68CD79A836F2F5A3]) [    ] o.a.s.h.c.HttpShardHandlerFactory created with socketTimeout : 90000,urlScheme : ,connTimeout : 15000,maxConnectionsPerHost : 20,maxConnections : 10000,corePoolSize : 0,maximumPoolSize : 2147483647,maxThreadIdleTime : 5,sizeOfQueue : -1,fairnessPolicy : false,useRetries : false,
   [junit4]   2> 13851 INFO  (TEST-ChaosMonkeyNothingIsSafeTest.test-seed#[68CD79A836F2F5A3]) [    ] o.a.s.u.UpdateShardHandler Creating UpdateShardHandler HTTP client with params: socketTimeout=340000&connTimeout=45000&retry=true
   [junit4]   2> 13852 INFO  (TEST-ChaosMonkeyNothingIsSafeTest.test-seed#[68CD79A836F2F5A3]) [    ] o.a.s.l.LogWatcher SLF4J impl is org.slf4j.impl.Log4jLoggerFactory
   [junit4]   2> 13852 INFO  (TEST-ChaosMonkeyNothingIsSafeTest.test-seed#[68CD79A836F2F5A3]) [    ] o.a.s.l.LogWatcher Registering Log Listener [Log4j (org.slf4j.impl.Log4jLoggerFactory)]
   [junit4]   2> 13852 INFO  (TEST-ChaosMonkeyNothingIsSafeTest.test-seed#[68CD79A836F2F5A3]) [    ] o.a.s.c.ZkContainer Zookeeper client=127.0.0.1:56725/solr
   [junit4]   2> 13863 INFO  (TEST-ChaosMonkeyNothingIsSafeTest.test-seed#[68CD79A836F2F5A3]) [    ] o.a.s.c.ZkController zkHost includes chroot
   [junit4]   2> 13863 INFO  (TEST-ChaosMonkeyNothingIsSafeTest.test-seed#[68CD79A836F2F5A3]) [    ] o.a.s.c.c.SolrZkClient Using default ZkCredentialsProvider
   [junit4]   2> 13863 INFO  (TEST-ChaosMonkeyNothingIsSafeTest.test-seed#[68CD79A836F2F5A3]) [    ] o.a.s.c.c.ConnectionManager Waiting for client to connect to ZooKeeper
   [junit4]   2> 13866 INFO  (zkCallback-24-thread-1) [    ] o.a.s.c.c.ConnectionManager Watcher org.apache.solr.common.cloud.ConnectionManager@4f11fd name:ZooKeeperConnection Watcher:127.0.0.1:56725 got event WatchedEvent state:SyncConnected type:None path:null path:null type:None
   [junit4]   2> 13867 INFO  (TEST-ChaosMonkeyNothingIsSafeTest.test-seed#[68CD79A836F2F5A3]) [    ] o.a.s.c.c.ConnectionManager Client is connected to ZooKeeper
   [junit4]   2> 13867 INFO  (TEST-ChaosMonkeyNothingIsSafeTest.test-seed#[68CD79A836F2F5A3]) [    ] o.a.s.c.c.SolrZkClient Using default ZkACLProvider
   [junit4]   2> 13871 INFO  (TEST-ChaosMonkeyNothingIsSafeTest.test-seed#[68CD79A836F2F5A3]) [    ] o.a.s.c.c.ConnectionManager Waiting for client to connect to ZooKeeper
   [junit4]   2> 13873 INFO  (zkCallback-25-thread-1) [    ] o.a.s.c.c.ConnectionManager Watcher org.apache.solr.common.cloud.ConnectionManager@18bc7b6 name:ZooKeeperConnection Watcher:127.0.0.1:56725/solr got event WatchedEvent state:SyncConnected type:None path:null path:null type:None
   [junit4]   2> 13873 INFO  (TEST-ChaosMonkeyNothingIsSafeTest.test-seed#[68CD79A836F2F5A3]) [    ] o.a.s.c.c.ConnectionManager Client is connected to ZooKeeper
   [junit4]   2> 13879 INFO  (TEST-ChaosMonkeyNothingIsSafeTest.test-seed#[68CD79A836F2F5A3]) [    ] o.a.s.c.c.SolrZkClient makePath: /overseer/queue
   [junit4]   2> 13885 INFO  (TEST-ChaosMonkeyNothingIsSafeTest.test-seed#[68CD79A836F2F5A3]) [    ] o.a.s.c.c.SolrZkClient makePath: /overseer/collection-queue-work
   [junit4]   2> 13891 INFO  (TEST-ChaosMonkeyNothingIsSafeTest.test-seed#[68CD79A836F2F5A3]) [    ] o.a.s.c.c.SolrZkClient makePath: /overseer/collection-map-running
   [junit4]   2> 13894 INFO  (TEST-ChaosMonkeyNothingIsSafeTest.test-seed#[68CD79A836F2F5A3]) [    ] o.a.s.c.c.SolrZkClient makePath: /overseer/collection-map-completed
   [junit4]   2> 13896 INFO  (TEST-ChaosMonkeyNothingIsSafeTest.test-seed#[68CD79A836F2F5A3]) [    ] o.a.s.c.c.SolrZkClient makePath: /overseer/collection-map-failure
   [junit4]   2> 13902 INFO  (TEST-ChaosMonkeyNothingIsSafeTest.test-seed#[68CD79A836F2F5A3]) [    ] o.a.s.c.c.SolrZkClient makePath: /live_nodes
   [junit4]   2> 13904 INFO  (TEST-ChaosMonkeyNothingIsSafeTest.test-seed#[68CD79A836F2F5A3]) [    ] o.a.s.c.c.SolrZkClient makePath: /aliases.json
   [junit4]   2> 13905 INFO  (TEST-ChaosMonkeyNothingIsSafeTest.test-seed#[68CD79A836F2F5A3]) [    ] o.a.s.c.c.SolrZkClient makePath: /clusterstate.json
   [junit4]   2> 13908 INFO  (TEST-ChaosMonkeyNothingIsSafeTest.test-seed#[68CD79A836F2F5A3]) [    ] o.a.s.c.c.SolrZkClient makePath: /security.json
   [junit4]   2> 13910 INFO  (TEST-ChaosMonkeyNothingIsSafeTest.test-seed#[68CD79A836F2F5A3]) [    ] o.a.s.c.ZkController Register node as live in ZooKeeper:/live_nodes/127.0.0.1:42737_e_sax%2Fnp
   [junit4]   2> 13911 INFO  (TEST-ChaosMonkeyNothingIsSafeTest.test-seed#[68CD79A836F2F5A3]) [    ] o.a.s.c.c.SolrZkClient makePath: /live_nodes/127.0.0.1:42737_e_sax%2Fnp
   [junit4]   2> 13915 INFO  (TEST-ChaosMonkeyNothingIsSafeTest.test-seed#[68CD79A836F2F5A3]) [    ] o.a.s.c.c.SolrZkClient makePath: /overseer_elect
   [junit4]   2> 13917 INFO  (TEST-ChaosMonkeyNothingIsSafeTest.test-seed#[68CD79A836F2F5A3]) [    ] o.a.s.c.c.SolrZkClient makePath: /overseer_elect/election
   [junit4]   2> 13919 INFO  (TEST-ChaosMonkeyNothingIsSafeTest.test-seed#[68CD79A836F2F5A3]) [    ] o.a.s.c.Overseer Overseer (id=null) closing
   [junit4]   2> 13920 INFO  (TEST-ChaosMonkeyNothingIsSafeTest.test-seed#[68CD79A836F2F5A3]) [    ] o.a.s.c.LeaderElector Joined leadership election with path: /overseer_elect/election/95402522712080388-127.0.0.1:42737_e_sax%2Fnp-n_0000000000
   [junit4]   2> 13924 INFO  (TEST-ChaosMonkeyNothingIsSafeTest.test-seed#[68CD79A836F2F5A3]) [    ] o.a.s.c.OverseerElectionContext I am going to be the leader 127.0.0.1:42737_e_sax%2Fnp
   [junit4]   2> 13924 INFO  (TEST-ChaosMonkeyNothingIsSafeTest.test-seed#[68CD79A836F2F5A3]) [    ] o.a.s.c.c.SolrZkClient makePath: /overseer_elect/leader
   [junit4]   2> 13926 INFO  (TEST-ChaosMonkeyNothingIsSafeTest.test-seed#[68CD79A836F2F5A3]) [    ] o.a.s.c.Overseer Overseer (id=95402522712080388-127.0.0.1:42737_e_sax%2Fnp-n_0000000000) starting
   [junit4]   2> 13931 INFO  (TEST-ChaosMonkeyNothingIsSafeTest.test-seed#[68CD79A836F2F5A3]) [    ] o.a.s.c.c.SolrZkClient makePath: /overseer/queue-work
   [junit4]   2> 13958 INFO  (TEST-ChaosMonkeyNothingIsSafeTest.test-seed#[68CD79A836F2F5A3]) [    ] o.a.s.c.OverseerAutoReplicaFailoverThread Starting OverseerAutoReplicaFailoverThread autoReplicaFailoverWorkLoopDelay=10000 autoReplicaFailoverWaitAfterExpiration=30000 autoReplicaFailoverBadNodeExpiration=60000
   [junit4]   2> 13962 INFO  (OverseerCollectionConfigSetProcessor-95402522712080388-127.0.0.1:42737_e_sax%2Fnp-n_0000000000) [    ] o.a.s.c.OverseerTaskProcessor Process current queue of overseer operations
   [junit4]   2> 13978 INFO  (TEST-ChaosMonkeyNothingIsSafeTest.test-seed#[68CD79A836F2F5A3]) [    ] o.a.s.c.c.ZkStateReader Updating cluster state from ZooKeeper... 
   [junit4]   2> 13966 INFO  (OverseerStateUpdate-95402522712080388-127.0.0.1:42737_e_sax%2Fnp-n_0000000000) [    ] o.a.s.c.Overseer Starting to work on the main queue
   [junit4]   2> 14040 INFO  (TEST-ChaosMonkeyNothingIsSafeTest.test-seed#[68CD79A836F2F5A3]) [    ] o.a.s.c.CoreContainer Security conf doesn't exist. Skipping setup for authorization module.
   [junit4]   2> 14040 INFO  (TEST-ChaosMonkeyNothingIsSafeTest.test-seed#[68CD79A836F2F5A3]) [    ] o.a.s.c.CoreContainer No authentication plugin used.
   [junit4]   2> 14041 INFO  (TEST-ChaosMonkeyNothingIsSafeTest.test-seed#[68CD79A836F2F5A3]) [    ] o.a.s.c.CorePropertiesLocator Looking for core definitions underneath /home/jenkins/workspace/Lucene-Solr-trunk-Linux/solr/build/solr-core/test/J1/../../../../../../../../../home/jenkins/workspace/Lucene-Solr-trunk-Linux/solr/build/solr-core/test/J1/temp/solr.cloud.ChaosMonkeyNothingIsSafeTest_68CD79A836F2F5A3-001/control-001/cores
   [junit4]   2> 14043 INFO  (TEST-ChaosMonkeyNothingIsSafeTest.test-seed#[68CD79A836F2F5A3]) [    ] o.a.s.c.CoreDescriptor Created CoreDescriptor: {name=collection1, config=solrconfig.xml, transient=false, schema=schema.xml, loadOnStartup=true, configSetProperties=configsetprops.json, collection=control_collection, coreNodeName=, dataDir=data/, shard=}
   [junit4]   2> 14043 INFO  (TEST-ChaosMonkeyNothingIsSafeTest.test-seed#[68CD79A836F2F5A3]) [    ] o.a.s.c.CorePropertiesLocator Found core collection1 in /home/jenkins/workspace/Lucene-Solr-trunk-Linux/solr/build/solr-core/test/J1/../../../../../../../../../home/jenkins/workspace/Lucene-Solr-trunk-Linux/solr/build/solr-core/test/J1/temp/solr.cloud.ChaosMonkeyNothingIsSafeTest_68CD79A836F2F5A3-001/control-001/cores/collection1
   [junit4]   2> 14044 INFO  (TEST-ChaosMonkeyNothingIsSafeTest.test-seed#[68CD79A836F2F5A3]) [    ] o.a.s.c.CorePropertiesLocator Found 1 core definitions
   [junit4]   2> 14044 INFO  (TEST-ChaosMonkeyNothingIsSafeTest.test-seed#[68CD79A836F2F5A3]) [    ] o.a.s.s.SolrDispatchFilter user.dir=/home/jenkins/workspace/Lucene-Solr-trunk-Linux/solr/build/solr-core/test/J1
   [junit4]   2> 14044 INFO  (TEST-ChaosMonkeyNothingIsSafeTest.test-seed#[68CD79A836F2F5A3]) [    ] o.a.s.s.SolrDispatchFilter SolrDispatchFilter.init() done
   [junit4]   2> 14045 INFO  (coreLoadExecutor-114-thread-1) [    ] o.a.s.c.ZkController publishing state=down
   [junit4]   2> 14045 INFO  (coreLoadExecutor-114-thread-1) [    ] o.a.s.c.ZkController numShards not found on descriptor - reading it from system property
   [junit4]   2> 14049 INFO  (OverseerStateUpdate-95402522712080388-127.0.0.1:42737_e_sax%2Fnp-n_0000000000) [    ] o.a.s.c.Overseer processMessage: queueSize: 1, message = {
   [junit4]   2>   "core":"collection1",
   [junit4]   2>   "roles":null,
   [junit4]   2>   "base_url":"http://127.0.0.1:42737/e_sax/np",
   [junit4]   2>   "node_name":"127.0.0.1:42737_e_sax%2Fnp",
   [junit4]   2>   "numShards":"1",
   [junit4]   2>   "state":"down",
   [junit4]   2>   "shard":null,
   [junit4]   2>   "collection":"control_collection",
   [junit4]   2>   "operation":"state"} current state version: 0
   [junit4]   2> 14052 INFO  (coreLoadExecutor-114-thread-1) [    ] o.a.s.c.ZkController look for our core node name
   [junit4]   2> 14060 INFO  (OverseerStateUpdate-95402522712080388-127.0.0.1:42737_e_sax%2Fnp-n_0000000000) [    ] o.a.s.c.o.ReplicaMutator Update state numShards=1 message={
   [junit4]   2>   "core":"collection1",
   [junit4]   2>   "roles":null,
   [junit4]   2>   "base_url":"http://127.0.0.1:42737/e_sax/np",
   [junit4]   2>   "node_name":"127.0.0.1:42737_e_sax%2Fnp",
   [junit4]   2>   "numShards":"1",
   [junit4]   2>   "state":"down",
   [junit4]   2>   "shard":null,
   [junit4]   2>   "collection":"control_collection",
   [junit4]   2>   "operation":"state"}
   [junit4]   2> 14061 INFO  (OverseerStateUpdate-95402522712080388-127.0.0.1:42737_e_sax%2Fnp-n_0000000000) [    ] o.a.s.c.o.ClusterStateMutator building a new cName: control_collection
   [junit4]   2> 14070 INFO  (OverseerStateUpdate-95402522712080388-127.0.0.1:42737_e_sax%2Fnp-n_0000000000) [    ] o.a.s.c.o.ReplicaMutator Assigning new node to shard shard=shard1
   [junit4]   2> 14078 INFO  (zkCallback-25-thread-1) [    ] o.a.s.c.c.ZkStateReader A cluster state change: [WatchedEvent state:SyncConnected type:NodeDataChanged path:/clusterstate.json], has occurred - updating... (live nodes size: [1])
   [junit4]   2> 15053 INFO  (coreLoadExecutor-114-thread-1) [    ] o.a.s.c.ZkController waiting to find shard id in clusterstate for collection1
   [junit4]   2> 15053 INFO  (coreLoadExecutor-114-thread-1) [    ] o.a.s.c.ZkController Check for collection zkNode:control_collection
   [junit4]   2> 15054 INFO  (coreLoadExecutor-114-thread-1) [    ] o.a.s.c.ZkController Collection zkNode exists
   [junit4]   2> 15054 INFO  (coreLoadExecutor-114-thread-1) [    ] o.a.s.c.c.ZkStateReader Load collection config from: [/collections/control_collection]
   [junit4]   2> 15054 INFO  (coreLoadExecutor-114-thread-1) [    ] o.a.s.c.c.ZkStateReader path=[/collections/control_collection] [configName]=[conf1] specified config exists in ZooKeeper
   [junit4]   2> 15055 INFO  (coreLoadExecutor-114-thread-1) [    ] o.a.s.c.SolrResourceLoader new SolrResourceLoader for directory: '/home/jenkins/workspace/Lucene-Solr-trunk-Linux/solr/build/solr-core/test/J1/temp/solr.cloud.ChaosMonkeyNothingIsSafeTest_68CD79A836F2F5A3-001/control-001/cores/collection1'
   [junit4]   2> 15055 INFO  (coreLoadExecutor-114-thread-1) [    ] o.a.s.c.SolrResourceLoader JNDI not configured for solr (NoInitialContextEx)
   [junit4]   2> 15055 INFO  (coreLoadExecutor-114-thread-1) [    ] o.a.s.c.SolrResourceLoader solr home defaulted to 'solr/' (could not find system property or JNDI)
   [junit4]   2> 15056 INFO  (coreLoadExecutor-114-thread-1) [    ] o.a.s.c.Config loaded config solrconfig.xml with version 0 
   [junit4]   2> 15063 INFO  (coreLoadExecutor-114-thread-1) [    ] o.a.s.c.SolrConfig current version of requestparams : -1
   [junit4]   2> 15068 INFO  (coreLoadExecutor-114-thread-1) [    ] o.a.s.c.SolrConfig Using Lucene MatchVersion: 6.0.0
   [junit4]   2> 15079 INFO  (coreLoadExecutor-114-thread-1) [    ] o.a.s.c.SolrConfig Loaded SolrConfig: solrconfig.xml
   [junit4]   2> 15086 INFO  (coreLoadExecutor-114-thread-1) [    ] o.a.s.s.IndexSchema [collection1] Schema name=test
   [junit4]   2> 15167 INFO  (coreLoadExecutor-114-thread-1) [    ] o.a.s.s.IndexSchema default search field in schema is text
   [junit4]   2> 15168 INFO  (coreLoadExecutor-114-thread-1) [    ] o.a.s.s.IndexSchema unique key field: id
   [junit4]   2> 15169 INFO  (coreLoadExecutor-114-thread-1) [    ] o.a.s.s.FileExchangeRateProvider Reloading exchange rates from file currency.xml
   [junit4]   2> 15172 INFO  (coreLoadExecutor-114-thread-1) [    ] o.a.s.s.FileExchangeRateProvider Reloading exchange rates from file currency.xml
   [junit4]   2> 15203 INFO  (coreLoadExecutor-114-thread-1) [    ] o.a.s.c.ConfigSetProperties Did not find ConfigSet properties, assuming default properties: Can't find resource 'configsetprops.json' in classpath or '/configs/conf1', cwd=/home/jenkins/workspace/Lucene-Solr-trunk-Linux/solr/build/solr-core/test/J1
   [junit4]   2> 15203 INFO  (coreLoadExecutor-114-thread-1) [    ] o.a.s.c.CoreContainer Creating SolrCore 'collection1' using configuration from collection control_collection
   [junit4]   2> 15203 INFO  (coreLoadExecutor-114-thread-1) [    ] o.a.s.c.SolrCore solr.StandardDirectoryFactory
   [junit4]   2> 15211 INFO  (coreLoadExecutor-114-thread-1) [    ] o.a.s.c.SolrCore [[collection1] ] Opening new SolrCore at [/home/jenkins/workspace/Lucene-Solr-trunk-Linux/solr/build/solr-core/test/J1/temp/solr.cloud.ChaosMonkeyNothingIsSafeTest_68CD79A836F2F5A3-001/control-001/cores/collection1], dataDir=[/home/jenkins/workspace/Lucene-Solr-trunk-Linux/solr/build/solr-core/test/J1/../../../../../../../../../home/jenkins/workspace/Lucene-Solr-trunk-Linux/solr/build/solr-core/test/J1/temp/solr.cloud.ChaosMonkeyNothingIsSafeTest_68CD79A836F2F5A3-001/control-001/cores/collection1/data/]
   [junit4]   2> 15211 INFO  (coreLoadExecutor-114-thread-1) [    ] o.a.s.c.JmxMonitoredMap JMX monitoring is enabled. Adding Solr mbeans to JMX Server: com.sun.jmx.mbeanserver.JmxMBeanServer@9c9396
   [junit4]   2> 15217 INFO  (coreLoadExecutor-114-thread-1) [    ] o.a.s.c.CachingDirectoryFactory return new directory for /home/jenkins/workspace/Lucene-Solr-trunk-Linux/solr/build/solr-core/test/J1/temp/solr.cloud.ChaosMonkeyNothingIsSafeTest_68CD79A836F2F5A3-001/control-001/cores/collection1/data
   [junit4]   2> 15217 INFO  (coreLoadExecutor-114-thread-1) [    ] o.a.s.c.SolrCore New index directory detected: old=null new=/home/jenkins/workspace/Lucene-Solr-trunk-Linux/solr/build/solr-core/test/J1/../../../../../../../../../home/jenkins/workspace/Lucene-Solr-trunk-Linux/solr/build/solr-core/test/J1/temp/solr.cloud.ChaosMonkeyNothingIsSafeTest_68CD79A836F2F5A3-001/control-001/cores/collection1/data/index/
   [junit4]   2> 15217 WARN  (coreLoadExecutor-114-thread-1) [    ] o.a.s.c.SolrCore [collection1] Solr index directory '/home/jenkins/workspace/Lucene-Solr-trunk-Linux/solr/build/solr-core/test/J1/../../../../../../../../../home/jenkins/workspace/Lucene-Solr-trunk-Linux/solr/build/solr-core/test/J1/temp/solr.cloud.ChaosMonkeyNothingIsSafeTest_68CD79A836F2F5A3-001/control-001/cores/collection1/data/index' doesn't exist. Creating new index...
   [junit4]   2> 15218 INFO  (coreLoadExecutor-114-thread-1) [    ] o.a.s.c.CachingDirectoryFactory return new directory for /home/jenkins/workspace/Lucene-Solr-trunk-Linux/solr/build/solr-core/test/J1/temp/solr.cloud.ChaosMonkeyNothingIsSafeTest_68CD79A836F2F5A3-001/control-001/cores/collection1/data/index
   [junit4]   2> 15218 INFO  (coreLoadExecutor-114-thread-1) [    ] o.a.s.u.RandomMergePolicy RandomMergePolicy wrapping class org.apache.lucene.index.TieredMergePolicy: [TieredMergePolicy: maxMergeAtOnce=10, maxMergeAtOnceExplicit=31, maxMergedSegmentMB=73.4306640625, floorSegmentMB=0.7412109375, forceMergeDeletesPctAllowed=10.119718162072225, segmentsPerTier=47.0, maxCFSSegmentSizeMB=8.796093022207999E12, noCFSRatio=0.4732115913861288
   [junit4]   2> 15243 INFO  (coreLoadExecutor-114-thread-1) [    ] o.a.s.c.SolrDeletionPolicy SolrDeletionPolicy.onCommit: commits: num=1
   [junit4]   2> 	commit{dir=/home/jenkins/workspace/Lucene-Solr-trunk-Linux/solr/build/solr-core/test/J1/temp/solr.cloud.ChaosMonkeyNothingIsSafeTest_68CD79A836F2F5A3-001/control-001/cores/collection1/data/index,segFN=segments_1,generation=1}
   [junit4]   2> 15243 INFO  (coreLoadExecutor-114-thread-1) [    ] o.a.s.c.SolrDeletionPolicy newest commit generation = 1
   [junit4]   2> 15243 INFO  (OldIndexDirectoryCleanupThreadForCore-collection1) [    ] o.a.s.c.SolrCore Looking for old index directories to cleanup for core collection1 in /home/jenkins/workspace/Lucene-Solr-trunk-Linux/solr/build/solr-core/test/J1/../../../../../../../../../home/jenkins/workspace/Lucene-Solr-trunk-Linux/solr/build/solr-core/test/J1/temp/solr.cloud.ChaosMonkeyNothingIsSafeTest_68CD79A836F2F5A3-001/control-001/cores/collection1/data/
   [junit4]   2> 15254 INFO  (coreLoadExecutor-114-thread-1) [    ] o.a.s.u.p.UpdateRequestProcessorChain creating updateRequestProcessorChain "nodistrib"
   [junit4]   2> 15255 INFO  (coreLoadExecutor-114-thread-1) [    ] o.a.s.u.p.UpdateRequestProcessorChain creating updateRequestProcessorChain "dedupe"
   [junit4]   2> 15255 INFO  (coreLoadExecutor-114-thread-1) [    ] o.a.s.u.p.UpdateRequestProcessorChain inserting DistributedUpdateProcessorFactory into updateRequestProcessorChain "dedupe"
   [junit4]   2> 15255 INFO  (coreLoadExecutor-114-thread-1) [    ] o.a.s.u.p.UpdateRequestProcessorChain creating updateRequestProcessorChain "stored_sig"
   [junit4]   2> 15255 INFO  (coreLoadExecutor-114-thread-1) [    ] o.a.s.u.p.UpdateRequestProcessorChain inserting DistributedUpdateProcessorFactory into updateRequestProcessorChain "stored_sig"
   [junit4]   2> 15255 INFO  (coreLoadExecutor-114-thread-1) [    ] o.a.s.u.p.UpdateRequestProcessorChain creating updateRequestProcessorChain "distrib-dup-test-chain-explicit"
   [junit4]   2> 15255 INFO  (coreLoadExecutor-114-thread-1) [    ] o.a.s.u.p.UpdateRequestProcessorChain creating updateRequestProcessorChain "distrib-dup-test-chain-implicit"
   [junit4]   2> 15255 INFO  (coreLoadExecutor-114-thread-1) [    ] o.a.s.u.p.UpdateRequestProcessorChain inserting DistributedUpdateProcessorFactory into updateRequestProcessorChain "distrib-dup-test-chain-implicit"
   [junit4]   2> 15255 INFO  (coreLoadExecutor-114-thread-1) [    ] o.a.s.c.SolrCore no updateRequestProcessorChain defined as default, creating implicit default
   [junit4]   2> 15256 WARN  (coreLoadExecutor-114-thread-1) [    ] o.a.s.c.RequestHandlers INVALID paramSet a in requestHandler {type = requestHandler,name = /dump,class = DumpRequestHandler,args = {defaults={a=A,b=B}}}
   [junit4]   2> 15258 INFO  (coreLoadExecutor-114-thread-1) [    ] o.a.s.h.l.XMLLoader xsltCacheLifetimeSeconds=60
   [junit4]   2> 15261 INFO  (coreLoadExecutor-114-thread-1) [    ] o.a.s.h.l.XMLLoader xsltCacheLifetimeSeconds=60
   [junit4]   2> 15263 INFO  (coreLoadExecutor-114-thread-1) [    ] o.a.s.h.l.XMLLoader xsltCacheLifetimeSeconds=60
   [junit4]   2> 15264 INFO  (coreLoadExecutor-114-thread-1) [    ] o.a.s.h.l.XMLLoader xsltCacheLifetimeSeconds=60
   [junit4]   2> 15280 INFO  (coreLoadExecutor-114-thread-1) [    ] o.a.s.c.RequestHandlers Registered paths: /admin/mbeans,standard,/dump,/update/csv,/sql,/update/json/docs,/admin/luke,/export,/admin/segments,/get,/admin/system,/replication,/admin/properties,/config,/stream,/schema,/admin/plugins,/admin/logging,/update/json,/admin/threads,/admin/ping,/update,/admin/file
   [junit4]   2> 15280 INFO  (coreLoadExecutor-114-thread-1) [    ] o.a.s.c.SolrCore Using default statsCache cache: org.apache.solr.search.stats.LocalStatsCache
   [junit4]   2> 15281 INFO  (coreLoadExecutor-114-thread-1) [    ] o.a.s.u.UpdateHandler Using UpdateLog implementation: org.apache.solr.update.UpdateLog
   [junit4]   2> 15281 INFO  (coreLoadExecutor-114-thread-1) [    ] o.a.s.u.UpdateLog Initializing UpdateLog: dataDir= defaultSyncLevel=FLUSH numRecordsToKeep=100 maxNumLogsToKeep=10 numVersionBuckets=65536
   [junit4]   2> 15282 INFO  (coreLoadExecutor-114-thread-1) [    ] o.a.s.u.CommitTracker Hard AutoCommit: if uncommited for 15000ms; 
   [junit4]   2> 15282 INFO  (coreLoadExecutor-114-thread-1) [    ] o.a.s.u.CommitTracker Soft AutoCommit: disabled
   [junit4]   2> 15283 INFO  (coreLoadExecutor-114-thread-1) [    ] o.a.s.u.RandomMergePolicy RandomMergePolicy wrapping class org.apache.lucene.index.TieredMergePolicy: [TieredMergePolicy: maxMergeAtOnce=23, maxMergeAtOnceExplicit=14, maxMergedSegmentMB=45.203125, floorSegmentMB=1.6416015625, forceMergeDeletesPctAllowed=17.51407319001985, segmentsPerTier=37.0, maxCFSSegmentSizeMB=8.796093022207999E12, noCFSRatio=0.11377421591262103
   [junit4]   2> 15283 INFO  (coreLoadExecutor-114-thread-1) [    ] o.a.s.c.SolrDeletionPolicy SolrDeletionPolicy.onInit: commits: num=1
   [junit4]   2> 	commit{dir=/home/jenkins/workspace/Lucene-Solr-trunk-Linux/solr/build/solr-core/test/J1/temp/solr.cloud.ChaosMonkeyNothingIsSafeTest_68CD79A836F2F5A3-001/control-001/cores/collection1/data/index,segFN=segments_1,generation=1}
   [junit4]   2> 15283 INFO  (coreLoadExecutor-114-thread-1) [    ] o.a.s.c.SolrDeletionPolicy newest commit generation = 1
   [junit4]   2> 15283 INFO  (coreLoadExecutor-114-thread-1) [    ] o.a.s.s.SolrIndexSearcher Opening [Searcher@188473e[collection1] main]
   [junit4]   2> 15284 INFO  (coreLoadExecutor-114-thread-1) [    ] o.a.s.c.c.ZkStateReader Load collection config from: [/collections/control_collection]
   [junit4]   2> 15285 INFO  (coreLoadExecutor-114-thread-1) [    ] o.a.s.c.c.ZkStateReader path=[/collections/control_collection] [configName]=[conf1] specified config exists in ZooKeeper
   [junit4]   2> 15285 INFO  (coreLoadExecutor-114-thread-1) [    ] o.a.s.r.ManagedResourceStorage Setting up ZooKeeper-based storage for the RestManager with znodeBase: /configs/conf1
   [junit4]   2> 15299 INFO  (coreLoadExecutor-114-thread-1) [    ] o.a.s.r.ManagedResourceStorage Configured ZooKeeperStorageIO with znodeBase: /configs/conf1
   [junit4]   2> 15299 INFO  (coreLoadExecutor-114-thread-1) [    ] o.a.s.r.RestManager Initializing RestManager with initArgs: {}
   [junit4]   2> 15299 INFO  (coreLoadExecutor-114-thread-1) [    ] o.a.s.r.ManagedResourceStorage Reading _rest_managed.json using ZooKeeperStorageIO:path=/configs/conf1
   [junit4]   2> 15300 INFO  (coreLoadExecutor-114-thread-1) [    ] o.a.s.r.ManagedResourceStorage No data found for znode /configs/conf1/_rest_managed.json
   [junit4]   2> 15300 INFO  (coreLoadExecutor-114-thread-1) [    ] o.a.s.r.ManagedResourceStorage Loaded null at path _rest_managed.json using ZooKeeperStorageIO:path=/configs/conf1
   [junit4]   2> 15300 INFO  (coreLoadExecutor-114-thread-1) [    ] o.a.s.r.RestManager Initializing 0 registered ManagedResources
   [junit4]   2> 15300 INFO  (coreLoadExecutor-114-thread-1) [    ] o.a.s.h.ReplicationHandler Commits will be reserved for  10000
   [junit4]   2> 15303 INFO  (searcherExecutor-115-thread-1) [    ] o.a.s.c.SolrCore [collection1] Registered new searcher Searcher@188473e[collection1] main{ExitableDirectoryReader(UninvertingDirectoryReader())}
   [junit4]   2> 15304 INFO  (coreLoadExecutor-114-thread-1) [    ] o.a.s.u.UpdateLog Looking up max value of version field to seed version buckets
   [junit4]   2> 15304 INFO  (coreLoadExecutor-114-thread-1) [    ] o.a.s.u.VersionInfo Refreshing highest value of _version_ for 65536 version buckets from index
   [junit4]   2> 15304 INFO  (coreLoadExecutor-114-thread-1) [    ] o.a.s.u.VersionInfo No terms found for _version_, cannot seed version bucket highest value from index
   [junit4]   2> 15304 INFO  (coreLoadExecutor-114-thread-1) [    ] o.a.s.u.UpdateLog Could not find max version in index or recent updates, using new clock 1526440365220954112
   [junit4]   2> 15305 INFO  (coreLoadExecutor-114-thread-1) [    ] o.a.s.u.UpdateLog Took 1.0ms to seed version buckets with highest version 1526440365220954112
   [junit4]   2> 15306 INFO  (coreLoadExecutor-114-thread-1) [    ] o.a.s.c.ZkController watch zkdir /configs/conf1
   [junit4]   2> 15308 INFO  (coreLoadExecutor-114-thread-1) [    ] o.a.s.c.CoreContainer registering core: collection1
   [junit4]   2> 15308 INFO  (coreZkRegister-108-thread-1) [    ] o.a.s.c.ZkController Register replica - core:collection1 address:http://127.0.0.1:42737/e_sax/np collection:control_collection shard:shard1
   [junit4]   2> 15317 INFO  (coreZkRegister-108-thread-1) [    ] o.a.s.c.c.SolrZkClient makePath: /collections/control_collection/leader_elect/shard1/election
   [junit4]   2> 15320 INFO  (coreZkRegister-108-thread-1) [    ] o.a.s.c.LeaderElector Joined leadership election with path: /collections/control_collection/leader_elect/shard1/election/95402522712080388-core_node1-n_0000000000
   [junit4]   2> 15321 INFO  (coreZkRegister-108-thread-1) [    ] o.a.s.c.ShardLeaderElectionContext Running the leader process for shard=shard1 and weAreReplacement=false and leaderVoteWait=10000
   [junit4]   2> 15323 INFO  (coreZkRegister-108-thread-1) [    ] o.a.s.c.ShardLeaderElectionContext Enough replicas found to continue.
   [junit4]   2> 15323 INFO  (coreZkRegister-108-thread-1) [    ] o.a.s.c.ShardLeaderElectionContext I may be the new leader - try and sync
   [junit4]   2> 15324 INFO  (OverseerStateUpdate-95402522712080388-127.0.0.1:42737_e_sax%2Fnp-n_0000000000) [    ] o.a.s.c.Overseer processMessage: queueSize: 1, message = {
   [junit4]   2>   "operation":"leader",
   [junit4]   2>   "shard":"shard1",
   [junit4]   2>   "collection":"control_collection"} current state version: 1
   [junit4]   2> 15324 INFO  (coreZkRegister-108-thread-1) [    ] o.a.s.c.SyncStrategy Sync replicas to http://127.0.0.1:42737/e_sax/np/collection1/
   [junit4]   2> 15325 INFO  (coreZkRegister-108-thread-1) [    ] o.a.s.c.SyncStrategy Sync Success - now sync replicas to me
   [junit4]   2> 15325 INFO  (coreZkRegister-108-thread-1) [    ] o.a.s.c.SyncStrategy http://127.0.0.1:42737/e_sax/np/collection1/ has no replicas
   [junit4]   2> 15328 INFO  (coreZkRegister-108-thread-1) [    ] o.a.s.c.c.SolrZkClient makePath: /collections/control_collection/leaders/shard1
   [junit4]   2> 15332 INFO  (coreZkRegister-108-thread-1) [    ] o.a.s.c.ShardLeaderElectionContextBase Creating leader registration node
   [junit4]   2> 15349 INFO  (coreZkRegister-108-thread-1) [    ] o.a.s.c.ShardLeaderElectionContext I am the new leader: http://127.0.0.1:42737/e_sax/np/collection1/ shard1
   [junit4]   2> 15351 INFO  (OverseerStateUpdate-95402522712080388-127.0.0.1:42737_e_sax%2Fnp-n_0000000000) [    ] o.a.s.c.Overseer processMessage: queueSize: 1, message = {
   [junit4]   2>   "operation":"leader",
   [junit4]   2>   "shard":"shard1",
   [junit4]   2>   "collection":"control_collection",
   [junit4]   2>   "base_url":"http://127.0.0.1:42737/e_sax/np",
   [junit4]   2>   "core":"collection1",
   [junit4]   2>   "state":"active"} current state version: 1
   [junit4]   2> 15459 INFO  (zkCallback-25-thread-1) [    ] o.a.s.c.c.ZkStateReader A cluster state change: [WatchedEvent state:SyncConnected type:NodeDataChanged path:/clusterstate.json], has occurred - updating... (live nodes size: [1])
   [junit4]   2> 15501 INFO  (coreZkRegister-108-thread-1) [    ] o.a.s.c.ZkController We are http://127.0.0.1:42737/e_sax/np/collection1/ and leader is http://127.0.0.1:42737/e_sax/np/collection1/
   [junit4]   2> 15501 INFO  (coreZkRegister-108-thread-1) [    ] o.a.s.c.ZkController No LogReplay needed for core=collection1 baseURL=http://127.0.0.1:42737/e_sax/np
   [junit4]   2> 15501 INFO  (coreZkRegister-108-thread-1) [    ] o.a.s.c.ZkController I am the leader, no recovery necessary
   [junit4]   2> 15501 INFO  (coreZkRegister-108-thread-1) [    ] o.a.s.c.ZkController publishing state=active
   [junit4]   2> 15501 INFO  (coreZkRegister-108-thread-1) [    ] o.a.s.c.ZkController numShards not found on descriptor - reading it from system property
   [junit4]   2> 15504 INFO  (OverseerStateUpdate-95402522712080388-127.0.0.1:42737_e_sax%2Fnp-n_0000000000) [    ] o.a.s.c.Overseer processMessage: queueSize: 1, message = {
   [junit4]   2>   "core":"collection1",
   [junit4]   2>   "core_node_name":"core_node1",
   [junit4]   2>   "roles":null,
   [junit4]   2>   "base_url":"http://127.0.0.1:42737/e_sax/np",
   [junit4]   2>   "node_name":"127.0.0.1:42737_e_sax%2Fnp",
   [junit4]   2>   "numShards":"1",
   [junit4]   2>   "state":"active",
   [junit4]   2>   "shard":"shard1",
   [junit4]   2>   "collection":"control_collection",
   [junit4]   2>   "operation":"state"} current state version: 2
   [junit4]   2> 15506 INFO  (OverseerStateUpdate-95402522712080388-127.0.0.1:42737_e_sax%2Fnp-n_0000000000) [    ] o.a.s.c.o.ReplicaMutator Update state numShards=1 message={
   [junit4]   2>   "core":"collection1",
   [junit4]   2>   "core_node_name":"core_node1",
   [junit4]   2>   "roles":null,
   [junit4]   2>   "base_url":"http://127.0.0.1:42737/e_sax/np",
   [junit4]   2>   "node_name":"127.0.0.1:42737_e_sax%2Fnp",
   [junit4]   2>   "numShards":"1",
   [junit4]   2>   "state":"active",
   [junit4]   2>   "shard":"shard1",
   [junit4]   2>   "collection":"control_collection",
   [junit4]   2>   "operation":"state"}
   [junit4]   2> 15565 INFO  (TEST-ChaosMonkeyNothingIsSafeTest.test-seed#[68CD79A836F2F5A3]) [    ] o.a.s.c.c.SolrZkClient Using default ZkCredentialsProvider
   [junit4]   2> 15566 INFO  (TEST-ChaosMonkeyNothingIsSafeTest.test-seed#[68CD79A836F2F5A3]) [    ] o.a.s.c.c.ConnectionManager Waiting for client to connect to ZooKeeper
   [junit4]   2> 15579 INFO  (zkCallback-27-thread-1) [    ] o.a.s.c.c.ConnectionManager Watcher org.apache.solr.common.cloud.ConnectionManager@98c2fa name:ZooKeeperConnection Watcher:127.0.0.1:56725/solr got event WatchedEvent state:SyncConnected type:None path:null path:null type:None
   [junit4]   2> 15580 INFO  (TEST-ChaosMonkeyNothingIsSafeTest.test-seed#[68CD79A836F2F5A3]) [    ] o.a.s.c.c.ConnectionManager Client is connected to ZooKeeper
   [junit4]   2> 15580 INFO  (TEST-ChaosMonkeyNothingIsSafeTest.test-seed#[68CD79A836F2F5A3]) [    ] o.a.s.c.c.SolrZkClient Using default ZkACLProvider
   [junit4]   2> 15580 INFO  (TEST-ChaosMonkeyNothingIsSafeTest.test-seed#[68CD79A836F2F5A3]) [    ] o.a.s.c.c.ZkStateReader Updating cluster state from ZooKeeper... 
   [junit4]   2> 15585 INFO  (TEST-ChaosMonkeyNothingIsSafeTest.test-seed#[68CD79A836F2F5A3]) [    ] o.a.s.c.ChaosMonkey monkey: init - expire sessions:false cause connection loss:false
   [junit4]   2> 15611 INFO  (zkCallback-25-thread-1) [    ] o.a.s.c.c.ZkStateReader A cluster state change: [WatchedEvent state:SyncConnected type:NodeDataChanged path:/clusterstate.json], has occurred - updating... (live nodes size: [1])
   [junit4]   2> 15612 INFO  (zkCallback-27-thread-1) [    ] o.a.s.c.c.ZkStateReader A cluster state change: [WatchedEvent state:SyncConnected type:NodeDataChanged path:/clusterstate.json], has occurred - updating... (live nodes size: [1])
   [junit4]   2> 15721 INFO  (TEST-ChaosMonkeyNothingIsSafeTest.test-seed#[68CD79A836F2F5A3]) [    ] o.a.s.SolrTestCaseJ4 Writing core.properties file to /home/jenkins/workspace/Lucene-Solr-trunk-Linux/solr/build/solr-core/test/J1/temp/solr.cloud.ChaosMonkeyNothingIsSafeTest_68CD79A836F2F5A3-001/shard-1-001/cores/collection1
   [junit4]   2> 15731 INFO  (TEST-ChaosMonkeyNothingIsSafeTest.test-seed#[68CD79A836F2F5A3]) [    ] o.a.s.c.AbstractFullDistribZkTestBase create jetty 1 in directory /home/jenkins/workspace/Lucene-Solr-trunk-Linux/solr/build/solr-core/test/J1/temp/solr.cloud.ChaosMonkeyNothingIsSafeTest_68CD79A836F2F5A3-001/shard-1-001
   [junit4]   2> 15732 INFO  (TEST-ChaosMonkeyNothingIsSafeTest.test-seed#[68CD79A836F2F5A3]) [    ] o.e.j.s.Server jetty-9.3.6.v20151106
   [junit4]   2> 15733 INFO  (TEST-ChaosMonkeyNothingIsSafeTest.test-seed#[68CD79A836F2F5A3]) [    ] o.e.j.s.h.ContextHandler Started o.e.j.s.ServletContextHandler@1babbf0{/e_sax/np,null,AVAILABLE}
   [junit4]   2> 15734 INFO  (TEST-ChaosMonkeyNothingIsSafeTest.test-seed#[68CD79A836F2F5A3]) [    ] o.e.j.s.ServerConnector Started ServerConnector@1fb8627{HTTP/1.1,[http/1.1]}{127.0.0.1:46724}
   [junit4]   2> 15734 INFO  (TEST-ChaosMonkeyNothingIsSafeTest.test-seed#[68CD79A836F2F5A3]) [    ] o.e.j.s.Server Started @17527ms
   [junit4]   2> 15734 INFO  (TEST-ChaosMonkeyNothingIsSafeTest.test-seed#[68CD79A836F2F5A3]) [    ] o.a.s.c.s.e.JettySolrRunner Jetty properties: {solr.data.dir=/home/jenkins/workspace/Lucene-Solr-trunk-Linux/solr/build/solr-core/test/J1/temp/solr.cloud.ChaosMonkeyNothingIsSafeTest_68CD79A836F2F5A3-001/tempDir-001/jetty1, solrconfig=solrconfig.xml, hostContext=/e_sax/np, hostPort=46724, coreRootDirectory=/home/jenkins/workspace/Lucene-Solr-trunk-Linux/solr/build/solr-core/test/J1/../../../../../../../../../home/jenkins/workspace/Lucene-Solr-trunk-Linux/solr/build/solr-core/test/J1/temp/solr.cloud.ChaosMonkeyNothingIsSafeTest_68CD79A836F2F5A3-001/shard-1-001/cores}
   [junit4]   2> 15735 INFO  (TEST-ChaosMonkeyNothingIsSafeTest.test-seed#[68CD79A836F2F5A3]) [    ] o.a.s.s.SolrDispatchFilter SolrDispatchFilter.init(): sun.misc.Launcher$AppClassLoader@8102c8
   [junit4]   2> 15735 INFO  (TEST-ChaosMonkeyNothingIsSafeTest.test-seed#[68CD79A836F2F5A3]) [    ] o.a.s.c.SolrResourceLoader new SolrResourceLoader for directory: '/home/jenkins/workspace/Lucene-Solr-trunk-Linux/solr/build/solr-core/test/J1/temp/solr.cloud.ChaosMonkeyNothingIsSafeTest_68CD79A836F2F5A3-001/shard-1-001'
   [junit4]   2> 15735 INFO  (TEST-ChaosMonkeyNothingIsSafeTest.test-seed#[68CD79A836F2F5A3]) [    ] o.a.s.c.SolrResourceLoader JNDI not configured for solr (NoInitialContextEx)
   [junit4]   2> 15735 INFO  (TEST-ChaosMonkeyNothingIsSafeTest.test-seed#[68CD79A836F2F5A3]) [    ] o.a.s.c.SolrResourceLoader solr home defaulted to 'solr/' (could not find system property or JNDI)
   [junit4]   2> 15735 INFO  (TEST-ChaosMonkeyNothingIsSafeTest.test-seed#[68CD79A836F2F5A3]) [    ] o.a.s.c.c.SolrZkClient Using default ZkCredentialsProvider
   [junit4]   2> 15736 INFO  (TEST-ChaosMonkeyNothingIsSafeTest.test-seed#[68CD79A836F2F5A3]) [    ] o.a.s.c.c.ConnectionManager Waiting for client to connect to ZooKeeper
   [junit4]   2> 15740 INFO  (zkCallback-28-thread-1) [    ] o.a.s.c.c.ConnectionManager Watcher org.apache.solr.common.cloud.ConnectionManager@5179bd name:ZooKeeperConnection Watcher:127.0.0.1:56725/solr got event WatchedEvent state:SyncConnected type:None path:null path:null type:None
   [junit4]   2> 15740 INFO  (TEST-ChaosMonkeyNothingIsSafeTest.test-seed#[68CD79A836F2F5A3]) [    ] o.a.s.c.c.ConnectionManager Client is connected to ZooKeeper
   [junit4]   2> 15740 INFO  (TEST-ChaosMonkeyNothingIsSafeTest.test-seed#[68CD79A836F2F5A3]) [    ] o.a.s.c.c.SolrZkClient Using default ZkACLProvider
   [junit4]   2> 15752 INFO  (TEST-ChaosMonkeyNothingIsSafeTest.test-seed#[68CD79A836F2F5A3]) [    ] o.a.s.s.SolrDispatchFilter Loading solr.xml from SolrHome (not found in ZooKeeper)
   [junit4]   2> 15752 INFO  (TEST-ChaosMonkeyNothingIsSafeTest.test-seed#[68CD79A836F2F5A3]) [    ] o.a.s.c.SolrXmlConfig Loading container configuration from /home/jenkins/workspace/Lucene-Solr-trunk-Linux/solr/build/solr-core/test/J1/temp/solr.cloud.ChaosMonkeyNothingIsSafeTest_68CD79A836F2F5A3-001/shard-1-001/solr.xml
   [junit4]   2> 15756 INFO  (TEST-ChaosMonkeyNothingIsSafeTest.test-seed#[68CD79A836F2F5A3]) [    ] o.a.s.c.CorePropertiesLocator Config-defined core root directory: /home/jenkins/workspace/Lucene-Solr-trunk-Linux/solr/build/solr-core/test/J1/../../../../../../../../../home/jenkins/workspace/Lucene-Solr-trunk-Linux/solr/build/solr-core/test/J1/temp/solr.cloud.ChaosMonkeyNothingIsSafeTest_68CD79A836F2F5A3-001/shard-1-001/cores
   [junit4]   2> 15756 INFO  (TEST-ChaosMonkeyNothingIsSafeTest.test-seed#[68CD79A836F2F5A3]) [    ] o.a.s.c.CoreContainer New CoreContainer 12881259
   [junit4]   2> 15756 INFO  (TEST-ChaosMonkeyNothingIsSafeTest.test-seed#[68CD79A836F2F5A3]) [    ] o.a.s.c.CoreContainer Loading cores into CoreContainer [instanceDir=/home/jenkins/workspace/Lucene-Solr-trunk-Linux/solr/build/solr-core/test/J1/temp/solr.cloud.ChaosMonkeyNothingIsSafeTest_68CD79A836F2F5A3-001/shard-1-001]
   [junit4]   2> 15757 WARN  (TEST-ChaosMonkeyNothingIsSafeTest.test-seed#[68CD79A836F2F5A3]) [    ] o.a.s.c.CoreContainer Couldn't add files from /home/jenkins/workspace/Lucene-Solr-trunk-Linux/solr/build/solr-core/test/J1/temp/solr.cloud.ChaosMonkeyNothingIsSafeTest_68CD79A836F2F5A3-001/shard-1-001/lib to classpath: /home/jenkins/workspace/Lucene-Solr-trunk-Linux/solr/build/solr-core/test/J1/temp/solr.cloud.ChaosMonkeyNothingIsSafeTest_68CD79A836F2F5A3-001/shard-1-001/lib
   [junit4]   2> 15757 INFO  (TEST-ChaosMonkeyNothingIsSafeTest.test-seed#[68CD79A836F2F5A3]) [    ] o.a.s.h.c.HttpShardHandlerFactory created with socketTimeout : 90000,urlScheme : ,connTimeout : 15000,maxConnectionsPerHost : 20,maxConnections : 10000,corePoolSize : 0,maximumPoolSize : 2147483647,maxThreadIdleTime : 5,sizeOfQueue : -1,fairnessPolicy : false,useRetries : false,
   [junit4]   2> 15759 INFO  (TEST-ChaosMonkeyNothingIsSafeTest.test-seed#[68CD79A836F2F5A3]) [    ] o.a.s.u.UpdateShardHandler Creating UpdateShardHandler HTTP client with params: socketTimeout=340000&connTimeout=45000&retry=true
   [junit4]   2> 15760 INFO  (TEST-ChaosMonkeyNothingIsSafeTest.test-seed#[68CD79A836F2F5A3]) [    ] o.a.s.l.LogWatcher SLF4J impl is org.slf4j.impl.Log4jLoggerFactory
   [junit4]   2> 15760 INFO  (TEST-ChaosMonkeyNothingIsSafeTest.test-seed#[68CD79A836F2F5A3]) [    ] o.a.s.l.LogWatcher Registering Log Listener [Log4j (org.slf4j.impl.Log4jLoggerFactory)]
   [junit4]   2> 15760 INFO  (TEST-ChaosMonkeyNothingIsSafeTest.test-seed#[68CD79A836F2F5A3]) [    ] o.a.s.c.ZkContainer Zookeeper client=127.0.0.1:56725/solr
   [junit4]   2> 15760 INFO  (TEST-ChaosMonkeyNothingIsSafeTest.test-seed#[68CD79A836F2F5A3]) [    ] o.a.s.c.ZkController zkHost includes chroot
   [junit4]   2> 15760 INFO  (TEST-ChaosMonkeyNothingIsSafeTest.test-seed#[68CD79A836F2F5A3]) [    ] o.a.s.c.c.SolrZkClient Using default ZkCredentialsProvider
   [junit4]   2> 15760 INFO  (TEST-ChaosMonkeyNothingIsSafeTest.test-seed#[68CD79A836F2F5A3]) [    ] o.a.s.c.c.ConnectionManager Waiting for client to connect to ZooKeeper
   [junit4]   2> 15761 INFO  (zkCallback-31-thread-1) [    ] o.a.s.c.c.ConnectionManager Watcher org.apache.solr.common.cloud.ConnectionManager@1374390 name:ZooKeeperConnection Watcher:127.0.0.1:56725 got event WatchedEvent state:SyncConnected type:None path:null path:null type:None
   [junit4]   2> 15761 INFO  (TEST-ChaosMonkeyNothingIsSafeTest.test-seed#[68CD79A836F2F5A3]) [    ] o.a.s.c.c.ConnectionManager Client is connected to ZooKeeper
   [junit4]   2> 15762 INFO  (TEST-ChaosMonkeyNothingIsSafeTest.test-seed#[68CD79A836F2F5A3]) [    ] o.a.s.c.c.SolrZkClient Using default ZkACLProvider
   [junit4]   2> 15763 INFO  (TEST-ChaosMonkeyNothingIsSafeTest.test-seed#[68CD79A836F2F5A3]) [    ] o.a.s.c.c.ConnectionManager Waiting for client to connect to ZooKeeper
   [junit4]   2> 15764 INFO  (zkCallback-32-thread-1) [    ] o.a.s.c.c.ConnectionManager Watcher org.apache.solr.common.cloud.ConnectionManager@b3b477 name:ZooKeeperConnection Watcher:127.0.0.1:56725/solr got event WatchedEvent state:SyncConnected type:None path:null path:null type:None
   [junit4]   2> 15764 INFO  (TEST-ChaosMonkeyNothingIsSafeTest.test-seed#[68CD79A836F2F5A3]) [    ] o.a.s.c.c.ConnectionManager Client is connected to ZooKeeper
   [junit4]   2> 15777 INFO  (TEST-ChaosMonkeyNothingIsSafeTest.test-seed#[68CD79A836F2F5A3]) [    ] o.a.s.c.c.ZkStateReader Updating cluster state from ZooKeeper... 
   [junit4]   2> 16783 INFO  (TEST-ChaosMonkeyNothingIsSafeTest.test-seed#[68CD79A836F2F5A3]) [    ] o.a.s.c.ZkController Register node as live in ZooKeeper:/live_nodes/127.0.0.1:46724_e_sax%2Fnp
   [junit4]   2> 16783 INFO  (TEST-ChaosMonkeyNothingIsSafeTest.test-seed#[68CD79A836F2F5A3]) [    ] o.a.s.c.c.SolrZkClient makePath: /live_nodes/127.0.0.1:46724_e_sax%2Fnp
   [junit4]   2> 16787 INFO  (zkCallback-25-thread-1) [    ] o.a.s.c.c.ZkStateReader A live node change: [WatchedEvent state:SyncConnected type:NodeChildrenChanged path:/live_nodes], has occurred - updating... (live nodes size: [1])
   [junit4]   2> 16787 INFO  (zkCallback-32-thread-1) [    ] o.a.s.c.c.ZkStateReader A live node change: [WatchedEvent state:SyncConnected type:NodeChildrenChanged path:/live_nodes], has occurred - updating... (live nodes size: [1])
   [junit4]   2> 16787 INFO  (zkCallback-27-thread-1) [    ] o.a.s.c.c.ZkStateReader A live node change: [WatchedEvent state:SyncConnected type:NodeChildrenChanged path:/live_nodes], has occurred - updating... (live nodes size: [1])
   [junit4]   2> 16789 INFO  (TEST-ChaosMonkeyNothingIsSafeTest.test-seed#[68CD79A836F2F5A3]) [    ] o.a.s.c.Overseer Overseer (id=null) closing
   [junit4]   2> 16789 INFO  (TEST-ChaosMonkeyNothingIsSafeTest.test-seed#[68CD79A836F2F5A3]) [    ] o.a.s.c.LeaderElector Joined leadership election with path: /overseer_elect/election/95402522712080392-127.0.0.1:46724_e_sax%2Fnp-n_0000000001
   [junit4]   2> 16791 INFO  (TEST-ChaosMonkeyNothingIsSafeTest.test-seed#[68CD79A836F2F5A3]) [    ] o.a.s.c.LeaderElector Watching path /overseer_elect/election/95402522712080388-127.0.0.1:42737_e_sax%2Fnp-n_0000000000 to know if I could be the leader
   [junit4]   2> 16848 INFO  (TEST-ChaosMonkeyNothingIsSafeTest.test-seed#[68CD79A836F2F5A3]) [    ] o.a.s.c.CoreContainer Security conf doesn't exist. Skipping setup for authorization module.
   [junit4]   2> 16848 INFO  (TEST-ChaosMonkeyNothingIsSafeTest.test-seed#[68CD79A836F2F5A3]) [    ] o.a.s.c.CoreContainer No authentication plugin used.
   [junit4]   2> 16849 INFO  (TEST-ChaosMonkeyNothingIsSafeTest.test-seed#[68CD79A836F2F5A3]) [    ] o.a.s.c.CorePropertiesLocator Looking for core definitions underneath /home/jenkins/workspace/Lucene-Solr-trunk-Linux/solr/build/solr-core/test/J1/../../../../../../../../../home/jenkins/workspace/Lucene-Solr-trunk-Linux/solr/build/solr-core/test/J1/temp/solr.cloud.ChaosMonkeyNothingIsSafeTest_68CD79A836F2F5A3-001/shard-1-001/cores
   [junit4]   2> 16850 INFO  (TEST-ChaosMonkeyNothingIsSafeTest.test-seed#[68CD79A836F2F5A3]) [    ] o.a.s.c.CoreDescriptor Created CoreDescriptor: {name=collection1, config=solrconfig.xml, transient=false, schema=schema.xml, loadOnStartup=true, configSetProperties=configsetprops.json, collection=collection1, coreNodeName=, dataDir=data/, shard=}
   [junit4]   2> 16850 INFO  (TEST-ChaosMonkeyNothingIsSafeTest.test-seed#[68CD79A836F2F5A3]) [    ] o.a.s.c.CorePropertiesLocator Found core collection1 in /home/jenkins/workspace/Lucene-Solr-trunk-Linux/solr/build/solr-core/test/J1/../../../../../../../../../home/jenkins/workspace/Lucene-Solr-trunk-Linux/solr/build/solr-core/test/J1/temp/solr.cloud.ChaosMonkeyNothingIsSafeTest_68CD79A836F2F5A3-001/shard-1-001/cores/collection1
   [junit4]   2> 16851 INFO  (TEST-ChaosMonkeyNothingIsSafeTest.test-seed#[68CD79A836F2F5A3]) [    ] o.a.s.c.CorePropertiesLocator Found 1 core definitions
   [junit4]   2> 16860 INFO  (coreLoadExecutor-125-thread-1) [    ] o.a.s.c.ZkController publishing state=down
   [junit4]   2> 16860 INFO  (TEST-ChaosMonkeyNothingIsSafeTest.test-seed#[68CD79A836F2F5A3]) [    ] o.a.s.s.SolrDispatchFilter user.dir=/home/jenkins/workspace/Lucene-Solr-trunk-Linux/solr/build/solr-core/test/J1
   [junit4]   2> 16860 INFO  (TEST-ChaosMonkeyNothingIsSafeTest.test-seed#[68CD79A836F2F5A3]) [    ] o.a.s.s.SolrDispatchFilter SolrDispatchFilter.init() done
   [junit4]   2> 16860 INFO  (coreLoadExecutor-125-thread-1) [    ] o.a.s.c.ZkController numShards not found on descriptor - reading it from system property
   [junit4]   2> 16862 INFO  (coreLoadExecuto

[...truncated too long message...]

    at java.lang.Object.wait(Native Method)
   [junit4]    >         at java.lang.Object.wait(Object.java:516)
   [junit4]    >         at java.util.TimerThread.mainLoop(Timer.java:526)
   [junit4]    >         at java.util.TimerThread.run(Timer.java:505)
   [junit4]    >    3) Thread[id=12047, name=ou=system.data, state=TIMED_WAITING, group=TGRP-SaslZkACLProviderTest]
   [junit4]    >         at jdk.internal.misc.Unsafe.park(Native Method)
   [junit4]    >         at java.util.concurrent.locks.LockSupport.parkNanos(LockSupport.java:230)
   [junit4]    >         at java.util.concurrent.locks.AbstractQueuedSynchronizer$ConditionObject.awaitNanos(AbstractQueuedSynchronizer.java:2106)
   [junit4]    >         at java.util.concurrent.ScheduledThreadPoolExecutor$DelayedWorkQueue.take(ScheduledThreadPoolExecutor.java:1131)
   [junit4]    >         at java.util.concurrent.ScheduledThreadPoolExecutor$DelayedWorkQueue.take(ScheduledThreadPoolExecutor.java:848)
   [junit4]    >         at java.util.concurrent.ThreadPoolExecutor.getTask(ThreadPoolExecutor.java:1083)
   [junit4]    >         at java.util.concurrent.ThreadPoolExecutor.runWorker(ThreadPoolExecutor.java:1143)
   [junit4]    >         at java.util.concurrent.ThreadPoolExecutor$Worker.run(ThreadPoolExecutor.java:632)
   [junit4]    >         at java.lang.Thread.run(Thread.java:804)
   [junit4]    >    4) Thread[id=12044, name=groupCache.data, state=TIMED_WAITING, group=TGRP-SaslZkACLProviderTest]
   [junit4]    >         at jdk.internal.misc.Unsafe.park(Native Method)
   [junit4]    >         at java.util.concurrent.locks.LockSupport.parkNanos(LockSupport.java:230)
   [junit4]    >         at java.util.concurrent.locks.AbstractQueuedSynchronizer$ConditionObject.awaitNanos(AbstractQueuedSynchronizer.java:2106)
   [junit4]    >         at java.util.concurrent.ScheduledThreadPoolExecutor$DelayedWorkQueue.take(ScheduledThreadPoolExecutor.java:1131)
   [junit4]    >         at java.util.concurrent.ScheduledThreadPoolExecutor$DelayedWorkQueue.take(ScheduledThreadPoolExecutor.java:848)
   [junit4]    >         at java.util.concurrent.ThreadPoolExecutor.getTask(ThreadPoolExecutor.java:1083)
   [junit4]    >         at java.util.concurrent.ThreadPoolExecutor.runWorker(ThreadPoolExecutor.java:1143)
   [junit4]    >         at java.util.concurrent.ThreadPoolExecutor$Worker.run(ThreadPoolExecutor.java:632)
   [junit4]    >         at java.lang.Thread.run(Thread.java:804)
   [junit4]    >    5) Thread[id=12046, name=kdcReplayCache.data, state=TIMED_WAITING, group=TGRP-SaslZkACLProviderTest]
   [junit4]    >         at jdk.internal.misc.Unsafe.park(Native Method)
   [junit4]    >         at java.util.concurrent.locks.LockSupport.parkNanos(LockSupport.java:230)
   [junit4]    >         at java.util.concurrent.locks.AbstractQueuedSynchronizer$ConditionObject.awaitNanos(AbstractQueuedSynchronizer.java:2106)
   [junit4]    >         at java.util.concurrent.ScheduledThreadPoolExecutor$DelayedWorkQueue.take(ScheduledThreadPoolExecutor.java:1131)
   [junit4]    >         at java.util.concurrent.ScheduledThreadPoolExecutor$DelayedWorkQueue.take(ScheduledThreadPoolExecutor.java:848)
   [junit4]    >         at java.util.concurrent.ThreadPoolExecutor.getTask(ThreadPoolExecutor.java:1083)
   [junit4]    >         at java.util.concurrent.ThreadPoolExecutor.runWorker(ThreadPoolExecutor.java:1143)
   [junit4]    >         at java.util.concurrent.ThreadPoolExecutor$Worker.run(ThreadPoolExecutor.java:632)
   [junit4]    >         at java.lang.Thread.run(Thread.java:804)
   [junit4]    > 	at __randomizedtesting.SeedInfo.seed([68CD79A836F2F5A3]:0)Throwable #2: com.carrotsearch.randomizedtesting.ThreadLeakError: There are still zombie threads that couldn't be terminated:
   [junit4]    >    1) Thread[id=12045, name=changePwdReplayCache.data, state=TIMED_WAITING, group=TGRP-SaslZkACLProviderTest]
   [junit4]    >         at jdk.internal.misc.Unsafe.park(Native Method)
   [junit4]    >         at java.util.concurrent.locks.LockSupport.parkNanos(LockSupport.java:230)
   [junit4]    >         at java.util.concurrent.locks.AbstractQueuedSynchronizer$ConditionObject.awaitNanos(AbstractQueuedSynchronizer.java:2106)
   [junit4]    >         at java.util.concurrent.ScheduledThreadPoolExecutor$DelayedWorkQueue.take(ScheduledThreadPoolExecutor.java:1131)
   [junit4]    >         at java.util.concurrent.ScheduledThreadPoolExecutor$DelayedWorkQueue.take(ScheduledThreadPoolExecutor.java:848)
   [junit4]    >         at java.util.concurrent.ThreadPoolExecutor.getTask(ThreadPoolExecutor.java:1083)
   [junit4]    >         at java.util.concurrent.ThreadPoolExecutor.runWorker(ThreadPoolExecutor.java:1143)
   [junit4]    >         at java.util.concurrent.ThreadPoolExecutor$Worker.run(ThreadPoolExecutor.java:632)
   [junit4]    >         at java.lang.Thread.run(Thread.java:804)
   [junit4]    >    2) Thread[id=12043, name=apacheds, state=WAITING, group=TGRP-SaslZkACLProviderTest]
   [junit4]    >         at java.lang.Object.wait(Native Method)
   [junit4]    >         at java.lang.Object.wait(Object.java:516)
   [junit4]    >         at java.util.TimerThread.mainLoop(Timer.java:526)
   [junit4]    >         at java.util.TimerThread.run(Timer.java:505)
   [junit4]    >    3) Thread[id=12047, name=ou=system.data, state=TIMED_WAITING, group=TGRP-SaslZkACLProviderTest]
   [junit4]    >         at jdk.internal.misc.Unsafe.park(Native Method)
   [junit4]    >         at java.util.concurrent.locks.LockSupport.parkNanos(LockSupport.java:230)
   [junit4]    >         at java.util.concurrent.locks.AbstractQueuedSynchronizer$ConditionObject.awaitNanos(AbstractQueuedSynchronizer.java:2106)
   [junit4]    >         at java.util.concurrent.ScheduledThreadPoolExecutor$DelayedWorkQueue.take(ScheduledThreadPoolExecutor.java:1131)
   [junit4]    >         at java.util.concurrent.ScheduledThreadPoolExecutor$DelayedWorkQueue.take(ScheduledThreadPoolExecutor.java:848)
   [junit4]    >         at java.util.concurrent.ThreadPoolExecutor.getTask(ThreadPoolExecutor.java:1083)
   [junit4]    >         at java.util.concurrent.ThreadPoolExecutor.runWorker(ThreadPoolExecutor.java:1143)
   [junit4]    >         at java.util.concurrent.ThreadPoolExecutor$Worker.run(ThreadPoolExecutor.java:632)
   [junit4]    >         at java.lang.Thread.run(Thread.java:804)
   [junit4]    >    4) Thread[id=12044, name=groupCache.data, state=TIMED_WAITING, group=TGRP-SaslZkACLProviderTest]
   [junit4]    >         at jdk.internal.misc.Unsafe.park(Native Method)
   [junit4]    >         at java.util.concurrent.locks.LockSupport.parkNanos(LockSupport.java:230)
   [junit4]    >         at java.util.concurrent.locks.AbstractQueuedSynchronizer$ConditionObject.awaitNanos(AbstractQueuedSynchronizer.java:2106)
   [junit4]    >         at java.util.concurrent.ScheduledThreadPoolExecutor$DelayedWorkQueue.take(ScheduledThreadPoolExecutor.java:1131)
   [junit4]    >         at java.util.concurrent.ScheduledThreadPoolExecutor$DelayedWorkQueue.take(ScheduledThreadPoolExecutor.java:848)
   [junit4]    >         at java.util.concurrent.ThreadPoolExecutor.getTask(ThreadPoolExecutor.java:1083)
   [junit4]    >         at java.util.concurrent.ThreadPoolExecutor.runWorker(ThreadPoolExecutor.java:1143)
   [junit4]    >         at java.util.concurrent.ThreadPoolExecutor$Worker.run(ThreadPoolExecutor.java:632)
   [junit4]    >         at java.lang.Thread.run(Thread.java:804)
   [junit4]    >    5) Thread[id=12046, name=kdcReplayCache.data, state=TIMED_WAITING, group=TGRP-SaslZkACLProviderTest]
   [junit4]    >         at jdk.internal.misc.Unsafe.park(Native Method)
   [junit4]    >         at java.util.concurrent.locks.LockSupport.parkNanos(LockSupport.java:230)
   [junit4]    >         at java.util.concurrent.locks.AbstractQueuedSynchronizer$ConditionObject.awaitNanos(AbstractQueuedSynchronizer.java:2106)
   [junit4]    >         at java.util.concurrent.ScheduledThreadPoolExecutor$DelayedWorkQueue.take(ScheduledThreadPoolExecutor.java:1131)
   [junit4]    >         at java.util.concurrent.ScheduledThreadPoolExecutor$DelayedWorkQueue.take(ScheduledThreadPoolExecutor.java:848)
   [junit4]    >         at java.util.concurrent.ThreadPoolExecutor.getTask(ThreadPoolExecutor.java:1083)
   [junit4]    >         at java.util.concurrent.ThreadPoolExecutor.runWorker(ThreadPoolExecutor.java:1143)
   [junit4]    >         at java.util.concurrent.ThreadPoolExecutor$Worker.run(ThreadPoolExecutor.java:632)
   [junit4]    >         at java.lang.Thread.run(Thread.java:804)
   [junit4]    > 	at __randomizedtesting.SeedInfo.seed([68CD79A836F2F5A3]:0)
   [junit4] Completed [455/579 (2!)] on J1 in 25.17s, 1 test, 3 errors <<< FAILURES!

[...truncated 415 lines...]
BUILD FAILED
/home/jenkins/workspace/Lucene-Solr-trunk-Linux/build.xml:740: The following error occurred while executing this line:
/home/jenkins/workspace/Lucene-Solr-trunk-Linux/build.xml:684: The following error occurred while executing this line:
/home/jenkins/workspace/Lucene-Solr-trunk-Linux/build.xml:59: The following error occurred while executing this line:
/home/jenkins/workspace/Lucene-Solr-trunk-Linux/solr/build.xml:233: The following error occurred while executing this line:
/home/jenkins/workspace/Lucene-Solr-trunk-Linux/solr/common-build.xml:524: The following error occurred while executing this line:
/home/jenkins/workspace/Lucene-Solr-trunk-Linux/lucene/common-build.xml:1457: The following error occurred while executing this line:
/home/jenkins/workspace/Lucene-Solr-trunk-Linux/lucene/common-build.xml:1014: There were test failures: 579 suites (8 ignored), 2331 tests, 2 suite-level errors, 1 error, 1 failure, 454 ignored (68 assumptions) [seed: 68CD79A836F2F5A3]

Total time: 44 minutes 41 seconds
Build step 'Invoke Ant' marked build as failure
Archiving artifacts
[WARNINGS] Skipping publisher since build result is FAILURE
Recording test results
Email was triggered for: Failure - Any
Sending email for trigger: Failure - Any



Mime
View raw message