lucene-dev mailing list archives

Site index · List index
Message view « Date » · « Thread »
Top « Date » · « Thread »
From Apache Jenkins Server <jenk...@builds.apache.org>
Subject [JENKINS] Lucene-Solr-Tests-5.5-Java7 - Build # 10 - Failure
Date Wed, 17 Feb 2016 18:36:06 GMT
Build: https://builds.apache.org/job/Lucene-Solr-Tests-5.5-Java7/10/

2 tests failed.
FAILED:  org.apache.solr.security.BasicAuthIntegrationTest.testBasics

Error Message:
Test abandoned because suite timeout was reached.

Stack Trace:
java.lang.Exception: Test abandoned because suite timeout was reached.
	at __randomizedtesting.SeedInfo.seed([AC5FA4FC630F58DB]:0)


FAILED:  junit.framework.TestSuite.org.apache.solr.security.BasicAuthIntegrationTest

Error Message:
Suite timeout exceeded (>= 7200000 msec).

Stack Trace:
java.lang.Exception: Suite timeout exceeded (>= 7200000 msec).
	at __randomizedtesting.SeedInfo.seed([AC5FA4FC630F58DB]:0)




Build Log:
[...truncated 12507 lines...]
   [junit4] Suite: org.apache.solr.security.BasicAuthIntegrationTest
   [junit4]   2> 2020339 INFO  (TEST-BasicAuthIntegrationTest.testBasics-seed#[AC5FA4FC630F58DB]) [    ] o.a.s.c.ZkTestServer STARTING ZK TEST SERVER
   [junit4]   2> 2020339 INFO  (Thread-7039) [    ] o.a.s.c.ZkTestServer client port:0.0.0.0/0.0.0.0:0
   [junit4]   2> 2020339 INFO  (Thread-7039) [    ] o.a.s.c.ZkTestServer Starting server
   [junit4]   2> 2020439 INFO  (TEST-BasicAuthIntegrationTest.testBasics-seed#[AC5FA4FC630F58DB]) [    ] o.a.s.c.ZkTestServer start zk server on port:58075
   [junit4]   2> 2020439 INFO  (TEST-BasicAuthIntegrationTest.testBasics-seed#[AC5FA4FC630F58DB]) [    ] o.a.s.c.c.SolrZkClient Using default ZkCredentialsProvider
   [junit4]   2> 2020466 INFO  (TEST-BasicAuthIntegrationTest.testBasics-seed#[AC5FA4FC630F58DB]) [    ] o.a.s.c.c.ConnectionManager Waiting for client to connect to ZooKeeper
   [junit4]   2> 2020476 INFO  (zkCallback-2585-thread-1) [    ] o.a.s.c.c.ConnectionManager Watcher org.apache.solr.common.cloud.ConnectionManager@24342387 name:ZooKeeperConnection Watcher:127.0.0.1:58075 got event WatchedEvent state:SyncConnected type:None path:null path:null type:None
   [junit4]   2> 2020477 INFO  (TEST-BasicAuthIntegrationTest.testBasics-seed#[AC5FA4FC630F58DB]) [    ] o.a.s.c.c.ConnectionManager Client is connected to ZooKeeper
   [junit4]   2> 2020477 INFO  (TEST-BasicAuthIntegrationTest.testBasics-seed#[AC5FA4FC630F58DB]) [    ] o.a.s.c.c.SolrZkClient Using default ZkACLProvider
   [junit4]   2> 2020477 INFO  (TEST-BasicAuthIntegrationTest.testBasics-seed#[AC5FA4FC630F58DB]) [    ] o.a.s.c.c.SolrZkClient makePath: /solr/solr.xml
   [junit4]   2> 2020522 INFO  (jetty-launcher-2584-thread-1) [    ] o.e.j.s.Server jetty-9.2.13.v20150730
   [junit4]   2> 2020529 INFO  (jetty-launcher-2584-thread-1) [    ] o.e.j.s.h.ContextHandler Started o.e.j.s.ServletContextHandler@1bf4eea9{/solr,null,AVAILABLE}
   [junit4]   2> 2020529 INFO  (jetty-launcher-2584-thread-3) [    ] o.e.j.s.Server jetty-9.2.13.v20150730
   [junit4]   2> 2020529 INFO  (jetty-launcher-2584-thread-2) [    ] o.e.j.s.Server jetty-9.2.13.v20150730
   [junit4]   2> 2020529 INFO  (jetty-launcher-2584-thread-1) [    ] o.e.j.s.ServerConnector Started ServerConnector@52e6aa2d{HTTP/1.1}{127.0.0.1:50858}
   [junit4]   2> 2020530 INFO  (jetty-launcher-2584-thread-5) [    ] o.e.j.s.Server jetty-9.2.13.v20150730
   [junit4]   2> 2020530 INFO  (jetty-launcher-2584-thread-1) [    ] o.e.j.s.Server Started @2023363ms
   [junit4]   2> 2020530 INFO  (jetty-launcher-2584-thread-1) [    ] o.a.s.c.s.e.JettySolrRunner Jetty properties: {hostContext=/solr, hostPort=50858}
   [junit4]   2> 2020530 INFO  (jetty-launcher-2584-thread-1) [    ] o.a.s.s.SolrDispatchFilter SolrDispatchFilter.init(): sun.misc.Launcher$AppClassLoader@41692a49
   [junit4]   2> 2020530 INFO  (jetty-launcher-2584-thread-1) [    ] o.a.s.c.SolrResourceLoader new SolrResourceLoader for directory: '/x1/jenkins/jenkins-slave/workspace/Lucene-Solr-Tests-5.5-Java7/solr/build/solr-core/test/J2/temp/solr.security.BasicAuthIntegrationTest_AC5FA4FC630F58DB-001/tempDir-001/node1'
   [junit4]   2> 2020530 INFO  (jetty-launcher-2584-thread-1) [    ] o.a.s.c.SolrResourceLoader JNDI not configured for solr (NoInitialContextEx)
   [junit4]   2> 2020530 INFO  (jetty-launcher-2584-thread-1) [    ] o.a.s.c.SolrResourceLoader solr home defaulted to 'solr/' (could not find system property or JNDI)
   [junit4]   2> 2020531 INFO  (jetty-launcher-2584-thread-1) [    ] o.a.s.c.c.SolrZkClient Using default ZkCredentialsProvider
   [junit4]   2> 2020553 INFO  (jetty-launcher-2584-thread-5) [    ] o.e.j.s.h.ContextHandler Started o.e.j.s.ServletContextHandler@7c9e01a0{/solr,null,AVAILABLE}
   [junit4]   2> 2020554 INFO  (jetty-launcher-2584-thread-1) [    ] o.a.s.c.c.ConnectionManager Waiting for client to connect to ZooKeeper
   [junit4]   2> 2020590 INFO  (jetty-launcher-2584-thread-2) [    ] o.e.j.s.h.ContextHandler Started o.e.j.s.ServletContextHandler@60e973d0{/solr,null,AVAILABLE}
   [junit4]   2> 2020590 INFO  (jetty-launcher-2584-thread-2) [    ] o.e.j.s.ServerConnector Started ServerConnector@7eb28e64{HTTP/1.1}{127.0.0.1:54054}
   [junit4]   2> 2020591 INFO  (jetty-launcher-2584-thread-2) [    ] o.e.j.s.Server Started @2023424ms
   [junit4]   2> 2020591 INFO  (jetty-launcher-2584-thread-2) [    ] o.a.s.c.s.e.JettySolrRunner Jetty properties: {hostPort=54054, hostContext=/solr}
   [junit4]   2> 2020591 INFO  (jetty-launcher-2584-thread-2) [    ] o.a.s.s.SolrDispatchFilter SolrDispatchFilter.init(): sun.misc.Launcher$AppClassLoader@41692a49
   [junit4]   2> 2020591 INFO  (jetty-launcher-2584-thread-2) [    ] o.a.s.c.SolrResourceLoader new SolrResourceLoader for directory: '/x1/jenkins/jenkins-slave/workspace/Lucene-Solr-Tests-5.5-Java7/solr/build/solr-core/test/J2/temp/solr.security.BasicAuthIntegrationTest_AC5FA4FC630F58DB-001/tempDir-001/node2'
   [junit4]   2> 2020591 INFO  (jetty-launcher-2584-thread-2) [    ] o.a.s.c.SolrResourceLoader JNDI not configured for solr (NoInitialContextEx)
   [junit4]   2> 2020591 INFO  (jetty-launcher-2584-thread-5) [    ] o.e.j.s.ServerConnector Started ServerConnector@6ad63e32{HTTP/1.1}{127.0.0.1:50456}
   [junit4]   2> 2020591 INFO  (jetty-launcher-2584-thread-2) [    ] o.a.s.c.SolrResourceLoader solr home defaulted to 'solr/' (could not find system property or JNDI)
   [junit4]   2> 2020591 INFO  (jetty-launcher-2584-thread-5) [    ] o.e.j.s.Server Started @2023424ms
   [junit4]   2> 2020592 INFO  (jetty-launcher-2584-thread-5) [    ] o.a.s.c.s.e.JettySolrRunner Jetty properties: {hostPort=50456, hostContext=/solr}
   [junit4]   2> 2020592 INFO  (jetty-launcher-2584-thread-2) [    ] o.a.s.c.c.SolrZkClient Using default ZkCredentialsProvider
   [junit4]   2> 2020592 INFO  (jetty-launcher-2584-thread-5) [    ] o.a.s.s.SolrDispatchFilter SolrDispatchFilter.init(): sun.misc.Launcher$AppClassLoader@41692a49
   [junit4]   2> 2020592 INFO  (jetty-launcher-2584-thread-5) [    ] o.a.s.c.SolrResourceLoader new SolrResourceLoader for directory: '/x1/jenkins/jenkins-slave/workspace/Lucene-Solr-Tests-5.5-Java7/solr/build/solr-core/test/J2/temp/solr.security.BasicAuthIntegrationTest_AC5FA4FC630F58DB-001/tempDir-001/node5'
   [junit4]   2> 2020592 INFO  (jetty-launcher-2584-thread-5) [    ] o.a.s.c.SolrResourceLoader JNDI not configured for solr (NoInitialContextEx)
   [junit4]   2> 2020592 INFO  (jetty-launcher-2584-thread-5) [    ] o.a.s.c.SolrResourceLoader solr home defaulted to 'solr/' (could not find system property or JNDI)
   [junit4]   2> 2020593 INFO  (jetty-launcher-2584-thread-5) [    ] o.a.s.c.c.SolrZkClient Using default ZkCredentialsProvider
   [junit4]   2> 2020606 INFO  (jetty-launcher-2584-thread-4) [    ] o.e.j.s.Server jetty-9.2.13.v20150730
   [junit4]   2> 2020606 INFO  (zkCallback-2586-thread-1) [    ] o.a.s.c.c.ConnectionManager Watcher org.apache.solr.common.cloud.ConnectionManager@425ce248 name:ZooKeeperConnection Watcher:127.0.0.1:58075/solr got event WatchedEvent state:SyncConnected type:None path:null path:null type:None
   [junit4]   2> 2020610 INFO  (jetty-launcher-2584-thread-5) [    ] o.a.s.c.c.ConnectionManager Waiting for client to connect to ZooKeeper
   [junit4]   2> 2020607 INFO  (jetty-launcher-2584-thread-3) [    ] o.e.j.s.h.ContextHandler Started o.e.j.s.ServletContextHandler@293073ff{/solr,null,AVAILABLE}
   [junit4]   2> 2020612 INFO  (jetty-launcher-2584-thread-1) [    ] o.a.s.c.c.ConnectionManager Client is connected to ZooKeeper
   [junit4]   2> 2020613 INFO  (jetty-launcher-2584-thread-1) [    ] o.a.s.c.c.SolrZkClient Using default ZkACLProvider
   [junit4]   2> 2020614 INFO  (jetty-launcher-2584-thread-1) [    ] o.a.s.s.SolrDispatchFilter solr.xml found in ZooKeeper. Loading...
   [junit4]   2> 2020635 INFO  (jetty-launcher-2584-thread-2) [    ] o.a.s.c.c.ConnectionManager Waiting for client to connect to ZooKeeper
   [junit4]   2> 2020647 INFO  (zkCallback-2588-thread-1) [    ] o.a.s.c.c.ConnectionManager Watcher org.apache.solr.common.cloud.ConnectionManager@5fec62e3 name:ZooKeeperConnection Watcher:127.0.0.1:58075/solr got event WatchedEvent state:SyncConnected type:None path:null path:null type:None
   [junit4]   2> 2020647 INFO  (jetty-launcher-2584-thread-5) [    ] o.a.s.c.c.ConnectionManager Client is connected to ZooKeeper
   [junit4]   2> 2020647 INFO  (jetty-launcher-2584-thread-5) [    ] o.a.s.c.c.SolrZkClient Using default ZkACLProvider
   [junit4]   2> 2020647 INFO  (jetty-launcher-2584-thread-4) [    ] o.e.j.s.h.ContextHandler Started o.e.j.s.ServletContextHandler@74318f10{/solr,null,AVAILABLE}
   [junit4]   2> 2020648 INFO  (jetty-launcher-2584-thread-4) [    ] o.e.j.s.ServerConnector Started ServerConnector@61a79f08{HTTP/1.1}{127.0.0.1:33588}
   [junit4]   2> 2020648 INFO  (jetty-launcher-2584-thread-4) [    ] o.e.j.s.Server Started @2023481ms
   [junit4]   2> 2020648 INFO  (jetty-launcher-2584-thread-4) [    ] o.a.s.c.s.e.JettySolrRunner Jetty properties: {hostPort=33588, hostContext=/solr}
   [junit4]   2> 2020648 INFO  (jetty-launcher-2584-thread-4) [    ] o.a.s.s.SolrDispatchFilter SolrDispatchFilter.init(): sun.misc.Launcher$AppClassLoader@41692a49
   [junit4]   2> 2020648 INFO  (jetty-launcher-2584-thread-4) [    ] o.a.s.c.SolrResourceLoader new SolrResourceLoader for directory: '/x1/jenkins/jenkins-slave/workspace/Lucene-Solr-Tests-5.5-Java7/solr/build/solr-core/test/J2/temp/solr.security.BasicAuthIntegrationTest_AC5FA4FC630F58DB-001/tempDir-001/node4'
   [junit4]   2> 2020649 INFO  (jetty-launcher-2584-thread-4) [    ] o.a.s.c.SolrResourceLoader JNDI not configured for solr (NoInitialContextEx)
   [junit4]   2> 2020649 INFO  (jetty-launcher-2584-thread-4) [    ] o.a.s.c.SolrResourceLoader solr home defaulted to 'solr/' (could not find system property or JNDI)
   [junit4]   2> 2020649 INFO  (jetty-launcher-2584-thread-4) [    ] o.a.s.c.c.SolrZkClient Using default ZkCredentialsProvider
   [junit4]   2> 2020650 INFO  (jetty-launcher-2584-thread-5) [    ] o.a.s.s.SolrDispatchFilter solr.xml found in ZooKeeper. Loading...
   [junit4]   2> 2020650 INFO  (jetty-launcher-2584-thread-4) [    ] o.a.s.c.c.ConnectionManager Waiting for client to connect to ZooKeeper
   [junit4]   2> 2020663 INFO  (jetty-launcher-2584-thread-3) [    ] o.e.j.s.ServerConnector Started ServerConnector@5cd757df{HTTP/1.1}{127.0.0.1:48904}
   [junit4]   2> 2020663 INFO  (jetty-launcher-2584-thread-3) [    ] o.e.j.s.Server Started @2023496ms
   [junit4]   2> 2020663 INFO  (jetty-launcher-2584-thread-3) [    ] o.a.s.c.s.e.JettySolrRunner Jetty properties: {hostContext=/solr, hostPort=48904}
   [junit4]   2> 2020663 INFO  (jetty-launcher-2584-thread-3) [    ] o.a.s.s.SolrDispatchFilter SolrDispatchFilter.init(): sun.misc.Launcher$AppClassLoader@41692a49
   [junit4]   2> 2020663 INFO  (jetty-launcher-2584-thread-3) [    ] o.a.s.c.SolrResourceLoader new SolrResourceLoader for directory: '/x1/jenkins/jenkins-slave/workspace/Lucene-Solr-Tests-5.5-Java7/solr/build/solr-core/test/J2/temp/solr.security.BasicAuthIntegrationTest_AC5FA4FC630F58DB-001/tempDir-001/node3'
   [junit4]   2> 2020664 INFO  (jetty-launcher-2584-thread-3) [    ] o.a.s.c.SolrResourceLoader JNDI not configured for solr (NoInitialContextEx)
   [junit4]   2> 2020664 INFO  (jetty-launcher-2584-thread-3) [    ] o.a.s.c.SolrResourceLoader solr home defaulted to 'solr/' (could not find system property or JNDI)
   [junit4]   2> 2020664 INFO  (jetty-launcher-2584-thread-3) [    ] o.a.s.c.c.SolrZkClient Using default ZkCredentialsProvider
   [junit4]   2> 2020687 INFO  (jetty-launcher-2584-thread-3) [    ] o.a.s.c.c.ConnectionManager Waiting for client to connect to ZooKeeper
   [junit4]   2> 2020687 INFO  (zkCallback-2587-thread-1) [    ] o.a.s.c.c.ConnectionManager Watcher org.apache.solr.common.cloud.ConnectionManager@5bcd67bc name:ZooKeeperConnection Watcher:127.0.0.1:58075/solr got event WatchedEvent state:SyncConnected type:None path:null path:null type:None
   [junit4]   2> 2020687 INFO  (jetty-launcher-2584-thread-2) [    ] o.a.s.c.c.ConnectionManager Client is connected to ZooKeeper
   [junit4]   2> 2020687 INFO  (jetty-launcher-2584-thread-2) [    ] o.a.s.c.c.SolrZkClient Using default ZkACLProvider
   [junit4]   2> 2020688 INFO  (jetty-launcher-2584-thread-1) [    ] o.a.s.c.CorePropertiesLocator Config-defined core root directory: /x1/jenkins/jenkins-slave/workspace/Lucene-Solr-Tests-5.5-Java7/solr/build/solr-core/test/J2/temp/solr.security.BasicAuthIntegrationTest_AC5FA4FC630F58DB-001/tempDir-001/node1/.
   [junit4]   2> 2020688 INFO  (jetty-launcher-2584-thread-1) [    ] o.a.s.c.CoreContainer New CoreContainer 1251393799
   [junit4]   2> 2020688 INFO  (jetty-launcher-2584-thread-1) [    ] o.a.s.c.CoreContainer Loading cores into CoreContainer [instanceDir=/x1/jenkins/jenkins-slave/workspace/Lucene-Solr-Tests-5.5-Java7/solr/build/solr-core/test/J2/temp/solr.security.BasicAuthIntegrationTest_AC5FA4FC630F58DB-001/tempDir-001/node1]
   [junit4]   2> 2020688 WARN  (jetty-launcher-2584-thread-1) [    ] o.a.s.c.CoreContainer Couldn't add files from /x1/jenkins/jenkins-slave/workspace/Lucene-Solr-Tests-5.5-Java7/solr/build/solr-core/test/J2/temp/solr.security.BasicAuthIntegrationTest_AC5FA4FC630F58DB-001/tempDir-001/node1/lib to classpath: /x1/jenkins/jenkins-slave/workspace/Lucene-Solr-Tests-5.5-Java7/solr/build/solr-core/test/J2/temp/solr.security.BasicAuthIntegrationTest_AC5FA4FC630F58DB-001/tempDir-001/node1/lib
   [junit4]   2> 2020689 INFO  (jetty-launcher-2584-thread-1) [    ] o.a.s.h.c.HttpShardHandlerFactory created with socketTimeout : 90000,urlScheme : ,connTimeout : 15000,maxConnectionsPerHost : 20,maxConnections : 10000,corePoolSize : 0,maximumPoolSize : 2147483647,maxThreadIdleTime : 5,sizeOfQueue : -1,fairnessPolicy : false,useRetries : false,
   [junit4]   2> 2020690 INFO  (jetty-launcher-2584-thread-1) [    ] o.a.s.u.UpdateShardHandler Creating UpdateShardHandler HTTP client with params: socketTimeout=340000&connTimeout=45000&retry=true
   [junit4]   2> 2020690 INFO  (jetty-launcher-2584-thread-1) [    ] o.a.s.l.LogWatcher SLF4J impl is org.slf4j.impl.Log4jLoggerFactory
   [junit4]   2> 2020691 INFO  (jetty-launcher-2584-thread-1) [    ] o.a.s.l.LogWatcher Registering Log Listener [Log4j (org.slf4j.impl.Log4jLoggerFactory)]
   [junit4]   2> 2020691 INFO  (jetty-launcher-2584-thread-1) [    ] o.a.s.c.ZkContainer Zookeeper client=127.0.0.1:58075/solr
   [junit4]   2> 2020691 INFO  (jetty-launcher-2584-thread-1) [    ] o.a.s.c.ZkController zkHost includes chroot
   [junit4]   2> 2020691 INFO  (jetty-launcher-2584-thread-1) [    ] o.a.s.c.c.SolrZkClient Using default ZkCredentialsProvider
   [junit4]   2> 2020692 INFO  (jetty-launcher-2584-thread-1) [    ] o.a.s.c.c.ConnectionManager Waiting for client to connect to ZooKeeper
   [junit4]   2> 2020694 INFO  (jetty-launcher-2584-thread-2) [    ] o.a.s.s.SolrDispatchFilter solr.xml found in ZooKeeper. Loading...
   [junit4]   2> 2020695 INFO  (zkCallback-2589-thread-1) [    ] o.a.s.c.c.ConnectionManager Watcher org.apache.solr.common.cloud.ConnectionManager@6ecf06de name:ZooKeeperConnection Watcher:127.0.0.1:58075/solr got event WatchedEvent state:SyncConnected type:None path:null path:null type:None
   [junit4]   2> 2020695 INFO  (jetty-launcher-2584-thread-4) [    ] o.a.s.c.c.ConnectionManager Client is connected to ZooKeeper
   [junit4]   2> 2020695 INFO  (jetty-launcher-2584-thread-4) [    ] o.a.s.c.c.SolrZkClient Using default ZkACLProvider
   [junit4]   2> 2020696 INFO  (jetty-launcher-2584-thread-4) [    ] o.a.s.s.SolrDispatchFilter solr.xml found in ZooKeeper. Loading...
   [junit4]   2> 2020711 INFO  (zkCallback-2593-thread-1) [    ] o.a.s.c.c.ConnectionManager Watcher org.apache.solr.common.cloud.ConnectionManager@6ad0316b name:ZooKeeperConnection Watcher:127.0.0.1:58075 got event WatchedEvent state:SyncConnected type:None path:null path:null type:None
   [junit4]   2> 2020711 INFO  (jetty-launcher-2584-thread-1) [    ] o.a.s.c.c.ConnectionManager Client is connected to ZooKeeper
   [junit4]   2> 2020711 INFO  (jetty-launcher-2584-thread-1) [    ] o.a.s.c.c.SolrZkClient Using default ZkACLProvider
   [junit4]   2> 2020719 INFO  (jetty-launcher-2584-thread-5) [    ] o.a.s.c.CorePropertiesLocator Config-defined core root directory: /x1/jenkins/jenkins-slave/workspace/Lucene-Solr-Tests-5.5-Java7/solr/build/solr-core/test/J2/temp/solr.security.BasicAuthIntegrationTest_AC5FA4FC630F58DB-001/tempDir-001/node5/.
   [junit4]   2> 2020720 INFO  (jetty-launcher-2584-thread-5) [    ] o.a.s.c.CoreContainer New CoreContainer 1860665895
   [junit4]   2> 2020720 INFO  (jetty-launcher-2584-thread-5) [    ] o.a.s.c.CoreContainer Loading cores into CoreContainer [instanceDir=/x1/jenkins/jenkins-slave/workspace/Lucene-Solr-Tests-5.5-Java7/solr/build/solr-core/test/J2/temp/solr.security.BasicAuthIntegrationTest_AC5FA4FC630F58DB-001/tempDir-001/node5]
   [junit4]   2> 2020720 WARN  (jetty-launcher-2584-thread-5) [    ] o.a.s.c.CoreContainer Couldn't add files from /x1/jenkins/jenkins-slave/workspace/Lucene-Solr-Tests-5.5-Java7/solr/build/solr-core/test/J2/temp/solr.security.BasicAuthIntegrationTest_AC5FA4FC630F58DB-001/tempDir-001/node5/lib to classpath: /x1/jenkins/jenkins-slave/workspace/Lucene-Solr-Tests-5.5-Java7/solr/build/solr-core/test/J2/temp/solr.security.BasicAuthIntegrationTest_AC5FA4FC630F58DB-001/tempDir-001/node5/lib
   [junit4]   2> 2020720 INFO  (jetty-launcher-2584-thread-5) [    ] o.a.s.h.c.HttpShardHandlerFactory created with socketTimeout : 90000,urlScheme : ,connTimeout : 15000,maxConnectionsPerHost : 20,maxConnections : 10000,corePoolSize : 0,maximumPoolSize : 2147483647,maxThreadIdleTime : 5,sizeOfQueue : -1,fairnessPolicy : false,useRetries : false,
   [junit4]   2> 2020721 INFO  (jetty-launcher-2584-thread-5) [    ] o.a.s.u.UpdateShardHandler Creating UpdateShardHandler HTTP client with params: socketTimeout=340000&connTimeout=45000&retry=true
   [junit4]   2> 2020722 INFO  (jetty-launcher-2584-thread-5) [    ] o.a.s.l.LogWatcher SLF4J impl is org.slf4j.impl.Log4jLoggerFactory
   [junit4]   2> 2020722 INFO  (jetty-launcher-2584-thread-5) [    ] o.a.s.l.LogWatcher Registering Log Listener [Log4j (org.slf4j.impl.Log4jLoggerFactory)]
   [junit4]   2> 2020722 INFO  (jetty-launcher-2584-thread-5) [    ] o.a.s.c.ZkContainer Zookeeper client=127.0.0.1:58075/solr
   [junit4]   2> 2020722 INFO  (jetty-launcher-2584-thread-5) [    ] o.a.s.c.ZkController zkHost includes chroot
   [junit4]   2> 2020722 INFO  (jetty-launcher-2584-thread-5) [    ] o.a.s.c.c.SolrZkClient Using default ZkCredentialsProvider
   [junit4]   2> 2020723 INFO  (zkCallback-2590-thread-1) [    ] o.a.s.c.c.ConnectionManager Watcher org.apache.solr.common.cloud.ConnectionManager@77d7791b name:ZooKeeperConnection Watcher:127.0.0.1:58075/solr got event WatchedEvent state:SyncConnected type:None path:null path:null type:None
   [junit4]   2> 2020723 INFO  (jetty-launcher-2584-thread-3) [    ] o.a.s.c.c.ConnectionManager Client is connected to ZooKeeper
   [junit4]   2> 2020724 INFO  (jetty-launcher-2584-thread-3) [    ] o.a.s.c.c.SolrZkClient Using default ZkACLProvider
   [junit4]   2> 2020725 INFO  (jetty-launcher-2584-thread-3) [    ] o.a.s.s.SolrDispatchFilter solr.xml found in ZooKeeper. Loading...
   [junit4]   2> 2020753 INFO  (jetty-launcher-2584-thread-5) [    ] o.a.s.c.c.ConnectionManager Waiting for client to connect to ZooKeeper
   [junit4]   2> 2020755 INFO  (jetty-launcher-2584-thread-1) [n:127.0.0.1:50858_solr    ] o.a.s.c.c.ConnectionManager Waiting for client to connect to ZooKeeper
   [junit4]   2> 2020756 INFO  (jetty-launcher-2584-thread-4) [    ] o.a.s.c.CorePropertiesLocator Config-defined core root directory: /x1/jenkins/jenkins-slave/workspace/Lucene-Solr-Tests-5.5-Java7/solr/build/solr-core/test/J2/temp/solr.security.BasicAuthIntegrationTest_AC5FA4FC630F58DB-001/tempDir-001/node4/.
   [junit4]   2> 2020756 INFO  (jetty-launcher-2584-thread-4) [    ] o.a.s.c.CoreContainer New CoreContainer 1886772118
   [junit4]   2> 2020756 INFO  (zkCallback-2596-thread-1) [    ] o.a.s.c.c.ConnectionManager Watcher org.apache.solr.common.cloud.ConnectionManager@49a38e88 name:ZooKeeperConnection Watcher:127.0.0.1:58075 got event WatchedEvent state:SyncConnected type:None path:null path:null type:None
   [junit4]   2> 2020756 INFO  (jetty-launcher-2584-thread-4) [    ] o.a.s.c.CoreContainer Loading cores into CoreContainer [instanceDir=/x1/jenkins/jenkins-slave/workspace/Lucene-Solr-Tests-5.5-Java7/solr/build/solr-core/test/J2/temp/solr.security.BasicAuthIntegrationTest_AC5FA4FC630F58DB-001/tempDir-001/node4]
   [junit4]   2> 2020756 INFO  (jetty-launcher-2584-thread-5) [    ] o.a.s.c.c.ConnectionManager Client is connected to ZooKeeper
   [junit4]   2> 2020756 WARN  (jetty-launcher-2584-thread-4) [    ] o.a.s.c.CoreContainer Couldn't add files from /x1/jenkins/jenkins-slave/workspace/Lucene-Solr-Tests-5.5-Java7/solr/build/solr-core/test/J2/temp/solr.security.BasicAuthIntegrationTest_AC5FA4FC630F58DB-001/tempDir-001/node4/lib to classpath: /x1/jenkins/jenkins-slave/workspace/Lucene-Solr-Tests-5.5-Java7/solr/build/solr-core/test/J2/temp/solr.security.BasicAuthIntegrationTest_AC5FA4FC630F58DB-001/tempDir-001/node4/lib
   [junit4]   2> 2020756 INFO  (jetty-launcher-2584-thread-5) [    ] o.a.s.c.c.SolrZkClient Using default ZkACLProvider
   [junit4]   2> 2020757 INFO  (jetty-launcher-2584-thread-4) [    ] o.a.s.h.c.HttpShardHandlerFactory created with socketTimeout : 90000,urlScheme : ,connTimeout : 15000,maxConnectionsPerHost : 20,maxConnections : 10000,corePoolSize : 0,maximumPoolSize : 2147483647,maxThreadIdleTime : 5,sizeOfQueue : -1,fairnessPolicy : false,useRetries : false,
   [junit4]   2> 2020759 INFO  (jetty-launcher-2584-thread-4) [    ] o.a.s.u.UpdateShardHandler Creating UpdateShardHandler HTTP client with params: socketTimeout=340000&connTimeout=45000&retry=true
   [junit4]   2> 2020759 INFO  (jetty-launcher-2584-thread-4) [    ] o.a.s.l.LogWatcher SLF4J impl is org.slf4j.impl.Log4jLoggerFactory
   [junit4]   2> 2020760 INFO  (jetty-launcher-2584-thread-4) [    ] o.a.s.l.LogWatcher Registering Log Listener [Log4j (org.slf4j.impl.Log4jLoggerFactory)]
   [junit4]   2> 2020760 INFO  (jetty-launcher-2584-thread-4) [    ] o.a.s.c.ZkContainer Zookeeper client=127.0.0.1:58075/solr
   [junit4]   2> 2020760 INFO  (jetty-launcher-2584-thread-4) [    ] o.a.s.c.ZkController zkHost includes chroot
   [junit4]   2> 2020760 INFO  (jetty-launcher-2584-thread-4) [    ] o.a.s.c.c.SolrZkClient Using default ZkCredentialsProvider
   [junit4]   2> 2020762 INFO  (jetty-launcher-2584-thread-4) [    ] o.a.s.c.c.ConnectionManager Waiting for client to connect to ZooKeeper
   [junit4]   2> 2020763 INFO  (jetty-launcher-2584-thread-2) [    ] o.a.s.c.CorePropertiesLocator Config-defined core root directory: /x1/jenkins/jenkins-slave/workspace/Lucene-Solr-Tests-5.5-Java7/solr/build/solr-core/test/J2/temp/solr.security.BasicAuthIntegrationTest_AC5FA4FC630F58DB-001/tempDir-001/node2/.
   [junit4]   2> 2020763 INFO  (jetty-launcher-2584-thread-3) [    ] o.a.s.c.CorePropertiesLocator Config-defined core root directory: /x1/jenkins/jenkins-slave/workspace/Lucene-Solr-Tests-5.5-Java7/solr/build/solr-core/test/J2/temp/solr.security.BasicAuthIntegrationTest_AC5FA4FC630F58DB-001/tempDir-001/node3/.
   [junit4]   2> 2020763 INFO  (jetty-launcher-2584-thread-2) [    ] o.a.s.c.CoreContainer New CoreContainer 1549213419
   [junit4]   2> 2020763 INFO  (jetty-launcher-2584-thread-5) [n:127.0.0.1:50456_solr    ] o.a.s.c.c.ConnectionManager Waiting for client to connect to ZooKeeper
   [junit4]   2> 2020763 INFO  (jetty-launcher-2584-thread-2) [    ] o.a.s.c.CoreContainer Loading cores into CoreContainer [instanceDir=/x1/jenkins/jenkins-slave/workspace/Lucene-Solr-Tests-5.5-Java7/solr/build/solr-core/test/J2/temp/solr.security.BasicAuthIntegrationTest_AC5FA4FC630F58DB-001/tempDir-001/node2]
   [junit4]   2> 2020763 INFO  (jetty-launcher-2584-thread-3) [    ] o.a.s.c.CoreContainer New CoreContainer 1538196905
   [junit4]   2> 2020763 INFO  (jetty-launcher-2584-thread-3) [    ] o.a.s.c.CoreContainer Loading cores into CoreContainer [instanceDir=/x1/jenkins/jenkins-slave/workspace/Lucene-Solr-Tests-5.5-Java7/solr/build/solr-core/test/J2/temp/solr.security.BasicAuthIntegrationTest_AC5FA4FC630F58DB-001/tempDir-001/node3]
   [junit4]   2> 2020763 WARN  (jetty-launcher-2584-thread-2) [    ] o.a.s.c.CoreContainer Couldn't add files from /x1/jenkins/jenkins-slave/workspace/Lucene-Solr-Tests-5.5-Java7/solr/build/solr-core/test/J2/temp/solr.security.BasicAuthIntegrationTest_AC5FA4FC630F58DB-001/tempDir-001/node2/lib to classpath: /x1/jenkins/jenkins-slave/workspace/Lucene-Solr-Tests-5.5-Java7/solr/build/solr-core/test/J2/temp/solr.security.BasicAuthIntegrationTest_AC5FA4FC630F58DB-001/tempDir-001/node2/lib
   [junit4]   2> 2020764 WARN  (jetty-launcher-2584-thread-3) [    ] o.a.s.c.CoreContainer Couldn't add files from /x1/jenkins/jenkins-slave/workspace/Lucene-Solr-Tests-5.5-Java7/solr/build/solr-core/test/J2/temp/solr.security.BasicAuthIntegrationTest_AC5FA4FC630F58DB-001/tempDir-001/node3/lib to classpath: /x1/jenkins/jenkins-slave/workspace/Lucene-Solr-Tests-5.5-Java7/solr/build/solr-core/test/J2/temp/solr.security.BasicAuthIntegrationTest_AC5FA4FC630F58DB-001/tempDir-001/node3/lib
   [junit4]   2> 2020764 INFO  (jetty-launcher-2584-thread-2) [    ] o.a.s.h.c.HttpShardHandlerFactory created with socketTimeout : 90000,urlScheme : ,connTimeout : 15000,maxConnectionsPerHost : 20,maxConnections : 10000,corePoolSize : 0,maximumPoolSize : 2147483647,maxThreadIdleTime : 5,sizeOfQueue : -1,fairnessPolicy : false,useRetries : false,
   [junit4]   2> 2020764 INFO  (jetty-launcher-2584-thread-3) [    ] o.a.s.h.c.HttpShardHandlerFactory created with socketTimeout : 90000,urlScheme : ,connTimeout : 15000,maxConnectionsPerHost : 20,maxConnections : 10000,corePoolSize : 0,maximumPoolSize : 2147483647,maxThreadIdleTime : 5,sizeOfQueue : -1,fairnessPolicy : false,useRetries : false,
   [junit4]   2> 2020763 INFO  (zkCallback-2597-thread-1-processing-n:127.0.0.1:50858_solr) [n:127.0.0.1:50858_solr    ] o.a.s.c.c.ConnectionManager Watcher org.apache.solr.common.cloud.ConnectionManager@3f9cc945 name:ZooKeeperConnection Watcher:127.0.0.1:58075/solr got event WatchedEvent state:SyncConnected type:None path:null path:null type:None
   [junit4]   2> 2020764 INFO  (jetty-launcher-2584-thread-1) [n:127.0.0.1:50858_solr    ] o.a.s.c.c.ConnectionManager Client is connected to ZooKeeper
   [junit4]   2> 2020765 INFO  (jetty-launcher-2584-thread-3) [    ] o.a.s.u.UpdateShardHandler Creating UpdateShardHandler HTTP client with params: socketTimeout=340000&connTimeout=45000&retry=true
   [junit4]   2> 2020765 INFO  (jetty-launcher-2584-thread-2) [    ] o.a.s.u.UpdateShardHandler Creating UpdateShardHandler HTTP client with params: socketTimeout=340000&connTimeout=45000&retry=true
   [junit4]   2> 2020765 INFO  (jetty-launcher-2584-thread-3) [    ] o.a.s.l.LogWatcher SLF4J impl is org.slf4j.impl.Log4jLoggerFactory
   [junit4]   2> 2020765 INFO  (jetty-launcher-2584-thread-3) [    ] o.a.s.l.LogWatcher Registering Log Listener [Log4j (org.slf4j.impl.Log4jLoggerFactory)]
   [junit4]   2> 2020765 INFO  (jetty-launcher-2584-thread-3) [    ] o.a.s.c.ZkContainer Zookeeper client=127.0.0.1:58075/solr
   [junit4]   2> 2020765 INFO  (jetty-launcher-2584-thread-3) [    ] o.a.s.c.ZkController zkHost includes chroot
   [junit4]   2> 2020765 INFO  (jetty-launcher-2584-thread-3) [    ] o.a.s.c.c.SolrZkClient Using default ZkCredentialsProvider
   [junit4]   2> 2020766 INFO  (jetty-launcher-2584-thread-1) [n:127.0.0.1:50858_solr    ] o.a.s.c.c.SolrZkClient makePath: /overseer/queue
   [junit4]   2> 2020766 INFO  (jetty-launcher-2584-thread-2) [    ] o.a.s.l.LogWatcher SLF4J impl is org.slf4j.impl.Log4jLoggerFactory
   [junit4]   2> 2020766 INFO  (jetty-launcher-2584-thread-2) [    ] o.a.s.l.LogWatcher Registering Log Listener [Log4j (org.slf4j.impl.Log4jLoggerFactory)]
   [junit4]   2> 2020766 INFO  (jetty-launcher-2584-thread-2) [    ] o.a.s.c.ZkContainer Zookeeper client=127.0.0.1:58075/solr
   [junit4]   2> 2020766 INFO  (jetty-launcher-2584-thread-2) [    ] o.a.s.c.ZkController zkHost includes chroot
   [junit4]   2> 2020766 INFO  (jetty-launcher-2584-thread-2) [    ] o.a.s.c.c.SolrZkClient Using default ZkCredentialsProvider
   [junit4]   2> 2020767 INFO  (jetty-launcher-2584-thread-3) [    ] o.a.s.c.c.ConnectionManager Waiting for client to connect to ZooKeeper
   [junit4]   2> 2020778 INFO  (zkCallback-2600-thread-1) [    ] o.a.s.c.c.ConnectionManager Watcher org.apache.solr.common.cloud.ConnectionManager@184b7591 name:ZooKeeperConnection Watcher:127.0.0.1:58075 got event WatchedEvent state:SyncConnected type:None path:null path:null type:None
   [junit4]   2> 2020778 INFO  (jetty-launcher-2584-thread-4) [    ] o.a.s.c.c.ConnectionManager Client is connected to ZooKeeper
   [junit4]   2> 2020779 INFO  (jetty-launcher-2584-thread-4) [    ] o.a.s.c.c.SolrZkClient Using default ZkACLProvider
   [junit4]   2> 2020781 INFO  (jetty-launcher-2584-thread-1) [n:127.0.0.1:50858_solr    ] o.a.s.c.c.SolrZkClient makePath: /overseer/collection-queue-work
   [junit4]   2> 2020785 INFO  (jetty-launcher-2584-thread-1) [n:127.0.0.1:50858_solr    ] o.a.s.c.c.SolrZkClient makePath: /overseer/collection-map-running
   [junit4]   2> 2020795 INFO  (jetty-launcher-2584-thread-2) [    ] o.a.s.c.c.ConnectionManager Waiting for client to connect to ZooKeeper
   [junit4]   2> 2020795 INFO  (zkCallback-2606-thread-1) [    ] o.a.s.c.c.ConnectionManager Watcher org.apache.solr.common.cloud.ConnectionManager@3cab08b4 name:ZooKeeperConnection Watcher:127.0.0.1:58075 got event WatchedEvent state:SyncConnected type:None path:null path:null type:None
   [junit4]   2> 2020795 INFO  (jetty-launcher-2584-thread-3) [    ] o.a.s.c.c.ConnectionManager Client is connected to ZooKeeper
   [junit4]   2> 2020795 INFO  (jetty-launcher-2584-thread-3) [    ] o.a.s.c.c.SolrZkClient Using default ZkACLProvider
   [junit4]   2> 2020795 INFO  (zkCallback-2601-thread-1-processing-n:127.0.0.1:50456_solr) [n:127.0.0.1:50456_solr    ] o.a.s.c.c.ConnectionManager Watcher org.apache.solr.common.cloud.ConnectionManager@38f2d18 name:ZooKeeperConnection Watcher:127.0.0.1:58075/solr got event WatchedEvent state:SyncConnected type:None path:null path:null type:None
   [junit4]   2> 2020795 INFO  (jetty-launcher-2584-thread-5) [n:127.0.0.1:50456_solr    ] o.a.s.c.c.ConnectionManager Client is connected to ZooKeeper
   [junit4]   2> 2020797 INFO  (jetty-launcher-2584-thread-4) [n:127.0.0.1:33588_solr    ] o.a.s.c.c.ConnectionManager Waiting for client to connect to ZooKeeper
   [junit4]   2> 2020798 WARN  (NIOServerCxn.Factory:0.0.0.0/0.0.0.0:0) [    ] o.a.z.s.NIOServerCnxn caught end of stream exception
   [junit4]   2> EndOfStreamException: Unable to read additional data from client sessionid 0x152f0144fc4000b, likely client has closed socket
   [junit4]   2> 	at org.apache.zookeeper.server.NIOServerCnxn.doIO(NIOServerCnxn.java:228)
   [junit4]   2> 	at org.apache.zookeeper.server.NIOServerCnxnFactory.run(NIOServerCnxnFactory.java:208)
   [junit4]   2> 	at java.lang.Thread.run(Thread.java:745)
   [junit4]   2> 2020798 INFO  (jetty-launcher-2584-thread-1) [n:127.0.0.1:50858_solr    ] o.a.s.c.c.SolrZkClient makePath: /overseer/collection-map-completed
   [junit4]   2> 2020800 INFO  (zkCallback-2607-thread-1) [    ] o.a.s.c.c.ConnectionManager Watcher org.apache.solr.common.cloud.ConnectionManager@58258102 name:ZooKeeperConnection Watcher:127.0.0.1:58075 got event WatchedEvent state:SyncConnected type:None path:null path:null type:None
   [junit4]   2> 2020800 INFO  (jetty-launcher-2584-thread-2) [    ] o.a.s.c.c.ConnectionManager Client is connected to ZooKeeper
   [junit4]   2> 2020800 INFO  (jetty-launcher-2584-thread-2) [    ] o.a.s.c.c.SolrZkClient Using default ZkACLProvider
   [junit4]   2> 2020801 INFO  (jetty-launcher-2584-thread-3) [n:127.0.0.1:48904_solr    ] o.a.s.c.c.ConnectionManager Waiting for client to connect to ZooKeeper
   [junit4]   2> 2020801 INFO  (zkCallback-2608-thread-1-processing-n:127.0.0.1:33588_solr) [n:127.0.0.1:33588_solr    ] o.a.s.c.c.ConnectionManager Watcher org.apache.solr.common.cloud.ConnectionManager@7ef7a68d name:ZooKeeperConnection Watcher:127.0.0.1:58075/solr got event WatchedEvent state:SyncConnected type:None path:null path:null type:None
   [junit4]   2> 2020801 INFO  (jetty-launcher-2584-thread-4) [n:127.0.0.1:33588_solr    ] o.a.s.c.c.ConnectionManager Client is connected to ZooKeeper
   [junit4]   2> 2020806 INFO  (jetty-launcher-2584-thread-1) [n:127.0.0.1:50858_solr    ] o.a.s.c.c.SolrZkClient makePath: /overseer/collection-map-failure
   [junit4]   2> 2020813 WARN  (NIOServerCxn.Factory:0.0.0.0/0.0.0.0:0) [    ] o.a.z.s.NIOServerCnxn caught end of stream exception
   [junit4]   2> EndOfStreamException: Unable to read additional data from client sessionid 0x152f0144fc4000c, likely client has closed socket
   [junit4]   2> 	at org.apache.zookeeper.server.NIOServerCnxn.doIO(NIOServerCnxn.java:228)
   [junit4]   2> 	at org.apache.zookeeper.server.NIOServerCnxnFactory.run(NIOServerCnxnFactory.java:208)
   [junit4]   2> 	at java.lang.Thread.run(Thread.java:745)
   [junit4]   2> 2020820 INFO  (zkCallback-2609-thread-1-processing-n:127.0.0.1:48904_solr) [n:127.0.0.1:48904_solr    ] o.a.s.c.c.ConnectionManager Watcher org.apache.solr.common.cloud.ConnectionManager@1410dc24 name:ZooKeeperConnection Watcher:127.0.0.1:58075/solr got event WatchedEvent state:SyncConnected type:None path:null path:null type:None
   [junit4]   2> 2020820 INFO  (jetty-launcher-2584-thread-3) [n:127.0.0.1:48904_solr    ] o.a.s.c.c.ConnectionManager Client is connected to ZooKeeper
   [junit4]   2> 2020821 INFO  (jetty-launcher-2584-thread-2) [n:127.0.0.1:54054_solr    ] o.a.s.c.c.ConnectionManager Waiting for client to connect to ZooKeeper
   [junit4]   2> 2020821 INFO  (jetty-launcher-2584-thread-1) [n:127.0.0.1:50858_solr    ] o.a.s.c.c.SolrZkClient makePath: /live_nodes
   [junit4]   2> 2020821 INFO  (jetty-launcher-2584-thread-5) [n:127.0.0.1:50456_solr    ] o.a.s.c.c.SolrZkClient makePath: /live_nodes
   [junit4]   2> 2020831 INFO  (jetty-launcher-2584-thread-5) [n:127.0.0.1:50456_solr    ] o.a.s.c.c.SolrZkClient makePath: /collections
   [junit4]   2> 2020832 INFO  (jetty-launcher-2584-thread-1) [n:127.0.0.1:50858_solr    ] o.a.s.c.c.SolrZkClient makePath: /collections
   [junit4]   2> 2020840 INFO  (jetty-launcher-2584-thread-5) [n:127.0.0.1:50456_solr    ] o.a.s.c.c.SolrZkClient makePath: /aliases.json
   [junit4]   2> 2020840 INFO  (jetty-launcher-2584-thread-4) [n:127.0.0.1:33588_solr    ] o.a.s.c.c.SolrZkClient makePath: /aliases.json
   [junit4]   2> 2020840 INFO  (jetty-launcher-2584-thread-1) [n:127.0.0.1:50858_solr    ] o.a.s.c.c.SolrZkClient makePath: /aliases.json
   [junit4]   2> 2020842 INFO  (zkCallback-2610-thread-1-processing-n:127.0.0.1:54054_solr) [n:127.0.0.1:54054_solr    ] o.a.s.c.c.ConnectionManager Watcher org.apache.solr.common.cloud.ConnectionManager@1a737926 name:ZooKeeperConnection Watcher:127.0.0.1:58075/solr got event WatchedEvent state:SyncConnected type:None path:null path:null type:None
   [junit4]   2> 2020842 INFO  (jetty-launcher-2584-thread-2) [n:127.0.0.1:54054_solr    ] o.a.s.c.c.ConnectionManager Client is connected to ZooKeeper
   [junit4]   2> 2020842 INFO  (jetty-launcher-2584-thread-4) [n:127.0.0.1:33588_solr    ] o.a.s.c.c.SolrZkClient makePath: /clusterstate.json
   [junit4]   2> 2020842 INFO  (jetty-launcher-2584-thread-5) [n:127.0.0.1:50456_solr    ] o.a.s.c.c.SolrZkClient makePath: /clusterstate.json
   [junit4]   2> 2020843 INFO  (jetty-launcher-2584-thread-1) [n:127.0.0.1:50858_solr    ] o.a.s.c.c.SolrZkClient makePath: /clusterstate.json
   [junit4]   2> 2020846 INFO  (jetty-launcher-2584-thread-5) [n:127.0.0.1:50456_solr    ] o.a.s.c.c.SolrZkClient makePath: /security.json
   [junit4]   2> 2020846 INFO  (jetty-launcher-2584-thread-4) [n:127.0.0.1:33588_solr    ] o.a.s.c.c.SolrZkClient makePath: /security.json
   [junit4]   2> 2020846 INFO  (jetty-launcher-2584-thread-1) [n:127.0.0.1:50858_solr    ] o.a.s.c.c.SolrZkClient makePath: /security.json
   [junit4]   2> 2020848 INFO  (jetty-launcher-2584-thread-1) [n:127.0.0.1:50858_solr    ] o.a.s.c.ZkController Register node as live in ZooKeeper:/live_nodes/127.0.0.1:50858_solr
   [junit4]   2> 2020848 INFO  (jetty-launcher-2584-thread-5) [n:127.0.0.1:50456_solr    ] o.a.s.c.ZkController Register node as live in ZooKeeper:/live_nodes/127.0.0.1:50456_solr
   [junit4]   2> 2020848 INFO  (jetty-launcher-2584-thread-4) [n:127.0.0.1:33588_solr    ] o.a.s.c.ZkController Register node as live in ZooKeeper:/live_nodes/127.0.0.1:33588_solr
   [junit4]   2> 2020849 INFO  (jetty-launcher-2584-thread-5) [n:127.0.0.1:50456_solr    ] o.a.s.c.c.SolrZkClient makePath: /live_nodes/127.0.0.1:50456_solr
   [junit4]   2> 2020849 INFO  (jetty-launcher-2584-thread-1) [n:127.0.0.1:50858_solr    ] o.a.s.c.c.SolrZkClient makePath: /live_nodes/127.0.0.1:50858_solr
   [junit4]   2> 2020849 INFO  (jetty-launcher-2584-thread-3) [n:127.0.0.1:48904_solr    ] o.a.s.c.ZkController Register node as live in ZooKeeper:/live_nodes/127.0.0.1:48904_solr
   [junit4]   2> 2020849 INFO  (jetty-launcher-2584-thread-4) [n:127.0.0.1:33588_solr    ] o.a.s.c.c.SolrZkClient makePath: /live_nodes/127.0.0.1:33588_solr
   [junit4]   2> 2020850 INFO  (jetty-launcher-2584-thread-3) [n:127.0.0.1:48904_solr    ] o.a.s.c.c.SolrZkClient makePath: /live_nodes/127.0.0.1:48904_solr
   [junit4]   2> 2020853 INFO  (jetty-launcher-2584-thread-5) [n:127.0.0.1:50456_solr    ] o.a.s.c.c.SolrZkClient makePath: /overseer_elect
   [junit4]   2> 2020854 INFO  (jetty-launcher-2584-thread-1) [n:127.0.0.1:50858_solr    ] o.a.s.c.c.SolrZkClient makePath: /overseer_elect
   [junit4]   2> 2020854 INFO  (jetty-launcher-2584-thread-3) [n:127.0.0.1:48904_solr    ] o.a.s.c.c.SolrZkClient makePath: /overseer_elect
   [junit4]   2> 2020855 INFO  (jetty-launcher-2584-thread-4) [n:127.0.0.1:33588_solr    ] o.a.s.c.c.SolrZkClient makePath: /overseer_elect
   [junit4]   2> 2020858 INFO  (jetty-launcher-2584-thread-3) [n:127.0.0.1:48904_solr    ] o.a.s.c.c.SolrZkClient makePath: /overseer_elect/election
   [junit4]   2> 2020859 INFO  (jetty-launcher-2584-thread-1) [n:127.0.0.1:50858_solr    ] o.a.s.c.c.SolrZkClient makePath: /overseer_elect/election
   [junit4]   2> 2020859 INFO  (jetty-launcher-2584-thread-2) [n:127.0.0.1:54054_solr    ] o.a.s.c.c.ZkStateReader Updating cluster state from ZooKeeper... 
   [junit4]   2> 2020859 INFO  (jetty-launcher-2584-thread-5) [n:127.0.0.1:50456_solr    ] o.a.s.c.c.SolrZkClient makePath: /overseer_elect/election
   [junit4]   2> 2020860 INFO  (jetty-launcher-2584-thread-4) [n:127.0.0.1:33588_solr    ] o.a.s.c.c.SolrZkClient makePath: /overseer_elect/election
   [junit4]   2> 2020861 INFO  (jetty-launcher-2584-thread-3) [n:127.0.0.1:48904_solr    ] o.a.s.c.Overseer Overseer (id=null) closing
   [junit4]   2> 2020864 INFO  (jetty-launcher-2584-thread-1) [n:127.0.0.1:50858_solr    ] o.a.s.c.Overseer Overseer (id=null) closing
   [junit4]   2> 2020864 INFO  (jetty-launcher-2584-thread-3) [n:127.0.0.1:48904_solr    ] o.a.s.c.LeaderElector Joined leadership election with path: /overseer_elect/election/95402512156459022-127.0.0.1:48904_solr-n_0000000000
   [junit4]   2> 2020864 INFO  (jetty-launcher-2584-thread-5) [n:127.0.0.1:50456_solr    ] o.a.s.c.Overseer Overseer (id=null) closing
   [junit4]   2> 2020865 INFO  (jetty-launcher-2584-thread-4) [n:127.0.0.1:33588_solr    ] o.a.s.c.Overseer Overseer (id=null) closing
   [junit4]   2> 2020866 INFO  (jetty-launcher-2584-thread-1) [n:127.0.0.1:50858_solr    ] o.a.s.c.LeaderElector Joined leadership election with path: /overseer_elect/election/95402512156459016-127.0.0.1:50858_solr-n_0000000001
   [junit4]   2> 2020866 INFO  (jetty-launcher-2584-thread-3) [n:127.0.0.1:48904_solr    ] o.a.s.c.OverseerElectionContext I am going to be the leader 127.0.0.1:48904_solr
   [junit4]   2> 2020866 INFO  (jetty-launcher-2584-thread-3) [n:127.0.0.1:48904_solr    ] o.a.s.c.c.SolrZkClient makePath: /overseer_elect/leader
   [junit4]   2> 2020866 INFO  (jetty-launcher-2584-thread-5) [n:127.0.0.1:50456_solr    ] o.a.s.c.LeaderElector Joined leadership election with path: /overseer_elect/election/95402512156459018-127.0.0.1:50456_solr-n_0000000002
   [junit4]   2> 2020867 INFO  (jetty-launcher-2584-thread-4) [n:127.0.0.1:33588_solr    ] o.a.s.c.LeaderElector Joined leadership election with path: /overseer_elect/election/95402512156459021-127.0.0.1:33588_solr-n_0000000003
   [junit4]   2> 2020868 INFO  (jetty-launcher-2584-thread-5) [n:127.0.0.1:50456_solr    ] o.a.s.c.LeaderElector Watching path /overseer_elect/election/95402512156459016-127.0.0.1:50858_solr-n_0000000001 to know if I could be the leader
   [junit4]   2> 2020868 INFO  (jetty-launcher-2584-thread-5) [n:127.0.0.1:50456_solr    ] o.a.s.c.c.ZkStateReader Updating cluster state from ZooKeeper... 
   [junit4]   2> 2020869 INFO  (jetty-launcher-2584-thread-1) [n:127.0.0.1:50858_solr    ] o.a.s.c.LeaderElector Watching path /overseer_elect/election/95402512156459022-127.0.0.1:48904_solr-n_0000000000 to know if I could be the leader
   [junit4]   2> 2020869 INFO  (jetty-launcher-2584-thread-1) [n:127.0.0.1:50858_solr    ] o.a.s.c.c.ZkStateReader Updating cluster state from ZooKeeper... 
   [junit4]   2> 2020869 INFO  (jetty-launcher-2584-thread-4) [n:127.0.0.1:33588_solr    ] o.a.s.c.LeaderElector Watching path /overseer_elect/election/95402512156459018-127.0.0.1:50456_solr-n_0000000002 to know if I could be the leader
   [junit4]   2> 2020869 INFO  (jetty-launcher-2584-thread-3) [n:127.0.0.1:48904_solr    ] o.a.s.c.Overseer Overseer (id=95402512156459022-127.0.0.1:48904_solr-n_0000000000) starting
   [junit4]   2> 2020869 INFO  (jetty-launcher-2584-thread-4) [n:127.0.0.1:33588_solr    ] o.a.s.c.c.ZkStateReader Updating cluster state from ZooKeeper... 
   [junit4]   2> 2020873 INFO  (jetty-launcher-2584-thread-3) [n:127.0.0.1:48904_solr    ] o.a.s.c.c.SolrZkClient makePath: /overseer/queue-work
   [junit4]   2> 2020884 INFO  (jetty-launcher-2584-thread-5) [n:127.0.0.1:50456_solr    ] o.a.s.c.CoreContainer Security conf doesn't exist. Skipping setup for authorization module.
   [junit4]   2> 2020884 INFO  (jetty-launcher-2584-thread-5) [n:127.0.0.1:50456_solr    ] o.a.s.c.CoreContainer No authentication plugin used.
   [junit4]   2> 2020894 INFO  (jetty-launcher-2584-thread-3) [n:127.0.0.1:48904_solr    ] o.a.s.c.OverseerAutoReplicaFailoverThread Starting OverseerAutoReplicaFailoverThread autoReplicaFailoverWorkLoopDelay=10000 autoReplicaFailoverWaitAfterExpiration=30000 autoReplicaFailoverBadNodeExpiration=60000
   [junit4]   2> 2020898 INFO  (jetty-launcher-2584-thread-5) [n:127.0.0.1:50456_solr    ] o.a.s.c.CorePropertiesLocator Looking for core definitions underneath /x1/jenkins/jenkins-slave/workspace/Lucene-Solr-Tests-5.5-Java7/solr/build/solr-core/test/J2/temp/solr.security.BasicAuthIntegrationTest_AC5FA4FC630F58DB-001/tempDir-001/node5/.
   [junit4]   2> 2020898 INFO  (jetty-launcher-2584-thread-5) [n:127.0.0.1:50456_solr    ] o.a.s.c.CorePropertiesLocator Found 0 core definitions
   [junit4]   2> 2020908 INFO  (jetty-launcher-2584-thread-1) [n:127.0.0.1:50858_solr    ] o.a.s.c.CoreContainer Security conf doesn't exist. Skipping setup for authorization module.
   [junit4]   2> 2020908 INFO  (jetty-launcher-2584-thread-1) [n:127.0.0.1:50858_solr    ] o.a.s.c.CoreContainer No authentication plugin used.
   [junit4]   2> 2020909 INFO  (jetty-launcher-2584-thread-1) [n:127.0.0.1:50858_solr    ] o.a.s.c.CorePropertiesLocator Looking for core definitions underneath /x1/jenkins/jenkins-slave/workspace/Lucene-Solr-Tests-5.5-Java7/solr/build/solr-core/test/J2/temp/solr.security.BasicAuthIntegrationTest_AC5FA4FC630F58DB-001/tempDir-001/node1/.
   [junit4]   2> 2020909 INFO  (jetty-launcher-2584-thread-1) [n:127.0.0.1:50858_solr    ] o.a.s.c.CorePropertiesLocator Found 0 core definitions
   [junit4]   2> 2020911 INFO  (OverseerStateUpdate-95402512156459022-127.0.0.1:48904_solr-n_0000000000) [n:127.0.0.1:48904_solr    ] o.a.s.c.Overseer Starting to work on the main queue
   [junit4]   2> 2020912 INFO  (OverseerCollectionConfigSetProcessor-95402512156459022-127.0.0.1:48904_solr-n_0000000000) [n:127.0.0.1:48904_solr    ] o.a.s.c.OverseerTaskProcessor Process current queue of overseer operations
   [junit4]   2> 2020912 INFO  (jetty-launcher-2584-thread-3) [n:127.0.0.1:48904_solr    ] o.a.s.c.c.ZkStateReader Updating cluster state from ZooKeeper... 
   [junit4]   2> 2020915 INFO  (jetty-launcher-2584-thread-4) [n:127.0.0.1:33588_solr    ] o.a.s.c.CoreContainer Security conf doesn't exist. Skipping setup for authorization module.
   [junit4]   2> 2020915 INFO  (jetty-launcher-2584-thread-4) [n:127.0.0.1:33588_solr    ] o.a.s.c.CoreContainer No authentication plugin used.
   [junit4]   2> 2020915 INFO  (jetty-launcher-2584-thread-4) [n:127.0.0.1:33588_solr    ] o.a.s.c.CorePropertiesLocator Looking for core definitions underneath /x1/jenkins/jenkins-slave/workspace/Lucene-Solr-Tests-5.5-Java7/solr/build/solr-core/test/J2/temp/solr.security.BasicAuthIntegrationTest_AC5FA4FC630F58DB-001/tempDir-001/node4/.
   [junit4]   2> 2020916 INFO  (jetty-launcher-2584-thread-4) [n:127.0.0.1:33588_solr    ] o.a.s.c.CorePropertiesLocator Found 0 core definitions
   [junit4]   2> 2020916 INFO  (jetty-launcher-2584-thread-1) [n:127.0.0.1:50858_solr    ] o.a.s.s.SolrDispatchFilter user.dir=/x1/jenkins/jenkins-slave/workspace/Lucene-Solr-Tests-5.5-Java7/solr/build/solr-core/test/J2
   [junit4]   2> 2020916 INFO  (jetty-launcher-2584-thread-1) [n:127.0.0.1:50858_solr    ] o.a.s.s.SolrDispatchFilter SolrDispatchFilter.init() done
   [junit4]   2> 2020918 INFO  (jetty-launcher-2584-thread-5) [n:127.0.0.1:50456_solr    ] o.a.s.s.SolrDispatchFilter user.dir=/x1/jenkins/jenkins-slave/workspace/Lucene-Solr-Tests-5.5-Java7/solr/build/solr-core/test/J2
   [junit4]   2> 2020918 INFO  (jetty-launcher-2584-thread-5) [n:127.0.0.1:50456_solr    ] o.a.s.s.SolrDispatchFilter SolrDispatchFilter.init() done
   [junit4]   2> 2020932 INFO  (jetty-launcher-2584-thread-3) [n:127.0.0.1:48904_solr    ] o.a.s.c.CoreContainer Security conf doesn't exist. Skipping setup for authorization module.
   [junit4]   2> 2020933 INFO  (jetty-launcher-2584-thread-3) [n:127.0.0.1:48904_solr    ] o.a.s.c.CoreContainer No authentication plugin used.
   [junit4]   2> 2020933 INFO  (jetty-launcher-2584-thread-3) [n:127.0.0.1:48904_solr    ] o.a.s.c.CorePropertiesLocator Looking for core definitions underneath /x1/jenkins/jenkins-slave/workspace/Lucene-Solr-Tests-5.5-Java7/solr/build/solr-core/test/J2/temp/solr.security.BasicAuthIntegrationTest_AC5FA4FC630F58DB-001/tempDir-001/node3/.
   [junit4]   2> 2020934 INFO  (jetty-launcher-2584-thread-3) [n:127.0.0.1:48904_solr    ] o.a.s.c.CorePropertiesLocator Found 0 core definitions
   [junit4]   2> 2020935 INFO  (jetty-launcher-2584-thread-4) [n:127.0.0.1:33588_solr    ] o.a.s.s.SolrDispatchFilter user.dir=/x1/jenkins/jenkins-slave/workspace/Lucene-Solr-Tests-5.5-Java7/solr/build/solr-core/test/J2
   [junit4]   2> 2020935 INFO  (jetty-launcher-2584-thread-4) [n:127.0.0.1:33588_solr    ] o.a.s.s.SolrDispatchFilter SolrDispatchFilter.init() done
   [junit4]   2> 2020935 INFO  (jetty-launcher-2584-thread-3) [n:127.0.0.1:48904_solr    ] o.a.s.s.SolrDispatchFilter user.dir=/x1/jenkins/jenkins-slave/workspace/Lucene-Solr-Tests-5.5-Java7/solr/build/solr-core/test/J2
   [junit4]   2> 2020935 INFO  (jetty-launcher-2584-thread-3) [n:127.0.0.1:48904_solr    ] o.a.s.s.SolrDispatchFilter SolrDispatchFilter.init() done
   [junit4]   2> 2021873 INFO  (jetty-launcher-2584-thread-2) [n:127.0.0.1:54054_solr    ] o.a.s.c.ZkController Register node as live in ZooKeeper:/live_nodes/127.0.0.1:54054_solr
   [junit4]   2> 2021874 INFO  (jetty-launcher-2584-thread-2) [n:127.0.0.1:54054_solr    ] o.a.s.c.c.SolrZkClient makePath: /live_nodes/127.0.0.1:54054_solr
   [junit4]   2> 2021876 INFO  (zkCallback-2601-thread-1-processing-n:127.0.0.1:50456_solr) [n:127.0.0.1:50456_solr    ] o.a.s.c.c.ZkStateReader A live node change: [WatchedEvent state:SyncConnected type:NodeChildrenChanged path:/live_nodes], has occurred - updating... (live nodes size: [4])
   [junit4]   2> 2021876 INFO  (zkCallback-2597-thread-1-processing-n:127.0.0.1:50858_solr) [n:127.0.0.1:50858_solr    ] o.a.s.c.c.ZkStateReader A live node change: [WatchedEvent state:SyncConnected type:NodeChildrenChanged path:/live_nodes], has occurred - updating... (live nodes size: [4])
   [junit4]   2> 2021876 INFO  (zkCallback-2609-thread-1-processing-n:127.0.0.1:48904_solr) [n:127.0.0.1:48904_solr    ] o.a.s.c.c.ZkStateReader A live node change: [WatchedEvent state:SyncConnected type:NodeChildrenChanged path:/live_nodes], has occurred - updating... (live nodes size: [4])
   [junit4]   2> 2021876 INFO  (zkCallback-2608-thread-1-processing-n:127.0.0.1:33588_solr) [n:127.0.0.1:33588_solr    ] o.a.s.c.c.ZkStateReader A live node change: [WatchedEvent state:SyncConnected type:NodeChildrenChanged path:/live_nodes], has occurred - updating... (live nodes size: [4])
   [junit4]   2> 2021877 INFO  (zkCallback-2610-thread-1-processing-n:127.0.0.1:54054_solr) [n:127.0.0.1:54054_solr    ] o.a.s.c.c.ZkStateReader A live node change: [WatchedEvent state:SyncConnected type:NodeChildrenChanged path:/live_nodes], has occurred - updating... (live nodes size: [4])
   [junit4]   2> 2021878 INFO  (jetty-launcher-2584-thread-2) [n:127.0.0.1:54054_solr    ] o.a.s.c.Overseer Overseer (id=null) closing
   [junit4]   2> 2021882 INFO  (jetty-launcher-2584-thread-2) [n:127.0.0.1:54054_solr    ] o.a.s.c.LeaderElector Joined leadership election with path: /overseer_elect/election/95402512156459023-127.0.0.1:54054_solr-n_0000000004
   [junit4]   2> 2021882 INFO  (jetty-launcher-2584-thread-2) [n:127.0.0.1:54054_solr    ] o.a.s.c.LeaderElector Watching path /overseer_elect/election/95402512156459021-127.0.0.1:33588_solr-n_0000000003 to know if I could be the leader
   [junit4]   2> 2021894 INFO  (jetty-launcher-2584-thread-2) [n:127.0.0.1:54054_solr    ] o.a.s.c.CoreContainer Security conf doesn't exist. Skipping setup for authorization module.
   [junit4]   2> 2021894 INFO  (jetty-launcher-2584-thread-2) [n:127.0.0.1:54054_solr    ] o.a.s.c.CoreContainer No authentication plugin used.
   [junit4]   2> 2021895 INFO  (jetty-launcher-2584-thread-2) [n:127.0.0.1:54054_solr    ] o.a.s.c.CorePropertiesLocator Looking for core definitions underneath /x1/jenkins/jenkins-slave/workspace/Lucene-Solr-Tests-5.5-Java7/solr/build/solr-core/test/J2/temp/solr.security.BasicAuthIntegrationTest_AC5FA4FC630F58DB-001/tempDir-001/node2/.
   [junit4]   2> 2021895 INFO  (jetty-launcher-2584-thread-2) [n:127.0.0.1:54054_solr    ] o.a.s.c.CorePropertiesLocator Found 0 core definitions
   [junit4]   2> 2021896 INFO  (jetty-launcher-2584-thread-2) [n:127.0.0.1:54054_solr    ] o.a.s.s.SolrDispatchFilter user.dir=/x1/jenkins/jenkins-slave/workspace/Lucene-Solr-Tests-5.5-Java7/solr/build/solr-core/test/J2
   [junit4]   2> 2021896 INFO  (jetty-launcher-2584-thread-2) [n:127.0.0.1:54054_solr    ] o.a.s.s.SolrDispatchFilter SolrDispatchFilter.init() done
   [junit4]   2> 2021896 INFO  (TEST-BasicAuthIntegrationTest.testBasics-seed#[AC5FA4FC630F58DB]) [    ] o.a.s.c.c.SolrZkClient Using default ZkCredentialsProvider
   [junit4]   2> 2021897 INFO  (TEST-BasicAuthIntegrationTest.testBasics-seed#[AC5FA4FC630F58DB]) [    ] o.a.s.c.c.ConnectionManager Waiting for client to connect to ZooKeeper
   [junit4]   2> 2021935 INFO  (zkCallback-2611-thread-1) [    ] o.a.s.c.c.ConnectionManager Watcher org.apache.solr.common.cloud.ConnectionManager@760d47b7 name:ZooKeeperConnection Watcher:127.0.0.1:58075 got event WatchedEvent state:SyncConnected type:None path:null path:null type:None
   [junit4]   2> 2021940 INFO  (TEST-BasicAuthIntegrationTest.testBasics-seed#[AC5FA4FC630F58DB]) [    ] o.a.s.c.c.ConnectionManager Client is connected to ZooKeeper
   [junit4]   2> 2021940 INFO  (TEST-BasicAuthIntegrationTest.testBasics-seed#[AC5FA4FC630F58DB]) [    ] o.a.s.c.c.SolrZkClient Using default ZkACLProvider
   [junit4]   2> 2021945 INFO  (TEST-BasicAuthIntegrationTest.testBasics-seed#[AC5FA4FC630F58DB]) [    ] o.e.j.s.ServerConnector Stopped ServerConnector@52e6aa2d{HTTP/1.1}{127.0.0.1:0}
   [junit4]   2> 2021957 INFO  (TEST-BasicAuthIntegrationTest.testBasics-seed#[AC5FA4FC630F58DB]) [    ] o.a.s.c.CoreContainer Shutting down CoreContainer instance=1251393799
   [junit4]   2> 2021958 INFO  (TEST-BasicAuthIntegrationTest.testBasics-seed#[AC5FA4FC630F58DB]) [    ] o.a.s.c.ZkController Publish node=127.0.0.1:50858_solr as DOWN
   [junit4]   2> 2021963 INFO  (OverseerStateUpdate-95402512156459022-127.0.0.1:48904_solr-n_0000000000) [n:127.0.0.1:48904_solr    ] o.a.s.c.Overseer processMessage: queueSize: 1, message = {
   [junit4]   2>   "operation":"downnode",
   [junit4]   2>   "node_name":"127.0.0.1:50858_solr"} current state version: 0
   [junit4]   2> 2021963 INFO  (OverseerStateUpdate-95402512156459022-127.0.0.1:48904_solr-n_0000000000) [n:127.0.0.1:48904_solr    ] o.a.s.c.o.NodeMutator DownNode state invoked for node: 127.0.0.1:50858_solr
   [junit4]   2> 2021967 INFO  (zkCallback-2610-thread-1-processing-n:127.0.0.1:54054_solr) [n:127.0.0.1:54054_solr    ] o.a.s.c.c.ZkStateReader A live node change: [WatchedEvent state:SyncConnected type:NodeChildrenChanged path:/live_nodes], has occurred - updating... (live nodes size: [5])
   [junit4]   2> 2021967 INFO  (zkCallback-2608-thread-1-processing-n:127.0.0.1:33588_solr) [n:127.0.0.1:33588_solr    ] o.a.s.c.c.ZkStateReader A live node change: [WatchedEvent state:SyncConnected type:NodeChildrenChanged path:/live_nodes], has occurred - updating... (live nodes size: [5])
   [junit4]   2> 2021967 INFO  (zkCallback-2597-thread-1-processing-n:127.0.0.1:50858_solr) [n:127.0.0.1:50858_solr    ] o.a.s.c.c.ZkStateReader A live node change: [WatchedEvent state:SyncConnected type:NodeChildrenChanged path:/live_nodes], has occurred - updating... (live nodes size: [5])
   [junit4]   2> 2021967 INFO  (zkCallback-2609-thread-1-processing-n:127.0.0.1:48904_solr) [n:127.0.0.1:48904_solr    ] o.a.s.c.c.ZkStateReader A live node change: [WatchedEvent state:SyncConnected type:NodeChildrenChanged path:/live_nodes], has occurred - updating... (live nodes size: [5])
   [junit4]   2> 2021974 INFO  (zkCallback-2601-thread-2-processing-n:127.0.0.1:50456_solr) [n:127.0.0.1:50456_solr    ] o.a.s.c.c.ZkStateReader A live node change: [WatchedEvent state:SyncConnected type:NodeChildrenChanged path:/live_nodes], has occurred - updating... (live nodes size: [5])
   [junit4]   2> 2021974 INFO  (zkCallback-2601-thread-1-processing-n:127.0.0.1:50456_solr) [n:127.0.0.1:50456_solr    ] o.a.s.c.LeaderElector Watching path /overseer_elect/election/95402512156459022-127.0.0.1:48904_solr-n_0000000000 to know if I could be the leader
   [junit4]   2> 2023467 WARN  (zkCallback-2597-thread-1-processing-n:127.0.0.1:50858_solr) [n:127.0.0.1:50858_solr    ] o.a.s.c.c.ZkStateReader ZooKeeper watch triggered, but Solr cannot talk to ZK: [KeeperErrorCode = Session expired for /live_nodes]
   [junit4]   2> 2023469 INFO  (TEST-BasicAuthIntegrationTest.testBasics-seed#[AC5FA4FC630F58DB]) [    ] o.e.j.s.h.ContextHandler Stopped o.e.j.s.ServletContextHandler@1bf4eea9{/solr,null,UNAVAILABLE}
   [junit4]   2> 2023470 INFO  (TEST-BasicAuthIntegrationTest.testBasics-seed#[AC5FA4FC630F58DB]) [    ] o.e.j.s.Server jetty-9.2.13.v20150730
   [junit4]   2> 2023478 INFO  (TEST-BasicAuthIntegrationTest.testBasics-seed#[AC5FA4FC630F58DB]) [    ] o.e.j.s.h.ContextHandler Started o.e.j.s.ServletContextHandler@192d9357{/solr,null,AVAILABLE}
   [junit4]   2> 2023478 INFO  (TEST-BasicAuthIntegrationTest.testBasics-seed#[AC5FA4FC630F58DB]) [    ] o.e.j.s.ServerConnector Started ServerConnector@2553411c{HTTP/1.1}{127.0.0.1:57377}
   [junit4]   2> 2023478 INFO  (TEST-BasicAuthIntegrationTest.testBasics-seed#[AC5FA4FC630F58DB]) [    ] o.e.j.s.Server Started @2026311ms
   [junit4]   2> 2023478 INFO  (TEST-BasicAuthIntegrationTest.testBasics-seed#[AC5FA4FC630F58DB]) [    ] o.a.s.c.s.e.JettySolrRunner Jetty properties: {hostContext=/solr, hostPort=57377}
   [junit4]   2> 2023479 INFO  (TEST-BasicAuthIntegrationTest.testBasics-seed#[AC5FA4FC630F58DB]) [    ] o.a.s.s.SolrDispatchFilter SolrDispatchFilter.init(): sun.misc.Launcher$AppClassLoader@41692a49
   [junit4]   2> 2023479 INFO  (TEST-BasicAuthIntegrationTest.testBasics-seed#[AC5FA4FC630F58DB]) [    ] o.a.s.c.SolrResourceLoader new SolrResourceLoader for directory: '/x1/jenkins/jenkins-slave/workspace/Lucene-Solr-Tests-5.5-Java7/solr/build/solr-core/test/J2/temp/solr.security.BasicAuthIntegrationTest_AC5FA4FC630F58DB-001/tempDir-001/node6'
   [junit4]   2> 2023479 INFO  (TEST-BasicAuthIntegrationTest.testBasics-seed#[AC5FA4FC630F58DB]) [    ] o.a.s.c.SolrResourceLoader JNDI not configured for solr (NoInitialContextEx)
   [junit4]   2> 2023479 INFO  (TEST-BasicAuthIntegrationTest.testBasics-seed#[AC5FA4FC630F58DB]) [    ] o.a.s.c.SolrResourceLoader solr home defaulted to 'solr/' (could not find system property or JNDI)
   [junit4]   2> 2023479 INFO  (TEST-BasicAuthIntegrationTest.testBasics-seed#[AC5FA4FC630F58DB]) [    ] o.a.s.c.c.SolrZkClient Using default ZkCredentialsProvider
   [junit4]   2> 2023494 INFO  (TEST-BasicAuthIntegrationTest.testBasics-seed#[AC5FA4FC630F58DB]) [    ] o.a.s.c.c.ConnectionManager Waiting for client to connect to ZooKeeper
   [junit4]   2> 2023498 INFO  (zkCallback-2613-thread-1) [    ] o.a.s.c.c.ConnectionManager Watcher org.apache.solr.common.cloud.ConnectionManager@154cc71e name:ZooKeeperConnection Watcher:127.0.0.1:58075/solr got event WatchedEvent state:SyncConnected type:None path:null path:null type:None
   [junit4]   2> 2023498 INFO  (TEST-BasicAuthIntegrationTest.testBasics-seed#[AC5FA4FC630F58DB]) [    ] o.a.s.c.c.ConnectionManager Client is connected to ZooKeeper
   [junit4]   2> 2023498 INFO  (TEST-BasicAuthIntegrationTest.testBasics-seed#[AC5FA4FC630F58DB]) [    ] o.a.s.c.c.SolrZkClient Using default ZkACLProvider
   [junit4]   2> 2023499 INFO  (TEST-BasicAuthIntegrationTest.testBasics-seed#[AC5FA4FC630F58DB]) [    ] o.a.s.s.SolrDispatchFilter solr.xml found in ZooKeeper. Loading...
   [junit4]   2> 2023519 INFO  (TEST-BasicAuthIntegrationTest.testBasics-seed#[AC5FA4FC630F58DB]) [    ] o.a.s.c.CorePropertiesLocator Config-defined core root directory: /x1/jenkins/jenkins-slave/workspace/Lucene-Solr-Tests-5.5-Java7/solr/build/solr-core/test/J2/temp/solr.security.BasicAuthIntegrationTest_AC5FA4FC630F58DB-001/tempDir-001/node6/.
   [junit4]   2> 2023519 INFO  (TEST-BasicAuthIntegrationTest.testBasics-seed#[AC5FA4FC630F58DB]) [    ] o.a.s.c.CoreContainer New CoreContainer 1254189068
   [junit4]   2> 2023519 INFO  (TEST-BasicAuthIntegrationTest.testBasics-seed#[AC5FA4FC630F58DB]) [    ] o.a.s.c.CoreContainer Loading cores into CoreContainer [instanceDir=/x1/jenkins/jenkins-slave/workspace/Lucene-Solr-Tests-5.5-Java7/solr/build/solr-core/test/J2/temp/solr.security.BasicAuthIntegrationTest_AC5FA4FC630F58DB-001/tempDir-001/node6]
   [junit4]   2> 2023519 WARN  (TEST-BasicAuthIntegrationTest.testBasics-seed#[AC5FA4FC630F58DB]) [    ] o.a.s.c.CoreContainer Couldn't add files from /x1/jenkins/jenkins-slave/workspace/Lucene-Solr-Tests-5.5-Java7/solr/build/solr-core/test/J2/temp/solr.security.BasicAuthIntegrationTest_AC5FA4FC630F58DB-001/tempDir-001/node6/lib to classpath: /x1/jenkins/jenkins-slave/workspace/Lucene-Solr-Tests-5.5-Java7/solr/build/solr-core/test/J2/temp/solr.security.BasicAuthIntegrationTest_AC5FA4FC630F58DB-001/tempDir-001/node6/lib
   [junit4]   2> 2023520 INFO  (TEST-BasicAuthIntegrationTest.testBasics-seed#[AC5FA4FC630F58DB]) [    ] o.a.s.h.c.HttpShardHandlerFactory created with socketTimeout : 90000,urlScheme : ,connTimeout : 15000,maxConnectionsPerHost : 20,maxConnections : 10000,corePoolSize : 0,maximumPoolSize : 2147483647,maxThreadIdleTime : 5,sizeOfQueue : -1,fairnessPolicy : false,useRetries : false,
   [junit4]   2> 2023521 INFO  (TEST-BasicAuthIntegrationTest.testBasics-seed#[AC5FA4FC630F58DB]) [    ] o.a.s.u.UpdateShardHandler Creating UpdateShardHandler HTTP client with params: socketTimeout=340000&connTimeout=45000&retry=true
   [junit4]   2> 2023521 INFO  (TEST-BasicAuthIntegrationTest.testBasics-seed#[AC5FA4FC630F58DB]) [    ] o.a.s.l.LogWatcher SLF4J impl is org.slf4j.impl.Log4jLoggerFactory
   [junit4]   2> 2023521 INFO  (TEST-BasicAuthIntegrationTest.testBasics-seed#[AC5FA4FC630F58DB]) [    ] o.a.s.l.LogWatcher Registering Log Listener [Log4j (org.slf4j.impl.Log4jLoggerFactory)]
   [junit4]   2> 2023521 INFO  (TEST-BasicAuthIntegrationTest.testBasics-seed#[AC5FA4FC630F58DB]) [    ] o.a.s.c.ZkContainer Zookeeper client=127.0.0.1:58075/solr
   [junit4]   2> 2023521 INFO  (TEST-BasicAuthIntegrationTest.testBasics-seed#[AC5FA4FC630F58DB]) [    ] o.a.s.c.ZkController zkHost includes chroot
   [junit4]   2> 2023522 INFO  (TEST-BasicAuthIntegrationTest.testBasics-seed#[AC5FA4FC630F58DB]) [    ] o.a.s.c.c.SolrZkClient Using default ZkCredentialsProvider
   [junit4]   2> 2023526 INFO  (TEST-BasicAuthIntegrationTest.testBasics-seed#[AC5FA4FC630F58DB]) [    ] o.a.s.c.c.ConnectionManager Waiting for client to connect to ZooKeeper
   [junit4]   2> 2023529 INFO  (zkCallback-2616-thread-1) [    ] o.a.s.c.c.ConnectionManager Watcher org.apache.solr.common.cloud.ConnectionManager@663385d3 name:ZooKeeperConnection Watcher:127.0.0.1:58075 got event WatchedEvent state:SyncConnected type:None path:null path:null type:None
   [junit4]   2> 2023529 INFO  (TEST-BasicAuthIntegrationTest.testBasics-seed#[AC5FA4FC630F58DB]) [    ] o.a.s.c.c.ConnectionManager Client is connected to ZooKeeper
   [junit4]   2> 2023529 INFO  (TEST-BasicAuthIntegrationTest.testBasics-seed#[AC5FA4FC630F58DB]) [    ] o.a.s.c.c.SolrZkClient Using default ZkACLProvider
   [junit4]   2> 2023535 INFO  (TEST-BasicAuthIntegrationTest.testBasics-seed#[AC5FA4FC630F58DB]) [n:127.0.0.1:57377_solr    ] o.a.s.c.c.ConnectionManager Waiting for client to connect to ZooKeeper
   [junit4]   2> 2023537 INFO  (zkCallback-2617-thread-1-processing-n:127.0.0.1:57377_solr) [n:127.0.0.1:57377_solr    ] o.a.s.c.c.ConnectionManager Watcher org.apache.solr.common.cloud.ConnectionManager@542a0075 name:ZooKeeperConnection Watcher:127.0.0.1:58075/solr got event WatchedEvent state:SyncConnected type:None path:null path:null type:None
   [junit4]   2> 2023537 INFO  (TEST-BasicAuthIntegrationTest.testBasics-seed#[AC5FA4FC630F58DB]) [n:127.0.0.1:57377_solr    ] o.a.s.c.c.ConnectionManager Client is connected to ZooKeeper
   [junit4]   2> 2023545 INFO  (TEST-BasicAuthIntegrationTest.testBasics-seed#[AC5FA4FC630F58DB]) [n:127.0.0.1:57377_solr    ] o.a.s.c.c.ZkStateReader Updating cluster state from ZooKeeper... 
   [junit4]   2> 2024553 INFO  (TEST-BasicAuthIntegrationTest.testBasics-seed#[AC5FA4FC630F58DB]) [n:127.0.0.1:57377_solr    ] o.a.s.c.ZkController Register node as live in ZooKeeper:/live_nodes/127.0.0.1:57377_solr
   [junit4]   2> 2024554 INFO  (TEST-BasicAuthIntegrationTest.testBasics-seed#[AC5FA4FC630F58DB]) [n:127.0.0.1:57377_solr    ] o.a.s.c.c.SolrZkClient makePath: /live_nodes/127.0.0.1:57377_solr
   [junit4]   2> 2024556 INFO  (zkCallback-2608-thread-1-processing-n:127.0.0.1:33588_solr) [n:127.0.0.1:33588_solr    ] o.a.s.c.c.ZkStateReader A live node change: [WatchedEvent state:SyncConnected type:NodeChildrenChanged path:/live_nodes], has occurred - updating... (live nodes size: [4])
   [junit4]   2> 2024556 INFO  (zkCallback-2617-thread-1-processing-n:127.0.0.1:57377_solr) [n:127.0.0.1:57377_solr    ] o.a.s.c.c.ZkStateReader A live node change: [WatchedEvent state:SyncConnected type:NodeChildrenChanged path:/live_nodes], has occurred - updating... (live nodes size: [4])
   [junit4]   2> 2024556 INFO  (zkCallback-2601-thread-2-processing-n:127.0.0.1:50456_solr) [n:127.0.0.1:50456_solr    ] o.a.s.c.c.ZkStateReader A live node change: [WatchedEvent state:SyncConnected type:NodeChildrenChanged path:/live_nodes], has occurred - updating... (live nodes size: [4])
   [junit4]   2> 2024556 INFO  (zkCallback-2610-thread-1-processing-n:127.0.0.1:54054_solr) [n:127.0.0.1:54054_solr    ] o.a.s.c.c.ZkStateReader A live node change: [WatchedEvent state:SyncConnected type:NodeChildrenChanged path:/live_nodes], has occurred - updating... (live nodes size: [4])
   [junit4]   2> 2024556 INFO  (zkCallback-2609-thread-1-processing-n:127.0.0.1:48904_solr) [n:127.0.0.1:48904_solr    ] o.a.s.c.c.ZkStateReader A live node change: [WatchedEvent state:SyncConnected type:NodeChildrenChanged path:/live_nodes], has occurred - updating... (live nodes size: [4])
   [junit4]   2> 2024557 INFO  (TEST-BasicAuthIntegrationTest.testBasics-seed#[AC5FA4FC630F58DB]) [n:127.0.0.1:57377_solr    ] o.a.s.c.Overseer Overseer (id=null) closing
   [junit4]   2> 2024558 INFO  (TEST-BasicAuthIntegrationTest.testBasics-seed#[AC5FA4FC630F58DB]) [n:127.0.0.1:57377_solr    ] o.a.s.c.LeaderElector Joined leadership election with path: /overseer_elect/election/95402512156459027-127.0.0.1:57377_solr-n_0000000005
   [junit4]   2> 2024559 INFO  (TEST-BasicAuthIntegrationTest.testBasics-seed#[AC5FA4FC630F58DB]) [n:127.0.0.1:57377_solr    ] o.a.s.c.LeaderElector Watching path /overseer_elect/election/95402512156459023-127.0.0.1:54054_solr-n_0000000004 to know if I could be the leader
   [junit4]   2> 2024574 INFO  (TEST-BasicAuthIntegrationTest.testBasics-seed#[AC5FA4FC630F58DB]) [n:127.0.0.1:57377_solr    ] o.a.s.c.CoreContainer Security conf doesn't exist. Skipping setup for authorization module.
   [junit4]   2> 2024575 INFO  (TEST-BasicAuthIntegrationTest.testBasics-seed#[AC5FA4FC630F58DB]) [n:127.0.0.1:57377_solr    ] o.a.s.c.CoreContainer No authentication plugin used.
   [junit4]   2> 2024575 INFO  (TEST-BasicAuthIntegrationTest.testBasics-seed#[AC5FA4FC630F58DB]) [n:127.0.0.1:57377_solr    ] o.a.s.c.CorePropertiesLocator Looking for core definitions underneath /x1/jenkins/jenkins-slave/workspace/Lucene-Solr-Tests-5.5-Java7/solr/build/solr-core/test/J2/temp/solr.security.BasicAuthIntegrationTest_AC5FA4FC630F58DB-001/tempDir-001/node6/.
   [junit4]   2> 2024576 INFO  (TEST-BasicAuthIntegrationTest.testBasics-seed#[AC5FA4FC630F58DB]) [n:127.0.0.1:57377_solr    ] o.a.s.c.CorePropertiesLocator Found 0 core definitions
   [junit4]   2> 2024577 INFO  (TEST-BasicAuthIntegrationTest.testBasics-seed#[AC5FA4FC630F58DB]) [n:127.0.0.1:57377_solr    ] o.a.s.s.SolrDispatchFilter user.dir=/x1/jenkins/jenkins-slave/workspace/Lucene-Solr-Tests-5.5-Java7/solr/build/solr-core/test/J2
   [junit4]   2> 2024577 INFO  (TEST-BasicAuthIntegrationTest.testBasics-seed#[AC5FA4FC630F58DB]) [n:127.0.0.1:57377_solr    ] o.a.s.s.SolrDispatchFilter SolrDispatchFilter.init() done
   [junit4]   2> 2024577 INFO  (TEST-BasicAuthIntegrationTest.testBasics-seed#[AC5FA4FC630F58DB]) [    ] o.a.s.c.c.SolrZkClient Using default ZkCredentialsProvider
   [junit4]   2> 2024586 INFO  (TEST-BasicAuthIntegrationTest.testBasics-seed#[AC5FA4FC630F58DB]) [    ] o.a.s.c.c.ConnectionManager Waiting for client to connect to ZooKeeper
   [junit4]   2> 2024593 INFO  (zkCallback-2618-thread-1) [    ] o.a.s.c.c.ConnectionManager Watcher org.apache.solr.common.cloud.ConnectionManager@408f9fae name:ZooKeeperConnection Watcher:127.0.0.1:58075/solr got event WatchedEvent state:SyncConnected type:None path:null path:null type:None
   [junit4]   2> 2024593 INFO  (TEST-BasicAuthIntegrationTest.testBasics-seed#[AC5FA4FC630F58DB]) [    ] o.a.s.c.c.ConnectionManager Client is connected to ZooKeeper
   [junit4]   2> 2024594 INFO  (TEST-BasicAuthIntegrationTest.testBasics-seed#[AC5FA4FC630F58DB]) [    ] o.a.s.c.c.SolrZkClient Using default ZkACLProvider
   [junit4]   2> 2024594 INFO  (TEST-BasicAuthIntegrationTest.testBasics-seed#[AC5FA4FC630F58DB]) [    ] o.a.s.c.c.SolrZkClient makePath: /configs/solrCloudCollectionConfig/solrconfig-spellcheckcomponent.xml
   [junit4]   2> 2024603 INFO  (TEST-BasicAuthIntegrationTest.testBasics-seed#[AC5FA4FC630F58DB]) [    ] o.a.s.c.c.SolrZkClient makePath: /configs/solrCloudCollectionConfig/schema-null-charfilters-analyzer.xml
   [junit4]   2> 2024606 INFO  (TEST-BasicAuthIntegrationTest.testBasics-seed#[AC5FA4FC630F58DB]) [    ] o.a.s.c.c.SolrZkClient makePath: /configs/solrCloudCollectionConfig/regex-boost-processor-test.txt
   [junit4]   2> 2024614 INFO  (TEST-BasicAuthIntegrationTest.testBasics-seed#[AC5FA4FC630F58DB]) [    ] o.a.s.c.c.SolrZkClient makePath: /configs/solrCloudCollectionConfig/solrconfig-spellchecker.xml
   [junit4]   2> 2024618 INFO  (TEST-BasicAuthIntegrationTest.testBasics-seed#[AC5FA4FC630F58DB]) [    ] o.a.s.c.c.SolrZkClient makePath: /configs/solrCloudCollectionConfig/bad-schema-multiple-asterisk-copyfield-dest-should-fail-test.xml
   [junit4]   2> 2024620 INFO  (TEST-BasicAuthIntegrationTest.testBasics-seed#[AC5FA4FC630F58DB]) [    ] o.a.s.c.c.SolrZkClient makePath: /configs/solrCloudCollectionConfig/schema-docValuesFaceting.xml
   [junit4]   2> 2024624 INFO  (TEST-BasicAuthIntegrationTest.testBasics-seed#[AC5FA4FC630F58DB]) [    ] o.a.s.c.c.SolrZkClient makePath: /configs/solrCloudCollectionConfig/solrconfig-tlog-with-delayingcomponent.xml
   [junit4]   2> 2024627 INFO  (TEST-BasicAuthIntegrationTest.testBasics-seed#[AC5FA4FC630F58DB]) [    ] o.a.s.c.c.SolrZkClient makePath: /configs/solrCloudCollectionConfig/bad-schema-currency-ft-bogus-default-code.xml
   [junit4]   2> 2024630 INFO  (TEST-BasicAuthIntegrationTest.testBasics-seed#[AC5FA4FC630F58DB]) [    ] o.a.s.c.c.SolrZkClient makePath: /configs/solrCloudCollectionConfig/schema-numeric.xml
   [junit4]   2> 2024633 INFO  (TEST-BasicAuthIntegrationTest.testBasics-seed#[AC5FA4FC630F58DB]) [    ] o.a.s.c.c.SolrZkClient makePath: /configs/solrCloudCollectionConfig/solrconfig_codec.xml
   [junit4]   2> 2024637 INFO  (TEST-BasicAuthIntegrationTest.testBasics-seed#[AC5FA4FC630F58DB]) [    ] o.a.s.c.c.SolrZkClient makePath: /configs/solrCloudCollectionConfig/bad-schema-multiple-asterisk-copyfield-source-should-fail-test.xml
   [junit4]   2> 2024639 INFO  (TEST-BasicAuthIntegrationTest.testBasics-seed#[AC5FA4FC630F58DB]) [    ] o.a.s.c.c.SolrZkClient makePath: /configs/solrCloudCollectionConfig/schema_latest.xml
   [junit4]   2> 2024644 INFO  (TEST-BasicAuthIntegrationTest.testBasics-seed#[AC5FA4FC630F58DB]) [    ] o.a.s.c.c.SolrZkClient makePath: /configs/solrCloudCollectionConfig/schema-sorts.xml
   [junit4]   2> 2024650 INFO  (TEST-BasicAuthIntegrationTest.testBasics-seed#[AC5FA4FC630F58DB]) [    ] o.a.s.c.c.SolrZkClient makePath: /configs/solrCloudCollectionConfig/solrconfig-headers.xml
   [junit4]   2> 2024654 INFO  (TEST-BasicAuthIntegrationTest.testBasics-seed#[AC5FA4FC630F58DB]) [    ] o.a.s.c.c.SolrZkClient makePath: /configs/solrCloudCollectionConfig/solrconfig-implicitproperties.xml
   [junit4]   2> 2024657 INFO  (TEST-BasicAuthIntegrationTest.testBasics-seed#[AC5FA4FC630F58DB]) [    ] o.a.s.c.c.SolrZkClient makePath: /configs/solrCloudCollectionConfig/bad-solrconfig-bogus-scriptengine-name.xml
   [junit4]   2> 2024659 INFO  (TEST-BasicAuthIntegrationTest.testBasics-seed#[AC5FA4FC630F58DB]) [    ] o.a.s.c.c.SolrZkClient makePath: /configs/solrCloudCollectionConfig/schema-snippet-types.incl
   [junit4]   2> 2024662 INFO  (TEST-BasicAuthIntegrationTest.testBasics-seed#[AC5FA4FC630F58DB]) [    ] o.a.s.c.c.SolrZkClient makePath: /configs/solrCloudCollectionConfig/solrconfig-parsing-update-processor-chains.xml
   [junit4]   2> 2024669 INFO  (TEST-BasicAuthIntegrationTest.testBasics-seed#[AC5FA4FC630F58DB]) [    ] o.a.s.c.c.SolrZkClient makePath: /configs/solrCloudCollectionConfig/schema-docValuesMissing.xml
   [junit4]   2> 2024675 INFO  (TEST-BasicAuthIntegrationTest.testBasics-seed#[AC5FA4FC630F58DB]) [    ] o.a.s.c.c.SolrZkClient makePath: /configs/solrCloudCollectionConfig/solrconfig-noopregen.xml
   [junit4]   2> 2024683 INFO  (TEST-BasicAuthIntegrationTest.testBasics-seed#[AC5FA4FC630F58DB]) [    ] o.a.s.c.c.SolrZkClient makePath: /configs/solrCloudCollectionConfig/schema-one-field-no-dynamic-field-unique-key.xml
   [junit4]   2> 2024688 INFO  (TEST-BasicAuthIntegrationTest.testBasics-seed#[AC5FA4FC630F58DB]) [    ] o.a.s.c.c.SolrZkClient makePath: /configs/solrCloudCollectionConfig/solrconfig-script-updateprocessor.xml
   [junit4]   2> 2024691 INFO  (TEST-BasicAuthIntegrationTest.testBasics-seed#[AC5FA4FC630F58DB]) [    ] o.a.s.c.c.SolrZkClient makePath: /configs/solrCloudCollectionConfig/bad-error-solrconfig.xml
   [junit4]   2> 2024693 INFO  (TEST-BasicAuthIntegrationTest.testBasics-seed#[AC5FA4FC630F58DB]) [    ] o.a.s.c.c.SolrZkClient makePath: /configs/solrCloudCollectionConfig/solrconfig-suggestercomponent.xml
   [junit4]   2> 2024697 INFO  (TEST-BasicAuthIntegrationTest.testBasics-seed#[AC5FA4FC630F58DB]) [    ] o.a.s.c.c.SolrZkClient makePath: /configs/solrCloudCollectionConfig/bad-currency.xml
   [junit4]   2> 2024699 INFO  (TEST-BasicAuthIntegrationTest.testBasics-seed#[AC5FA4FC630F58DB]) [    ] o.a.s.c.c.SolrZkClient makePath: /configs/solrCloudCollectionConfig/solrconfig-query-parser-init.xml
   [junit4]   2> 2024702 INFO  (TEST-BasicAuthIntegrationTest.testBasics-seed#[AC5FA4FC630F58DB]) [    ] o.a.s.c.c.SolrZkClient makePath: /configs/solrCloudCollectionConfig/solrconfig-caching.xml
   [junit4]   2> 2024704 INFO  (TEST-BasicAuthIntegrationTest.testBasics-seed#[AC5FA4FC630F58DB]) [    ] o.a.s.c.c.SolrZkClient makePath: /configs/solrCloudCollectionConfig/conditional.updateprocessor.js
   [junit4]   2> 2024706 INFO  (TEST-BasicAuthIntegrationTest.testBasics-seed#[AC5FA4FC630F58DB]) [    ] o.a.s.c.c.SolrZkClient makePath: /configs/solrCloudCollectionConfig/solrconfig-indexconfig-mergepolicyfactory.xml
   [junit4]   2> 2024712 INFO  (TEST-BasicAuthIntegrationTest.testBasics-seed#[AC5FA4FC630F58DB]) [    ] o.a.s.c.c.SolrZkClient makePath: /configs/solrCloudCollectionConfig/compoundDictionary.txt
   [junit4]   2> 2024714 INFO  (TEST-BasicAuthIntegrationTest.testBasics-seed#[AC5FA4FC630F58DB]) [    ] o.a.s.c.c.SolrZkClient makePath: /configs/solrCloudCollectionConfig/solrconfig-tieredmergepolicyfactory.xml
   [junit4]   2> 2024716 INFO  (TEST-BasicAuthIntegrationTest.testBasics-seed#[AC5FA4FC630F58DB]) [    ] o.a.s.c.c.SolrZkClient makePath: /configs/solrCloudCollectionConfig/phrasesuggest.txt
   [junit4]   2> 2024718 INFO  (TEST-BasicAuthIntegrationTest.testBasics-seed#[AC5FA4FC630F58DB]) [    ] o.a.s.c.c.SolrZkClient makePath: /configs/solrCloudCollectionConfig/solrconfig-transformers.xml
   [junit4]   2> 2024721 INFO  (TEST-BasicAuthIntegrationTest.testBasics-seed#[AC5FA4FC630F58DB]) [    ] o.a.s.c.c.SolrZkClient makePath: /configs/solrCloudCollectionConfig/bad-schema-not-indexed-but-norms.xml
   [junit4]   2> 2024724 INFO  (TEST-BasicAuthIntegrationTest.testBasics-seed#[AC5FA4FC630F58DB]) [    ] o.a.s.c.c.SolrZkClient makePath: /configs/solrCloudCollectionConfig/blendedInfixSuggest.txt
   [junit4]   2> 2024727 INFO  (TEST-BasicAuthIntegrationTest.testBasics-seed#[AC5FA4FC630F58DB]) [    ] o.a.s.c.c.SolrZkClient makePath: /configs/solrCloudCollectionConfig/schema-phrasesuggest.xml
   [junit4]   2> 2024729 INFO  (TEST-BasicAuthIntegrationTest.testBasics-seed#[AC5FA4FC630F58DB]) [    ] o.a.s.c.c.SolrZkClient makePath: /configs/solrCloudCollectionConfig/hunspell-test.dic
   [junit4]   2> 2024731 INFO  (TEST-BasicAuthIntegrationTest.testBasics-seed#[AC5FA4FC630F58DB]) [    ] o.a.s.c.c.SolrZkClient makePath: /configs/solrCloudCollectionConfig/schema-HighlighterMaxOffsetTest.xml
   [junit4]   2> 2024734 INFO  (TEST-BasicAuthIntegrationTest.testBasics-seed#[AC5FA4FC630F58DB]) [    ] o.a.s.c.c.SolrZkClient makePath: /configs/solrCloudCollectionConfig/schema-rest-lucene-match-version.xml
   [junit4]   2> 2024738 INFO  (TEST-BasicAuthIntegrationTest.testBasics-seed#[AC5FA4FC630F58DB]) [    ] o.a.s.c.c.SolrZkClient makePath: /configs/solrCloudCollectionConfig/solrconfig-functionquery.xml
   [junit4]   2> 2024740 INFO  (TEST-BasicAuthIntegrationTest.testBasics-seed#[AC5FA4FC630F58DB]) [    ] o.a.s.c.c.SolrZkClient makePath: /configs/solrCloudCollectionConfig/solrconfig-externalversionconstraint.xml
   [junit4]   2> 2024744 INFO  (TEST-BasicAuthIntegrationTest.testBasics-seed#[AC5FA4FC630F58DB]) [    ] o.a.s.c.c.SolrZkClient makePath: /configs/solrCloudCollectionConfig/bad-schema-codec-global-vs-ft-mismatch.xml
   [junit4]   2> 2024747 INFO  (TEST-BasicAuthIntegrationTest.testBasics-seed#[AC5FA4FC630F58DB]) [    ] o.a.s.c.c.SolrZkClient makePath: /configs/solrCloudCollectionConfig/schema-sim.xml
   [junit4]   2> 2024750 INFO  (TEST-BasicAuthIntegrationTest.testBasics-seed#[AC5FA4FC630F58DB]) [    ] o.a.s.c.c.SolrZkClient makePath: /configs/solrCloudCollectionConfig/schema-docValuesMulti.xml
   [junit4]   2> 2024753 INFO  (TEST-BasicAuthIntegrationTest.testBasics-seed#[AC5FA4FC630F58DB]) [    ] o.a.s.c.c.SolrZkClient makePath: /configs/solrCloudCollectionConfig/solrconfig-logmergepolicyfactory.xml
   [junit4]   2> 2024756 INFO  (TEST-BasicAuthIntegrationTest.testBasics-seed#[AC5FA4FC630F58DB]) [    ] o.a.s.c.c.SolrZkClient makePath: /configs/solrCloudCollectionConfig/solrconfig-collapseqparser.xml
   [junit4]   2> 2024759 INFO  (TEST-BasicAuthIntegrationTest.testBasics-seed#[AC5FA4FC630F58DB]) [    ] o.a.s.c.c.SolrZkClient makePath: /configs/solrCloudCollectionConfig/solrconfig-analytics-query.xml
   [junit4]   2> 2024762 INFO  (TEST-BasicAuthIntegrationTest.testBasics-seed#[AC5FA4FC630F58DB]) [    ] o.a.s.c.c.SolrZkClient makePath: /configs/solrCloudCollectionConfig/schema-sweetspot.xml
   [junit4]   2> 2024765 INFO  (TEST-BasicAuthIntegrationTest.testBasics-seed#[AC5FA4FC630F58DB]) [    ] o.a.s.c.c.SolrZkClient makePath: /configs/solrCloudCollectionConfig/solrconfig-searcher-listeners1.xml
   [junit4]   2> 2024768 INFO  (TEST-BasicAuthIntegrationTest.testBasics-seed#[AC5FA4FC630F58DB]) [    ] o.a.s.c.c.SolrZkClient makePath: /configs/solrCloudCollectionConfig/schema-id-and-version-fields-only.xml
   [junit4]   2> 2024771 INFO  (TEST-BasicAuthIntegrationTest.testBasics-seed#[AC5FA4FC630F58DB]) [    ] o.a.s.c.c.SolrZkClient makePath: /configs/solrCloudCollectionConfig/bad-solrconfig-schema-mutable-but-not-managed.xml
   [junit4]   2> 2024773 INFO  (TEST-BasicAuthIntegrationTest.testBasics-seed#[AC5FA4FC630F58DB]) [    ] o.a.s.c.c.SolrZkClient makePath: /configs/solrCloudCollectionConfig/hunspell-test.aff
   [junit4]   2> 2024775 INFO  (TEST-BasicAuthIntegrationTest.testBasics-seed#[AC5FA4FC630F58DB]) [    ] o.a.s.c.c.SolrZkClient makePath: /configs/solrCloudCollectionConfig/solrconfig-response-log-component.xml
   [junit4]   2> 2024778 INFO  (TEST-BasicAuthIntegrationTest.testBasics-seed#[AC5FA4FC630F58DB]) [    ] o.a.s.c.c.SolrZkClient makePath: /configs/solrCloudCollectionConfig/bad-schema-sim-default-does-not-exist.xml
   [junit4]   2> 2024785 INFO  (TEST-BasicAuthIntegrationTest.testBasics-seed#[AC5FA4FC630F58DB]) [    ] o.a.s.c.c.SolrZkClient makePath: /configs/solrCloudCollectionConfig/bad-schema-dynamicfield-required.xml
   [junit4]   2> 2024792 INFO  (TEST-BasicAuthIntegrationTest.testBasics-seed#[AC5FA4FC630F58DB]) [    ] o.a.s.c.c.SolrZkClient makePath: /configs/solrCloudCollectionConfig/bad-schema-not-indexed-but-pos.xml
   [junit4]   2> 2024804 INFO  (TEST-BasicAuthIntegrationTest.testBasics-seed#[AC5FA4FC630F58DB]) [    ] o.a.s.c.c.SolrZkClient makePath: /configs/solrCloudCollectionConfig/solrconfig-hash.xml
   [junit4]   2> 2024808 INFO  (TEST-BasicAuthIntegrationTest.testBasics-seed#[AC5FA4FC630F58DB]) [    ] o.a.s.c.c.SolrZkClient makePath: /configs/solrCloudCollectionConfig/solrconfig-components-name.xml
   [junit4]   2> 2024810 INFO  (TEST-BasicAuthIntegrationTest.testBasics-seed#[AC5FA4FC630F58DB]) [    ] o.a.s.c.c.SolrZkClient makePath: /configs/solrCloudCollectionConfig/bad-mp-solrconfig.xml
   [junit4]   2> 2024813 INFO  (TEST-BasicAuthIntegrationTest.testBasics-seed#[AC5FA4FC630F58DB]) [    ] o.a.s.c.c.SolrZkClient makePath: /configs/solrCloudCollectionConfig/solrconfig.snippet.randomindexconfig.xml
   [junit4]   2> 2024815 INFO  (TEST-BasicAuthIntegrationTest.testBasics-seed#[AC5FA4FC630F58DB]) [    ] o.a.s.c.c.SolrZkClient makePath: /configs/solrCloudCollectionConfig/solrconfig-xinclude.xml
   [junit4]   2> 2024819 INFO  (TEST-BasicAuthIntegrationTest.testBasics-seed#[AC5FA4FC630F58DB]) [    ] o.a.s.c.c.SolrZkClient makePath: /configs/solrCloudCollectionConfig/cross-compatible.js
   [junit4]   2> 2024821 INFO  (TEST-BasicAuthIntegrationTest.testBasics-seed#[AC5FA4FC630F58DB]) [    ] o.a.s.c.c.SolrZkClient makePath: /configs/solrCloudCollectionConfig/solrconfig_perf.xml
   [junit4]   2> 2024824 INFO  (TEST-BasicAuthIntegrationTest.testBasics-seed#[AC5FA4FC630F58DB]) [    ] o.a.s.c.c.SolrZkClient makePath: /configs/solrCloudCollectionConfig/bad-solrconfig-invalid-scriptfile.xml
   [junit4]   2> 2024825 INFO  (TEST-BasicAuthIntegrationTest.testBasics-seed#[AC5FA4FC630F58DB]) [    ] o.a.s.c.c.SolrZkClient makePath: /configs/solrCloudCollectionConfig/solrconfig-basic.xml
   [junit4]   2> 2024827 INFO  (TEST-BasicAuthIntegrationTest.testBasics-seed#[AC5FA4FC630F58DB]) [    ] o.a.s.c.c.SolrZkClient makePath: /configs/solrCloudCollectionConfig/schema-replication1.xml
   [junit4]   2> 2024834 INFO  (TEST-BasicAuthIntegrationTest.testBasics-seed#[AC5FA4FC630F58DB]) [    ] o.a.s.c.c.SolrZkClient makePath: /configs/solrCloudCollectionConfig/bad-solrconfig-missing-scriptfile.xml
   [junit4]   2> 2024841 INFO  (TEST-BasicAuthIntegrationTest.testBasics-seed#[AC5FA4FC630F58DB]) [    ] o.a.s.c.c.SolrZkClient makePath: /configs/solrCloudCollectionConfig/solrconfig-altdirectory.xml
   [junit4]   2> 2024845 INFO  (TEST-BasicAuthIntegrationTest.testBasics-seed#[AC5FA4FC630F58DB]) [    ] o.a.s.c.c.SolrZkClient makePath: /configs/solrCloudCollectionConfig/schema-distributed-missing-sort.xml
   [junit4]   2> 2024849 INFO  (TEST-BasicAuthIntegrationTest.testBasics-seed#[AC5FA4FC630F58DB]) [    ] o.a.s.c.c.SolrZkClient makePath: /configs/solrCloudCollectionConfig/enumsConfig.xml
   [junit4]   2> 2024851 INFO  (TEST-BasicAuthIntegrationTest.testBasics-seed#[AC5FA4FC630F58DB]) [    ] o.a.s.c.c.SolrZkClient makePath: /configs/solrCloudCollectionConfig/schema-tfidf.xml
   [junit4]   2> 2024854 INFO  (TEST-BasicAuthIntegrationTest.testBasics-seed#[AC5FA4FC630F58DB]) [    ] o.a.s.c.c.SolrZkClient makePath: /configs/solrCloudCollectionConfig/jasuggest.txt
   [junit4]   2> 2024856 INFO  (TEST-BasicAuthIntegrationTest.testBasics-seed#[AC5FA4FC630F58DB]) [    ] o.a.s.c.c.SolrZkClient makePath: /configs/solrCloudCollectionConfig/bad-schema-dup-field.xml
   [junit4]   2> 2024858 INFO  (TEST-BasicAuthIntegrationTest.testBasics-seed#[AC5FA4FC630F58DB]) [    ] o.a.s.c.c.SolrZkClient makePath: /configs/solrCloudCollectionConfig/fuzzysuggest.txt
   [junit4]   2> 2024860 INFO  (TEST-BasicAuthIntegrationTest.testBasics-seed#[AC5FA4FC630F58DB]) [    ] o.a.s.c.c.SolrZkClient makePath: /configs/solrCloudCollectionConfig/schema-minimal.xml
   [junit4]   2> 2024864 INFO  (TEST-BasicAuthIntegrationTest.testBasics-seed#[AC5FA4FC630F58DB]) [    ] o.a.s.c.c.SolrZkClient makePath: /configs/solrCloudCollectionConfig/solrconfig-highlight.xml
   [junit4]   2> 2024866 INFO  (TEST-BasicAuthIntegrationTest.testBasics-seed#[AC5FA4FC630F58DB]) [    ] o.a.s.c.c.SolrZkClient makePath: /configs/solrCloudCollectionConfig/solrconfig-tieredmergepolicy.xml
   [junit4]   2> 2024869 INFO  (TEST-BasicAuthIntegrationTest.testBasics-seed#[AC5FA4FC630F58DB]) [    ] o.a.s.c.c.SolrZkClient makePath: /configs/solrCloudCollectionConfig/schema-blockjoinfacetcomponent.xml
   [junit4]   2> 2024871 INFO  (TEST-BasicAuthIntegrationTest.testBasics-seed#[AC5FA4FC630F58DB]) [    ] o.a.s.c.c.SolrZkClient makePath: /configs/solrCloudCollectionConfig/schema-version-indexed.xml
   [junit4]   2> 2024881 INFO  (TEST-BasicAuthIntegrationTest.testBasics-seed#[AC5FA4FC630F58DB]) [    ] o.a.s.c.c.SolrZkClient makePath: /configs/solrCloudCollectionConfig/bad-schema-unsupported-docValues.xml
   [junit4]   2> 2024883 INFO  (TEST-BasicAuthIntegrationTest.testBasics-seed#[AC5FA4FC630F58DB]) [    ] o.a.s.c.c.SolrZkClient makePath: /configs/solrCloudCollectionConfig/mapping-ISOLatin1Accent.txt
   [junit4]   2> 2024887 INFO  (TEST-BasicAuthIntegrationTest.testBasics-seed#[AC5FA4FC630F58DB]) [    ] o.a.s.c.c.SolrZkClient makePath: /configs/solrCloudCollectionConfig/schema-lmdirichlet.xml
   [junit4]   2> 2024889 INFO  (TEST-BasicAuthIntegrationTest.testBasics-seed#[AC5FA4FC630F58DB]) [    ] o.a.s.c.c.SolrZkClient makePath: /configs/solrCloudCollectionConfig/schema-synonym-tokenizer.xml
   [junit4]   2> 2024892 INFO  (TEST-BasicAuthIntegrationTest.testBasics-seed#[AC5FA4FC630F58DB]) [    ] o.a.s.c.c.SolrZkClient makePath: /configs/solrCloudCollectionConfig/stop-2.txt
   [junit4]   2> 2024894 INFO  (TEST-BasicAuthIntegrationTest.testBasics-seed#[AC5FA4FC630F58DB]) [    ] o.a.s.c.c.SolrZkClient makePath: /configs/solrCloudCollectionConfig/schema-non-stored-docvalues.xml
   [junit4]   2> 2024902 INFO  (TEST-BasicAuthIntegrationTest.testBasics-seed#[AC5FA4FC630F58DB]) [    ] o.a.s.c.c.SolrZkClient makePath: /configs/solrCloudCollectionConfig/schema-sim-default-override.xml
   [junit4]   2> 2024905 INFO  (TEST-BasicAuthIntegrationTest.testBasics-seed#[AC5FA4FC630F58DB]) [    ] o.a.s.c.c.SolrZkClient makePath: /configs/solrCloudCollectionConfig/solrconfig-plugcollector.xml
   [junit4]   2> 2024913 INFO  (TEST-BasicAuthIntegrationTest.testBasics-seed#[AC5FA4FC630F58DB]) [    ] o.a.s.c.c.SolrZkClient makePath: /configs/solrCloudCollectionConfig/bad-schema-uniquekey-uses-default.xml
   [junit4]   2> 2024915 INFO  (TEST-BasicAuthIntegrationTest.testBasics-seed#[AC5FA4FC630F58DB]) [    ] o.a.s.c.c.SolrZkClient makePath: /configs/solrCloudCollectionConfig/bad-schema-sim-global-vs-ft-mismatch.xml
   [junit4]   2> 2024917 INFO  (TEST-BasicAuthIntegrationTest.testBasics-seed#[AC5FA4FC630F58DB]) [    ] o.a.s.c.c.SolrZkClient makePath: /configs/solrCloudCollectionConfig/solrconfig-warmer.xml
   [junit4]   2> 2024920 INFO  (TEST-BasicAuthIntegrationTest.testBasics-seed#[AC5FA4FC630F58DB]) [    ] o.a.s.c.c.SolrZkClient makePath: /configs/solrCloudCollectionConfig/schema11.xml
   [junit4]   2> 2024923 INFO  (TEST-BasicAuthIntegrationTest.testBasics-seed#[AC5FA4FC630F58DB]) [    ] o.a.s.c.c.SolrZkClient makePath: /configs/solrCloudCollectionConfig/solrconfig-tlog.xml
   [junit4]   2> 2024926 INFO  (TEST-BasicAuthIntegrationTest.testBasics-seed#[AC5FA4FC630F58DB]) [    ] o.a.s.c.c.SolrZkClient makePath: /configs/solrCloudCollectionConfig/solrconfig-withgethandler.xml
   [junit4]   2> 2024932 INFO  (TEST-BasicAuthIntegrationTest.testBasics-seed#[AC5FA4FC630F58DB]) [    ] o.a.s.c.c.SolrZkClient makePath: /configs/solrCloudCollectionConfig/schema-lmjelinekmercer.xml
   [junit4]   2> 2024934 INFO  (TEST-BasicAuthIntegrationTest.testBasics-seed#[AC5FA4FC630F58DB]) [    ] o.a.s.c.c.SolrZkClient makePath: /configs/solrCloudCollectionConfig/schema12.xml
   [junit4]   2> 2024937 INFO  (TEST-BasicAuthIntegrationTest.testBasics-seed#[AC5FA4FC630F58DB]) [    ] o.a.s.c.c.SolrZkClient makePath: /configs/solrCloudCollectionConfig/solrconfig-SOLR-749.xml
   [junit4]   2> 2024940 INFO  (TEST-BasicAuthIntegrationTest.testBasics-seed#[AC5FA4FC630F58DB]) [    ] o.a.s.c.c.SolrZkClient makePath: /configs/solrCloudCollectionConfig/bad-schema-sweetspot-partial-hyperbolic.xml
   [junit4]   2> 2024943 INFO  (TEST-BasicAuthIntegrationTest.testBasics-seed#[AC5FA4FC630F58DB]) [    ] o.a.s.c.c.SolrZkClient makePath: /configs/solrCloudCollectionConfig/solrconfig-master2.xml
   [junit4]   2> 2024946 INFO  (TEST-BasicAuthIntegrationTest.testBasics-seed#[AC5FA4FC630F58DB]) [    ] o.a.s.c.c.SolrZkClient makePath: /configs/solrCloudCollectionConfig/schema-bm25.xml
   [junit4]   2> 2024948 INFO  (TEST-BasicAuthIntegrationTest.testBasics-seed#[AC5FA4FC630F58DB]) [    ] o.a.s.c.c.SolrZkClient makePath: /configs/solrCloudCollectionConfig/open-exchange-rates.json
   [junit4]   2> 2024962 INFO  (TEST-BasicAuthIntegrationTest.testBasics-seed#[AC5FA4FC630F58DB]) [    ] o.a.s.c.c.SolrZkClient makePath: /configs/solrCloudCollectionConfig/schema-preanalyzed.xml
   [junit4]   2> 2024971 INFO  (TEST-BasicAuthIntegrationTest.testBasics-seed#[AC5FA4FC630F58DB]) [    ] o.a.s.c.c.SolrZkClient makePath: /configs/solrCloudCollectionConfig/schema-snippet-type.xml
   [junit4]   2> 2024973 INFO  (TEST-BasicAuthIntegrationTest.testBasics-seed#[AC5FA4FC630F58DB]) [    ] o.a.s.c.c.SolrZkClient makePath: /configs/solrCloudCollectionConfig/solrconfig-suggestercomponent-context-filter-query.xml
   [junit4]   2> 2024977 INFO  (TEST-BasicAuthIntegrationTest.testBasics-seed#[AC5FA4FC630F58DB]) [    ] o.a.s.c.c.SolrZkClient makePath: /configs/solrCloudCollectionConfig/schema-distrib-interval-faceting.xml
   [junit4]   2> 2024980 INFO  (TEST-BasicAuthIntegrationTest.testBasics-seed#[AC5FA4FC630F58DB]) [    ] o.a.s.c.c.SolrZkClient makePath: /configs

[...truncated too long message...]

.s.ServletContextHandler@10d37a97{/solr,null,UNAVAILABLE}
   [junit4]   2> 9242537 INFO  (TEST-BasicAuthIntegrationTest.testBasics-seed#[AC5FA4FC630F58DB]) [    ] o.a.s.c.ZkTestServer connecting to 127.0.0.1:58075 58075
   [junit4]   2> NOTE: leaving temporary files on disk at: /x1/jenkins/jenkins-slave/workspace/Lucene-Solr-Tests-5.5-Java7/solr/build/solr-core/test/J2/temp/solr.security.BasicAuthIntegrationTest_AC5FA4FC630F58DB-001
   [junit4]   2> 9242960 WARN  (jetty-launcher-2584-thread-5-SendThread(127.0.0.1:58075)) [n:127.0.0.1:50456_solr    ] o.a.z.c.StaticHostProvider Unexpected exception
   [junit4]   2> java.lang.InterruptedException: sleep interrupted
   [junit4]   2> 	at java.lang.Thread.sleep(Native Method)
   [junit4]   2> 	at org.apache.zookeeper.client.StaticHostProvider.next(StaticHostProvider.java:101)
   [junit4]   2> 	at org.apache.zookeeper.ClientCnxn$SendThread.startConnect(ClientCnxn.java:940)
   [junit4]   2> 	at org.apache.zookeeper.ClientCnxn$SendThread.run(ClientCnxn.java:1003)
   [junit4]   2> 9242960 WARN  (jetty-launcher-2584-thread-2-SendThread(127.0.0.1:58075)) [n:127.0.0.1:54054_solr    ] o.a.z.c.StaticHostProvider Unexpected exception
   [junit4]   2> java.lang.InterruptedException: sleep interrupted
   [junit4]   2> 	at java.lang.Thread.sleep(Native Method)
   [junit4]   2> 	at org.apache.zookeeper.client.StaticHostProvider.next(StaticHostProvider.java:101)
   [junit4]   2> 	at org.apache.zookeeper.ClientCnxn$SendThread.startConnect(ClientCnxn.java:940)
   [junit4]   2> 	at org.apache.zookeeper.ClientCnxn$SendThread.run(ClientCnxn.java:1003)
   [junit4]   2> 9242960 WARN  (jetty-launcher-2584-thread-3-SendThread(127.0.0.1:58075)) [n:127.0.0.1:48904_solr    ] o.a.z.c.StaticHostProvider Unexpected exception
   [junit4]   2> java.lang.InterruptedException: sleep interrupted
   [junit4]   2> 	at java.lang.Thread.sleep(Native Method)
   [junit4]   2> 	at org.apache.zookeeper.client.StaticHostProvider.next(StaticHostProvider.java:101)
   [junit4]   2> 	at org.apache.zookeeper.ClientCnxn$SendThread.startConnect(ClientCnxn.java:940)
   [junit4]   2> 	at org.apache.zookeeper.ClientCnxn$SendThread.run(ClientCnxn.java:1003)
   [junit4]   2> 9242960 WARN  (TEST-BasicAuthIntegrationTest.testBasics-seed#[AC5FA4FC630F58DB]-SendThread(127.0.0.1:58075)) [n:127.0.0.1:33588_solr    ] o.a.z.c.StaticHostProvider Unexpected exception
   [junit4]   2> java.lang.InterruptedException: sleep interrupted
   [junit4]   2> 	at java.lang.Thread.sleep(Native Method)
   [junit4]   2> 	at org.apache.zookeeper.client.StaticHostProvider.next(StaticHostProvider.java:101)
   [junit4]   2> 	at org.apache.zookeeper.ClientCnxn$SendThread.startConnect(ClientCnxn.java:940)
   [junit4]   2> 	at org.apache.zookeeper.ClientCnxn$SendThread.run(ClientCnxn.java:1003)
   [junit4]   2> Feb 17, 2016 6:33:51 PM com.carrotsearch.randomizedtesting.ThreadLeakControl tryToInterruptAll
   [junit4]   2> INFO: All leaked threads terminated.
   [junit4]   2> NOTE: test params are: codec=Asserting(Lucene54): {intDefault=PostingsFormat(name=LuceneVarGapFixedInterval), range_facet_i_dv=TestBloomFilteredLucenePostings(BloomFilteringPostingsFormat(Lucene50(blocksize=128))), _version_=PostingsFormat(name=LuceneVarGapFixedInterval), timestamp=TestBloomFilteredLucenePostings(BloomFilteringPostingsFormat(Lucene50(blocksize=128))), range_facet_l=TestBloomFilteredLucenePostings(BloomFilteringPostingsFormat(Lucene50(blocksize=128))), multiDefault=TestBloomFilteredLucenePostings(BloomFilteringPostingsFormat(Lucene50(blocksize=128))), range_facet_l_dv=FST50, id=FST50}, docValues:{range_facet_i_dv=DocValuesFormat(name=Memory), timestamp=DocValuesFormat(name=Memory), range_facet_l_dv=DocValuesFormat(name=SimpleText)}, sim=RandomSimilarity(queryNorm=false,coord=no): {}, locale=lv-LV, timezone=Asia/Irkutsk
   [junit4]   2> NOTE: Linux 3.13.0-52-generic amd64/Oracle Corporation 1.7.0_80 (64-bit)/cpus=4,threads=2,free=285140104,total=526909440
   [junit4]   2> NOTE: All tests run in this JVM: [TestReload, BitVectorTest, TestCollationField, TestUtils, TestManagedSchema, TestReplicaProperties, MultiThreadedOCPTest, TestSolrConfigHandler, TestOverriddenPrefixQueryForCustomFieldType, TestJmxIntegration, SSLMigrationTest, BadIndexSchemaTest, BasicDistributedZk2Test, TestSolrQueryParserResource, TestFastWriter, TestSearchPerf, TestJettySolrRunner, CurrencyFieldXmlFileTest, CollectionReloadTest, TestMacros, HLLSerializationTest, SolrTestCaseJ4Test, TestWriterPerf, HdfsNNFailoverTest, SuggesterTSTTest, HardAutoCommitTest, TestShortCircuitedRequests, ConnectionManagerTest, TestSchemaNameResource, RecoveryZkTest, TestSchemaVersionResource, OverseerTest, TestClusterStateMutator, SortSpecParsingTest, TestClassicSimilarityFactory, TestCryptoKeys, LeaderInitiatedRecoveryOnCommitTest, StatelessScriptUpdateProcessorFactoryTest, TestGroupingSearch, IgnoreCommitOptimizeUpdateProcessorFactoryTest, CoreAdminRequestStatusTest, BinaryUpdateRequestHandlerTest, DateRangeFieldTest, SharedFSAutoReplicaFailoverTest, TestNamedUpdateProcessors, TestStressReorder, OverseerTaskQueueTest, UnloadDistributedZkTest, TermVectorComponentDistributedTest, TestSolrQueryParser, TestExclusionRuleCollectionAccess, FieldAnalysisRequestHandlerTest, TestFuzzyAnalyzedSuggestions, TestLRUStatsCache, SpatialRPTFieldTypeTest, TestAnalyzeInfixSuggestions, TestHdfsUpdateLog, TestConfigSetsAPI, AutoCommitTest, TestFreeTextSuggestions, TestSolrJ, TestUseDocValuesAsStored2, RequestLoggingTest, TestCopyFieldCollectionResource, SecurityConfHandlerTest, SimpleFacetsTest, HighlighterConfigTest, RequestHandlersTest, TestConfigSetProperties, TestSortingResponseWriter, TestPerFieldSimilarity, BlockDirectoryTest, TestFieldSortValues, TestJsonRequest, TestSuggestSpellingConverter, DeleteStatusTest, DirectSolrConnectionTest, QueryResultKeyTest, CoreAdminHandlerTest, HdfsLockFactoryTest, PluginInfoTest, BadComponentTest, TestIndexingPerformance, TestSort, TestMinMaxOnMultiValuedField, TestDynamicFieldResource, TestManagedSchemaFieldResource, TestDistribIDF, ChaosMonkeySafeLeaderTest, CollectionsAPIDistributedZkTest, TestRandomFaceting, LeaderElectionTest, TestFaceting, TestHashPartitioner, TestSolr4Spatial, SpellCheckComponentTest, TestFiltering, DirectUpdateHandlerTest, HighlighterTest, SoftAutoCommitTest, TestTrie, SpatialFilterTest, WordBreakSolrSpellCheckerTest, TestUpdate, TestAtomicUpdateErrorCases, TestWordDelimiterFilterFactory, TestRemoteStreaming, DebugComponentTest, DisMaxRequestHandlerTest, DirectSolrSpellCheckerTest, FileBasedSpellCheckerTest, TestValueSourceCache, IndexSchemaRuntimeFieldTest, ReturnFieldsTest, TestCSVResponseWriter, TestPHPSerializedResponseWriter, SearchHandlerTest, SOLR749Test, AlternateDirectoryTest, TestQuerySenderNoQuery, SolrIndexConfigTest, TestSolrDeletionPolicy2, TestDocSet, TestPostingsSolrHighlighter, TestPhraseSuggestions, SynonymTokenizerTest, TestSweetSpotSimilarityFactory, TestIBSimilarityFactory, TestFastOutputStream, OpenExchangeRatesOrgProviderTest, TestFastLRUCache, ChaosMonkeyNothingIsSafeTest, CollectionStateFormat2Test, ConcurrentDeleteAndCreateCollectionTest, DeleteLastCustomShardedReplicaTest, DistribDocExpirationUpdateProcessorTest, LeaderFailoverAfterPartitionTest, RemoteQueryErrorTest, ReplicationFactorTest, SaslZkACLProviderTest, SolrCloudExampleTest, SolrXmlInZkTest, TestAuthenticationFramework, TestMiniSolrCloudClusterBase, TestRebalanceLeaders, TriLevelCompositeIdRoutingTest, TestConfigReload, TestSolrConfigHandlerConcurrent, DistributedFacetPivotSmallAdvancedTest, DistributedFacetPivotSmallTest, FacetPivotSmallTest, SpatialHeatmapFacetsTest, TestDistributedStatsComponentCardinality, TestReloadDeadlock, TestSearcherReuse, TestSmileRequest, TestSolr4Spatial2, TestStressUserVersions, TestTrieFacet, TestXmlQParser, TestSortByMinMaxFunction, BJQParserTest, BlockJoinFacetDistribTest, BlockJoinFacetSimpleTest, TestScoreJoinQPNoScore, TestScoreJoinQPScore, SimpleMLTQParserTest, TestPerFieldSimilarityWithDefaultOverride, TestDefaultStatsCache, TestExactStatsCache, BasicAuthIntegrationTest]
   [junit4]   2> NOTE: reproduce with: ant test  -Dtestcase=BasicAuthIntegrationTest -Dtests.seed=AC5FA4FC630F58DB -Dtests.multiplier=2 -Dtests.slow=true -Dtests.locale=lv-LV -Dtests.timezone=Asia/Irkutsk -Dtests.asserts=true -Dtests.file.encoding=US-ASCII
   [junit4] ERROR   0.00s J2 | BasicAuthIntegrationTest (suite) <<<
   [junit4]    > Throwable #1: java.lang.Exception: Suite timeout exceeded (>= 7200000 msec).
   [junit4]    > 	at __randomizedtesting.SeedInfo.seed([AC5FA4FC630F58DB]:0)
   [junit4] Completed [566/566 (1!)] on J2 in 7222.75s, 1 test, 2 errors <<< FAILURES!

[...truncated 12 lines...]
BUILD FAILED
/x1/jenkins/jenkins-slave/workspace/Lucene-Solr-Tests-5.5-Java7/build.xml:750: The following error occurred while executing this line:
/x1/jenkins/jenkins-slave/workspace/Lucene-Solr-Tests-5.5-Java7/build.xml:694: The following error occurred while executing this line:
/x1/jenkins/jenkins-slave/workspace/Lucene-Solr-Tests-5.5-Java7/build.xml:59: The following error occurred while executing this line:
/x1/jenkins/jenkins-slave/workspace/Lucene-Solr-Tests-5.5-Java7/solr/build.xml:233: The following error occurred while executing this line:
/x1/jenkins/jenkins-slave/workspace/Lucene-Solr-Tests-5.5-Java7/solr/common-build.xml:534: The following error occurred while executing this line:
/x1/jenkins/jenkins-slave/workspace/Lucene-Solr-Tests-5.5-Java7/lucene/common-build.xml:1477: The following error occurred while executing this line:
/x1/jenkins/jenkins-slave/workspace/Lucene-Solr-Tests-5.5-Java7/lucene/common-build.xml:1033: There were test failures: 566 suites (7 ignored), 2275 tests, 1 suite-level error, 1 error, 55 ignored (39 assumptions) [seed: AC5FA4FC630F58DB]

Total time: 181 minutes 14 seconds
Build step 'Invoke Ant' marked build as failure
Archiving artifacts
Recording test results
Email was triggered for: Failure - Any
Sending email for trigger: Failure - Any



Mime
View raw message