lucene-dev mailing list archives

Site index · List index
Message view « Date » · « Thread »
Top « Date » · « Thread »
From Policeman Jenkins Server <jenk...@thetaphi.de>
Subject [JENKINS] Lucene-Solr-trunk-Linux (32bit/jdk1.8.0_72) - Build # 15814 - Failure!
Date Mon, 08 Feb 2016 12:10:27 GMT
Build: http://jenkins.thetaphi.de/job/Lucene-Solr-trunk-Linux/15814/
Java: 32bit/jdk1.8.0_72 -client -XX:+UseParallelGC

3 tests failed.
FAILED:  junit.framework.TestSuite.org.apache.solr.cloud.CollectionsAPIDistributedZkTest

Error Message:
6 threads leaked from SUITE scope at org.apache.solr.cloud.CollectionsAPIDistributedZkTest:     1) Thread[id=458, name=zkCallback-68-thread-2, state=TIMED_WAITING, group=TGRP-CollectionsAPIDistributedZkTest]         at sun.misc.Unsafe.park(Native Method)         at java.util.concurrent.locks.LockSupport.parkNanos(LockSupport.java:215)         at java.util.concurrent.SynchronousQueue$TransferStack.awaitFulfill(SynchronousQueue.java:460)         at java.util.concurrent.SynchronousQueue$TransferStack.transfer(SynchronousQueue.java:362)         at java.util.concurrent.SynchronousQueue.poll(SynchronousQueue.java:941)         at java.util.concurrent.ThreadPoolExecutor.getTask(ThreadPoolExecutor.java:1066)         at java.util.concurrent.ThreadPoolExecutor.runWorker(ThreadPoolExecutor.java:1127)         at java.util.concurrent.ThreadPoolExecutor$Worker.run(ThreadPoolExecutor.java:617)         at java.lang.Thread.run(Thread.java:745)    2) Thread[id=337, name=TEST-CollectionsAPIDistributedZkTest.test-seed#[A66F97A98B2E5409]-SendThread(127.0.0.1:39471), state=TIMED_WAITING, group=TGRP-CollectionsAPIDistributedZkTest]         at java.lang.Thread.sleep(Native Method)         at org.apache.zookeeper.client.StaticHostProvider.next(StaticHostProvider.java:101)         at org.apache.zookeeper.ClientCnxn$SendThread.startConnect(ClientCnxn.java:940)         at org.apache.zookeeper.ClientCnxn$SendThread.run(ClientCnxn.java:1003)    3) Thread[id=530, name=zkCallback-68-thread-4, state=TIMED_WAITING, group=TGRP-CollectionsAPIDistributedZkTest]         at sun.misc.Unsafe.park(Native Method)         at java.util.concurrent.locks.LockSupport.parkNanos(LockSupport.java:215)         at java.util.concurrent.SynchronousQueue$TransferStack.awaitFulfill(SynchronousQueue.java:460)         at java.util.concurrent.SynchronousQueue$TransferStack.transfer(SynchronousQueue.java:362)         at java.util.concurrent.SynchronousQueue.poll(SynchronousQueue.java:941)         at java.util.concurrent.ThreadPoolExecutor.getTask(ThreadPoolExecutor.java:1066)         at java.util.concurrent.ThreadPoolExecutor.runWorker(ThreadPoolExecutor.java:1127)         at java.util.concurrent.ThreadPoolExecutor$Worker.run(ThreadPoolExecutor.java:617)         at java.lang.Thread.run(Thread.java:745)    4) Thread[id=338, name=TEST-CollectionsAPIDistributedZkTest.test-seed#[A66F97A98B2E5409]-EventThread, state=WAITING, group=TGRP-CollectionsAPIDistributedZkTest]         at sun.misc.Unsafe.park(Native Method)         at java.util.concurrent.locks.LockSupport.park(LockSupport.java:175)         at java.util.concurrent.locks.AbstractQueuedSynchronizer$ConditionObject.await(AbstractQueuedSynchronizer.java:2039)         at java.util.concurrent.LinkedBlockingQueue.take(LinkedBlockingQueue.java:442)         at org.apache.zookeeper.ClientCnxn$EventThread.run(ClientCnxn.java:494)    5) Thread[id=463, name=zkCallback-68-thread-3, state=TIMED_WAITING, group=TGRP-CollectionsAPIDistributedZkTest]         at sun.misc.Unsafe.park(Native Method)         at java.util.concurrent.locks.LockSupport.parkNanos(LockSupport.java:215)         at java.util.concurrent.SynchronousQueue$TransferStack.awaitFulfill(SynchronousQueue.java:460)         at java.util.concurrent.SynchronousQueue$TransferStack.transfer(SynchronousQueue.java:362)         at java.util.concurrent.SynchronousQueue.poll(SynchronousQueue.java:941)         at java.util.concurrent.ThreadPoolExecutor.getTask(ThreadPoolExecutor.java:1066)         at java.util.concurrent.ThreadPoolExecutor.runWorker(ThreadPoolExecutor.java:1127)         at java.util.concurrent.ThreadPoolExecutor$Worker.run(ThreadPoolExecutor.java:617)         at java.lang.Thread.run(Thread.java:745)    6) Thread[id=339, name=zkCallback-68-thread-1, state=TIMED_WAITING, group=TGRP-CollectionsAPIDistributedZkTest]         at sun.misc.Unsafe.park(Native Method)         at java.util.concurrent.locks.LockSupport.parkNanos(LockSupport.java:215)         at java.util.concurrent.SynchronousQueue$TransferStack.awaitFulfill(SynchronousQueue.java:460)         at java.util.concurrent.SynchronousQueue$TransferStack.transfer(SynchronousQueue.java:362)         at java.util.concurrent.SynchronousQueue.poll(SynchronousQueue.java:941)         at java.util.concurrent.ThreadPoolExecutor.getTask(ThreadPoolExecutor.java:1066)         at java.util.concurrent.ThreadPoolExecutor.runWorker(ThreadPoolExecutor.java:1127)         at java.util.concurrent.ThreadPoolExecutor$Worker.run(ThreadPoolExecutor.java:617)         at java.lang.Thread.run(Thread.java:745)

Stack Trace:
com.carrotsearch.randomizedtesting.ThreadLeakError: 6 threads leaked from SUITE scope at org.apache.solr.cloud.CollectionsAPIDistributedZkTest: 
   1) Thread[id=458, name=zkCallback-68-thread-2, state=TIMED_WAITING, group=TGRP-CollectionsAPIDistributedZkTest]
        at sun.misc.Unsafe.park(Native Method)
        at java.util.concurrent.locks.LockSupport.parkNanos(LockSupport.java:215)
        at java.util.concurrent.SynchronousQueue$TransferStack.awaitFulfill(SynchronousQueue.java:460)
        at java.util.concurrent.SynchronousQueue$TransferStack.transfer(SynchronousQueue.java:362)
        at java.util.concurrent.SynchronousQueue.poll(SynchronousQueue.java:941)
        at java.util.concurrent.ThreadPoolExecutor.getTask(ThreadPoolExecutor.java:1066)
        at java.util.concurrent.ThreadPoolExecutor.runWorker(ThreadPoolExecutor.java:1127)
        at java.util.concurrent.ThreadPoolExecutor$Worker.run(ThreadPoolExecutor.java:617)
        at java.lang.Thread.run(Thread.java:745)
   2) Thread[id=337, name=TEST-CollectionsAPIDistributedZkTest.test-seed#[A66F97A98B2E5409]-SendThread(127.0.0.1:39471), state=TIMED_WAITING, group=TGRP-CollectionsAPIDistributedZkTest]
        at java.lang.Thread.sleep(Native Method)
        at org.apache.zookeeper.client.StaticHostProvider.next(StaticHostProvider.java:101)
        at org.apache.zookeeper.ClientCnxn$SendThread.startConnect(ClientCnxn.java:940)
        at org.apache.zookeeper.ClientCnxn$SendThread.run(ClientCnxn.java:1003)
   3) Thread[id=530, name=zkCallback-68-thread-4, state=TIMED_WAITING, group=TGRP-CollectionsAPIDistributedZkTest]
        at sun.misc.Unsafe.park(Native Method)
        at java.util.concurrent.locks.LockSupport.parkNanos(LockSupport.java:215)
        at java.util.concurrent.SynchronousQueue$TransferStack.awaitFulfill(SynchronousQueue.java:460)
        at java.util.concurrent.SynchronousQueue$TransferStack.transfer(SynchronousQueue.java:362)
        at java.util.concurrent.SynchronousQueue.poll(SynchronousQueue.java:941)
        at java.util.concurrent.ThreadPoolExecutor.getTask(ThreadPoolExecutor.java:1066)
        at java.util.concurrent.ThreadPoolExecutor.runWorker(ThreadPoolExecutor.java:1127)
        at java.util.concurrent.ThreadPoolExecutor$Worker.run(ThreadPoolExecutor.java:617)
        at java.lang.Thread.run(Thread.java:745)
   4) Thread[id=338, name=TEST-CollectionsAPIDistributedZkTest.test-seed#[A66F97A98B2E5409]-EventThread, state=WAITING, group=TGRP-CollectionsAPIDistributedZkTest]
        at sun.misc.Unsafe.park(Native Method)
        at java.util.concurrent.locks.LockSupport.park(LockSupport.java:175)
        at java.util.concurrent.locks.AbstractQueuedSynchronizer$ConditionObject.await(AbstractQueuedSynchronizer.java:2039)
        at java.util.concurrent.LinkedBlockingQueue.take(LinkedBlockingQueue.java:442)
        at org.apache.zookeeper.ClientCnxn$EventThread.run(ClientCnxn.java:494)
   5) Thread[id=463, name=zkCallback-68-thread-3, state=TIMED_WAITING, group=TGRP-CollectionsAPIDistributedZkTest]
        at sun.misc.Unsafe.park(Native Method)
        at java.util.concurrent.locks.LockSupport.parkNanos(LockSupport.java:215)
        at java.util.concurrent.SynchronousQueue$TransferStack.awaitFulfill(SynchronousQueue.java:460)
        at java.util.concurrent.SynchronousQueue$TransferStack.transfer(SynchronousQueue.java:362)
        at java.util.concurrent.SynchronousQueue.poll(SynchronousQueue.java:941)
        at java.util.concurrent.ThreadPoolExecutor.getTask(ThreadPoolExecutor.java:1066)
        at java.util.concurrent.ThreadPoolExecutor.runWorker(ThreadPoolExecutor.java:1127)
        at java.util.concurrent.ThreadPoolExecutor$Worker.run(ThreadPoolExecutor.java:617)
        at java.lang.Thread.run(Thread.java:745)
   6) Thread[id=339, name=zkCallback-68-thread-1, state=TIMED_WAITING, group=TGRP-CollectionsAPIDistributedZkTest]
        at sun.misc.Unsafe.park(Native Method)
        at java.util.concurrent.locks.LockSupport.parkNanos(LockSupport.java:215)
        at java.util.concurrent.SynchronousQueue$TransferStack.awaitFulfill(SynchronousQueue.java:460)
        at java.util.concurrent.SynchronousQueue$TransferStack.transfer(SynchronousQueue.java:362)
        at java.util.concurrent.SynchronousQueue.poll(SynchronousQueue.java:941)
        at java.util.concurrent.ThreadPoolExecutor.getTask(ThreadPoolExecutor.java:1066)
        at java.util.concurrent.ThreadPoolExecutor.runWorker(ThreadPoolExecutor.java:1127)
        at java.util.concurrent.ThreadPoolExecutor$Worker.run(ThreadPoolExecutor.java:617)
        at java.lang.Thread.run(Thread.java:745)
	at __randomizedtesting.SeedInfo.seed([A66F97A98B2E5409]:0)


FAILED:  junit.framework.TestSuite.org.apache.solr.cloud.CollectionsAPIDistributedZkTest

Error Message:
There are still zombie threads that couldn't be terminated:    1) Thread[id=458, name=zkCallback-68-thread-2, state=TIMED_WAITING, group=TGRP-CollectionsAPIDistributedZkTest]         at sun.misc.Unsafe.park(Native Method)         at java.util.concurrent.locks.LockSupport.parkNanos(LockSupport.java:215)         at java.util.concurrent.SynchronousQueue$TransferStack.awaitFulfill(SynchronousQueue.java:460)         at java.util.concurrent.SynchronousQueue$TransferStack.transfer(SynchronousQueue.java:362)         at java.util.concurrent.SynchronousQueue.poll(SynchronousQueue.java:941)         at java.util.concurrent.ThreadPoolExecutor.getTask(ThreadPoolExecutor.java:1066)         at java.util.concurrent.ThreadPoolExecutor.runWorker(ThreadPoolExecutor.java:1127)         at java.util.concurrent.ThreadPoolExecutor$Worker.run(ThreadPoolExecutor.java:617)         at java.lang.Thread.run(Thread.java:745)    2) Thread[id=337, name=TEST-CollectionsAPIDistributedZkTest.test-seed#[A66F97A98B2E5409]-SendThread(127.0.0.1:39471), state=TIMED_WAITING, group=TGRP-CollectionsAPIDistributedZkTest]         at java.lang.Thread.sleep(Native Method)         at org.apache.zookeeper.client.StaticHostProvider.next(StaticHostProvider.java:101)         at org.apache.zookeeper.ClientCnxn$SendThread.startConnect(ClientCnxn.java:940)         at org.apache.zookeeper.ClientCnxn$SendThread.run(ClientCnxn.java:1003)    3) Thread[id=530, name=zkCallback-68-thread-4, state=TIMED_WAITING, group=TGRP-CollectionsAPIDistributedZkTest]         at sun.misc.Unsafe.park(Native Method)         at java.util.concurrent.locks.LockSupport.parkNanos(LockSupport.java:215)         at java.util.concurrent.SynchronousQueue$TransferStack.awaitFulfill(SynchronousQueue.java:460)         at java.util.concurrent.SynchronousQueue$TransferStack.transfer(SynchronousQueue.java:362)         at java.util.concurrent.SynchronousQueue.poll(SynchronousQueue.java:941)         at java.util.concurrent.ThreadPoolExecutor.getTask(ThreadPoolExecutor.java:1066)         at java.util.concurrent.ThreadPoolExecutor.runWorker(ThreadPoolExecutor.java:1127)         at java.util.concurrent.ThreadPoolExecutor$Worker.run(ThreadPoolExecutor.java:617)         at java.lang.Thread.run(Thread.java:745)    4) Thread[id=463, name=zkCallback-68-thread-3, state=TIMED_WAITING, group=TGRP-CollectionsAPIDistributedZkTest]         at sun.misc.Unsafe.park(Native Method)         at java.util.concurrent.locks.LockSupport.parkNanos(LockSupport.java:215)         at java.util.concurrent.SynchronousQueue$TransferStack.awaitFulfill(SynchronousQueue.java:460)         at java.util.concurrent.SynchronousQueue$TransferStack.transfer(SynchronousQueue.java:362)         at java.util.concurrent.SynchronousQueue.poll(SynchronousQueue.java:941)         at java.util.concurrent.ThreadPoolExecutor.getTask(ThreadPoolExecutor.java:1066)         at java.util.concurrent.ThreadPoolExecutor.runWorker(ThreadPoolExecutor.java:1127)         at java.util.concurrent.ThreadPoolExecutor$Worker.run(ThreadPoolExecutor.java:617)         at java.lang.Thread.run(Thread.java:745)    5) Thread[id=339, name=zkCallback-68-thread-1, state=TIMED_WAITING, group=TGRP-CollectionsAPIDistributedZkTest]         at sun.misc.Unsafe.park(Native Method)         at java.util.concurrent.locks.LockSupport.parkNanos(LockSupport.java:215)         at java.util.concurrent.SynchronousQueue$TransferStack.awaitFulfill(SynchronousQueue.java:460)         at java.util.concurrent.SynchronousQueue$TransferStack.transfer(SynchronousQueue.java:362)         at java.util.concurrent.SynchronousQueue.poll(SynchronousQueue.java:941)         at java.util.concurrent.ThreadPoolExecutor.getTask(ThreadPoolExecutor.java:1066)         at java.util.concurrent.ThreadPoolExecutor.runWorker(ThreadPoolExecutor.java:1127)         at java.util.concurrent.ThreadPoolExecutor$Worker.run(ThreadPoolExecutor.java:617)         at java.lang.Thread.run(Thread.java:745)

Stack Trace:
com.carrotsearch.randomizedtesting.ThreadLeakError: There are still zombie threads that couldn't be terminated:
   1) Thread[id=458, name=zkCallback-68-thread-2, state=TIMED_WAITING, group=TGRP-CollectionsAPIDistributedZkTest]
        at sun.misc.Unsafe.park(Native Method)
        at java.util.concurrent.locks.LockSupport.parkNanos(LockSupport.java:215)
        at java.util.concurrent.SynchronousQueue$TransferStack.awaitFulfill(SynchronousQueue.java:460)
        at java.util.concurrent.SynchronousQueue$TransferStack.transfer(SynchronousQueue.java:362)
        at java.util.concurrent.SynchronousQueue.poll(SynchronousQueue.java:941)
        at java.util.concurrent.ThreadPoolExecutor.getTask(ThreadPoolExecutor.java:1066)
        at java.util.concurrent.ThreadPoolExecutor.runWorker(ThreadPoolExecutor.java:1127)
        at java.util.concurrent.ThreadPoolExecutor$Worker.run(ThreadPoolExecutor.java:617)
        at java.lang.Thread.run(Thread.java:745)
   2) Thread[id=337, name=TEST-CollectionsAPIDistributedZkTest.test-seed#[A66F97A98B2E5409]-SendThread(127.0.0.1:39471), state=TIMED_WAITING, group=TGRP-CollectionsAPIDistributedZkTest]
        at java.lang.Thread.sleep(Native Method)
        at org.apache.zookeeper.client.StaticHostProvider.next(StaticHostProvider.java:101)
        at org.apache.zookeeper.ClientCnxn$SendThread.startConnect(ClientCnxn.java:940)
        at org.apache.zookeeper.ClientCnxn$SendThread.run(ClientCnxn.java:1003)
   3) Thread[id=530, name=zkCallback-68-thread-4, state=TIMED_WAITING, group=TGRP-CollectionsAPIDistributedZkTest]
        at sun.misc.Unsafe.park(Native Method)
        at java.util.concurrent.locks.LockSupport.parkNanos(LockSupport.java:215)
        at java.util.concurrent.SynchronousQueue$TransferStack.awaitFulfill(SynchronousQueue.java:460)
        at java.util.concurrent.SynchronousQueue$TransferStack.transfer(SynchronousQueue.java:362)
        at java.util.concurrent.SynchronousQueue.poll(SynchronousQueue.java:941)
        at java.util.concurrent.ThreadPoolExecutor.getTask(ThreadPoolExecutor.java:1066)
        at java.util.concurrent.ThreadPoolExecutor.runWorker(ThreadPoolExecutor.java:1127)
        at java.util.concurrent.ThreadPoolExecutor$Worker.run(ThreadPoolExecutor.java:617)
        at java.lang.Thread.run(Thread.java:745)
   4) Thread[id=463, name=zkCallback-68-thread-3, state=TIMED_WAITING, group=TGRP-CollectionsAPIDistributedZkTest]
        at sun.misc.Unsafe.park(Native Method)
        at java.util.concurrent.locks.LockSupport.parkNanos(LockSupport.java:215)
        at java.util.concurrent.SynchronousQueue$TransferStack.awaitFulfill(SynchronousQueue.java:460)
        at java.util.concurrent.SynchronousQueue$TransferStack.transfer(SynchronousQueue.java:362)
        at java.util.concurrent.SynchronousQueue.poll(SynchronousQueue.java:941)
        at java.util.concurrent.ThreadPoolExecutor.getTask(ThreadPoolExecutor.java:1066)
        at java.util.concurrent.ThreadPoolExecutor.runWorker(ThreadPoolExecutor.java:1127)
        at java.util.concurrent.ThreadPoolExecutor$Worker.run(ThreadPoolExecutor.java:617)
        at java.lang.Thread.run(Thread.java:745)
   5) Thread[id=339, name=zkCallback-68-thread-1, state=TIMED_WAITING, group=TGRP-CollectionsAPIDistributedZkTest]
        at sun.misc.Unsafe.park(Native Method)
        at java.util.concurrent.locks.LockSupport.parkNanos(LockSupport.java:215)
        at java.util.concurrent.SynchronousQueue$TransferStack.awaitFulfill(SynchronousQueue.java:460)
        at java.util.concurrent.SynchronousQueue$TransferStack.transfer(SynchronousQueue.java:362)
        at java.util.concurrent.SynchronousQueue.poll(SynchronousQueue.java:941)
        at java.util.concurrent.ThreadPoolExecutor.getTask(ThreadPoolExecutor.java:1066)
        at java.util.concurrent.ThreadPoolExecutor.runWorker(ThreadPoolExecutor.java:1127)
        at java.util.concurrent.ThreadPoolExecutor$Worker.run(ThreadPoolExecutor.java:617)
        at java.lang.Thread.run(Thread.java:745)
	at __randomizedtesting.SeedInfo.seed([A66F97A98B2E5409]:0)


FAILED:  org.apache.solr.cloud.CollectionsAPIDistributedZkTest.test

Error Message:
Error from server at http://127.0.0.1:51975: Error handling 'status' action 

Stack Trace:
org.apache.solr.client.solrj.impl.HttpSolrClient$RemoteSolrException: Error from server at http://127.0.0.1:51975: Error handling 'status' action 
	at __randomizedtesting.SeedInfo.seed([A66F97A98B2E5409:2E3BA87325D239F1]:0)
	at org.apache.solr.client.solrj.impl.HttpSolrClient.executeMethod(HttpSolrClient.java:576)
	at org.apache.solr.client.solrj.impl.HttpSolrClient.request(HttpSolrClient.java:240)
	at org.apache.solr.client.solrj.impl.HttpSolrClient.request(HttpSolrClient.java:229)
	at org.apache.solr.client.solrj.SolrRequest.process(SolrRequest.java:149)
	at org.apache.solr.client.solrj.SolrRequest.process(SolrRequest.java:166)
	at org.apache.solr.client.solrj.request.CoreAdminRequest.getStatus(CoreAdminRequest.java:552)
	at org.apache.solr.cloud.CollectionsAPIDistributedZkTest.collectStartTimes(CollectionsAPIDistributedZkTest.java:981)
	at org.apache.solr.cloud.CollectionsAPIDistributedZkTest.waitForReloads(CollectionsAPIDistributedZkTest.java:940)
	at org.apache.solr.cloud.CollectionsAPIDistributedZkTest.testCollectionsAPI(CollectionsAPIDistributedZkTest.java:747)
	at org.apache.solr.cloud.CollectionsAPIDistributedZkTest.test(CollectionsAPIDistributedZkTest.java:159)
	at sun.reflect.NativeMethodAccessorImpl.invoke0(Native Method)
	at sun.reflect.NativeMethodAccessorImpl.invoke(NativeMethodAccessorImpl.java:62)
	at sun.reflect.DelegatingMethodAccessorImpl.invoke(DelegatingMethodAccessorImpl.java:43)
	at java.lang.reflect.Method.invoke(Method.java:498)
	at com.carrotsearch.randomizedtesting.RandomizedRunner.invoke(RandomizedRunner.java:1764)
	at com.carrotsearch.randomizedtesting.RandomizedRunner$8.evaluate(RandomizedRunner.java:871)
	at com.carrotsearch.randomizedtesting.RandomizedRunner$9.evaluate(RandomizedRunner.java:907)
	at com.carrotsearch.randomizedtesting.RandomizedRunner$10.evaluate(RandomizedRunner.java:921)
	at org.apache.solr.BaseDistributedSearchTestCase$ShardsRepeatRule$ShardsFixedStatement.callStatement(BaseDistributedSearchTestCase.java:964)
	at org.apache.solr.BaseDistributedSearchTestCase$ShardsRepeatRule$ShardsStatement.evaluate(BaseDistributedSearchTestCase.java:939)
	at com.carrotsearch.randomizedtesting.rules.SystemPropertiesRestoreRule$1.evaluate(SystemPropertiesRestoreRule.java:57)
	at org.apache.lucene.util.TestRuleSetupTeardownChained$1.evaluate(TestRuleSetupTeardownChained.java:49)
	at org.apache.lucene.util.AbstractBeforeAfterRule$1.evaluate(AbstractBeforeAfterRule.java:45)
	at org.apache.lucene.util.TestRuleThreadAndTestName$1.evaluate(TestRuleThreadAndTestName.java:48)
	at org.apache.lucene.util.TestRuleIgnoreAfterMaxFailures$1.evaluate(TestRuleIgnoreAfterMaxFailures.java:64)
	at org.apache.lucene.util.TestRuleMarkFailure$1.evaluate(TestRuleMarkFailure.java:47)
	at com.carrotsearch.randomizedtesting.rules.StatementAdapter.evaluate(StatementAdapter.java:36)
	at com.carrotsearch.randomizedtesting.ThreadLeakControl$StatementRunner.run(ThreadLeakControl.java:367)
	at com.carrotsearch.randomizedtesting.ThreadLeakControl.forkTimeoutingTask(ThreadLeakControl.java:809)
	at com.carrotsearch.randomizedtesting.ThreadLeakControl$3.evaluate(ThreadLeakControl.java:460)
	at com.carrotsearch.randomizedtesting.RandomizedRunner.runSingleTest(RandomizedRunner.java:880)
	at com.carrotsearch.randomizedtesting.RandomizedRunner$5.evaluate(RandomizedRunner.java:781)
	at com.carrotsearch.randomizedtesting.RandomizedRunner$6.evaluate(RandomizedRunner.java:816)
	at com.carrotsearch.randomizedtesting.RandomizedRunner$7.evaluate(RandomizedRunner.java:827)
	at com.carrotsearch.randomizedtesting.rules.StatementAdapter.evaluate(StatementAdapter.java:36)
	at com.carrotsearch.randomizedtesting.rules.SystemPropertiesRestoreRule$1.evaluate(SystemPropertiesRestoreRule.java:57)
	at org.apache.lucene.util.AbstractBeforeAfterRule$1.evaluate(AbstractBeforeAfterRule.java:45)
	at com.carrotsearch.randomizedtesting.rules.StatementAdapter.evaluate(StatementAdapter.java:36)
	at org.apache.lucene.util.TestRuleStoreClassName$1.evaluate(TestRuleStoreClassName.java:41)
	at com.carrotsearch.randomizedtesting.rules.NoShadowingOrOverridesOnMethodsRule$1.evaluate(NoShadowingOrOverridesOnMethodsRule.java:40)
	at com.carrotsearch.randomizedtesting.rules.NoShadowingOrOverridesOnMethodsRule$1.evaluate(NoShadowingOrOverridesOnMethodsRule.java:40)
	at com.carrotsearch.randomizedtesting.rules.StatementAdapter.evaluate(StatementAdapter.java:36)
	at com.carrotsearch.randomizedtesting.rules.StatementAdapter.evaluate(StatementAdapter.java:36)
	at com.carrotsearch.randomizedtesting.rules.StatementAdapter.evaluate(StatementAdapter.java:36)
	at org.apache.lucene.util.TestRuleAssertionsRequired$1.evaluate(TestRuleAssertionsRequired.java:53)
	at org.apache.lucene.util.TestRuleMarkFailure$1.evaluate(TestRuleMarkFailure.java:47)
	at org.apache.lucene.util.TestRuleIgnoreAfterMaxFailures$1.evaluate(TestRuleIgnoreAfterMaxFailures.java:64)
	at org.apache.lucene.util.TestRuleIgnoreTestSuites$1.evaluate(TestRuleIgnoreTestSuites.java:54)
	at com.carrotsearch.randomizedtesting.rules.StatementAdapter.evaluate(StatementAdapter.java:36)
	at com.carrotsearch.randomizedtesting.ThreadLeakControl$StatementRunner.run(ThreadLeakControl.java:367)
	at java.lang.Thread.run(Thread.java:745)




Build Log:
[...truncated 10404 lines...]
   [junit4] Suite: org.apache.solr.cloud.CollectionsAPIDistributedZkTest
   [junit4]   2> Creating dataDir: /home/jenkins/workspace/Lucene-Solr-trunk-Linux/solr/build/solr-core/test/J1/temp/solr.cloud.CollectionsAPIDistributedZkTest_A66F97A98B2E5409-001/init-core-data-001
   [junit4]   2> 15274 INFO  (SUITE-CollectionsAPIDistributedZkTest-seed#[A66F97A98B2E5409]-worker) [    ] o.a.s.SolrTestCaseJ4 Randomized ssl (false) and clientAuth (false)
   [junit4]   2> 15274 INFO  (SUITE-CollectionsAPIDistributedZkTest-seed#[A66F97A98B2E5409]-worker) [    ] o.a.s.BaseDistributedSearchTestCase Setting hostContext system property: /
   [junit4]   2> 15278 INFO  (TEST-CollectionsAPIDistributedZkTest.test-seed#[A66F97A98B2E5409]) [    ] o.a.s.c.ZkTestServer STARTING ZK TEST SERVER
   [junit4]   2> 15278 INFO  (Thread-27) [    ] o.a.s.c.ZkTestServer client port:0.0.0.0/0.0.0.0:0
   [junit4]   2> 15279 INFO  (Thread-27) [    ] o.a.s.c.ZkTestServer Starting server
   [junit4]   2> 15379 INFO  (TEST-CollectionsAPIDistributedZkTest.test-seed#[A66F97A98B2E5409]) [    ] o.a.s.c.ZkTestServer start zk server on port:39471
   [junit4]   2> 15379 INFO  (TEST-CollectionsAPIDistributedZkTest.test-seed#[A66F97A98B2E5409]) [    ] o.a.s.c.c.SolrZkClient Using default ZkCredentialsProvider
   [junit4]   2> 15379 INFO  (TEST-CollectionsAPIDistributedZkTest.test-seed#[A66F97A98B2E5409]) [    ] o.a.s.c.c.ConnectionManager Waiting for client to connect to ZooKeeper
   [junit4]   2> 15381 INFO  (zkCallback-32-thread-1) [    ] o.a.s.c.c.ConnectionManager Watcher org.apache.solr.common.cloud.ConnectionManager@1181da5 name:ZooKeeperConnection Watcher:127.0.0.1:39471 got event WatchedEvent state:SyncConnected type:None path:null path:null type:None
   [junit4]   2> 15381 INFO  (TEST-CollectionsAPIDistributedZkTest.test-seed#[A66F97A98B2E5409]) [    ] o.a.s.c.c.ConnectionManager Client is connected to ZooKeeper
   [junit4]   2> 15381 INFO  (TEST-CollectionsAPIDistributedZkTest.test-seed#[A66F97A98B2E5409]) [    ] o.a.s.c.c.SolrZkClient Using default ZkACLProvider
   [junit4]   2> 15382 INFO  (TEST-CollectionsAPIDistributedZkTest.test-seed#[A66F97A98B2E5409]) [    ] o.a.s.c.c.SolrZkClient makePath: /solr
   [junit4]   2> 15384 INFO  (TEST-CollectionsAPIDistributedZkTest.test-seed#[A66F97A98B2E5409]) [    ] o.a.s.c.c.SolrZkClient Using default ZkCredentialsProvider
   [junit4]   2> 15384 INFO  (TEST-CollectionsAPIDistributedZkTest.test-seed#[A66F97A98B2E5409]) [    ] o.a.s.c.c.ConnectionManager Waiting for client to connect to ZooKeeper
   [junit4]   2> 15385 INFO  (zkCallback-33-thread-1) [    ] o.a.s.c.c.ConnectionManager Watcher org.apache.solr.common.cloud.ConnectionManager@7ae9cf name:ZooKeeperConnection Watcher:127.0.0.1:39471/solr got event WatchedEvent state:SyncConnected type:None path:null path:null type:None
   [junit4]   2> 15385 INFO  (TEST-CollectionsAPIDistributedZkTest.test-seed#[A66F97A98B2E5409]) [    ] o.a.s.c.c.ConnectionManager Client is connected to ZooKeeper
   [junit4]   2> 15385 INFO  (TEST-CollectionsAPIDistributedZkTest.test-seed#[A66F97A98B2E5409]) [    ] o.a.s.c.c.SolrZkClient Using default ZkACLProvider
   [junit4]   2> 15386 INFO  (TEST-CollectionsAPIDistributedZkTest.test-seed#[A66F97A98B2E5409]) [    ] o.a.s.c.c.SolrZkClient makePath: /collections/collection1
   [junit4]   2> 15388 INFO  (TEST-CollectionsAPIDistributedZkTest.test-seed#[A66F97A98B2E5409]) [    ] o.a.s.c.c.SolrZkClient makePath: /collections/collection1/shards
   [junit4]   2> 15389 INFO  (TEST-CollectionsAPIDistributedZkTest.test-seed#[A66F97A98B2E5409]) [    ] o.a.s.c.c.SolrZkClient makePath: /collections/control_collection
   [junit4]   2> 15391 INFO  (TEST-CollectionsAPIDistributedZkTest.test-seed#[A66F97A98B2E5409]) [    ] o.a.s.c.c.SolrZkClient makePath: /collections/control_collection/shards
   [junit4]   2> 15392 INFO  (TEST-CollectionsAPIDistributedZkTest.test-seed#[A66F97A98B2E5409]) [    ] o.a.s.c.AbstractZkTestCase put /home/jenkins/workspace/Lucene-Solr-trunk-Linux/solr/core/src/test-files/solr/collection1/conf/solrconfig-tlog.xml to /configs/conf1/solrconfig.xml
   [junit4]   2> 15399 INFO  (TEST-CollectionsAPIDistributedZkTest.test-seed#[A66F97A98B2E5409]) [    ] o.a.s.c.c.SolrZkClient makePath: /configs/conf1/solrconfig.xml
   [junit4]   2> 15402 INFO  (TEST-CollectionsAPIDistributedZkTest.test-seed#[A66F97A98B2E5409]) [    ] o.a.s.c.AbstractZkTestCase put /home/jenkins/workspace/Lucene-Solr-trunk-Linux/solr/core/src/test-files/solr/collection1/conf/schema.xml to /configs/conf1/schema.xml
   [junit4]   2> 15402 INFO  (TEST-CollectionsAPIDistributedZkTest.test-seed#[A66F97A98B2E5409]) [    ] o.a.s.c.c.SolrZkClient makePath: /configs/conf1/schema.xml
   [junit4]   2> 15404 INFO  (TEST-CollectionsAPIDistributedZkTest.test-seed#[A66F97A98B2E5409]) [    ] o.a.s.c.AbstractZkTestCase put /home/jenkins/workspace/Lucene-Solr-trunk-Linux/solr/core/src/test-files/solr/collection1/conf/solrconfig.snippet.randomindexconfig.xml to /configs/conf1/solrconfig.snippet.randomindexconfig.xml
   [junit4]   2> 15404 INFO  (TEST-CollectionsAPIDistributedZkTest.test-seed#[A66F97A98B2E5409]) [    ] o.a.s.c.c.SolrZkClient makePath: /configs/conf1/solrconfig.snippet.randomindexconfig.xml
   [junit4]   2> 15406 INFO  (TEST-CollectionsAPIDistributedZkTest.test-seed#[A66F97A98B2E5409]) [    ] o.a.s.c.AbstractZkTestCase put /home/jenkins/workspace/Lucene-Solr-trunk-Linux/solr/core/src/test-files/solr/collection1/conf/stopwords.txt to /configs/conf1/stopwords.txt
   [junit4]   2> 15406 INFO  (TEST-CollectionsAPIDistributedZkTest.test-seed#[A66F97A98B2E5409]) [    ] o.a.s.c.c.SolrZkClient makePath: /configs/conf1/stopwords.txt
   [junit4]   2> 15407 INFO  (TEST-CollectionsAPIDistributedZkTest.test-seed#[A66F97A98B2E5409]) [    ] o.a.s.c.AbstractZkTestCase put /home/jenkins/workspace/Lucene-Solr-trunk-Linux/solr/core/src/test-files/solr/collection1/conf/protwords.txt to /configs/conf1/protwords.txt
   [junit4]   2> 15407 INFO  (TEST-CollectionsAPIDistributedZkTest.test-seed#[A66F97A98B2E5409]) [    ] o.a.s.c.c.SolrZkClient makePath: /configs/conf1/protwords.txt
   [junit4]   2> 15409 INFO  (TEST-CollectionsAPIDistributedZkTest.test-seed#[A66F97A98B2E5409]) [    ] o.a.s.c.AbstractZkTestCase put /home/jenkins/workspace/Lucene-Solr-trunk-Linux/solr/core/src/test-files/solr/collection1/conf/currency.xml to /configs/conf1/currency.xml
   [junit4]   2> 15409 INFO  (TEST-CollectionsAPIDistributedZkTest.test-seed#[A66F97A98B2E5409]) [    ] o.a.s.c.c.SolrZkClient makePath: /configs/conf1/currency.xml
   [junit4]   2> 15411 INFO  (TEST-CollectionsAPIDistributedZkTest.test-seed#[A66F97A98B2E5409]) [    ] o.a.s.c.AbstractZkTestCase put /home/jenkins/workspace/Lucene-Solr-trunk-Linux/solr/core/src/test-files/solr/collection1/conf/enumsConfig.xml to /configs/conf1/enumsConfig.xml
   [junit4]   2> 15411 INFO  (TEST-CollectionsAPIDistributedZkTest.test-seed#[A66F97A98B2E5409]) [    ] o.a.s.c.c.SolrZkClient makePath: /configs/conf1/enumsConfig.xml
   [junit4]   2> 15412 INFO  (TEST-CollectionsAPIDistributedZkTest.test-seed#[A66F97A98B2E5409]) [    ] o.a.s.c.AbstractZkTestCase put /home/jenkins/workspace/Lucene-Solr-trunk-Linux/solr/core/src/test-files/solr/collection1/conf/open-exchange-rates.json to /configs/conf1/open-exchange-rates.json
   [junit4]   2> 15413 INFO  (TEST-CollectionsAPIDistributedZkTest.test-seed#[A66F97A98B2E5409]) [    ] o.a.s.c.c.SolrZkClient makePath: /configs/conf1/open-exchange-rates.json
   [junit4]   2> 15414 INFO  (TEST-CollectionsAPIDistributedZkTest.test-seed#[A66F97A98B2E5409]) [    ] o.a.s.c.AbstractZkTestCase put /home/jenkins/workspace/Lucene-Solr-trunk-Linux/solr/core/src/test-files/solr/collection1/conf/mapping-ISOLatin1Accent.txt to /configs/conf1/mapping-ISOLatin1Accent.txt
   [junit4]   2> 15414 INFO  (TEST-CollectionsAPIDistributedZkTest.test-seed#[A66F97A98B2E5409]) [    ] o.a.s.c.c.SolrZkClient makePath: /configs/conf1/mapping-ISOLatin1Accent.txt
   [junit4]   2> 15416 INFO  (TEST-CollectionsAPIDistributedZkTest.test-seed#[A66F97A98B2E5409]) [    ] o.a.s.c.AbstractZkTestCase put /home/jenkins/workspace/Lucene-Solr-trunk-Linux/solr/core/src/test-files/solr/collection1/conf/old_synonyms.txt to /configs/conf1/old_synonyms.txt
   [junit4]   2> 15416 INFO  (TEST-CollectionsAPIDistributedZkTest.test-seed#[A66F97A98B2E5409]) [    ] o.a.s.c.c.SolrZkClient makePath: /configs/conf1/old_synonyms.txt
   [junit4]   2> 15417 INFO  (TEST-CollectionsAPIDistributedZkTest.test-seed#[A66F97A98B2E5409]) [    ] o.a.s.c.AbstractZkTestCase put /home/jenkins/workspace/Lucene-Solr-trunk-Linux/solr/core/src/test-files/solr/collection1/conf/synonyms.txt to /configs/conf1/synonyms.txt
   [junit4]   2> 15417 INFO  (TEST-CollectionsAPIDistributedZkTest.test-seed#[A66F97A98B2E5409]) [    ] o.a.s.c.c.SolrZkClient makePath: /configs/conf1/synonyms.txt
   [junit4]   2> 15491 INFO  (TEST-CollectionsAPIDistributedZkTest.test-seed#[A66F97A98B2E5409]) [    ] o.a.s.SolrTestCaseJ4 Writing core.properties file to /home/jenkins/workspace/Lucene-Solr-trunk-Linux/solr/build/solr-core/test/J1/temp/solr.cloud.CollectionsAPIDistributedZkTest_A66F97A98B2E5409-001/control-001/cores/collection1
   [junit4]   2> 15514 INFO  (TEST-CollectionsAPIDistributedZkTest.test-seed#[A66F97A98B2E5409]) [    ] o.e.j.u.log Logging initialized @16740ms
   [junit4]   2> 15633 INFO  (TEST-CollectionsAPIDistributedZkTest.test-seed#[A66F97A98B2E5409]) [    ] o.e.j.s.Server jetty-9.2.13.v20150730
   [junit4]   2> 15680 INFO  (TEST-CollectionsAPIDistributedZkTest.test-seed#[A66F97A98B2E5409]) [    ] o.e.j.s.h.ContextHandler Started o.e.j.s.ServletContextHandler@2b1949{/,null,AVAILABLE}
   [junit4]   2> 15689 INFO  (TEST-CollectionsAPIDistributedZkTest.test-seed#[A66F97A98B2E5409]) [    ] o.e.j.s.ServerConnector Started ServerConnector@fec9e4{HTTP/1.1}{127.0.0.1:44144}
   [junit4]   2> 15690 INFO  (TEST-CollectionsAPIDistributedZkTest.test-seed#[A66F97A98B2E5409]) [    ] o.e.j.s.Server Started @16916ms
   [junit4]   2> 15690 INFO  (TEST-CollectionsAPIDistributedZkTest.test-seed#[A66F97A98B2E5409]) [    ] o.a.s.c.s.e.JettySolrRunner Jetty properties: {solr.data.dir=/home/jenkins/workspace/Lucene-Solr-trunk-Linux/solr/build/solr-core/test/J1/temp/solr.cloud.CollectionsAPIDistributedZkTest_A66F97A98B2E5409-001/tempDir-001/control/data, hostContext=/, hostPort=44144, coreRootDirectory=/home/jenkins/workspace/Lucene-Solr-trunk-Linux/solr/build/solr-core/test/J1/../../../../../../../../../home/jenkins/workspace/Lucene-Solr-trunk-Linux/solr/build/solr-core/test/J1/temp/solr.cloud.CollectionsAPIDistributedZkTest_A66F97A98B2E5409-001/control-001/cores}
   [junit4]   2> 15695 INFO  (TEST-CollectionsAPIDistributedZkTest.test-seed#[A66F97A98B2E5409]) [    ] o.a.s.s.SolrDispatchFilter SolrDispatchFilter.init(): sun.misc.Launcher$AppClassLoader@1d16e93
   [junit4]   2> 15695 INFO  (TEST-CollectionsAPIDistributedZkTest.test-seed#[A66F97A98B2E5409]) [    ] o.a.s.c.SolrResourceLoader new SolrResourceLoader for directory: '/home/jenkins/workspace/Lucene-Solr-trunk-Linux/solr/build/solr-core/test/J1/temp/solr.cloud.CollectionsAPIDistributedZkTest_A66F97A98B2E5409-001/control-001'
   [junit4]   2> 15695 INFO  (TEST-CollectionsAPIDistributedZkTest.test-seed#[A66F97A98B2E5409]) [    ] o.a.s.c.SolrResourceLoader JNDI not configured for solr (NoInitialContextEx)
   [junit4]   2> 15695 INFO  (TEST-CollectionsAPIDistributedZkTest.test-seed#[A66F97A98B2E5409]) [    ] o.a.s.c.SolrResourceLoader solr home defaulted to 'solr/' (could not find system property or JNDI)
   [junit4]   2> 15696 INFO  (TEST-CollectionsAPIDistributedZkTest.test-seed#[A66F97A98B2E5409]) [    ] o.a.s.c.c.SolrZkClient Using default ZkCredentialsProvider
   [junit4]   2> 15696 INFO  (TEST-CollectionsAPIDistributedZkTest.test-seed#[A66F97A98B2E5409]) [    ] o.a.s.c.c.ConnectionManager Waiting for client to connect to ZooKeeper
   [junit4]   2> 15699 INFO  (zkCallback-34-thread-1) [    ] o.a.s.c.c.ConnectionManager Watcher org.apache.solr.common.cloud.ConnectionManager@15063e8 name:ZooKeeperConnection Watcher:127.0.0.1:39471/solr got event WatchedEvent state:SyncConnected type:None path:null path:null type:None
   [junit4]   2> 15699 INFO  (TEST-CollectionsAPIDistributedZkTest.test-seed#[A66F97A98B2E5409]) [    ] o.a.s.c.c.ConnectionManager Client is connected to ZooKeeper
   [junit4]   2> 15699 INFO  (TEST-CollectionsAPIDistributedZkTest.test-seed#[A66F97A98B2E5409]) [    ] o.a.s.c.c.SolrZkClient Using default ZkACLProvider
   [junit4]   2> 15701 INFO  (TEST-CollectionsAPIDistributedZkTest.test-seed#[A66F97A98B2E5409]) [    ] o.a.s.s.SolrDispatchFilter Loading solr.xml from SolrHome (not found in ZooKeeper)
   [junit4]   2> 15703 INFO  (TEST-CollectionsAPIDistributedZkTest.test-seed#[A66F97A98B2E5409]) [    ] o.a.s.c.SolrXmlConfig Loading container configuration from /home/jenkins/workspace/Lucene-Solr-trunk-Linux/solr/build/solr-core/test/J1/temp/solr.cloud.CollectionsAPIDistributedZkTest_A66F97A98B2E5409-001/control-001/solr.xml
   [junit4]   2> 15719 INFO  (TEST-CollectionsAPIDistributedZkTest.test-seed#[A66F97A98B2E5409]) [    ] o.a.s.c.CorePropertiesLocator Config-defined core root directory: /home/jenkins/workspace/Lucene-Solr-trunk-Linux/solr/build/solr-core/test/J1/../../../../../../../../../home/jenkins/workspace/Lucene-Solr-trunk-Linux/solr/build/solr-core/test/J1/temp/solr.cloud.CollectionsAPIDistributedZkTest_A66F97A98B2E5409-001/control-001/cores
   [junit4]   2> 15719 INFO  (TEST-CollectionsAPIDistributedZkTest.test-seed#[A66F97A98B2E5409]) [    ] o.a.s.c.CoreContainer New CoreContainer 32753977
   [junit4]   2> 15719 INFO  (TEST-CollectionsAPIDistributedZkTest.test-seed#[A66F97A98B2E5409]) [    ] o.a.s.c.CoreContainer Loading cores into CoreContainer [instanceDir=/home/jenkins/workspace/Lucene-Solr-trunk-Linux/solr/build/solr-core/test/J1/temp/solr.cloud.CollectionsAPIDistributedZkTest_A66F97A98B2E5409-001/control-001]
   [junit4]   2> 15719 WARN  (TEST-CollectionsAPIDistributedZkTest.test-seed#[A66F97A98B2E5409]) [    ] o.a.s.c.CoreContainer Couldn't add files from /home/jenkins/workspace/Lucene-Solr-trunk-Linux/solr/build/solr-core/test/J1/temp/solr.cloud.CollectionsAPIDistributedZkTest_A66F97A98B2E5409-001/control-001/lib to classpath: /home/jenkins/workspace/Lucene-Solr-trunk-Linux/solr/build/solr-core/test/J1/temp/solr.cloud.CollectionsAPIDistributedZkTest_A66F97A98B2E5409-001/control-001/lib
   [junit4]   2> 15727 INFO  (TEST-CollectionsAPIDistributedZkTest.test-seed#[A66F97A98B2E5409]) [    ] o.a.s.h.c.HttpShardHandlerFactory created with socketTimeout : 90000,urlScheme : ,connTimeout : 15000,maxConnectionsPerHost : 20,maxConnections : 10000,corePoolSize : 0,maximumPoolSize : 2147483647,maxThreadIdleTime : 5,sizeOfQueue : -1,fairnessPolicy : false,useRetries : false,
   [junit4]   2> 15728 INFO  (TEST-CollectionsAPIDistributedZkTest.test-seed#[A66F97A98B2E5409]) [    ] o.a.s.u.UpdateShardHandler Creating UpdateShardHandler HTTP client with params: socketTimeout=340000&connTimeout=45000&retry=true
   [junit4]   2> 15729 INFO  (TEST-CollectionsAPIDistributedZkTest.test-seed#[A66F97A98B2E5409]) [    ] o.a.s.l.LogWatcher SLF4J impl is org.slf4j.impl.Log4jLoggerFactory
   [junit4]   2> 15729 INFO  (TEST-CollectionsAPIDistributedZkTest.test-seed#[A66F97A98B2E5409]) [    ] o.a.s.l.LogWatcher Registering Log Listener [Log4j (org.slf4j.impl.Log4jLoggerFactory)]
   [junit4]   2> 15729 INFO  (TEST-CollectionsAPIDistributedZkTest.test-seed#[A66F97A98B2E5409]) [    ] o.a.s.c.ZkContainer Zookeeper client=127.0.0.1:39471/solr
   [junit4]   2> 15729 INFO  (TEST-CollectionsAPIDistributedZkTest.test-seed#[A66F97A98B2E5409]) [    ] o.a.s.c.ZkController zkHost includes chroot
   [junit4]   2> 15729 INFO  (TEST-CollectionsAPIDistributedZkTest.test-seed#[A66F97A98B2E5409]) [    ] o.a.s.c.c.SolrZkClient Using default ZkCredentialsProvider
   [junit4]   2> 15730 INFO  (TEST-CollectionsAPIDistributedZkTest.test-seed#[A66F97A98B2E5409]) [    ] o.a.s.c.c.ConnectionManager Waiting for client to connect to ZooKeeper
   [junit4]   2> 15731 INFO  (zkCallback-37-thread-1) [    ] o.a.s.c.c.ConnectionManager Watcher org.apache.solr.common.cloud.ConnectionManager@174acfe name:ZooKeeperConnection Watcher:127.0.0.1:39471 got event WatchedEvent state:SyncConnected type:None path:null path:null type:None
   [junit4]   2> 15731 INFO  (TEST-CollectionsAPIDistributedZkTest.test-seed#[A66F97A98B2E5409]) [    ] o.a.s.c.c.ConnectionManager Client is connected to ZooKeeper
   [junit4]   2> 15732 INFO  (TEST-CollectionsAPIDistributedZkTest.test-seed#[A66F97A98B2E5409]) [    ] o.a.s.c.c.SolrZkClient Using default ZkACLProvider
   [junit4]   2> 15733 INFO  (TEST-CollectionsAPIDistributedZkTest.test-seed#[A66F97A98B2E5409]) [n:127.0.0.1:44144_    ] o.a.s.c.c.ConnectionManager Waiting for client to connect to ZooKeeper
   [junit4]   2> 15735 INFO  (zkCallback-38-thread-1-processing-n:127.0.0.1:44144_) [n:127.0.0.1:44144_    ] o.a.s.c.c.ConnectionManager Watcher org.apache.solr.common.cloud.ConnectionManager@1bad117 name:ZooKeeperConnection Watcher:127.0.0.1:39471/solr got event WatchedEvent state:SyncConnected type:None path:null path:null type:None
   [junit4]   2> 15735 INFO  (TEST-CollectionsAPIDistributedZkTest.test-seed#[A66F97A98B2E5409]) [n:127.0.0.1:44144_    ] o.a.s.c.c.ConnectionManager Client is connected to ZooKeeper
   [junit4]   2> 15736 INFO  (TEST-CollectionsAPIDistributedZkTest.test-seed#[A66F97A98B2E5409]) [n:127.0.0.1:44144_    ] o.a.s.c.c.SolrZkClient makePath: /overseer/queue
   [junit4]   2> 15738 INFO  (TEST-CollectionsAPIDistributedZkTest.test-seed#[A66F97A98B2E5409]) [n:127.0.0.1:44144_    ] o.a.s.c.c.SolrZkClient makePath: /overseer/collection-queue-work
   [junit4]   2> 15740 INFO  (TEST-CollectionsAPIDistributedZkTest.test-seed#[A66F97A98B2E5409]) [n:127.0.0.1:44144_    ] o.a.s.c.c.SolrZkClient makePath: /overseer/collection-map-running
   [junit4]   2> 15742 INFO  (TEST-CollectionsAPIDistributedZkTest.test-seed#[A66F97A98B2E5409]) [n:127.0.0.1:44144_    ] o.a.s.c.c.SolrZkClient makePath: /overseer/collection-map-completed
   [junit4]   2> 15744 INFO  (TEST-CollectionsAPIDistributedZkTest.test-seed#[A66F97A98B2E5409]) [n:127.0.0.1:44144_    ] o.a.s.c.c.SolrZkClient makePath: /overseer/collection-map-failure
   [junit4]   2> 15745 INFO  (TEST-CollectionsAPIDistributedZkTest.test-seed#[A66F97A98B2E5409]) [n:127.0.0.1:44144_    ] o.a.s.c.c.SolrZkClient makePath: /live_nodes
   [junit4]   2> 15747 INFO  (TEST-CollectionsAPIDistributedZkTest.test-seed#[A66F97A98B2E5409]) [n:127.0.0.1:44144_    ] o.a.s.c.c.SolrZkClient makePath: /aliases.json
   [junit4]   2> 15748 INFO  (TEST-CollectionsAPIDistributedZkTest.test-seed#[A66F97A98B2E5409]) [n:127.0.0.1:44144_    ] o.a.s.c.c.SolrZkClient makePath: /clusterstate.json
   [junit4]   2> 15749 INFO  (TEST-CollectionsAPIDistributedZkTest.test-seed#[A66F97A98B2E5409]) [n:127.0.0.1:44144_    ] o.a.s.c.c.SolrZkClient makePath: /security.json
   [junit4]   2> 15750 INFO  (TEST-CollectionsAPIDistributedZkTest.test-seed#[A66F97A98B2E5409]) [n:127.0.0.1:44144_    ] o.a.s.c.ZkController Register node as live in ZooKeeper:/live_nodes/127.0.0.1:44144_
   [junit4]   2> 15751 INFO  (TEST-CollectionsAPIDistributedZkTest.test-seed#[A66F97A98B2E5409]) [n:127.0.0.1:44144_    ] o.a.s.c.c.SolrZkClient makePath: /live_nodes/127.0.0.1:44144_
   [junit4]   2> 15752 INFO  (TEST-CollectionsAPIDistributedZkTest.test-seed#[A66F97A98B2E5409]) [n:127.0.0.1:44144_    ] o.a.s.c.c.SolrZkClient makePath: /overseer_elect
   [junit4]   2> 15753 INFO  (TEST-CollectionsAPIDistributedZkTest.test-seed#[A66F97A98B2E5409]) [n:127.0.0.1:44144_    ] o.a.s.c.c.SolrZkClient makePath: /overseer_elect/election
   [junit4]   2> 15754 INFO  (TEST-CollectionsAPIDistributedZkTest.test-seed#[A66F97A98B2E5409]) [n:127.0.0.1:44144_    ] o.a.s.c.Overseer Overseer (id=null) closing
   [junit4]   2> 15755 INFO  (TEST-CollectionsAPIDistributedZkTest.test-seed#[A66F97A98B2E5409]) [n:127.0.0.1:44144_    ] o.a.s.c.LeaderElector Joined leadership election with path: /overseer_elect/election/95350462304026628-127.0.0.1:44144_-n_0000000000
   [junit4]   2> 15755 INFO  (TEST-CollectionsAPIDistributedZkTest.test-seed#[A66F97A98B2E5409]) [n:127.0.0.1:44144_    ] o.a.s.c.OverseerElectionContext I am going to be the leader 127.0.0.1:44144_
   [junit4]   2> 15755 INFO  (TEST-CollectionsAPIDistributedZkTest.test-seed#[A66F97A98B2E5409]) [n:127.0.0.1:44144_    ] o.a.s.c.c.SolrZkClient makePath: /overseer_elect/leader
   [junit4]   2> 15756 INFO  (TEST-CollectionsAPIDistributedZkTest.test-seed#[A66F97A98B2E5409]) [n:127.0.0.1:44144_    ] o.a.s.c.Overseer Overseer (id=95350462304026628-127.0.0.1:44144_-n_0000000000) starting
   [junit4]   2> 15758 INFO  (TEST-CollectionsAPIDistributedZkTest.test-seed#[A66F97A98B2E5409]) [n:127.0.0.1:44144_    ] o.a.s.c.c.SolrZkClient makePath: /overseer/queue-work
   [junit4]   2> 15763 INFO  (TEST-CollectionsAPIDistributedZkTest.test-seed#[A66F97A98B2E5409]) [n:127.0.0.1:44144_    ] o.a.s.c.OverseerAutoReplicaFailoverThread Starting OverseerAutoReplicaFailoverThread autoReplicaFailoverWorkLoopDelay=10000 autoReplicaFailoverWaitAfterExpiration=10000 autoReplicaFailoverBadNodeExpiration=60000
   [junit4]   2> 15763 INFO  (OverseerCollectionConfigSetProcessor-95350462304026628-127.0.0.1:44144_-n_0000000000) [n:127.0.0.1:44144_    ] o.a.s.c.OverseerTaskProcessor Process current queue of overseer operations
   [junit4]   2> 15763 INFO  (TEST-CollectionsAPIDistributedZkTest.test-seed#[A66F97A98B2E5409]) [n:127.0.0.1:44144_    ] o.a.s.c.c.ZkStateReader Updating cluster state from ZooKeeper... 
   [junit4]   2> 15764 INFO  (OverseerStateUpdate-95350462304026628-127.0.0.1:44144_-n_0000000000) [n:127.0.0.1:44144_    ] o.a.s.c.Overseer Starting to work on the main queue
   [junit4]   2> 15848 INFO  (TEST-CollectionsAPIDistributedZkTest.test-seed#[A66F97A98B2E5409]) [n:127.0.0.1:44144_    ] o.a.s.c.CoreContainer Security conf doesn't exist. Skipping setup for authorization module.
   [junit4]   2> 15848 INFO  (TEST-CollectionsAPIDistributedZkTest.test-seed#[A66F97A98B2E5409]) [n:127.0.0.1:44144_    ] o.a.s.c.CoreContainer No authentication plugin used.
   [junit4]   2> 15849 INFO  (TEST-CollectionsAPIDistributedZkTest.test-seed#[A66F97A98B2E5409]) [n:127.0.0.1:44144_    ] o.a.s.c.CorePropertiesLocator Looking for core definitions underneath /home/jenkins/workspace/Lucene-Solr-trunk-Linux/solr/build/solr-core/test/J1/../../../../../../../../../home/jenkins/workspace/Lucene-Solr-trunk-Linux/solr/build/solr-core/test/J1/temp/solr.cloud.CollectionsAPIDistributedZkTest_A66F97A98B2E5409-001/control-001/cores
   [junit4]   2> 15852 INFO  (TEST-CollectionsAPIDistributedZkTest.test-seed#[A66F97A98B2E5409]) [n:127.0.0.1:44144_    ] o.a.s.c.CoreDescriptor Created CoreDescriptor: {name=collection1, config=solrconfig.xml, transient=false, schema=schema.xml, loadOnStartup=true, configSetProperties=configsetprops.json, collection=control_collection, coreNodeName=, dataDir=data/, shard=}
   [junit4]   2> 15852 INFO  (TEST-CollectionsAPIDistributedZkTest.test-seed#[A66F97A98B2E5409]) [n:127.0.0.1:44144_    ] o.a.s.c.CorePropertiesLocator Found core collection1 in /home/jenkins/workspace/Lucene-Solr-trunk-Linux/solr/build/solr-core/test/J1/../../../../../../../../../home/jenkins/workspace/Lucene-Solr-trunk-Linux/solr/build/solr-core/test/J1/temp/solr.cloud.CollectionsAPIDistributedZkTest_A66F97A98B2E5409-001/control-001/cores/collection1
   [junit4]   2> 15852 INFO  (TEST-CollectionsAPIDistributedZkTest.test-seed#[A66F97A98B2E5409]) [n:127.0.0.1:44144_    ] o.a.s.c.CorePropertiesLocator Found 1 core definitions
   [junit4]   2> 15854 INFO  (TEST-CollectionsAPIDistributedZkTest.test-seed#[A66F97A98B2E5409]) [n:127.0.0.1:44144_    ] o.a.s.s.SolrDispatchFilter user.dir=/home/jenkins/workspace/Lucene-Solr-trunk-Linux/solr/build/solr-core/test/J1
   [junit4]   2> 15854 INFO  (coreLoadExecutor-91-thread-1-processing-n:127.0.0.1:44144_) [n:127.0.0.1:44144_ c:control_collection   x:collection1] o.a.s.c.ZkController publishing state=down
   [junit4]   2> 15854 INFO  (TEST-CollectionsAPIDistributedZkTest.test-seed#[A66F97A98B2E5409]) [n:127.0.0.1:44144_    ] o.a.s.s.SolrDispatchFilter SolrDispatchFilter.init() done
   [junit4]   2> 15854 INFO  (coreLoadExecutor-91-thread-1-processing-n:127.0.0.1:44144_) [n:127.0.0.1:44144_ c:control_collection   x:collection1] o.a.s.c.ZkController numShards not found on descriptor - reading it from system property
   [junit4]   2> 15857 INFO  (coreLoadExecutor-91-thread-1-processing-n:127.0.0.1:44144_) [n:127.0.0.1:44144_ c:control_collection   x:collection1] o.a.s.c.ZkController look for our core node name
   [junit4]   2> 15857 INFO  (OverseerStateUpdate-95350462304026628-127.0.0.1:44144_-n_0000000000) [n:127.0.0.1:44144_    ] o.a.s.c.Overseer processMessage: queueSize: 1, message = {
   [junit4]   2>   "core":"collection1",
   [junit4]   2>   "roles":null,
   [junit4]   2>   "base_url":"http://127.0.0.1:44144",
   [junit4]   2>   "node_name":"127.0.0.1:44144_",
   [junit4]   2>   "numShards":"1",
   [junit4]   2>   "state":"down",
   [junit4]   2>   "shard":null,
   [junit4]   2>   "collection":"control_collection",
   [junit4]   2>   "operation":"state"} current state version: 0
   [junit4]   2> 15865 INFO  (OverseerStateUpdate-95350462304026628-127.0.0.1:44144_-n_0000000000) [n:127.0.0.1:44144_    ] o.a.s.c.o.ReplicaMutator Update state numShards=1 message={
   [junit4]   2>   "core":"collection1",
   [junit4]   2>   "roles":null,
   [junit4]   2>   "base_url":"http://127.0.0.1:44144",
   [junit4]   2>   "node_name":"127.0.0.1:44144_",
   [junit4]   2>   "numShards":"1",
   [junit4]   2>   "state":"down",
   [junit4]   2>   "shard":null,
   [junit4]   2>   "collection":"control_collection",
   [junit4]   2>   "operation":"state"}
   [junit4]   2> 15867 INFO  (OverseerStateUpdate-95350462304026628-127.0.0.1:44144_-n_0000000000) [n:127.0.0.1:44144_    ] o.a.s.c.o.ClusterStateMutator building a new cName: control_collection
   [junit4]   2> 15874 INFO  (OverseerStateUpdate-95350462304026628-127.0.0.1:44144_-n_0000000000) [n:127.0.0.1:44144_    ] o.a.s.c.o.ReplicaMutator Assigning new node to shard shard=shard1
   [junit4]   2> 15879 INFO  (zkCallback-38-thread-1-processing-n:127.0.0.1:44144_) [n:127.0.0.1:44144_    ] o.a.s.c.c.ZkStateReader A cluster state change: [WatchedEvent state:SyncConnected type:NodeDataChanged path:/clusterstate.json], has occurred - updating... (live nodes size: [1])
   [junit4]   2> 16858 INFO  (coreLoadExecutor-91-thread-1-processing-n:127.0.0.1:44144_) [n:127.0.0.1:44144_ c:control_collection   x:collection1] o.a.s.c.ZkController waiting to find shard id in clusterstate for collection1
   [junit4]   2> 16858 INFO  (coreLoadExecutor-91-thread-1-processing-n:127.0.0.1:44144_) [n:127.0.0.1:44144_ c:control_collection   x:collection1] o.a.s.c.ZkController Check for collection zkNode:control_collection
   [junit4]   2> 16858 INFO  (coreLoadExecutor-91-thread-1-processing-n:127.0.0.1:44144_) [n:127.0.0.1:44144_ c:control_collection   x:collection1] o.a.s.c.ZkController Collection zkNode exists
   [junit4]   2> 16858 INFO  (coreLoadExecutor-91-thread-1-processing-n:127.0.0.1:44144_) [n:127.0.0.1:44144_ c:control_collection   x:collection1] o.a.s.c.c.ZkStateReader Load collection config from: [/collections/control_collection]
   [junit4]   2> 16859 INFO  (coreLoadExecutor-91-thread-1-processing-n:127.0.0.1:44144_) [n:127.0.0.1:44144_ c:control_collection   x:collection1] o.a.s.c.c.ZkStateReader path=[/collections/control_collection] [configName]=[conf1] specified config exists in ZooKeeper
   [junit4]   2> 16859 INFO  (coreLoadExecutor-91-thread-1-processing-n:127.0.0.1:44144_) [n:127.0.0.1:44144_ c:control_collection   x:collection1] o.a.s.c.SolrResourceLoader new SolrResourceLoader for directory: '/home/jenkins/workspace/Lucene-Solr-trunk-Linux/solr/build/solr-core/test/J1/temp/solr.cloud.CollectionsAPIDistributedZkTest_A66F97A98B2E5409-001/control-001/cores/collection1'
   [junit4]   2> 16859 INFO  (coreLoadExecutor-91-thread-1-processing-n:127.0.0.1:44144_) [n:127.0.0.1:44144_ c:control_collection   x:collection1] o.a.s.c.SolrResourceLoader JNDI not configured for solr (NoInitialContextEx)
   [junit4]   2> 16859 INFO  (coreLoadExecutor-91-thread-1-processing-n:127.0.0.1:44144_) [n:127.0.0.1:44144_ c:control_collection   x:collection1] o.a.s.c.SolrResourceLoader solr home defaulted to 'solr/' (could not find system property or JNDI)
   [junit4]   2> 16861 INFO  (coreLoadExecutor-91-thread-1-processing-n:127.0.0.1:44144_) [n:127.0.0.1:44144_ c:control_collection   x:collection1] o.a.s.c.Config loaded config solrconfig.xml with version 0 
   [junit4]   2> 16876 INFO  (coreLoadExecutor-91-thread-1-processing-n:127.0.0.1:44144_) [n:127.0.0.1:44144_ c:control_collection   x:collection1] o.a.s.c.SolrConfig current version of requestparams : -1
   [junit4]   2> 16889 INFO  (coreLoadExecutor-91-thread-1-processing-n:127.0.0.1:44144_) [n:127.0.0.1:44144_ c:control_collection   x:collection1] o.a.s.c.SolrConfig Using Lucene MatchVersion: 6.0.0
   [junit4]   2> 16905 INFO  (coreLoadExecutor-91-thread-1-processing-n:127.0.0.1:44144_) [n:127.0.0.1:44144_ c:control_collection   x:collection1] o.a.s.c.SolrConfig Loaded SolrConfig: solrconfig.xml
   [junit4]   2> 16947 INFO  (coreLoadExecutor-91-thread-1-processing-n:127.0.0.1:44144_) [n:127.0.0.1:44144_ c:control_collection   x:collection1] o.a.s.s.IndexSchema [collection1] Schema name=test
   [junit4]   2> 17063 INFO  (coreLoadExecutor-91-thread-1-processing-n:127.0.0.1:44144_) [n:127.0.0.1:44144_ c:control_collection   x:collection1] o.a.s.s.OpenExchangeRatesOrgProvider Initialized with rates=open-exchange-rates.json, refreshInterval=1440.
   [junit4]   2> 17071 INFO  (coreLoadExecutor-91-thread-1-processing-n:127.0.0.1:44144_) [n:127.0.0.1:44144_ c:control_collection   x:collection1] o.a.s.s.IndexSchema default search field in schema is text
   [junit4]   2> 17072 INFO  (coreLoadExecutor-91-thread-1-processing-n:127.0.0.1:44144_) [n:127.0.0.1:44144_ c:control_collection   x:collection1] o.a.s.s.IndexSchema unique key field: id
   [junit4]   2> 17087 INFO  (coreLoadExecutor-91-thread-1-processing-n:127.0.0.1:44144_) [n:127.0.0.1:44144_ c:control_collection   x:collection1] o.a.s.s.FileExchangeRateProvider Reloading exchange rates from file currency.xml
   [junit4]   2> 17091 INFO  (coreLoadExecutor-91-thread-1-processing-n:127.0.0.1:44144_) [n:127.0.0.1:44144_ c:control_collection   x:collection1] o.a.s.s.FileExchangeRateProvider Reloading exchange rates from file currency.xml
   [junit4]   2> 17093 INFO  (coreLoadExecutor-91-thread-1-processing-n:127.0.0.1:44144_) [n:127.0.0.1:44144_ c:control_collection   x:collection1] o.a.s.s.OpenExchangeRatesOrgProvider Reloading exchange rates from open-exchange-rates.json
   [junit4]   2> 17093 INFO  (coreLoadExecutor-91-thread-1-processing-n:127.0.0.1:44144_) [n:127.0.0.1:44144_ c:control_collection   x:collection1] o.a.s.s.OpenExchangeRatesOrgProvider Reloading exchange rates from open-exchange-rates.json
   [junit4]   2> 17095 INFO  (coreLoadExecutor-91-thread-1-processing-n:127.0.0.1:44144_) [n:127.0.0.1:44144_ c:control_collection   x:collection1] o.a.s.c.ConfigSetProperties Did not find ConfigSet properties, assuming default properties: Can't find resource 'configsetprops.json' in classpath or '/configs/conf1', cwd=/home/jenkins/workspace/Lucene-Solr-trunk-Linux/solr/build/solr-core/test/J1
   [junit4]   2> 17095 INFO  (coreLoadExecutor-91-thread-1-processing-n:127.0.0.1:44144_) [n:127.0.0.1:44144_ c:control_collection   x:collection1] o.a.s.c.CoreContainer Creating SolrCore 'collection1' using configuration from collection control_collection
   [junit4]   2> 17095 INFO  (coreLoadExecutor-91-thread-1-processing-n:127.0.0.1:44144_) [n:127.0.0.1:44144_ c:control_collection s:shard1 r:core_node1 x:collection1] o.a.s.c.SolrCore org.apache.solr.core.MockDirectoryFactory
   [junit4]   2> 17095 INFO  (coreLoadExecutor-91-thread-1-processing-n:127.0.0.1:44144_) [n:127.0.0.1:44144_ c:control_collection s:shard1 r:core_node1 x:collection1] o.a.s.c.SolrCore [[collection1] ] Opening new SolrCore at [/home/jenkins/workspace/Lucene-Solr-trunk-Linux/solr/build/solr-core/test/J1/temp/solr.cloud.CollectionsAPIDistributedZkTest_A66F97A98B2E5409-001/control-001/cores/collection1], dataDir=[/home/jenkins/workspace/Lucene-Solr-trunk-Linux/solr/build/solr-core/test/J1/../../../../../../../../../home/jenkins/workspace/Lucene-Solr-trunk-Linux/solr/build/solr-core/test/J1/temp/solr.cloud.CollectionsAPIDistributedZkTest_A66F97A98B2E5409-001/control-001/cores/collection1/data/]
   [junit4]   2> 17096 INFO  (coreLoadExecutor-91-thread-1-processing-n:127.0.0.1:44144_) [n:127.0.0.1:44144_ c:control_collection s:shard1 r:core_node1 x:collection1] o.a.s.c.JmxMonitoredMap JMX monitoring is enabled. Adding Solr mbeans to JMX Server: com.sun.jmx.mbeanserver.JmxMBeanServer@511078
   [junit4]   2> 17099 INFO  (coreLoadExecutor-91-thread-1-processing-n:127.0.0.1:44144_) [n:127.0.0.1:44144_ c:control_collection s:shard1 r:core_node1 x:collection1] o.a.s.c.CachingDirectoryFactory return new directory for /home/jenkins/workspace/Lucene-Solr-trunk-Linux/solr/build/solr-core/test/J1/../../../../../../../../../home/jenkins/workspace/Lucene-Solr-trunk-Linux/solr/build/solr-core/test/J1/temp/solr.cloud.CollectionsAPIDistributedZkTest_A66F97A98B2E5409-001/control-001/cores/collection1/data
   [junit4]   2> 17099 INFO  (coreLoadExecutor-91-thread-1-processing-n:127.0.0.1:44144_) [n:127.0.0.1:44144_ c:control_collection s:shard1 r:core_node1 x:collection1] o.a.s.c.SolrCore New index directory detected: old=null new=/home/jenkins/workspace/Lucene-Solr-trunk-Linux/solr/build/solr-core/test/J1/../../../../../../../../../home/jenkins/workspace/Lucene-Solr-trunk-Linux/solr/build/solr-core/test/J1/temp/solr.cloud.CollectionsAPIDistributedZkTest_A66F97A98B2E5409-001/control-001/cores/collection1/data/index/
   [junit4]   2> 17099 WARN  (coreLoadExecutor-91-thread-1-processing-n:127.0.0.1:44144_) [n:127.0.0.1:44144_ c:control_collection s:shard1 r:core_node1 x:collection1] o.a.s.c.SolrCore [collection1] Solr index directory '/home/jenkins/workspace/Lucene-Solr-trunk-Linux/solr/build/solr-core/test/J1/../../../../../../../../../home/jenkins/workspace/Lucene-Solr-trunk-Linux/solr/build/solr-core/test/J1/temp/solr.cloud.CollectionsAPIDistributedZkTest_A66F97A98B2E5409-001/control-001/cores/collection1/data/index' doesn't exist. Creating new index...
   [junit4]   2> 17100 INFO  (coreLoadExecutor-91-thread-1-processing-n:127.0.0.1:44144_) [n:127.0.0.1:44144_ c:control_collection s:shard1 r:core_node1 x:collection1] o.a.s.c.CachingDirectoryFactory return new directory for /home/jenkins/workspace/Lucene-Solr-trunk-Linux/solr/build/solr-core/test/J1/../../../../../../../../../home/jenkins/workspace/Lucene-Solr-trunk-Linux/solr/build/solr-core/test/J1/temp/solr.cloud.CollectionsAPIDistributedZkTest_A66F97A98B2E5409-001/control-001/cores/collection1/data/index
   [junit4]   2> 17100 INFO  (coreLoadExecutor-91-thread-1-processing-n:127.0.0.1:44144_) [n:127.0.0.1:44144_ c:control_collection s:shard1 r:core_node1 x:collection1] o.a.s.u.RandomMergePolicy RandomMergePolicy wrapping class org.apache.lucene.index.TieredMergePolicy: [TieredMergePolicy: maxMergeAtOnce=17, maxMergeAtOnceExplicit=14, maxMergedSegmentMB=38.2529296875, floorSegmentMB=1.568359375, forceMergeDeletesPctAllowed=23.263581505045288, segmentsPerTier=13.0, maxCFSSegmentSizeMB=8.796093022207999E12, noCFSRatio=0.18333831422983185
   [junit4]   2> 17100 INFO  (coreLoadExecutor-91-thread-1-processing-n:127.0.0.1:44144_) [n:127.0.0.1:44144_ c:control_collection s:shard1 r:core_node1 x:collection1] o.a.s.c.SolrDeletionPolicy SolrDeletionPolicy.onCommit: commits: num=1
   [junit4]   2> 	commit{dir=MockDirectoryWrapper(RAMDirectory@198f930 lockFactory=org.apache.lucene.store.SingleInstanceLockFactory@144889b),segFN=segments_1,generation=1}
   [junit4]   2> 17100 INFO  (coreLoadExecutor-91-thread-1-processing-n:127.0.0.1:44144_) [n:127.0.0.1:44144_ c:control_collection s:shard1 r:core_node1 x:collection1] o.a.s.c.SolrDeletionPolicy newest commit generation = 1
   [junit4]   2> 17101 INFO  (OldIndexDirectoryCleanupThreadForCore-collection1) [n:127.0.0.1:44144_ c:control_collection s:shard1 r:core_node1 x:collection1] o.a.s.c.SolrCore Looking for old index directories to cleanup for core collection1 in /home/jenkins/workspace/Lucene-Solr-trunk-Linux/solr/build/solr-core/test/J1/../../../../../../../../../home/jenkins/workspace/Lucene-Solr-trunk-Linux/solr/build/solr-core/test/J1/temp/solr.cloud.CollectionsAPIDistributedZkTest_A66F97A98B2E5409-001/control-001/cores/collection1/data/
   [junit4]   2> 17101 WARN  (OldIndexDirectoryCleanupThreadForCore-collection1) [n:127.0.0.1:44144_ c:control_collection s:shard1 r:core_node1 x:collection1] o.a.s.c.DirectoryFactory /home/jenkins/workspace/Lucene-Solr-trunk-Linux/solr/build/solr-core/test/J1/../../../../../../../../../home/jenkins/workspace/Lucene-Solr-trunk-Linux/solr/build/solr-core/test/J1/temp/solr.cloud.CollectionsAPIDistributedZkTest_A66F97A98B2E5409-001/control-001/cores/collection1/data/ does not point to a valid data directory; skipping clean-up of old index directories.
   [junit4]   2> 17107 INFO  (coreLoadExecutor-91-thread-1-processing-n:127.0.0.1:44144_) [n:127.0.0.1:44144_ c:control_collection s:shard1 r:core_node1 x:collection1] o.a.s.u.p.UpdateRequestProcessorChain creating updateRequestProcessorChain "nodistrib"
   [junit4]   2> 17107 INFO  (coreLoadExecutor-91-thread-1-processing-n:127.0.0.1:44144_) [n:127.0.0.1:44144_ c:control_collection s:shard1 r:core_node1 x:collection1] o.a.s.u.p.UpdateRequestProcessorChain creating updateRequestProcessorChain "dedupe"
   [junit4]   2> 17107 INFO  (coreLoadExecutor-91-thread-1-processing-n:127.0.0.1:44144_) [n:127.0.0.1:44144_ c:control_collection s:shard1 r:core_node1 x:collection1] o.a.s.u.p.UpdateRequestProcessorChain inserting DistributedUpdateProcessorFactory into updateRequestProcessorChain "dedupe"
   [junit4]   2> 17107 INFO  (coreLoadExecutor-91-thread-1-processing-n:127.0.0.1:44144_) [n:127.0.0.1:44144_ c:control_collection s:shard1 r:core_node1 x:collection1] o.a.s.u.p.UpdateRequestProcessorChain creating updateRequestProcessorChain "stored_sig"
   [junit4]   2> 17107 INFO  (coreLoadExecutor-91-thread-1-processing-n:127.0.0.1:44144_) [n:127.0.0.1:44144_ c:control_collection s:shard1 r:core_node1 x:collection1] o.a.s.u.p.UpdateRequestProcessorChain inserting DistributedUpdateProcessorFactory into updateRequestProcessorChain "stored_sig"
   [junit4]   2> 17107 INFO  (coreLoadExecutor-91-thread-1-processing-n:127.0.0.1:44144_) [n:127.0.0.1:44144_ c:control_collection s:shard1 r:core_node1 x:collection1] o.a.s.u.p.UpdateRequestProcessorChain creating updateRequestProcessorChain "distrib-dup-test-chain-explicit"
   [junit4]   2> 17108 INFO  (coreLoadExecutor-91-thread-1-processing-n:127.0.0.1:44144_) [n:127.0.0.1:44144_ c:control_collection s:shard1 r:core_node1 x:collection1] o.a.s.u.p.UpdateRequestProcessorChain creating updateRequestProcessorChain "distrib-dup-test-chain-implicit"
   [junit4]   2> 17108 INFO  (coreLoadExecutor-91-thread-1-processing-n:127.0.0.1:44144_) [n:127.0.0.1:44144_ c:control_collection s:shard1 r:core_node1 x:collection1] o.a.s.u.p.UpdateRequestProcessorChain inserting DistributedUpdateProcessorFactory into updateRequestProcessorChain "distrib-dup-test-chain-implicit"
   [junit4]   2> 17108 INFO  (coreLoadExecutor-91-thread-1-processing-n:127.0.0.1:44144_) [n:127.0.0.1:44144_ c:control_collection s:shard1 r:core_node1 x:collection1] o.a.s.c.SolrCore no updateRequestProcessorChain defined as default, creating implicit default
   [junit4]   2> 17108 WARN  (coreLoadExecutor-91-thread-1-processing-n:127.0.0.1:44144_) [n:127.0.0.1:44144_ c:control_collection s:shard1 r:core_node1 x:collection1] o.a.s.c.RequestHandlers INVALID paramSet a in requestHandler {type = requestHandler,name = /dump,class = DumpRequestHandler,args = {defaults={a=A,b=B}}}
   [junit4]   2> 17110 INFO  (coreLoadExecutor-91-thread-1-processing-n:127.0.0.1:44144_) [n:127.0.0.1:44144_ c:control_collection s:shard1 r:core_node1 x:collection1] o.a.s.h.l.XMLLoader xsltCacheLifetimeSeconds=60
   [junit4]   2> 17111 INFO  (coreLoadExecutor-91-thread-1-processing-n:127.0.0.1:44144_) [n:127.0.0.1:44144_ c:control_collection s:shard1 r:core_node1 x:collection1] o.a.s.h.l.XMLLoader xsltCacheLifetimeSeconds=60
   [junit4]   2> 17113 INFO  (coreLoadExecutor-91-thread-1-processing-n:127.0.0.1:44144_) [n:127.0.0.1:44144_ c:control_collection s:shard1 r:core_node1 x:collection1] o.a.s.h.l.XMLLoader xsltCacheLifetimeSeconds=60
   [junit4]   2> 17114 INFO  (coreLoadExecutor-91-thread-1-processing-n:127.0.0.1:44144_) [n:127.0.0.1:44144_ c:control_collection s:shard1 r:core_node1 x:collection1] o.a.s.h.l.XMLLoader xsltCacheLifetimeSeconds=60
   [junit4]   2> 17123 INFO  (coreLoadExecutor-91-thread-1-processing-n:127.0.0.1:44144_) [n:127.0.0.1:44144_ c:control_collection s:shard1 r:core_node1 x:collection1] o.a.s.c.RequestHandlers Registered paths: /admin/mbeans,standard,/dump,/update/csv,/sql,/update/json/docs,/admin/luke,/export,/admin/segments,/get,/admin/system,/replication,/admin/properties,/config,/stream,/schema,/admin/plugins,/admin/logging,/update/json,/admin/threads,/admin/ping,/update,/admin/file
   [junit4]   2> 17124 INFO  (coreLoadExecutor-91-thread-1-processing-n:127.0.0.1:44144_) [n:127.0.0.1:44144_ c:control_collection s:shard1 r:core_node1 x:collection1] o.a.s.c.SolrCore Using default statsCache cache: org.apache.solr.search.stats.LocalStatsCache
   [junit4]   2> 17124 INFO  (coreLoadExecutor-91-thread-1-processing-n:127.0.0.1:44144_) [n:127.0.0.1:44144_ c:control_collection s:shard1 r:core_node1 x:collection1] o.a.s.u.UpdateHandler Using UpdateLog implementation: org.apache.solr.update.UpdateLog
   [junit4]   2> 17124 INFO  (coreLoadExecutor-91-thread-1-processing-n:127.0.0.1:44144_) [n:127.0.0.1:44144_ c:control_collection s:shard1 r:core_node1 x:collection1] o.a.s.u.UpdateLog Initializing UpdateLog: dataDir= defaultSyncLevel=FLUSH numRecordsToKeep=100 maxNumLogsToKeep=10 numVersionBuckets=65536
   [junit4]   2> 17125 INFO  (coreLoadExecutor-91-thread-1-processing-n:127.0.0.1:44144_) [n:127.0.0.1:44144_ c:control_collection s:shard1 r:core_node1 x:collection1] o.a.s.u.CommitTracker Hard AutoCommit: disabled
   [junit4]   2> 17125 INFO  (coreLoadExecutor-91-thread-1-processing-n:127.0.0.1:44144_) [n:127.0.0.1:44144_ c:control_collection s:shard1 r:core_node1 x:collection1] o.a.s.u.CommitTracker Soft AutoCommit: disabled
   [junit4]   2> 17126 INFO  (coreLoadExecutor-91-thread-1-processing-n:127.0.0.1:44144_) [n:127.0.0.1:44144_ c:control_collection s:shard1 r:core_node1 x:collection1] o.a.s.u.RandomMergePolicy RandomMergePolicy wrapping class org.apache.lucene.index.LogByteSizeMergePolicy: [LogByteSizeMergePolicy: minMergeSize=1677721, mergeFactor=44, maxMergeSize=2147483648, maxMergeSizeForForcedMerge=9223372036854775807, calibrateSizeByDeletes=true, maxMergeDocs=2147483647, maxCFSSegmentSizeMB=8.796093022207999E12, noCFSRatio=0.5093280927487739]
   [junit4]   2> 17126 INFO  (coreLoadExecutor-91-thread-1-processing-n:127.0.0.1:44144_) [n:127.0.0.1:44144_ c:control_collection s:shard1 r:core_node1 x:collection1] o.a.s.c.SolrDeletionPolicy SolrDeletionPolicy.onInit: commits: num=1
   [junit4]   2> 	commit{dir=MockDirectoryWrapper(RAMDirectory@198f930 lockFactory=org.apache.lucene.store.SingleInstanceLockFactory@144889b),segFN=segments_1,generation=1}
   [junit4]   2> 17126 INFO  (coreLoadExecutor-91-thread-1-processing-n:127.0.0.1:44144_) [n:127.0.0.1:44144_ c:control_collection s:shard1 r:core_node1 x:collection1] o.a.s.c.SolrDeletionPolicy newest commit generation = 1
   [junit4]   2> 17127 INFO  (coreLoadExecutor-91-thread-1-processing-n:127.0.0.1:44144_) [n:127.0.0.1:44144_ c:control_collection s:shard1 r:core_node1 x:collection1] o.a.s.s.SolrIndexSearcher Opening [Searcher@d975f7[collection1] main]
   [junit4]   2> 17127 INFO  (coreLoadExecutor-91-thread-1-processing-n:127.0.0.1:44144_) [n:127.0.0.1:44144_ c:control_collection s:shard1 r:core_node1 x:collection1] o.a.s.c.c.ZkStateReader Load collection config from: [/collections/control_collection]
   [junit4]   2> 17127 INFO  (coreLoadExecutor-91-thread-1-processing-n:127.0.0.1:44144_) [n:127.0.0.1:44144_ c:control_collection s:shard1 r:core_node1 x:collection1] o.a.s.c.c.ZkStateReader path=[/collections/control_collection] [configName]=[conf1] specified config exists in ZooKeeper
   [junit4]   2> 17128 INFO  (coreLoadExecutor-91-thread-1-processing-n:127.0.0.1:44144_) [n:127.0.0.1:44144_ c:control_collection s:shard1 r:core_node1 x:collection1] o.a.s.r.ManagedResourceStorage Setting up ZooKeeper-based storage for the RestManager with znodeBase: /configs/conf1
   [junit4]   2> 17129 INFO  (coreLoadExecutor-91-thread-1-processing-n:127.0.0.1:44144_) [n:127.0.0.1:44144_ c:control_collection s:shard1 r:core_node1 x:collection1] o.a.s.r.ManagedResourceStorage Configured ZooKeeperStorageIO with znodeBase: /configs/conf1
   [junit4]   2> 17129 INFO  (coreLoadExecutor-91-thread-1-processing-n:127.0.0.1:44144_) [n:127.0.0.1:44144_ c:control_collection s:shard1 r:core_node1 x:collection1] o.a.s.r.RestManager Initializing RestManager with initArgs: {}
   [junit4]   2> 17129 INFO  (coreLoadExecutor-91-thread-1-processing-n:127.0.0.1:44144_) [n:127.0.0.1:44144_ c:control_collection s:shard1 r:core_node1 x:collection1] o.a.s.r.ManagedResourceStorage Reading _rest_managed.json using ZooKeeperStorageIO:path=/configs/conf1
   [junit4]   2> 17130 INFO  (coreLoadExecutor-91-thread-1-processing-n:127.0.0.1:44144_) [n:127.0.0.1:44144_ c:control_collection s:shard1 r:core_node1 x:collection1] o.a.s.r.ManagedResourceStorage No data found for znode /configs/conf1/_rest_managed.json
   [junit4]   2> 17130 INFO  (coreLoadExecutor-91-thread-1-processing-n:127.0.0.1:44144_) [n:127.0.0.1:44144_ c:control_collection s:shard1 r:core_node1 x:collection1] o.a.s.r.ManagedResourceStorage Loaded null at path _rest_managed.json using ZooKeeperStorageIO:path=/configs/conf1
   [junit4]   2> 17130 INFO  (coreLoadExecutor-91-thread-1-processing-n:127.0.0.1:44144_) [n:127.0.0.1:44144_ c:control_collection s:shard1 r:core_node1 x:collection1] o.a.s.r.RestManager Initializing 0 registered ManagedResources
   [junit4]   2> 17130 INFO  (coreLoadExecutor-91-thread-1-processing-n:127.0.0.1:44144_) [n:127.0.0.1:44144_ c:control_collection s:shard1 r:core_node1 x:collection1] o.a.s.h.ReplicationHandler Commits will be reserved for  10000
   [junit4]   2> 17132 INFO  (searcherExecutor-92-thread-1-processing-n:127.0.0.1:44144_ x:collection1 s:shard1 c:control_collection r:core_node1) [n:127.0.0.1:44144_ c:control_collection s:shard1 r:core_node1 x:collection1] o.a.s.c.SolrCore [collection1] Registered new searcher Searcher@d975f7[collection1] main{ExitableDirectoryReader(UninvertingDirectoryReader())}
   [junit4]   2> 17132 INFO  (coreLoadExecutor-91-thread-1-processing-n:127.0.0.1:44144_) [n:127.0.0.1:44144_ c:control_collection s:shard1 r:core_node1 x:collection1] o.a.s.u.UpdateLog Looking up max value of version field to seed version buckets
   [junit4]   2> 17132 INFO  (coreLoadExecutor-91-thread-1-processing-n:127.0.0.1:44144_) [n:127.0.0.1:44144_ c:control_collection s:shard1 r:core_node1 x:collection1] o.a.s.u.VersionInfo Refreshing highest value of _version_ for 65536 version buckets from index
   [junit4]   2> 17132 INFO  (coreLoadExecutor-91-thread-1-processing-n:127.0.0.1:44144_) [n:127.0.0.1:44144_ c:control_collection s:shard1 r:core_node1 x:collection1] o.a.s.u.VersionInfo No terms found for _version_, cannot seed version bucket highest value from index
   [junit4]   2> 17132 INFO  (coreLoadExecutor-91-thread-1-processing-n:127.0.0.1:44144_) [n:127.0.0.1:44144_ c:control_collection s:shard1 r:core_node1 x:collection1] o.a.s.u.UpdateLog Could not find max version in index or recent updates, using new clock 1525607398806388736
   [junit4]   2> 17134 INFO  (coreLoadExecutor-91-thread-1-processing-n:127.0.0.1:44144_) [n:127.0.0.1:44144_ c:control_collection s:shard1 r:core_node1 x:collection1] o.a.s.u.UpdateLog Took 1.0ms to seed version buckets with highest version 1525607398806388736
   [junit4]   2> 17135 INFO  (coreLoadExecutor-91-thread-1-processing-n:127.0.0.1:44144_) [n:127.0.0.1:44144_ c:control_collection s:shard1 r:core_node1 x:collection1] o.a.s.c.ZkController watch zkdir /configs/conf1
   [junit4]   2> 17136 INFO  (coreLoadExecutor-91-thread-1-processing-n:127.0.0.1:44144_) [n:127.0.0.1:44144_ c:control_collection s:shard1 r:core_node1 x:collection1] o.a.s.c.CoreContainer registering core: collection1
   [junit4]   2> 17136 INFO  (coreZkRegister-85-thread-1-processing-n:127.0.0.1:44144_ x:collection1 s:shard1 c:control_collection r:core_node1) [n:127.0.0.1:44144_ c:control_collection s:shard1 r:core_node1 x:collection1] o.a.s.c.ZkController Register replica - core:collection1 address:http://127.0.0.1:44144 collection:control_collection shard:shard1
   [junit4]   2> 17143 INFO  (coreZkRegister-85-thread-1-processing-n:127.0.0.1:44144_ x:collection1 s:shard1 c:control_collection r:core_node1) [n:127.0.0.1:44144_ c:control_collection s:shard1 r:core_node1 x:collection1] o.a.s.c.c.SolrZkClient makePath: /collections/control_collection/leader_elect/shard1/election
   [junit4]   2> 17146 INFO  (coreZkRegister-85-thread-1-processing-n:127.0.0.1:44144_ x:collection1 s:shard1 c:control_collection r:core_node1) [n:127.0.0.1:44144_ c:control_collection s:shard1 r:core_node1 x:collection1] o.a.s.c.LeaderElector Joined leadership election with path: /collections/control_collection/leader_elect/shard1/election/95350462304026628-core_node1-n_0000000000
   [junit4]   2> 17147 INFO  (coreZkRegister-85-thread-1-processing-n:127.0.0.1:44144_ x:collection1 s:shard1 c:control_collection r:core_node1) [n:127.0.0.1:44144_ c:control_collection s:shard1 r:core_node1 x:collection1] o.a.s.c.ShardLeaderElectionContext Running the leader process for shard=shard1 and weAreReplacement=false and leaderVoteWait=180000
   [junit4]   2> 17149 INFO  (coreZkRegister-85-thread-1-processing-n:127.0.0.1:44144_ x:collection1 s:shard1 c:control_collection r:core_node1) [n:127.0.0.1:44144_ c:control_collection s:shard1 r:core_node1 x:collection1] o.a.s.c.ShardLeaderElectionContext Enough replicas found to continue.
   [junit4]   2> 17149 INFO  (coreZkRegister-85-thread-1-processing-n:127.0.0.1:44144_ x:collection1 s:shard1 c:control_collection r:core_node1) [n:127.0.0.1:44144_ c:control_collection s:shard1 r:core_node1 x:collection1] o.a.s.c.ShardLeaderElectionContext I may be the new leader - try and sync
   [junit4]   2> 17149 INFO  (OverseerStateUpdate-95350462304026628-127.0.0.1:44144_-n_0000000000) [n:127.0.0.1:44144_    ] o.a.s.c.Overseer processMessage: queueSize: 1, message = {
   [junit4]   2>   "operation":"leader",
   [junit4]   2>   "shard":"shard1",
   [junit4]   2>   "collection":"control_collection"} current state version: 1
   [junit4]   2> 17151 INFO  (coreZkRegister-85-thread-1-processing-n:127.0.0.1:44144_ x:collection1 s:shard1 c:control_collection r:core_node1) [n:127.0.0.1:44144_ c:control_collection s:shard1 r:core_node1 x:collection1] o.a.s.c.SyncStrategy Sync replicas to http://127.0.0.1:44144/collection1/
   [junit4]   2> 17151 INFO  (coreZkRegister-85-thread-1-processing-n:127.0.0.1:44144_ x:collection1 s:shard1 c:control_collection r:core_node1) [n:127.0.0.1:44144_ c:control_collection s:shard1 r:core_node1 x:collection1] o.a.s.c.SyncStrategy Sync Success - now sync replicas to me
   [junit4]   2> 17151 INFO  (coreZkRegister-85-thread-1-processing-n:127.0.0.1:44144_ x:collection1 s:shard1 c:control_collection r:core_node1) [n:127.0.0.1:44144_ c:control_collection s:shard1 r:core_node1 x:collection1] o.a.s.c.SyncStrategy http://127.0.0.1:44144/collection1/ has no replicas
   [junit4]   2> 17154 INFO  (coreZkRegister-85-thread-1-processing-n:127.0.0.1:44144_ x:collection1 s:shard1 c:control_collection r:core_node1) [n:127.0.0.1:44144_ c:control_collection s:shard1 r:core_node1 x:collection1] o.a.s.c.c.SolrZkClient makePath: /collections/control_collection/leaders/shard1
   [junit4]   2> 17157 INFO  (coreZkRegister-85-thread-1-processing-n:127.0.0.1:44144_ x:collection1 s:shard1 c:control_collection r:core_node1) [n:127.0.0.1:44144_ c:control_collection s:shard1 r:core_node1 x:collection1] o.a.s.c.ShardLeaderElectionContextBase Creating leader registration node
   [junit4]   2> 17169 INFO  (coreZkRegister-85-thread-1-processing-n:127.0.0.1:44144_ x:collection1 s:shard1 c:control_collection r:core_node1) [n:127.0.0.1:44144_ c:control_collection s:shard1 r:core_node1 x:collection1] o.a.s.c.ShardLeaderElectionContext I am the new leader: http://127.0.0.1:44144/collection1/ shard1
   [junit4]   2> 17170 INFO  (OverseerStateUpdate-95350462304026628-127.0.0.1:44144_-n_0000000000) [n:127.0.0.1:44144_    ] o.a.s.c.Overseer processMessage: queueSize: 1, message = {
   [junit4]   2>   "operation":"leader",
   [junit4]   2>   "shard":"shard1",
   [junit4]   2>   "collection":"control_collection",
   [junit4]   2>   "base_url":"http://127.0.0.1:44144",
   [junit4]   2>   "core":"collection1",
   [junit4]   2>   "state":"active"} current state version: 1
   [junit4]   2> 17272 INFO  (zkCallback-38-thread-1-processing-n:127.0.0.1:44144_) [n:127.0.0.1:44144_    ] o.a.s.c.c.ZkStateReader A cluster state change: [WatchedEvent state:SyncConnected type:NodeDataChanged path:/clusterstate.json], has occurred - updating... (live nodes size: [1])
   [junit4]   2> 17320 INFO  (coreZkRegister-85-thread-1-processing-n:127.0.0.1:44144_ x:collection1 s:shard1 c:control_collection r:core_node1) [n:127.0.0.1:44144_ c:control_collection s:shard1 r:core_node1 x:collection1] o.a.s.c.ZkController We are http://127.0.0.1:44144/collection1/ and leader is http://127.0.0.1:44144/collection1/
   [junit4]   2> 17320 INFO  (coreZkRegister-85-thread-1-processing-n:127.0.0.1:44144_ x:collection1 s:shard1 c:control_collection r:core_node1) [n:127.0.0.1:44144_ c:control_collection s:shard1 r:core_node1 x:collection1] o.a.s.c.ZkController No LogReplay needed for core=collection1 baseURL=http://127.0.0.1:44144
   [junit4]   2> 17321 INFO  (coreZkRegister-85-thread-1-processing-n:127.0.0.1:44144_ x:collection1 s:shard1 c:control_collection r:core_node1) [n:127.0.0.1:44144_ c:control_collection s:shard1 r:core_node1 x:collection1] o.a.s.c.ZkController I am the leader, no recovery necessary
   [junit4]   2> 17321 INFO  (coreZkRegister-85-thread-1-processing-n:127.0.0.1:44144_ x:collection1 s:shard1 c:control_collection r:core_node1) [n:127.0.0.1:44144_ c:control_collection s:shard1 r:core_node1 x:collection1] o.a.s.c.ZkController publishing state=active
   [junit4]   2> 17321 INFO  (coreZkRegister-85-thread-1-processing-n:127.0.0.1:44144_ x:collection1 s:shard1 c:control_collection r:core_node1) [n:127.0.0.1:44144_ c:control_collection s:shard1 r:core_node1 x:collection1] o.a.s.c.ZkController numShards not found on descriptor - reading it from system property
   [junit4]   2> 17323 INFO  (OverseerStateUpdate-95350462304026628-127.0.0.1:44144_-n_0000000000) [n:127.0.0.1:44144_    ] o.a.s.c.Overseer processMessage: queueSize: 1, message = {
   [junit4]   2>   "core":"collection1",
   [junit4]   2>   "core_node_name":"core_node1",
   [junit4]   2>   "roles":null,
   [junit4]   2>   "base_url":"http://127.0.0.1:44144",
   [junit4]   2>   "node_name":"127.0.0.1:44144_",
   [junit4]   2>   "numShards":"1",
   [junit4]   2>   "state":"active",
   [junit4]   2>   "shard":"shard1",
   [junit4]   2>   "collection":"control_collection",
   [junit4]   2>   "operation":"state"} current state version: 2
   [junit4]   2> 17323 INFO  (OverseerStateUpdate-95350462304026628-127.0.0.1:44144_-n_0000000000) [n:127.0.0.1:44144_    ] o.a.s.c.o.ReplicaMutator Update state numShards=1 message={
   [junit4]   2>   "core":"collection1",
   [junit4]   2>   "core_node_name":"core_node1",
   [junit4]   2>   "roles":null,
   [junit4]   2>   "base_url":"http://127.0.0.1:44144",
   [junit4]   2>   "node_name":"127.0.0.1:44144_",
   [junit4]   2>   "numShards":"1",
   [junit4]   2>   "state":"active",
   [junit4]   2>   "shard":"shard1",
   [junit4]   2>   "collection":"control_collection",
   [junit4]   2>   "operation":"state"}
   [junit4]   2> 17373 INFO  (TEST-CollectionsAPIDistributedZkTest.test-seed#[A66F97A98B2E5409]) [    ] o.a.s.c.c.SolrZkClient Using default ZkCredentialsProvider
   [junit4]   2> 17373 INFO  (TEST-CollectionsAPIDistributedZkTest.test-seed#[A66F97A98B2E5409]) [    ] o.a.s.c.c.ConnectionManager Waiting for client to connect to ZooKeeper
   [junit4]   2> 17375 INFO  (zkCallback-40-thread-1) [    ] o.a.s.c.c.ConnectionManager Watcher org.apache.solr.common.cloud.ConnectionManager@17762a4 name:ZooKeeperConnection Watcher:127.0.0.1:39471/solr got event WatchedEvent state:SyncConnected type:None path:null path:null type:None
   [junit4]   2> 17375 INFO  (TEST-CollectionsAPIDistributedZkTest.test-seed#[A66F97A98B2E5409]) [    ] o.a.s.c.c.ConnectionManager Client is connected to ZooKeeper
   [junit4]   2> 17375 INFO  (TEST-CollectionsAPIDistributedZkTest.test-seed#[A66F97A98B2E5409]) [    ] o.a.s.c.c.SolrZkClient Using default ZkACLProvider
   [junit4]   2> 17375 INFO  (TEST-CollectionsAPIDistributedZkTest.test-seed#[A66F97A98B2E5409]) [    ] o.a.s.c.c.ZkStateReader Updating cluster state from ZooKeeper... 
   [junit4]   2> 17379 INFO  (TEST-CollectionsAPIDistributedZkTest.test-seed#[A66F97A98B2E5409]) [    ] o.a.s.c.ChaosMonkey monkey: init - expire sessions:false cause connection loss:false
   [junit4]   2> 17425 INFO  (zkCallback-40-thread-1) [    ] o.a.s.c.c.ZkStateReader A cluster state change: [WatchedEvent state:SyncConnected type:NodeDataChanged path:/clusterstate.json], has occurred - updating... (live nodes size: [1])
   [junit4]   2> 17425 INFO  (zkCallback-38-thread-1-processing-n:127.0.0.1:44144_) [n:127.0.0.1:44144_    ] o.a.s.c.c.ZkStateReader A cluster state change: [WatchedEvent state:SyncConnected type:NodeDataChanged path:/clusterstate.json], has occurred - updating... (live nodes size: [1])
   [junit4]   2> 17455 INFO  (TEST-CollectionsAPIDistributedZkTest.test-seed#[A66F97A98B2E5409]) [    ] o.a.s.SolrTestCaseJ4 Writing core.properties file to /home/jenkins/workspace/Lucene-Solr-trunk-Linux/solr/build/solr-core/test/J1/temp/solr.cloud.CollectionsAPIDistributedZkTest_A66F97A98B2E5409-001/shard-1-001/cores/collection1
   [junit4]   2> 17456 INFO  (TEST-CollectionsAPIDistributedZkTest.test-seed#[A66F97A98B2E5409]) [    ] o.a.s.c.AbstractFullDistribZkTestBase create jetty 1 in directory /home/jenkins/workspace/Lucene-Solr-trunk-Linux/solr/build/solr-core/test/J1/temp/solr.cloud.CollectionsAPIDistributedZkTest_A66F97A98B2E5409-001/shard-1-001
   [junit4]   2> 17457 INFO  (TEST-CollectionsAPIDistributedZkTest.test-seed#[A66F97A98B2E5409]) [    ] o.e.j.s.Server jetty-9.2.13.v20150730
   [junit4]   2> 17459 INFO  (TEST-CollectionsAPIDistributedZkTest.test-seed#[A66F97A98B2E5409]) [    ] o.e.j.s.h.ContextHandler Started o.e.j.s.ServletContextHandler@18e5515{/,null,AVAILABLE}
   [junit4]   2> 17460 INFO  (TEST-CollectionsAPIDistributedZkTest.test-seed#[A66F97A98B2E5409]) [    ] o.e.j.s.ServerConnector Started ServerConnector@1804b1{HTTP/1.1}{127.0.0.1:51975}
   [junit4]   2> 17460 INFO  (TEST-CollectionsAPIDistributedZkTest.test-seed#[A66F97A98B2E5409]) [    ] o.e.j.s.Server Started @18686ms
   [junit4]   2> 17460 INFO  (TEST-CollectionsAPIDistributedZkTest.test-seed#[A66F97A98B2E5409]) [    ] o.a.s.c.s.e.JettySolrRunner Jetty properties: {solr.data.dir=/home/jenkins/workspace/Lucene-Solr-trunk-Linux/solr/build/solr-core/test/J1/temp/solr.cloud.CollectionsAPIDistributedZkTest_A66F97A98B2E5409-001/tempDir-001/jetty1, solrconfig=solrconfig.xml, hostContext=/, hostPort=51975, coreRootDirectory=/home/jenkins/workspace/Lucene-Solr-trunk-Linux/solr/build/solr-core/test/J1/../../../../../../../../../home/jenkins/workspace/Lucene-Solr-trunk-Linux/solr/build/solr-core/test/J1/temp/solr.cloud.CollectionsAPIDistributedZkTest_A66F97A98B2E5409-001/shard-1-001/cores}
   [junit4]   2> 17460 INFO  (TEST-CollectionsAPIDistributedZkTest.test-seed#[A66F97A98B2E5409]) [    ] o.a.s.s.SolrDispatchFilter SolrDispatchFilter.init(): sun.misc.Launcher$AppClassLoader@1d16e93
   [junit4]   2> 17461 INFO  (TEST-CollectionsAPIDistributedZkTest.test-seed#[A66F97A98B2E5409]) [    ] o.a.s.c.SolrResourceLoader new SolrResourceLoader for directory: '/home/jenkins/workspace/Lucene-Solr-trunk-Linux/solr/build/solr-core/test/J1/temp/solr.cloud.CollectionsAPIDistributedZkTest_A66F97A98B2E5409-001/shard-1-001'
   [junit4]   2> 17461 INFO  (TEST-CollectionsAPIDistributedZkTest.test-seed#[A66F97A98B2E5409]) [    ] o.a.s.c.SolrResourceLoader JNDI not configured for solr (NoInitialContextEx)
   [junit4]   2> 17461 INFO  (TEST-CollectionsAPIDistributedZkTest.test-seed#[A66F97A98B2E5409]) [    ] o.a.s.c.SolrResourceLoader solr home defaulted to 'solr/' (could not find system property or JNDI)
   [junit4]   2> 17461 INFO  (TEST-CollectionsAPIDistributedZkTest.test-seed#[A66F97A98B2E5409]) [    ] o.a.s.c.c.SolrZkClient Using default ZkCredentialsProvider
   [junit4]   2> 17462 INFO  (TEST-CollectionsAPIDistributedZkTest.test-seed#[A66F97A98B2E5409]) [    ] o.a.s.c.c.ConnectionManager Waiting for client to connect to ZooKeeper
   [junit4]   2> 17463 INFO  (zkCallback-41-thread-1) [    ] o.a.s.c.c.ConnectionManager Watcher org.apache.solr.common.cloud.ConnectionManager@d63f9d name:ZooKeeperConnection Watcher:127.0.0.1:39471/solr got event WatchedEvent state:SyncConnected type:None path:null path:null type:None
   [junit4]   2> 17463 INFO  (TEST-CollectionsAPIDistributedZkTest.test-seed#[A66F97A98B2E5409]) [    ] o.a.s.c.c.ConnectionManager Client is connected to ZooKeeper
   [junit4]   2> 17464 INFO  (TEST-CollectionsAPIDistributedZkTest.test-seed#[A66F97A98B2E5409]) [    ] o.a.s.c.c.SolrZkClient Using default ZkACLProvider
   [junit4]   2> 17465 INFO  (TEST-CollectionsAPIDistributedZkTest.test-seed#[A66F97A98B2E5409]) [    ] o.a.s.s.SolrDispatchFilter Loading solr.xml from SolrHome (not found in ZooKeeper)
   [junit4]   2> 17465 INFO  (TEST-CollectionsAPIDistributedZkTest.test-seed#[A66F97A98B2E5409]) [    ] o.a.s.c.SolrXmlConfig Loading container configuration from /home/jenkins/workspace/Lucene-Solr-trunk-Linux/solr/build/solr-core/test/J1/temp/solr.cloud.CollectionsAPIDistributedZkTest_A66F97A98B2E5409-001/shard-1-001/solr.xml
   [junit4]   2> 17479 INFO  (TEST-CollectionsAPIDistributedZkTest.test-seed#[A66F97A98B2E5409]) [    ] o.a.s.c.CorePropertiesLocator Config-defined core root directory: /home/jenkins/workspace/Lucene-Solr-trunk-Linux/solr/build/solr-core/test/J1/../../../../../../../../../home/jenkins/workspace/Lucene-Solr-trunk-Linux/solr/build/solr-core/test/J1/temp/solr.cloud.CollectionsAPIDistributedZkTest_A66F97A98B2E5409-001/shard-1-001/cores
   [junit4]   2> 17480 INFO  (TEST-CollectionsAPIDistributedZkTest.test-seed#[A66F97A98B2E5409]) [    ] o.a.s.c.CoreContainer New CoreContainer 23350462
   [junit4]   2> 17480 INFO  (TEST-CollectionsAPIDistributedZkTest.test-seed#[A66F97A98B2E5409]) [    ] o.a.s.c.CoreContainer Loading cores into CoreContainer [instanceDir=/home/jenkins/workspace/Lucene-Solr-trunk-Linux/solr/build/solr-core/test/J1/temp/solr.cloud.CollectionsAPIDistributedZkTest_A66F97A98B2E5409-001/shard-1-001]
   [junit4]   2> 17480 WARN  (TEST-CollectionsAPIDistributedZkTest.test-seed#[A66F97A98B2E5409]) [    ] o.a.s.c.CoreContainer Couldn't add files from /home/jenkins/workspace/Lucene-Solr-trunk-Linux/solr/build/solr-core/test/J1/temp/solr.cloud.CollectionsAPIDistributedZkTest_A66F97A98B2E5409-001/shard-1-001/lib to classpath: /home/jenkins/workspace/Lucene-Solr-trunk-Linux/solr/build/solr-core/test/J1/temp/solr.cloud.CollectionsAPIDistributedZkTest_A66F97A98B2E5409-001/shard-1-001/lib
   [junit4]   2> 17480 INFO  (TEST-CollectionsAPIDistributedZkTest.test-seed#[A66F97A98B2E5409]) [    ] o.a.s.h.c.HttpShardHandlerFactory created with socketTimeout : 90000,urlScheme : ,connTimeout : 15000,maxConnectionsPerHost : 20,maxConnections : 10000,corePoolSize : 0,maximumPoolSize : 2147483647,maxThreadIdleTime : 5,sizeOfQueue : -1,fairnessPolicy : false,useRetries : false,
   [junit4]   2> 17482 INFO  (TEST-CollectionsAPIDistributedZkTest.test-seed#[A66F97A98B2E5409]) [    ] o.a.s.u.UpdateShardHandler Creating UpdateShardHandler HTTP client with params: socketTimeout=340000&connTimeout=45000&retry=true
   [junit4]   2> 17483 INFO  (TEST-CollectionsAPIDistributedZkTest.test-seed#[A66F97A98B2E5409]) [    ] o.a.s.l.LogWatcher SLF4J impl is org.slf4j.impl.Log4jLoggerFactory
   [junit4]   2> 17483 INFO  (TEST-CollectionsAPIDistributedZkTest.test-seed#[A66F97A98B2E5409]) [    ] o.a.s.l.LogWatcher Registering Log Listener [Log4j (org.slf4j.impl.Log4jLoggerFactory)]
   [junit4]   2> 17483 INFO  (TEST-CollectionsAPIDistributedZkTest.test-seed#[A66F97A98B2E5409]) [    ] o.a.s.c.ZkContainer Zookeeper client=127.0.0.1:39471/solr
   [junit4]   2> 17483 INFO  (TEST-CollectionsAPIDistributedZkTest.test-seed#[A66F97A98B2E5409]) [    ] o.a.s.c.ZkController zkHost includes chroot
   [junit4]   2> 17483 INFO  (TEST-CollectionsAPIDistributedZkTest.test-seed#[A66F97A98B2E5409]) [    ] o.a.s.c.c.SolrZkClient Using default ZkCredentialsProvider
   [junit4]   2> 17483 INFO  (TEST-CollectionsAPIDistributedZkTest.test-seed#[A66F97A98B2E5409]) [    ] o.a.s.c.c.ConnectionManager Waiting for client to connect to ZooKeeper
   [junit4]   2> 17485 INFO  (zkCallback-44-thread-1) [    ] o.a.s.c.c.ConnectionManager Watcher org.apache.solr.common.cloud.ConnectionManager@1b23127 name:ZooKeeperConnection Watcher:127.0.0.1:39471 got event WatchedEvent state:SyncConnected type:None path:null path:null type:None
   [junit4]   2> 17485 INFO  (TEST-CollectionsAPIDistributedZkTest.test-seed#[A66F97A98B2E5409]) [    ] o.a.s.c.c.ConnectionManager Client is connected to ZooKeeper
   [junit4]   2> 17485 INFO  (TEST-CollectionsAPIDistributedZkTest.test-seed#[A66F97A98B2E5409]) [    ] o.a.s.c.c.SolrZkClient Using default ZkACLProvider
   [junit4]   2> 17488 INFO  (TEST-CollectionsAPIDistributedZkTest.test-seed#[A66F97A98B2E5409]) [n:127.0.0.1:51975_    ] o.a.s.c.c.ConnectionManager Waiting for client to connect to ZooKeeper
   [junit4]   2> 17489 INFO  (zkCallback-45-thread-1-processing-n:127.0.0.1:51975_) [n:127.0.0.1:51975_    ] o.a.s.c.c.ConnectionManager Watcher org.apache.solr.common.cloud.ConnectionManager@1d278b5 name:ZooKeeperConnection Watcher:127.0.0.1:39471/solr got event WatchedEvent state:SyncConnected type:None path:null path:nul

[...truncated too long message...]

hread[id=530, name=zkCallback-68-thread-4, state=TIMED_WAITING, group=TGRP-CollectionsAPIDistributedZkTest]
   [junit4]    >         at sun.misc.Unsafe.park(Native Method)
   [junit4]    >         at java.util.concurrent.locks.LockSupport.parkNanos(LockSupport.java:215)
   [junit4]    >         at java.util.concurrent.SynchronousQueue$TransferStack.awaitFulfill(SynchronousQueue.java:460)
   [junit4]    >         at java.util.concurrent.SynchronousQueue$TransferStack.transfer(SynchronousQueue.java:362)
   [junit4]    >         at java.util.concurrent.SynchronousQueue.poll(SynchronousQueue.java:941)
   [junit4]    >         at java.util.concurrent.ThreadPoolExecutor.getTask(ThreadPoolExecutor.java:1066)
   [junit4]    >         at java.util.concurrent.ThreadPoolExecutor.runWorker(ThreadPoolExecutor.java:1127)
   [junit4]    >         at java.util.concurrent.ThreadPoolExecutor$Worker.run(ThreadPoolExecutor.java:617)
   [junit4]    >         at java.lang.Thread.run(Thread.java:745)
   [junit4]    >    4) Thread[id=338, name=TEST-CollectionsAPIDistributedZkTest.test-seed#[A66F97A98B2E5409]-EventThread, state=WAITING, group=TGRP-CollectionsAPIDistributedZkTest]
   [junit4]    >         at sun.misc.Unsafe.park(Native Method)
   [junit4]    >         at java.util.concurrent.locks.LockSupport.park(LockSupport.java:175)
   [junit4]    >         at java.util.concurrent.locks.AbstractQueuedSynchronizer$ConditionObject.await(AbstractQueuedSynchronizer.java:2039)
   [junit4]    >         at java.util.concurrent.LinkedBlockingQueue.take(LinkedBlockingQueue.java:442)
   [junit4]    >         at org.apache.zookeeper.ClientCnxn$EventThread.run(ClientCnxn.java:494)
   [junit4]    >    5) Thread[id=463, name=zkCallback-68-thread-3, state=TIMED_WAITING, group=TGRP-CollectionsAPIDistributedZkTest]
   [junit4]    >         at sun.misc.Unsafe.park(Native Method)
   [junit4]    >         at java.util.concurrent.locks.LockSupport.parkNanos(LockSupport.java:215)
   [junit4]    >         at java.util.concurrent.SynchronousQueue$TransferStack.awaitFulfill(SynchronousQueue.java:460)
   [junit4]    >         at java.util.concurrent.SynchronousQueue$TransferStack.transfer(SynchronousQueue.java:362)
   [junit4]    >         at java.util.concurrent.SynchronousQueue.poll(SynchronousQueue.java:941)
   [junit4]    >         at java.util.concurrent.ThreadPoolExecutor.getTask(ThreadPoolExecutor.java:1066)
   [junit4]    >         at java.util.concurrent.ThreadPoolExecutor.runWorker(ThreadPoolExecutor.java:1127)
   [junit4]    >         at java.util.concurrent.ThreadPoolExecutor$Worker.run(ThreadPoolExecutor.java:617)
   [junit4]    >         at java.lang.Thread.run(Thread.java:745)
   [junit4]    >    6) Thread[id=339, name=zkCallback-68-thread-1, state=TIMED_WAITING, group=TGRP-CollectionsAPIDistributedZkTest]
   [junit4]    >         at sun.misc.Unsafe.park(Native Method)
   [junit4]    >         at java.util.concurrent.locks.LockSupport.parkNanos(LockSupport.java:215)
   [junit4]    >         at java.util.concurrent.SynchronousQueue$TransferStack.awaitFulfill(SynchronousQueue.java:460)
   [junit4]    >         at java.util.concurrent.SynchronousQueue$TransferStack.transfer(SynchronousQueue.java:362)
   [junit4]    >         at java.util.concurrent.SynchronousQueue.poll(SynchronousQueue.java:941)
   [junit4]    >         at java.util.concurrent.ThreadPoolExecutor.getTask(ThreadPoolExecutor.java:1066)
   [junit4]    >         at java.util.concurrent.ThreadPoolExecutor.runWorker(ThreadPoolExecutor.java:1127)
   [junit4]    >         at java.util.concurrent.ThreadPoolExecutor$Worker.run(ThreadPoolExecutor.java:617)
   [junit4]    >         at java.lang.Thread.run(Thread.java:745)
   [junit4]    > 	at __randomizedtesting.SeedInfo.seed([A66F97A98B2E5409]:0)Throwable #2: com.carrotsearch.randomizedtesting.ThreadLeakError: There are still zombie threads that couldn't be terminated:
   [junit4]    >    1) Thread[id=458, name=zkCallback-68-thread-2, state=TIMED_WAITING, group=TGRP-CollectionsAPIDistributedZkTest]
   [junit4]    >         at sun.misc.Unsafe.park(Native Method)
   [junit4]    >         at java.util.concurrent.locks.LockSupport.parkNanos(LockSupport.java:215)
   [junit4]    >         at java.util.concurrent.SynchronousQueue$TransferStack.awaitFulfill(SynchronousQueue.java:460)
   [junit4]    >         at java.util.concurrent.SynchronousQueue$TransferStack.transfer(SynchronousQueue.java:362)
   [junit4]    >         at java.util.concurrent.SynchronousQueue.poll(SynchronousQueue.java:941)
   [junit4]    >         at java.util.concurrent.ThreadPoolExecutor.getTask(ThreadPoolExecutor.java:1066)
   [junit4]    >         at java.util.concurrent.ThreadPoolExecutor.runWorker(ThreadPoolExecutor.java:1127)
   [junit4]    >         at java.util.concurrent.ThreadPoolExecutor$Worker.run(ThreadPoolExecutor.java:617)
   [junit4]    >         at java.lang.Thread.run(Thread.java:745)
   [junit4]    >    2) Thread[id=337, name=TEST-CollectionsAPIDistributedZkTest.test-seed#[A66F97A98B2E5409]-SendThread(127.0.0.1:39471), state=TIMED_WAITING, group=TGRP-CollectionsAPIDistributedZkTest]
   [junit4]    >         at java.lang.Thread.sleep(Native Method)
   [junit4]    >         at org.apache.zookeeper.client.StaticHostProvider.next(StaticHostProvider.java:101)
   [junit4]    >         at org.apache.zookeeper.ClientCnxn$SendThread.startConnect(ClientCnxn.java:940)
   [junit4]    >         at org.apache.zookeeper.ClientCnxn$SendThread.run(ClientCnxn.java:1003)
   [junit4]    >    3) Thread[id=530, name=zkCallback-68-thread-4, state=TIMED_WAITING, group=TGRP-CollectionsAPIDistributedZkTest]
   [junit4]    >         at sun.misc.Unsafe.park(Native Method)
   [junit4]    >         at java.util.concurrent.locks.LockSupport.parkNanos(LockSupport.java:215)
   [junit4]    >         at java.util.concurrent.SynchronousQueue$TransferStack.awaitFulfill(SynchronousQueue.java:460)
   [junit4]    >         at java.util.concurrent.SynchronousQueue$TransferStack.transfer(SynchronousQueue.java:362)
   [junit4]    >         at java.util.concurrent.SynchronousQueue.poll(SynchronousQueue.java:941)
   [junit4]    >         at java.util.concurrent.ThreadPoolExecutor.getTask(ThreadPoolExecutor.java:1066)
   [junit4]    >         at java.util.concurrent.ThreadPoolExecutor.runWorker(ThreadPoolExecutor.java:1127)
   [junit4]    >         at java.util.concurrent.ThreadPoolExecutor$Worker.run(ThreadPoolExecutor.java:617)
   [junit4]    >         at java.lang.Thread.run(Thread.java:745)
   [junit4]    >    4) Thread[id=463, name=zkCallback-68-thread-3, state=TIMED_WAITING, group=TGRP-CollectionsAPIDistributedZkTest]
   [junit4]    >         at sun.misc.Unsafe.park(Native Method)
   [junit4]    >         at java.util.concurrent.locks.LockSupport.parkNanos(LockSupport.java:215)
   [junit4]    >         at java.util.concurrent.SynchronousQueue$TransferStack.awaitFulfill(SynchronousQueue.java:460)
   [junit4]    >         at java.util.concurrent.SynchronousQueue$TransferStack.transfer(SynchronousQueue.java:362)
   [junit4]    >         at java.util.concurrent.SynchronousQueue.poll(SynchronousQueue.java:941)
   [junit4]    >         at java.util.concurrent.ThreadPoolExecutor.getTask(ThreadPoolExecutor.java:1066)
   [junit4]    >         at java.util.concurrent.ThreadPoolExecutor.runWorker(ThreadPoolExecutor.java:1127)
   [junit4]    >         at java.util.concurrent.ThreadPoolExecutor$Worker.run(ThreadPoolExecutor.java:617)
   [junit4]    >         at java.lang.Thread.run(Thread.java:745)
   [junit4]    >    5) Thread[id=339, name=zkCallback-68-thread-1, state=TIMED_WAITING, group=TGRP-CollectionsAPIDistributedZkTest]
   [junit4]    >         at sun.misc.Unsafe.park(Native Method)
   [junit4]    >         at java.util.concurrent.locks.LockSupport.parkNanos(LockSupport.java:215)
   [junit4]    >         at java.util.concurrent.SynchronousQueue$TransferStack.awaitFulfill(SynchronousQueue.java:460)
   [junit4]    >         at java.util.concurrent.SynchronousQueue$TransferStack.transfer(SynchronousQueue.java:362)
   [junit4]    >         at java.util.concurrent.SynchronousQueue.poll(SynchronousQueue.java:941)
   [junit4]    >         at java.util.concurrent.ThreadPoolExecutor.getTask(ThreadPoolExecutor.java:1066)
   [junit4]    >         at java.util.concurrent.ThreadPoolExecutor.runWorker(ThreadPoolExecutor.java:1127)
   [junit4]    >         at java.util.concurrent.ThreadPoolExecutor$Worker.run(ThreadPoolExecutor.java:617)
   [junit4]    >         at java.lang.Thread.run(Thread.java:745)
   [junit4]    > 	at __randomizedtesting.SeedInfo.seed([A66F97A98B2E5409]:0)
   [junit4] Completed [24/577 (1!)] on J1 in 77.68s, 1 test, 3 errors <<< FAILURES!

[...truncated 1775 lines...]
BUILD FAILED
/home/jenkins/workspace/Lucene-Solr-trunk-Linux/build.xml:740: The following error occurred while executing this line:
/home/jenkins/workspace/Lucene-Solr-trunk-Linux/build.xml:684: The following error occurred while executing this line:
/home/jenkins/workspace/Lucene-Solr-trunk-Linux/build.xml:59: The following error occurred while executing this line:
/home/jenkins/workspace/Lucene-Solr-trunk-Linux/solr/build.xml:233: The following error occurred while executing this line:
/home/jenkins/workspace/Lucene-Solr-trunk-Linux/solr/common-build.xml:524: The following error occurred while executing this line:
/home/jenkins/workspace/Lucene-Solr-trunk-Linux/lucene/common-build.xml:1457: The following error occurred while executing this line:
/home/jenkins/workspace/Lucene-Solr-trunk-Linux/lucene/common-build.xml:1014: There were test failures: 577 suites (8 ignored), 2318 tests, 2 suite-level errors, 1 error, 1354 ignored (62 assumptions) [seed: A66F97A98B2E5409]

Total time: 36 minutes 0 seconds
Build step 'Invoke Ant' marked build as failure
Archiving artifacts
[WARNINGS] Skipping publisher since build result is FAILURE
Recording test results
Email was triggered for: Failure - Any
Sending email for trigger: Failure - Any



Mime
View raw message