lucene-dev mailing list archives

Site index · List index
Message view « Date » · « Thread »
Top « Date » · « Thread »
From Policeman Jenkins Server <jenk...@thetaphi.de>
Subject [JENKINS] Lucene-Solr-trunk-Windows (64bit/jdk1.8.0_72) - Build # 5607 - Still Failing!
Date Mon, 08 Feb 2016 19:44:53 GMT
Build: http://jenkins.thetaphi.de/job/Lucene-Solr-trunk-Windows/5607/
Java: 64bit/jdk1.8.0_72 -XX:+UseCompressedOops -XX:+UseConcMarkSweepGC

4 tests failed.
FAILED:  junit.framework.TestSuite.org.apache.solr.core.TestLazyCores

Error Message:
ObjectTracker found 4 object(s) that were not released!!! [MDCAwareThreadPoolExecutor, MockDirectoryWrapper, SolrCore, MockDirectoryWrapper]

Stack Trace:
java.lang.AssertionError: ObjectTracker found 4 object(s) that were not released!!! [MDCAwareThreadPoolExecutor, MockDirectoryWrapper, SolrCore, MockDirectoryWrapper]
	at __randomizedtesting.SeedInfo.seed([B4E8B3C1ADDDE1B]:0)
	at org.junit.Assert.fail(Assert.java:93)
	at org.junit.Assert.assertTrue(Assert.java:43)
	at org.junit.Assert.assertNull(Assert.java:551)
	at org.apache.solr.SolrTestCaseJ4.afterClass(SolrTestCaseJ4.java:228)
	at sun.reflect.NativeMethodAccessorImpl.invoke0(Native Method)
	at sun.reflect.NativeMethodAccessorImpl.invoke(NativeMethodAccessorImpl.java:62)
	at sun.reflect.DelegatingMethodAccessorImpl.invoke(DelegatingMethodAccessorImpl.java:43)
	at java.lang.reflect.Method.invoke(Method.java:498)
	at com.carrotsearch.randomizedtesting.RandomizedRunner.invoke(RandomizedRunner.java:1764)
	at com.carrotsearch.randomizedtesting.RandomizedRunner$7.evaluate(RandomizedRunner.java:834)
	at com.carrotsearch.randomizedtesting.rules.StatementAdapter.evaluate(StatementAdapter.java:36)
	at com.carrotsearch.randomizedtesting.rules.SystemPropertiesRestoreRule$1.evaluate(SystemPropertiesRestoreRule.java:57)
	at org.apache.lucene.util.AbstractBeforeAfterRule$1.evaluate(AbstractBeforeAfterRule.java:45)
	at com.carrotsearch.randomizedtesting.rules.StatementAdapter.evaluate(StatementAdapter.java:36)
	at org.apache.lucene.util.TestRuleStoreClassName$1.evaluate(TestRuleStoreClassName.java:41)
	at com.carrotsearch.randomizedtesting.rules.NoShadowingOrOverridesOnMethodsRule$1.evaluate(NoShadowingOrOverridesOnMethodsRule.java:40)
	at com.carrotsearch.randomizedtesting.rules.NoShadowingOrOverridesOnMethodsRule$1.evaluate(NoShadowingOrOverridesOnMethodsRule.java:40)
	at com.carrotsearch.randomizedtesting.rules.StatementAdapter.evaluate(StatementAdapter.java:36)
	at com.carrotsearch.randomizedtesting.rules.StatementAdapter.evaluate(StatementAdapter.java:36)
	at com.carrotsearch.randomizedtesting.rules.StatementAdapter.evaluate(StatementAdapter.java:36)
	at org.apache.lucene.util.TestRuleAssertionsRequired$1.evaluate(TestRuleAssertionsRequired.java:53)
	at org.apache.lucene.util.TestRuleMarkFailure$1.evaluate(TestRuleMarkFailure.java:47)
	at org.apache.lucene.util.TestRuleIgnoreAfterMaxFailures$1.evaluate(TestRuleIgnoreAfterMaxFailures.java:64)
	at org.apache.lucene.util.TestRuleIgnoreTestSuites$1.evaluate(TestRuleIgnoreTestSuites.java:54)
	at com.carrotsearch.randomizedtesting.rules.StatementAdapter.evaluate(StatementAdapter.java:36)
	at com.carrotsearch.randomizedtesting.ThreadLeakControl$StatementRunner.run(ThreadLeakControl.java:367)
	at java.lang.Thread.run(Thread.java:745)


FAILED:  junit.framework.TestSuite.org.apache.solr.core.TestLazyCores

Error Message:
1 thread leaked from SUITE scope at org.apache.solr.core.TestLazyCores:     1) Thread[id=122, name=searcherExecutor-165-thread-1, state=WAITING, group=TGRP-TestLazyCores]         at sun.misc.Unsafe.park(Native Method)         at java.util.concurrent.locks.LockSupport.park(LockSupport.java:175)         at java.util.concurrent.locks.AbstractQueuedSynchronizer$ConditionObject.await(AbstractQueuedSynchronizer.java:2039)         at java.util.concurrent.LinkedBlockingQueue.take(LinkedBlockingQueue.java:442)         at java.util.concurrent.ThreadPoolExecutor.getTask(ThreadPoolExecutor.java:1067)         at java.util.concurrent.ThreadPoolExecutor.runWorker(ThreadPoolExecutor.java:1127)         at java.util.concurrent.ThreadPoolExecutor$Worker.run(ThreadPoolExecutor.java:617)         at java.lang.Thread.run(Thread.java:745)

Stack Trace:
com.carrotsearch.randomizedtesting.ThreadLeakError: 1 thread leaked from SUITE scope at org.apache.solr.core.TestLazyCores: 
   1) Thread[id=122, name=searcherExecutor-165-thread-1, state=WAITING, group=TGRP-TestLazyCores]
        at sun.misc.Unsafe.park(Native Method)
        at java.util.concurrent.locks.LockSupport.park(LockSupport.java:175)
        at java.util.concurrent.locks.AbstractQueuedSynchronizer$ConditionObject.await(AbstractQueuedSynchronizer.java:2039)
        at java.util.concurrent.LinkedBlockingQueue.take(LinkedBlockingQueue.java:442)
        at java.util.concurrent.ThreadPoolExecutor.getTask(ThreadPoolExecutor.java:1067)
        at java.util.concurrent.ThreadPoolExecutor.runWorker(ThreadPoolExecutor.java:1127)
        at java.util.concurrent.ThreadPoolExecutor$Worker.run(ThreadPoolExecutor.java:617)
        at java.lang.Thread.run(Thread.java:745)
	at __randomizedtesting.SeedInfo.seed([B4E8B3C1ADDDE1B]:0)


FAILED:  junit.framework.TestSuite.org.apache.solr.core.TestLazyCores

Error Message:
There are still zombie threads that couldn't be terminated:    1) Thread[id=122, name=searcherExecutor-165-thread-1, state=WAITING, group=TGRP-TestLazyCores]         at sun.misc.Unsafe.park(Native Method)         at java.util.concurrent.locks.LockSupport.park(LockSupport.java:175)         at java.util.concurrent.locks.AbstractQueuedSynchronizer$ConditionObject.await(AbstractQueuedSynchronizer.java:2039)         at java.util.concurrent.LinkedBlockingQueue.take(LinkedBlockingQueue.java:442)         at java.util.concurrent.ThreadPoolExecutor.getTask(ThreadPoolExecutor.java:1067)         at java.util.concurrent.ThreadPoolExecutor.runWorker(ThreadPoolExecutor.java:1127)         at java.util.concurrent.ThreadPoolExecutor$Worker.run(ThreadPoolExecutor.java:617)         at java.lang.Thread.run(Thread.java:745)

Stack Trace:
com.carrotsearch.randomizedtesting.ThreadLeakError: There are still zombie threads that couldn't be terminated:
   1) Thread[id=122, name=searcherExecutor-165-thread-1, state=WAITING, group=TGRP-TestLazyCores]
        at sun.misc.Unsafe.park(Native Method)
        at java.util.concurrent.locks.LockSupport.park(LockSupport.java:175)
        at java.util.concurrent.locks.AbstractQueuedSynchronizer$ConditionObject.await(AbstractQueuedSynchronizer.java:2039)
        at java.util.concurrent.LinkedBlockingQueue.take(LinkedBlockingQueue.java:442)
        at java.util.concurrent.ThreadPoolExecutor.getTask(ThreadPoolExecutor.java:1067)
        at java.util.concurrent.ThreadPoolExecutor.runWorker(ThreadPoolExecutor.java:1127)
        at java.util.concurrent.ThreadPoolExecutor$Worker.run(ThreadPoolExecutor.java:617)
        at java.lang.Thread.run(Thread.java:745)
	at __randomizedtesting.SeedInfo.seed([B4E8B3C1ADDDE1B]:0)


FAILED:  org.apache.solr.handler.component.SpellCheckComponentTest.testNumericQuery

Error Message:
List size mismatch @ spellcheck/suggestions

Stack Trace:
java.lang.RuntimeException: List size mismatch @ spellcheck/suggestions
	at __randomizedtesting.SeedInfo.seed([B4E8B3C1ADDDE1B:62DCFC851462B4]:0)
	at org.apache.solr.SolrTestCaseJ4.assertJQ(SolrTestCaseJ4.java:842)
	at org.apache.solr.SolrTestCaseJ4.assertJQ(SolrTestCaseJ4.java:789)
	at org.apache.solr.handler.component.SpellCheckComponentTest.testNumericQuery(SpellCheckComponentTest.java:154)
	at sun.reflect.NativeMethodAccessorImpl.invoke0(Native Method)
	at sun.reflect.NativeMethodAccessorImpl.invoke(NativeMethodAccessorImpl.java:62)
	at sun.reflect.DelegatingMethodAccessorImpl.invoke(DelegatingMethodAccessorImpl.java:43)
	at java.lang.reflect.Method.invoke(Method.java:498)
	at com.carrotsearch.randomizedtesting.RandomizedRunner.invoke(RandomizedRunner.java:1764)
	at com.carrotsearch.randomizedtesting.RandomizedRunner$8.evaluate(RandomizedRunner.java:871)
	at com.carrotsearch.randomizedtesting.RandomizedRunner$9.evaluate(RandomizedRunner.java:907)
	at com.carrotsearch.randomizedtesting.RandomizedRunner$10.evaluate(RandomizedRunner.java:921)
	at com.carrotsearch.randomizedtesting.rules.SystemPropertiesRestoreRule$1.evaluate(SystemPropertiesRestoreRule.java:57)
	at org.apache.lucene.util.TestRuleSetupTeardownChained$1.evaluate(TestRuleSetupTeardownChained.java:49)
	at org.apache.lucene.util.AbstractBeforeAfterRule$1.evaluate(AbstractBeforeAfterRule.java:45)
	at org.apache.lucene.util.TestRuleThreadAndTestName$1.evaluate(TestRuleThreadAndTestName.java:48)
	at org.apache.lucene.util.TestRuleIgnoreAfterMaxFailures$1.evaluate(TestRuleIgnoreAfterMaxFailures.java:64)
	at org.apache.lucene.util.TestRuleMarkFailure$1.evaluate(TestRuleMarkFailure.java:47)
	at com.carrotsearch.randomizedtesting.rules.StatementAdapter.evaluate(StatementAdapter.java:36)
	at com.carrotsearch.randomizedtesting.ThreadLeakControl$StatementRunner.run(ThreadLeakControl.java:367)
	at com.carrotsearch.randomizedtesting.ThreadLeakControl.forkTimeoutingTask(ThreadLeakControl.java:809)
	at com.carrotsearch.randomizedtesting.ThreadLeakControl$3.evaluate(ThreadLeakControl.java:460)
	at com.carrotsearch.randomizedtesting.RandomizedRunner.runSingleTest(RandomizedRunner.java:880)
	at com.carrotsearch.randomizedtesting.RandomizedRunner$5.evaluate(RandomizedRunner.java:781)
	at com.carrotsearch.randomizedtesting.RandomizedRunner$6.evaluate(RandomizedRunner.java:816)
	at com.carrotsearch.randomizedtesting.RandomizedRunner$7.evaluate(RandomizedRunner.java:827)
	at com.carrotsearch.randomizedtesting.rules.StatementAdapter.evaluate(StatementAdapter.java:36)
	at com.carrotsearch.randomizedtesting.rules.SystemPropertiesRestoreRule$1.evaluate(SystemPropertiesRestoreRule.java:57)
	at org.apache.lucene.util.AbstractBeforeAfterRule$1.evaluate(AbstractBeforeAfterRule.java:45)
	at com.carrotsearch.randomizedtesting.rules.StatementAdapter.evaluate(StatementAdapter.java:36)
	at org.apache.lucene.util.TestRuleStoreClassName$1.evaluate(TestRuleStoreClassName.java:41)
	at com.carrotsearch.randomizedtesting.rules.NoShadowingOrOverridesOnMethodsRule$1.evaluate(NoShadowingOrOverridesOnMethodsRule.java:40)
	at com.carrotsearch.randomizedtesting.rules.NoShadowingOrOverridesOnMethodsRule$1.evaluate(NoShadowingOrOverridesOnMethodsRule.java:40)
	at com.carrotsearch.randomizedtesting.rules.StatementAdapter.evaluate(StatementAdapter.java:36)
	at com.carrotsearch.randomizedtesting.rules.StatementAdapter.evaluate(StatementAdapter.java:36)
	at com.carrotsearch.randomizedtesting.rules.StatementAdapter.evaluate(StatementAdapter.java:36)
	at org.apache.lucene.util.TestRuleAssertionsRequired$1.evaluate(TestRuleAssertionsRequired.java:53)
	at org.apache.lucene.util.TestRuleMarkFailure$1.evaluate(TestRuleMarkFailure.java:47)
	at org.apache.lucene.util.TestRuleIgnoreAfterMaxFailures$1.evaluate(TestRuleIgnoreAfterMaxFailures.java:64)
	at org.apache.lucene.util.TestRuleIgnoreTestSuites$1.evaluate(TestRuleIgnoreTestSuites.java:54)
	at com.carrotsearch.randomizedtesting.rules.StatementAdapter.evaluate(StatementAdapter.java:36)
	at com.carrotsearch.randomizedtesting.ThreadLeakControl$StatementRunner.run(ThreadLeakControl.java:367)
	at java.lang.Thread.run(Thread.java:745)




Build Log:
[...truncated 10402 lines...]
   [junit4] Suite: org.apache.solr.core.TestLazyCores
   [junit4]   2> Creating dataDir: C:\Users\JenkinsSlave\workspace\Lucene-Solr-trunk-Windows\solr\build\solr-core\test\J0\temp\solr.core.TestLazyCores_B4E8B3C1ADDDE1B-001\init-core-data-001
   [junit4]   2> 0    INFO  (SUITE-TestLazyCores-seed#[B4E8B3C1ADDDE1B]-worker) [    ] o.a.s.SolrTestCaseJ4 Randomized ssl (false) and clientAuth (false)
   [junit4]   2> 120  INFO  (TEST-TestLazyCores.testLazySearch-seed#[B4E8B3C1ADDDE1B]) [    ] o.a.s.SolrTestCaseJ4 ###Starting testLazySearch
   [junit4]   2> 402  INFO  (TEST-TestLazyCores.testLazySearch-seed#[B4E8B3C1ADDDE1B]) [    ] o.a.s.c.SolrResourceLoader new SolrResourceLoader for directory: 'C:\Users\JenkinsSlave\workspace\Lucene-Solr-trunk-Windows\solr\build\solr-core\test\J0\temp\solr.core.TestLazyCores_B4E8B3C1ADDDE1B-001\tempDir-001'
   [junit4]   2> 414  INFO  (TEST-TestLazyCores.testLazySearch-seed#[B4E8B3C1ADDDE1B]) [    ] o.a.s.c.SolrResourceLoader JNDI not configured for solr (NoInitialContextEx)
   [junit4]   2> 414  INFO  (TEST-TestLazyCores.testLazySearch-seed#[B4E8B3C1ADDDE1B]) [    ] o.a.s.c.SolrResourceLoader solr home defaulted to 'solr/' (could not find system property or JNDI)
   [junit4]   2> 606  INFO  (TEST-TestLazyCores.testLazySearch-seed#[B4E8B3C1ADDDE1B]) [    ] o.a.s.c.CoreContainer New CoreContainer 1857853639
   [junit4]   2> 607  INFO  (TEST-TestLazyCores.testLazySearch-seed#[B4E8B3C1ADDDE1B]) [    ] o.a.s.c.CoreContainer Loading cores into CoreContainer [instanceDir=C:\Users\JenkinsSlave\workspace\Lucene-Solr-trunk-Windows\solr\build\solr-core\test\J0\temp\solr.core.TestLazyCores_B4E8B3C1ADDDE1B-001\tempDir-001]
   [junit4]   2> 612  WARN  (TEST-TestLazyCores.testLazySearch-seed#[B4E8B3C1ADDDE1B]) [    ] o.a.s.c.CoreContainer Couldn't add files from C:\Users\JenkinsSlave\workspace\Lucene-Solr-trunk-Windows\solr\build\solr-core\test\J0\temp\solr.core.TestLazyCores_B4E8B3C1ADDDE1B-001\tempDir-001\lib to classpath: C:\Users\JenkinsSlave\workspace\Lucene-Solr-trunk-Windows\solr\build\solr-core\test\J0\temp\solr.core.TestLazyCores_B4E8B3C1ADDDE1B-001\tempDir-001\lib
   [junit4]   2> 681  INFO  (TEST-TestLazyCores.testLazySearch-seed#[B4E8B3C1ADDDE1B]) [    ] o.a.s.h.c.HttpShardHandlerFactory created with socketTimeout : 600000,connTimeout : 60000,maxConnectionsPerHost : 20,maxConnections : 10000,corePoolSize : 0,maximumPoolSize : 2147483647,maxThreadIdleTime : 5,sizeOfQueue : -1,fairnessPolicy : false,useRetries : false,
   [junit4]   2> 1331 INFO  (TEST-TestLazyCores.testLazySearch-seed#[B4E8B3C1ADDDE1B]) [    ] o.a.s.u.UpdateShardHandler Creating UpdateShardHandler HTTP client with params: socketTimeout=600000&connTimeout=60000&retry=true
   [junit4]   2> 1337 INFO  (TEST-TestLazyCores.testLazySearch-seed#[B4E8B3C1ADDDE1B]) [    ] o.a.s.c.SolrCores Allocating transient cache for 4 transient cores
   [junit4]   2> 1351 INFO  (TEST-TestLazyCores.testLazySearch-seed#[B4E8B3C1ADDDE1B]) [    ] o.a.s.l.LogWatcher SLF4J impl is org.slf4j.impl.Log4jLoggerFactory
   [junit4]   2> 1354 INFO  (TEST-TestLazyCores.testLazySearch-seed#[B4E8B3C1ADDDE1B]) [    ] o.a.s.l.LogWatcher Registering Log Listener [Log4j (org.slf4j.impl.Log4jLoggerFactory)]
   [junit4]   2> 1366 INFO  (TEST-TestLazyCores.testLazySearch-seed#[B4E8B3C1ADDDE1B]) [    ] o.a.s.c.CoreContainer Security conf doesn't exist. Skipping setup for authorization module.
   [junit4]   2> 1367 INFO  (TEST-TestLazyCores.testLazySearch-seed#[B4E8B3C1ADDDE1B]) [    ] o.a.s.c.CoreContainer No authentication plugin used.
   [junit4]   2> 1635 INFO  (TEST-TestLazyCores.testLazySearch-seed#[B4E8B3C1ADDDE1B]) [    ] o.a.s.c.CoreDescriptor Created CoreDescriptor: {name=collection1, config=solrconfig.xml, loadOnStartup=true, schema=schema.xml, configSetProperties=configsetprops.json, transient=false, dataDir=data\}
   [junit4]   2> 1636 INFO  (TEST-TestLazyCores.testLazySearch-seed#[B4E8B3C1ADDDE1B]) [    ] o.a.s.c.CoreDescriptor Created CoreDescriptor: {name=collection2, config=solrconfig.xml, loadOnStartup=true, schema=schema.xml, configSetProperties=configsetprops.json, transient=true, dataDir=data\}
   [junit4]   2> 1637 INFO  (TEST-TestLazyCores.testLazySearch-seed#[B4E8B3C1ADDDE1B]) [    ] o.a.s.c.CoreDescriptor Created CoreDescriptor: {name=collection3, config=solrconfig.xml, loadOnStartup=false, schema=schema.xml, configSetProperties=configsetprops.json, transient=on, dataDir=data\}
   [junit4]   2> 1639 INFO  (TEST-TestLazyCores.testLazySearch-seed#[B4E8B3C1ADDDE1B]) [    ] o.a.s.c.CoreDescriptor Created CoreDescriptor: {name=collection4, config=solrconfig.xml, loadOnStartup=false, schema=schema.xml, configSetProperties=configsetprops.json, transient=false, dataDir=data\}
   [junit4]   2> 1641 INFO  (TEST-TestLazyCores.testLazySearch-seed#[B4E8B3C1ADDDE1B]) [    ] o.a.s.c.CoreDescriptor Created CoreDescriptor: {name=collection5, config=solrconfig.xml, loadOnStartup=true, schema=schema.xml, configSetProperties=configsetprops.json, transient=false, dataDir=data\}
   [junit4]   2> 1642 INFO  (TEST-TestLazyCores.testLazySearch-seed#[B4E8B3C1ADDDE1B]) [    ] o.a.s.c.CoreDescriptor Created CoreDescriptor: {name=collection6, config=solrconfig.xml, loadOnStartup=false, schema=schema.xml, configSetProperties=configsetprops.json, transient=true, dataDir=data\}
   [junit4]   2> 1642 INFO  (TEST-TestLazyCores.testLazySearch-seed#[B4E8B3C1ADDDE1B]) [    ] o.a.s.c.CoreDescriptor Created CoreDescriptor: {name=collection7, config=solrconfig.xml, loadOnStartup=false, schema=schema.xml, configSetProperties=configsetprops.json, transient=true, dataDir=data\}
   [junit4]   2> 1644 INFO  (TEST-TestLazyCores.testLazySearch-seed#[B4E8B3C1ADDDE1B]) [    ] o.a.s.c.CoreDescriptor Created CoreDescriptor: {name=collection8, config=solrconfig.xml, loadOnStartup=false, schema=schema.xml, configSetProperties=configsetprops.json, transient=true, dataDir=data\}
   [junit4]   2> 1646 INFO  (TEST-TestLazyCores.testLazySearch-seed#[B4E8B3C1ADDDE1B]) [    ] o.a.s.c.CoreDescriptor Created CoreDescriptor: {name=collection9, config=solrconfig.xml, loadOnStartup=false, schema=schema.xml, configSetProperties=configsetprops.json, transient=true, dataDir=data\}
   [junit4]   2> 1672 INFO  (coreLoadExecutor-6-thread-1) [    ] o.a.s.c.SolrResourceLoader new SolrResourceLoader for directory: 'C:\Users\JenkinsSlave\workspace\Lucene-Solr-trunk-Windows\solr\build\solr-core\test\J0\temp\solr.core.TestLazyCores_B4E8B3C1ADDDE1B-001\tempDir-001\collection1'
   [junit4]   2> 1672 INFO  (coreLoadExecutor-6-thread-3) [    ] o.a.s.c.SolrResourceLoader new SolrResourceLoader for directory: 'C:\Users\JenkinsSlave\workspace\Lucene-Solr-trunk-Windows\solr\build\solr-core\test\J0\temp\solr.core.TestLazyCores_B4E8B3C1ADDDE1B-001\tempDir-001\collection5'
   [junit4]   2> 1672 INFO  (coreLoadExecutor-6-thread-2) [    ] o.a.s.c.SolrResourceLoader new SolrResourceLoader for directory: 'C:\Users\JenkinsSlave\workspace\Lucene-Solr-trunk-Windows\solr\build\solr-core\test\J0\temp\solr.core.TestLazyCores_B4E8B3C1ADDDE1B-001\tempDir-001\collection2'
   [junit4]   2> 1673 INFO  (coreLoadExecutor-6-thread-3) [    ] o.a.s.c.SolrResourceLoader JNDI not configured for solr (NoInitialContextEx)
   [junit4]   2> 1673 INFO  (coreLoadExecutor-6-thread-1) [    ] o.a.s.c.SolrResourceLoader JNDI not configured for solr (NoInitialContextEx)
   [junit4]   2> 1674 INFO  (coreLoadExecutor-6-thread-3) [    ] o.a.s.c.SolrResourceLoader solr home defaulted to 'solr/' (could not find system property or JNDI)
   [junit4]   2> 1674 INFO  (coreLoadExecutor-6-thread-1) [    ] o.a.s.c.SolrResourceLoader solr home defaulted to 'solr/' (could not find system property or JNDI)
   [junit4]   2> 1681 INFO  (coreLoadExecutor-6-thread-2) [    ] o.a.s.c.SolrResourceLoader JNDI not configured for solr (NoInitialContextEx)
   [junit4]   2> 1681 INFO  (coreLoadExecutor-6-thread-2) [    ] o.a.s.c.SolrResourceLoader solr home defaulted to 'solr/' (could not find system property or JNDI)
   [junit4]   2> 1828 INFO  (coreLoadExecutor-6-thread-1) [    ] o.a.s.c.SolrConfig current version of requestparams : -1
   [junit4]   2> 1834 INFO  (coreLoadExecutor-6-thread-2) [    ] o.a.s.c.SolrConfig current version of requestparams : -1
   [junit4]   2> 1834 INFO  (coreLoadExecutor-6-thread-3) [    ] o.a.s.c.SolrConfig current version of requestparams : -1
   [junit4]   2> 1900 INFO  (coreLoadExecutor-6-thread-2) [    ] o.a.s.c.SolrConfig Using Lucene MatchVersion: 6.0.0
   [junit4]   2> 1905 INFO  (coreLoadExecutor-6-thread-1) [    ] o.a.s.c.SolrConfig Using Lucene MatchVersion: 6.0.0
   [junit4]   2> 1912 INFO  (coreLoadExecutor-6-thread-3) [    ] o.a.s.c.SolrConfig Using Lucene MatchVersion: 6.0.0
   [junit4]   2> 2050 INFO  (coreLoadExecutor-6-thread-2) [    ] o.a.s.c.SolrConfig Loaded SolrConfig: solrconfig.xml
   [junit4]   2> 2050 INFO  (coreLoadExecutor-6-thread-1) [    ] o.a.s.c.SolrConfig Loaded SolrConfig: solrconfig.xml
   [junit4]   2> 2050 INFO  (coreLoadExecutor-6-thread-3) [    ] o.a.s.c.SolrConfig Loaded SolrConfig: solrconfig.xml
   [junit4]   2> 2087 INFO  (coreLoadExecutor-6-thread-2) [    ] o.a.s.s.IndexSchema [collection2] Schema name=tiny
   [junit4]   2> 2106 INFO  (coreLoadExecutor-6-thread-1) [    ] o.a.s.s.IndexSchema [collection1] Schema name=tiny
   [junit4]   2> 2114 INFO  (coreLoadExecutor-6-thread-3) [    ] o.a.s.s.IndexSchema [collection5] Schema name=tiny
   [junit4]   2> 2700 INFO  (coreLoadExecutor-6-thread-2) [    ] o.a.s.s.IndexSchema unique key field: id
   [junit4]   2> 2702 INFO  (coreLoadExecutor-6-thread-1) [    ] o.a.s.s.IndexSchema unique key field: id
   [junit4]   2> 2704 INFO  (coreLoadExecutor-6-thread-3) [    ] o.a.s.s.IndexSchema unique key field: id
   [junit4]   2> 2728 INFO  (coreLoadExecutor-6-thread-2) [    ] o.a.s.c.ConfigSetProperties Did not find ConfigSet properties, assuming default properties: Can't find resource 'configsetprops.json' in classpath or 'C:\Users\JenkinsSlave\workspace\Lucene-Solr-trunk-Windows\solr\build\solr-core\test\J0\temp\solr.core.TestLazyCores_B4E8B3C1ADDDE1B-001\tempDir-001\collection2'
   [junit4]   2> 2728 INFO  (coreLoadExecutor-6-thread-1) [    ] o.a.s.c.ConfigSetProperties Did not find ConfigSet properties, assuming default properties: Can't find resource 'configsetprops.json' in classpath or 'C:\Users\JenkinsSlave\workspace\Lucene-Solr-trunk-Windows\solr\build\solr-core\test\J0\temp\solr.core.TestLazyCores_B4E8B3C1ADDDE1B-001\tempDir-001\collection1'
   [junit4]   2> 2730 INFO  (coreLoadExecutor-6-thread-3) [    ] o.a.s.c.ConfigSetProperties Did not find ConfigSet properties, assuming default properties: Can't find resource 'configsetprops.json' in classpath or 'C:\Users\JenkinsSlave\workspace\Lucene-Solr-trunk-Windows\solr\build\solr-core\test\J0\temp\solr.core.TestLazyCores_B4E8B3C1ADDDE1B-001\tempDir-001\collection5'
   [junit4]   2> 2731 INFO  (coreLoadExecutor-6-thread-2) [    ] o.a.s.c.CoreContainer Creating SolrCore 'collection2' using configuration from instancedir C:\Users\JenkinsSlave\workspace\Lucene-Solr-trunk-Windows\solr\build\solr-core\test\J0\temp\solr.core.TestLazyCores_B4E8B3C1ADDDE1B-001\tempDir-001\collection2
   [junit4]   2> 2734 INFO  (coreLoadExecutor-6-thread-3) [    ] o.a.s.c.CoreContainer Creating SolrCore 'collection5' using configuration from instancedir C:\Users\JenkinsSlave\workspace\Lucene-Solr-trunk-Windows\solr\build\solr-core\test\J0\temp\solr.core.TestLazyCores_B4E8B3C1ADDDE1B-001\tempDir-001\collection5
   [junit4]   2> 2734 INFO  (coreLoadExecutor-6-thread-1) [    ] o.a.s.c.CoreContainer Creating SolrCore 'collection1' using configuration from instancedir C:\Users\JenkinsSlave\workspace\Lucene-Solr-trunk-Windows\solr\build\solr-core\test\J0\temp\solr.core.TestLazyCores_B4E8B3C1ADDDE1B-001\tempDir-001\collection1
   [junit4]   2> 2861 INFO  (coreLoadExecutor-6-thread-2) [    x:collection2] o.a.s.c.SolrCore org.apache.solr.core.MockDirectoryFactory
   [junit4]   2> 2862 INFO  (coreLoadExecutor-6-thread-1) [    x:collection1] o.a.s.c.SolrCore org.apache.solr.core.MockDirectoryFactory
   [junit4]   2> 2864 INFO  (coreLoadExecutor-6-thread-3) [    x:collection5] o.a.s.c.SolrCore org.apache.solr.core.MockDirectoryFactory
   [junit4]   2> 2899 INFO  (coreLoadExecutor-6-thread-2) [    x:collection2] o.a.s.c.SolrCore [[collection2] ] Opening new SolrCore at [C:\Users\JenkinsSlave\workspace\Lucene-Solr-trunk-Windows\solr\build\solr-core\test\J0\temp\solr.core.TestLazyCores_B4E8B3C1ADDDE1B-001\tempDir-001\collection2], dataDir=[C:\Users\JenkinsSlave\workspace\Lucene-Solr-trunk-Windows\solr\build\solr-core\test\J0\temp\solr.core.TestLazyCores_B4E8B3C1ADDDE1B-001\tempDir-001\collection2\data\]
   [junit4]   2> 2899 INFO  (coreLoadExecutor-6-thread-2) [    x:collection2] o.a.s.c.SolrCore JMX monitoring not detected for core: collection2
   [junit4]   2> 2900 INFO  (coreLoadExecutor-6-thread-1) [    x:collection1] o.a.s.c.SolrCore [[collection1] ] Opening new SolrCore at [C:\Users\JenkinsSlave\workspace\Lucene-Solr-trunk-Windows\solr\build\solr-core\test\J0\temp\solr.core.TestLazyCores_B4E8B3C1ADDDE1B-001\tempDir-001\collection1], dataDir=[C:\Users\JenkinsSlave\workspace\Lucene-Solr-trunk-Windows\solr\build\solr-core\test\J0\temp\solr.core.TestLazyCores_B4E8B3C1ADDDE1B-001\tempDir-001\collection1\data\]
   [junit4]   2> 2900 INFO  (coreLoadExecutor-6-thread-1) [    x:collection1] o.a.s.c.SolrCore JMX monitoring not detected for core: collection1
   [junit4]   2> 2901 INFO  (coreLoadExecutor-6-thread-3) [    x:collection5] o.a.s.c.SolrCore [[collection5] ] Opening new SolrCore at [C:\Users\JenkinsSlave\workspace\Lucene-Solr-trunk-Windows\solr\build\solr-core\test\J0\temp\solr.core.TestLazyCores_B4E8B3C1ADDDE1B-001\tempDir-001\collection5], dataDir=[C:\Users\JenkinsSlave\workspace\Lucene-Solr-trunk-Windows\solr\build\solr-core\test\J0\temp\solr.core.TestLazyCores_B4E8B3C1ADDDE1B-001\tempDir-001\collection5\data\]
   [junit4]   2> 2901 INFO  (coreLoadExecutor-6-thread-3) [    x:collection5] o.a.s.c.SolrCore JMX monitoring not detected for core: collection5
   [junit4]   2> 2975 INFO  (coreLoadExecutor-6-thread-2) [    x:collection2] o.a.s.c.CachingDirectoryFactory return new directory for C:\Users\JenkinsSlave\workspace\Lucene-Solr-trunk-Windows\solr\build\solr-core\test\J0\temp\solr.core.TestLazyCores_B4E8B3C1ADDDE1B-001\tempDir-001\collection2\data\
   [junit4]   2> 2976 INFO  (coreLoadExecutor-6-thread-2) [    x:collection2] o.a.s.c.SolrCore New index directory detected: old=null new=C:\Users\JenkinsSlave\workspace\Lucene-Solr-trunk-Windows\solr\build\solr-core\test\J0\temp\solr.core.TestLazyCores_B4E8B3C1ADDDE1B-001\tempDir-001\collection2\data\index/
   [junit4]   2> 2976 WARN  (coreLoadExecutor-6-thread-2) [    x:collection2] o.a.s.c.SolrCore [collection2] Solr index directory 'C:\Users\JenkinsSlave\workspace\Lucene-Solr-trunk-Windows\solr\build\solr-core\test\J0\temp\solr.core.TestLazyCores_B4E8B3C1ADDDE1B-001\tempDir-001\collection2\data\index' doesn't exist. Creating new index...
   [junit4]   2> 2976 INFO  (coreLoadExecutor-6-thread-1) [    x:collection1] o.a.s.c.CachingDirectoryFactory return new directory for C:\Users\JenkinsSlave\workspace\Lucene-Solr-trunk-Windows\solr\build\solr-core\test\J0\temp\solr.core.TestLazyCores_B4E8B3C1ADDDE1B-001\tempDir-001\collection1\data\
   [junit4]   2> 2977 INFO  (coreLoadExecutor-6-thread-1) [    x:collection1] o.a.s.c.SolrCore New index directory detected: old=null new=C:\Users\JenkinsSlave\workspace\Lucene-Solr-trunk-Windows\solr\build\solr-core\test\J0\temp\solr.core.TestLazyCores_B4E8B3C1ADDDE1B-001\tempDir-001\collection1\data\index/
   [junit4]   2> 2977 WARN  (coreLoadExecutor-6-thread-1) [    x:collection1] o.a.s.c.SolrCore [collection1] Solr index directory 'C:\Users\JenkinsSlave\workspace\Lucene-Solr-trunk-Windows\solr\build\solr-core\test\J0\temp\solr.core.TestLazyCores_B4E8B3C1ADDDE1B-001\tempDir-001\collection1\data\index' doesn't exist. Creating new index...
   [junit4]   2> 2976 INFO  (coreLoadExecutor-6-thread-3) [    x:collection5] o.a.s.c.CachingDirectoryFactory return new directory for C:\Users\JenkinsSlave\workspace\Lucene-Solr-trunk-Windows\solr\build\solr-core\test\J0\temp\solr.core.TestLazyCores_B4E8B3C1ADDDE1B-001\tempDir-001\collection5\data\
   [junit4]   2> 2978 INFO  (coreLoadExecutor-6-thread-3) [    x:collection5] o.a.s.c.SolrCore New index directory detected: old=null new=C:\Users\JenkinsSlave\workspace\Lucene-Solr-trunk-Windows\solr\build\solr-core\test\J0\temp\solr.core.TestLazyCores_B4E8B3C1ADDDE1B-001\tempDir-001\collection5\data\index/
   [junit4]   2> 2978 WARN  (coreLoadExecutor-6-thread-3) [    x:collection5] o.a.s.c.SolrCore [collection5] Solr index directory 'C:\Users\JenkinsSlave\workspace\Lucene-Solr-trunk-Windows\solr\build\solr-core\test\J0\temp\solr.core.TestLazyCores_B4E8B3C1ADDDE1B-001\tempDir-001\collection5\data\index' doesn't exist. Creating new index...
   [junit4]   2> 2998 INFO  (coreLoadExecutor-6-thread-2) [    x:collection2] o.a.s.c.CachingDirectoryFactory return new directory for C:\Users\JenkinsSlave\workspace\Lucene-Solr-trunk-Windows\solr\build\solr-core\test\J0\temp\solr.core.TestLazyCores_B4E8B3C1ADDDE1B-001\tempDir-001\collection2\data\index
   [junit4]   2> 2999 INFO  (coreLoadExecutor-6-thread-3) [    x:collection5] o.a.s.c.CachingDirectoryFactory return new directory for C:\Users\JenkinsSlave\workspace\Lucene-Solr-trunk-Windows\solr\build\solr-core\test\J0\temp\solr.core.TestLazyCores_B4E8B3C1ADDDE1B-001\tempDir-001\collection5\data\index
   [junit4]   2> 2999 INFO  (coreLoadExecutor-6-thread-1) [    x:collection1] o.a.s.c.CachingDirectoryFactory return new directory for C:\Users\JenkinsSlave\workspace\Lucene-Solr-trunk-Windows\solr\build\solr-core\test\J0\temp\solr.core.TestLazyCores_B4E8B3C1ADDDE1B-001\tempDir-001\collection1\data\index
   [junit4]   2> 3004 INFO  (coreLoadExecutor-6-thread-2) [    x:collection2] o.a.s.u.RandomMergePolicy RandomMergePolicy wrapping class org.apache.lucene.index.TieredMergePolicy: [TieredMergePolicy: maxMergeAtOnce=43, maxMergeAtOnceExplicit=11, maxMergedSegmentMB=98.6982421875, floorSegmentMB=0.666015625, forceMergeDeletesPctAllowed=8.59655014928823, segmentsPerTier=37.0, maxCFSSegmentSizeMB=8.796093022207999E12, noCFSRatio=0.3422322514305557
   [junit4]   2> 3005 INFO  (coreLoadExecutor-6-thread-1) [    x:collection1] o.a.s.u.RandomMergePolicy RandomMergePolicy wrapping class org.apache.lucene.index.TieredMergePolicy: [TieredMergePolicy: maxMergeAtOnce=43, maxMergeAtOnceExplicit=11, maxMergedSegmentMB=98.6982421875, floorSegmentMB=0.666015625, forceMergeDeletesPctAllowed=8.59655014928823, segmentsPerTier=37.0, maxCFSSegmentSizeMB=8.796093022207999E12, noCFSRatio=0.3422322514305557
   [junit4]   2> 3005 INFO  (coreLoadExecutor-6-thread-3) [    x:collection5] o.a.s.u.RandomMergePolicy RandomMergePolicy wrapping class org.apache.lucene.index.TieredMergePolicy: [TieredMergePolicy: maxMergeAtOnce=43, maxMergeAtOnceExplicit=11, maxMergedSegmentMB=98.6982421875, floorSegmentMB=0.666015625, forceMergeDeletesPctAllowed=8.59655014928823, segmentsPerTier=37.0, maxCFSSegmentSizeMB=8.796093022207999E12, noCFSRatio=0.3422322514305557
   [junit4]   2> 3169 INFO  (coreLoadExecutor-6-thread-3) [    x:collection5] o.a.s.c.SolrDeletionPolicy SolrDeletionPolicy.onCommit: commits: num=1
   [junit4]   2> 	commit{dir=MockDirectoryWrapper(RAMDirectory@2b720bde lockFactory=org.apache.lucene.store.SingleInstanceLockFactory@2116fbb5),segFN=segments_1,generation=1}
   [junit4]   2> 3171 INFO  (coreLoadExecutor-6-thread-3) [    x:collection5] o.a.s.c.SolrDeletionPolicy newest commit generation = 1
   [junit4]   2> 3172 INFO  (coreLoadExecutor-6-thread-2) [    x:collection2] o.a.s.c.SolrDeletionPolicy SolrDeletionPolicy.onCommit: commits: num=1
   [junit4]   2> 	commit{dir=MockDirectoryWrapper(RAMDirectory@7055b76c lockFactory=org.apache.lucene.store.SingleInstanceLockFactory@7e78ff13),segFN=segments_1,generation=1}
   [junit4]   2> 3174 INFO  (coreLoadExecutor-6-thread-2) [    x:collection2] o.a.s.c.SolrDeletionPolicy newest commit generation = 1
   [junit4]   2> 3172 INFO  (coreLoadExecutor-6-thread-1) [    x:collection1] o.a.s.c.SolrDeletionPolicy SolrDeletionPolicy.onCommit: commits: num=1
   [junit4]   2> 	commit{dir=MockDirectoryWrapper(RAMDirectory@3df37b03 lockFactory=org.apache.lucene.store.SingleInstanceLockFactory@37eadd8e),segFN=segments_1,generation=1}
   [junit4]   2> 3177 INFO  (coreLoadExecutor-6-thread-1) [    x:collection1] o.a.s.c.SolrDeletionPolicy newest commit generation = 1
   [junit4]   2> 3184 INFO  (OldIndexDirectoryCleanupThreadForCore-collection2) [    x:collection2] o.a.s.c.SolrCore Looking for old index directories to cleanup for core collection2 in C:\Users\JenkinsSlave\workspace\Lucene-Solr-trunk-Windows\solr\build\solr-core\test\J0\temp\solr.core.TestLazyCores_B4E8B3C1ADDDE1B-001\tempDir-001\collection2\data\
   [junit4]   2> 3184 INFO  (OldIndexDirectoryCleanupThreadForCore-collection1) [    x:collection1] o.a.s.c.SolrCore Looking for old index directories to cleanup for core collection1 in C:\Users\JenkinsSlave\workspace\Lucene-Solr-trunk-Windows\solr\build\solr-core\test\J0\temp\solr.core.TestLazyCores_B4E8B3C1ADDDE1B-001\tempDir-001\collection1\data\
   [junit4]   2> 3185 WARN  (OldIndexDirectoryCleanupThreadForCore-collection1) [    x:collection1] o.a.s.c.DirectoryFactory C:\Users\JenkinsSlave\workspace\Lucene-Solr-trunk-Windows\solr\build\solr-core\test\J0\temp\solr.core.TestLazyCores_B4E8B3C1ADDDE1B-001\tempDir-001\collection1\data\ does not point to a valid data directory; skipping clean-up of old index directories.
   [junit4]   2> 3189 INFO  (OldIndexDirectoryCleanupThreadForCore-collection5) [    x:collection5] o.a.s.c.SolrCore Looking for old index directories to cleanup for core collection5 in C:\Users\JenkinsSlave\workspace\Lucene-Solr-trunk-Windows\solr\build\solr-core\test\J0\temp\solr.core.TestLazyCores_B4E8B3C1ADDDE1B-001\tempDir-001\collection5\data\
   [junit4]   2> 3189 WARN  (OldIndexDirectoryCleanupThreadForCore-collection2) [    x:collection2] o.a.s.c.DirectoryFactory C:\Users\JenkinsSlave\workspace\Lucene-Solr-trunk-Windows\solr\build\solr-core\test\J0\temp\solr.core.TestLazyCores_B4E8B3C1ADDDE1B-001\tempDir-001\collection2\data\ does not point to a valid data directory; skipping clean-up of old index directories.
   [junit4]   2> 3196 WARN  (OldIndexDirectoryCleanupThreadForCore-collection5) [    x:collection5] o.a.s.c.DirectoryFactory C:\Users\JenkinsSlave\workspace\Lucene-Solr-trunk-Windows\solr\build\solr-core\test\J0\temp\solr.core.TestLazyCores_B4E8B3C1ADDDE1B-001\tempDir-001\collection5\data\ does not point to a valid data directory; skipping clean-up of old index directories.
   [junit4]   2> 3944 INFO  (coreLoadExecutor-6-thread-3) [    x:collection5] o.a.s.c.SolrCore no updateRequestProcessorChain defined as default, creating implicit default
   [junit4]   2> 3945 INFO  (coreLoadExecutor-6-thread-1) [    x:collection1] o.a.s.c.SolrCore no updateRequestProcessorChain defined as default, creating implicit default
   [junit4]   2> 3949 INFO  (coreLoadExecutor-6-thread-2) [    x:collection2] o.a.s.c.SolrCore no updateRequestProcessorChain defined as default, creating implicit default
   [junit4]   2> 4124 INFO  (coreLoadExecutor-6-thread-2) [    x:collection2] o.a.s.h.l.XMLLoader xsltCacheLifetimeSeconds=60
   [junit4]   2> 4125 INFO  (coreLoadExecutor-6-thread-1) [    x:collection1] o.a.s.h.l.XMLLoader xsltCacheLifetimeSeconds=60
   [junit4]   2> 4128 INFO  (coreLoadExecutor-6-thread-3) [    x:collection5] o.a.s.h.l.XMLLoader xsltCacheLifetimeSeconds=60
   [junit4]   2> 4142 INFO  (coreLoadExecutor-6-thread-3) [    x:collection5] o.a.s.h.l.XMLLoader xsltCacheLifetimeSeconds=60
   [junit4]   2> 4142 INFO  (coreLoadExecutor-6-thread-2) [    x:collection2] o.a.s.h.l.XMLLoader xsltCacheLifetimeSeconds=60
   [junit4]   2> 4144 INFO  (coreLoadExecutor-6-thread-3) [    x:collection5] o.a.s.h.l.XMLLoader xsltCacheLifetimeSeconds=60
   [junit4]   2> 4148 INFO  (coreLoadExecutor-6-thread-3) [    x:collection5] o.a.s.h.l.XMLLoader xsltCacheLifetimeSeconds=60
   [junit4]   2> 4152 INFO  (coreLoadExecutor-6-thread-2) [    x:collection2] o.a.s.h.l.XMLLoader xsltCacheLifetimeSeconds=60
   [junit4]   2> 4143 INFO  (coreLoadExecutor-6-thread-1) [    x:collection1] o.a.s.h.l.XMLLoader xsltCacheLifetimeSeconds=60
   [junit4]   2> 4161 INFO  (coreLoadExecutor-6-thread-1) [    x:collection1] o.a.s.h.l.XMLLoader xsltCacheLifetimeSeconds=60
   [junit4]   2> 4163 INFO  (coreLoadExecutor-6-thread-1) [    x:collection1] o.a.s.h.l.XMLLoader xsltCacheLifetimeSeconds=60
   [junit4]   2> 4164 INFO  (coreLoadExecutor-6-thread-2) [    x:collection2] o.a.s.h.l.XMLLoader xsltCacheLifetimeSeconds=60
   [junit4]   2> 4326 INFO  (coreLoadExecutor-6-thread-2) [    x:collection2] o.a.s.c.RequestHandlers Registered paths: /admin/mbeans,/update/csv,/sql,/update/json/docs,/admin/luke,/export,/select,/admin/segments,/get,/admin/system,/replication,/admin/properties,/config,/stream,/schema,/admin/plugins,/admin/logging,/update/json,/admin/threads,/admin/ping,/update,/admin/file
   [junit4]   2> 4326 INFO  (coreLoadExecutor-6-thread-2) [    x:collection2] o.a.s.c.SolrCore Using default statsCache cache: org.apache.solr.search.stats.LocalStatsCache
   [junit4]   2> 4341 INFO  (coreLoadExecutor-6-thread-3) [    x:collection5] o.a.s.c.RequestHandlers Registered paths: /admin/mbeans,/update/csv,/sql,/update/json/docs,/admin/luke,/export,/select,/admin/segments,/get,/admin/system,/replication,/admin/properties,/config,/stream,/schema,/admin/plugins,/admin/logging,/update/json,/admin/threads,/admin/ping,/update,/admin/file
   [junit4]   2> 4343 INFO  (coreLoadExecutor-6-thread-3) [    x:collection5] o.a.s.c.SolrCore Using default statsCache cache: org.apache.solr.search.stats.LocalStatsCache
   [junit4]   2> 4330 INFO  (coreLoadExecutor-6-thread-1) [    x:collection1] o.a.s.c.RequestHandlers Registered paths: /admin/mbeans,/update/csv,/sql,/update/json/docs,/admin/luke,/export,/select,/admin/segments,/get,/admin/system,/replication,/admin/properties,/config,/stream,/schema,/admin/plugins,/admin/logging,/update/json,/admin/threads,/admin/ping,/update,/admin/file
   [junit4]   2> 4352 INFO  (coreLoadExecutor-6-thread-1) [    x:collection1] o.a.s.c.SolrCore Using default statsCache cache: org.apache.solr.search.stats.LocalStatsCache
   [junit4]   2> 4393 INFO  (coreLoadExecutor-6-thread-2) [    x:collection2] o.a.s.u.CommitTracker Hard AutoCommit: disabled
   [junit4]   2> 4393 INFO  (coreLoadExecutor-6-thread-2) [    x:collection2] o.a.s.u.CommitTracker Soft AutoCommit: disabled
   [junit4]   2> 4394 INFO  (coreLoadExecutor-6-thread-2) [    x:collection2] o.a.s.u.RandomMergePolicy RandomMergePolicy wrapping class org.apache.lucene.index.LogDocMergePolicy: [LogDocMergePolicy: minMergeSize=1000, mergeFactor=46, maxMergeSize=9223372036854775807, maxMergeSizeForForcedMerge=9223372036854775807, calibrateSizeByDeletes=false, maxMergeDocs=2147483647, maxCFSSegmentSizeMB=8.796093022207999E12, noCFSRatio=0.0]
   [junit4]   2> 4394 INFO  (coreLoadExecutor-6-thread-3) [    x:collection5] o.a.s.u.CommitTracker Hard AutoCommit: disabled
   [junit4]   2> 4394 INFO  (coreLoadExecutor-6-thread-3) [    x:collection5] o.a.s.u.CommitTracker Soft AutoCommit: disabled
   [junit4]   2> 4394 INFO  (coreLoadExecutor-6-thread-3) [    x:collection5] o.a.s.u.RandomMergePolicy RandomMergePolicy wrapping class org.apache.lucene.index.LogDocMergePolicy: [LogDocMergePolicy: minMergeSize=1000, mergeFactor=46, maxMergeSize=9223372036854775807, maxMergeSizeForForcedMerge=9223372036854775807, calibrateSizeByDeletes=false, maxMergeDocs=2147483647, maxCFSSegmentSizeMB=8.796093022207999E12, noCFSRatio=0.0]
   [junit4]   2> 4394 INFO  (coreLoadExecutor-6-thread-1) [    x:collection1] o.a.s.u.CommitTracker Hard AutoCommit: disabled
   [junit4]   2> 4400 INFO  (coreLoadExecutor-6-thread-1) [    x:collection1] o.a.s.u.CommitTracker Soft AutoCommit: disabled
   [junit4]   2> 4401 INFO  (coreLoadExecutor-6-thread-1) [    x:collection1] o.a.s.u.RandomMergePolicy RandomMergePolicy wrapping class org.apache.lucene.index.LogDocMergePolicy: [LogDocMergePolicy: minMergeSize=1000, mergeFactor=46, maxMergeSize=9223372036854775807, maxMergeSizeForForcedMerge=9223372036854775807, calibrateSizeByDeletes=false, maxMergeDocs=2147483647, maxCFSSegmentSizeMB=8.796093022207999E12, noCFSRatio=0.0]
   [junit4]   2> 4405 INFO  (coreLoadExecutor-6-thread-2) [    x:collection2] o.a.s.c.SolrDeletionPolicy SolrDeletionPolicy.onInit: commits: num=1
   [junit4]   2> 	commit{dir=MockDirectoryWrapper(RAMDirectory@7055b76c lockFactory=org.apache.lucene.store.SingleInstanceLockFactory@7e78ff13),segFN=segments_1,generation=1}
   [junit4]   2> 4405 INFO  (coreLoadExecutor-6-thread-2) [    x:collection2] o.a.s.c.SolrDeletionPolicy newest commit generation = 1
   [junit4]   2> 4405 INFO  (coreLoadExecutor-6-thread-1) [    x:collection1] o.a.s.c.SolrDeletionPolicy SolrDeletionPolicy.onInit: commits: num=1
   [junit4]   2> 	commit{dir=MockDirectoryWrapper(RAMDirectory@3df37b03 lockFactory=org.apache.lucene.store.SingleInstanceLockFactory@37eadd8e),segFN=segments_1,generation=1}
   [junit4]   2> 4405 INFO  (coreLoadExecutor-6-thread-1) [    x:collection1] o.a.s.c.SolrDeletionPolicy newest commit generation = 1
   [junit4]   2> 4405 INFO  (coreLoadExecutor-6-thread-3) [    x:collection5] o.a.s.c.SolrDeletionPolicy SolrDeletionPolicy.onInit: commits: num=1
   [junit4]   2> 	commit{dir=MockDirectoryWrapper(RAMDirectory@2b720bde lockFactory=org.apache.lucene.store.SingleInstanceLockFactory@2116fbb5),segFN=segments_1,generation=1}
   [junit4]   2> 4407 INFO  (coreLoadExecutor-6-thread-3) [    x:collection5] o.a.s.c.SolrDeletionPolicy newest commit generation = 1
   [junit4]   2> 4477 INFO  (coreLoadExecutor-6-thread-1) [    x:collection1] o.a.s.s.SolrIndexSearcher Opening [Searcher@731faa5e[collection1] main]
   [junit4]   2> 4477 INFO  (coreLoadExecutor-6-thread-3) [    x:collection5] o.a.s.s.SolrIndexSearcher Opening [Searcher@53257fb8[collection5] main]
   [junit4]   2> 4477 INFO  (coreLoadExecutor-6-thread-2) [    x:collection2] o.a.s.s.SolrIndexSearcher Opening [Searcher@3b2624bd[collection2] main]
   [junit4]   2> 4510 INFO  (coreLoadExecutor-6-thread-3) [    x:collection5] o.a.s.r.ManagedResourceStorage File-based storage initialized to use dir: C:\Users\JenkinsSlave\workspace\Lucene-Solr-trunk-Windows\solr\build\solr-core\test\J0\temp\solr.core.TestLazyCores_B4E8B3C1ADDDE1B-001\tempDir-001\collection5\conf
   [junit4]   2> 4510 INFO  (coreLoadExecutor-6-thread-3) [    x:collection5] o.a.s.r.RestManager Initializing RestManager with initArgs: {storageDir=C:\Users\JenkinsSlave\workspace\Lucene-Solr-trunk-Windows\solr\build\solr-core\test\J0\temp\solr.core.TestLazyCores_B4E8B3C1ADDDE1B-001\tempDir-001\collection5\conf}
   [junit4]   2> 4510 INFO  (coreLoadExecutor-6-thread-2) [    x:collection2] o.a.s.r.ManagedResourceStorage File-based storage initialized to use dir: C:\Users\JenkinsSlave\workspace\Lucene-Solr-trunk-Windows\solr\build\solr-core\test\J0\temp\solr.core.TestLazyCores_B4E8B3C1ADDDE1B-001\tempDir-001\collection2\conf
   [junit4]   2> 4510 INFO  (coreLoadExecutor-6-thread-1) [    x:collection1] o.a.s.r.ManagedResourceStorage File-based storage initialized to use dir: C:\Users\JenkinsSlave\workspace\Lucene-Solr-trunk-Windows\solr\build\solr-core\test\J0\temp\solr.core.TestLazyCores_B4E8B3C1ADDDE1B-001\tempDir-001\collection1\conf
   [junit4]   2> 4510 INFO  (coreLoadExecutor-6-thread-1) [    x:collection1] o.a.s.r.RestManager Initializing RestManager with initArgs: {storageDir=C:\Users\JenkinsSlave\workspace\Lucene-Solr-trunk-Windows\solr\build\solr-core\test\J0\temp\solr.core.TestLazyCores_B4E8B3C1ADDDE1B-001\tempDir-001\collection1\conf}
   [junit4]   2> 4510 INFO  (coreLoadExecutor-6-thread-2) [    x:collection2] o.a.s.r.RestManager Initializing RestManager with initArgs: {storageDir=C:\Users\JenkinsSlave\workspace\Lucene-Solr-trunk-Windows\solr\build\solr-core\test\J0\temp\solr.core.TestLazyCores_B4E8B3C1ADDDE1B-001\tempDir-001\collection2\conf}
   [junit4]   2> 4581 INFO  (coreLoadExecutor-6-thread-1) [    x:collection1] o.a.s.r.ManagedResourceStorage Reading _rest_managed.json using file:dir=C:\Users\JenkinsSlave\workspace\Lucene-Solr-trunk-Windows\solr\build\solr-core\test\J0\temp\solr.core.TestLazyCores_B4E8B3C1ADDDE1B-001\tempDir-001\collection1\conf
   [junit4]   2> 4581 INFO  (coreLoadExecutor-6-thread-2) [    x:collection2] o.a.s.r.ManagedResourceStorage Reading _rest_managed.json using file:dir=C:\Users\JenkinsSlave\workspace\Lucene-Solr-trunk-Windows\solr\build\solr-core\test\J0\temp\solr.core.TestLazyCores_B4E8B3C1ADDDE1B-001\tempDir-001\collection2\conf
   [junit4]   2> 4581 INFO  (coreLoadExecutor-6-thread-1) [    x:collection1] o.a.s.r.RestManager Initializing 0 registered ManagedResources
   [junit4]   2> 4581 INFO  (coreLoadExecutor-6-thread-3) [    x:collection5] o.a.s.r.ManagedResourceStorage Reading _rest_managed.json using file:dir=C:\Users\JenkinsSlave\workspace\Lucene-Solr-trunk-Windows\solr\build\solr-core\test\J0\temp\solr.core.TestLazyCores_B4E8B3C1ADDDE1B-001\tempDir-001\collection5\conf
   [junit4]   2> 4582 INFO  (coreLoadExecutor-6-thread-3) [    x:collection5] o.a.s.r.RestManager Initializing 0 registered ManagedResources
   [junit4]   2> 4581 INFO  (coreLoadExecutor-6-thread-2) [    x:collection2] o.a.s.r.RestManager Initializing 0 registered ManagedResources
   [junit4]   2> 4659 INFO  (coreLoadExecutor-6-thread-2) [    x:collection2] o.a.s.h.ReplicationHandler Commits will be reserved for  10000
   [junit4]   2> 4659 INFO  (coreLoadExecutor-6-thread-3) [    x:collection5] o.a.s.h.ReplicationHandler Commits will be reserved for  10000
   [junit4]   2> 4659 INFO  (coreLoadExecutor-6-thread-1) [    x:collection1] o.a.s.h.ReplicationHandler Commits will be reserved for  10000
   [junit4]   2> 4720 INFO  (searcherExecutor-8-thread-1-processing-x:collection5) [    x:collection5] o.a.s.c.SolrCore [collection5] Registered new searcher Searcher@53257fb8[collection5] main{ExitableDirectoryReader(UninvertingDirectoryReader())}
   [junit4]   2> 4720 INFO  (searcherExecutor-9-thread-1-processing-x:collection1) [    x:collection1] o.a.s.c.SolrCore [collection1] Registered new searcher Searcher@731faa5e[collection1] main{ExitableDirectoryReader(UninvertingDirectoryReader())}
   [junit4]   2> 4720 INFO  (coreLoadExecutor-6-thread-1) [    x:collection1] o.a.s.c.CoreContainer registering core: collection1
   [junit4]   2> 4722 INFO  (coreLoadExecutor-6-thread-3) [    x:collection5] o.a.s.c.CoreContainer registering core: collection5
   [junit4]   2> 4722 INFO  (searcherExecutor-7-thread-1-processing-x:collection2) [    x:collection2] o.a.s.c.SolrCore [collection2] Registered new searcher Searcher@3b2624bd[collection2] main{ExitableDirectoryReader(UninvertingDirectoryReader())}
   [junit4]   2> 4723 INFO  (coreLoadExecutor-6-thread-2) [    x:collection2] o.a.s.c.SolrCores Opening transient core collection2
   [junit4]   2> 4723 INFO  (coreLoadExecutor-6-thread-2) [    x:collection2] o.a.s.c.CoreContainer registering core: collection2
   [junit4]   2> 4731 INFO  (TEST-TestLazyCores.testLazySearch-seed#[B4E8B3C1ADDDE1B]) [    ] o.a.s.c.SolrResourceLoader new SolrResourceLoader for directory: 'C:\Users\JenkinsSlave\workspace\Lucene-Solr-trunk-Windows\solr\build\solr-core\test\J0\temp\solr.core.TestLazyCores_B4E8B3C1ADDDE1B-001\tempDir-001\collection4'
   [junit4]   2> 4731 INFO  (TEST-TestLazyCores.testLazySearch-seed#[B4E8B3C1ADDDE1B]) [    ] o.a.s.c.SolrResourceLoader JNDI not configured for solr (NoInitialContextEx)
   [junit4]   2> 4731 INFO  (TEST-TestLazyCores.testLazySearch-seed#[B4E8B3C1ADDDE1B]) [    ] o.a.s.c.SolrResourceLoader solr home defaulted to 'solr/' (could not find system property or JNDI)
   [junit4]   2> 4771 INFO  (TEST-TestLazyCores.testLazySearch-seed#[B4E8B3C1ADDDE1B]) [    ] o.a.s.c.SolrConfig current version of requestparams : -1
   [junit4]   2> 4792 INFO  (TEST-TestLazyCores.testLazySearch-seed#[B4E8B3C1ADDDE1B]) [    ] o.a.s.c.SolrConfig Using Lucene MatchVersion: 6.0.0
   [junit4]   2> 4828 INFO  (TEST-TestLazyCores.testLazySearch-seed#[B4E8B3C1ADDDE1B]) [    ] o.a.s.c.SolrConfig Loaded SolrConfig: solrconfig.xml
   [junit4]   2> 4835 INFO  (TEST-TestLazyCores.testLazySearch-seed#[B4E8B3C1ADDDE1B]) [    ] o.a.s.s.IndexSchema [collection4] Schema name=tiny
   [junit4]   2> 4841 INFO  (TEST-TestLazyCores.testLazySearch-seed#[B4E8B3C1ADDDE1B]) [    ] o.a.s.s.IndexSchema unique key field: id
   [junit4]   2> 4848 INFO  (TEST-TestLazyCores.testLazySearch-seed#[B4E8B3C1ADDDE1B]) [    ] o.a.s.c.ConfigSetProperties Did not find ConfigSet properties, assuming default properties: Can't find resource 'configsetprops.json' in classpath or 'C:\Users\JenkinsSlave\workspace\Lucene-Solr-trunk-Windows\solr\build\solr-core\test\J0\temp\solr.core.TestLazyCores_B4E8B3C1ADDDE1B-001\tempDir-001\collection4'
   [junit4]   2> 4848 INFO  (TEST-TestLazyCores.testLazySearch-seed#[B4E8B3C1ADDDE1B]) [    ] o.a.s.c.CoreContainer Creating SolrCore 'collection4' using configuration from instancedir C:\Users\JenkinsSlave\workspace\Lucene-Solr-trunk-Windows\solr\build\solr-core\test\J0\temp\solr.core.TestLazyCores_B4E8B3C1ADDDE1B-001\tempDir-001\collection4
   [junit4]   2> 4848 INFO  (TEST-TestLazyCores.testLazySearch-seed#[B4E8B3C1ADDDE1B]) [    x:collection4] o.a.s.c.SolrCore org.apache.solr.core.MockDirectoryFactory
   [junit4]   2> 4849 INFO  (TEST-TestLazyCores.testLazySearch-seed#[B4E8B3C1ADDDE1B]) [    x:collection4] o.a.s.c.SolrCore [[collection4] ] Opening new SolrCore at [C:\Users\JenkinsSlave\workspace\Lucene-Solr-trunk-Windows\solr\build\solr-core\test\J0\temp\solr.core.TestLazyCores_B4E8B3C1ADDDE1B-001\tempDir-001\collection4], dataDir=[C:\Users\JenkinsSlave\workspace\Lucene-Solr-trunk-Windows\solr\build\solr-core\test\J0\temp\solr.core.TestLazyCores_B4E8B3C1ADDDE1B-001\tempDir-001\collection4\data\]
   [junit4]   2> 4849 INFO  (TEST-TestLazyCores.testLazySearch-seed#[B4E8B3C1ADDDE1B]) [    x:collection4] o.a.s.c.SolrCore JMX monitoring not detected for core: collection4
   [junit4]   2> 4851 INFO  (TEST-TestLazyCores.testLazySearch-seed#[B4E8B3C1ADDDE1B]) [    x:collection4] o.a.s.c.CachingDirectoryFactory return new directory for C:\Users\JenkinsSlave\workspace\Lucene-Solr-trunk-Windows\solr\build\solr-core\test\J0\temp\solr.core.TestLazyCores_B4E8B3C1ADDDE1B-001\tempDir-001\collection4\data\
   [junit4]   2> 4851 INFO  (TEST-TestLazyCores.testLazySearch-seed#[B4E8B3C1ADDDE1B]) [    x:collection4] o.a.s.c.SolrCore New index directory detected: old=null new=C:\Users\JenkinsSlave\workspace\Lucene-Solr-trunk-Windows\solr\build\solr-core\test\J0\temp\solr.core.TestLazyCores_B4E8B3C1ADDDE1B-001\tempDir-001\collection4\data\index/
   [junit4]   2> 4851 WARN  (TEST-TestLazyCores.testLazySearch-seed#[B4E8B3C1ADDDE1B]) [    x:collection4] o.a.s.c.SolrCore [collection4] Solr index directory 'C:\Users\JenkinsSlave\workspace\Lucene-Solr-trunk-Windows\solr\build\solr-core\test\J0\temp\solr.core.TestLazyCores_B4E8B3C1ADDDE1B-001\tempDir-001\collection4\data\index' doesn't exist. Creating new index...
   [junit4]   2> 4852 INFO  (TEST-TestLazyCores.testLazySearch-seed#[B4E8B3C1ADDDE1B]) [    x:collection4] o.a.s.c.CachingDirectoryFactory return new directory for C:\Users\JenkinsSlave\workspace\Lucene-Solr-trunk-Windows\solr\build\solr-core\test\J0\temp\solr.core.TestLazyCores_B4E8B3C1ADDDE1B-001\tempDir-001\collection4\data\index
   [junit4]   2> 4852 INFO  (TEST-TestLazyCores.testLazySearch-seed#[B4E8B3C1ADDDE1B]) [    x:collection4] o.a.s.u.RandomMergePolicy RandomMergePolicy wrapping class org.apache.lucene.index.TieredMergePolicy: [TieredMergePolicy: maxMergeAtOnce=46, maxMergeAtOnceExplicit=14, maxMergedSegmentMB=68.884765625, floorSegmentMB=1.7392578125, forceMergeDeletesPctAllowed=16.01271156935461, segmentsPerTier=21.0, maxCFSSegmentSizeMB=8.796093022207999E12, noCFSRatio=0.11098253424649461
   [junit4]   2> 4855 INFO  (TEST-TestLazyCores.testLazySearch-seed#[B4E8B3C1ADDDE1B]) [    x:collection4] o.a.s.c.SolrDeletionPolicy SolrDeletionPolicy.onCommit: commits: num=1
   [junit4]   2> 	commit{dir=MockDirectoryWrapper(RAMDirectory@3e2dd556 lockFactory=org.apache.lucene.store.SingleInstanceLockFactory@736b7f9d),segFN=segments_1,generation=1}
   [junit4]   2> 4855 INFO  (TEST-TestLazyCores.testLazySearch-seed#[B4E8B3C1ADDDE1B]) [    x:collection4] o.a.s.c.SolrDeletionPolicy newest commit generation = 1
   [junit4]   2> 4860 INFO  (TEST-TestLazyCores.testLazySearch-seed#[B4E8B3C1ADDDE1B]) [    x:collection4] o.a.s.c.SolrCore no updateRequestProcessorChain defined as default, creating implicit default
   [junit4]   2> 4862 INFO  (OldIndexDirectoryCleanupThreadForCore-collection4) [    x:collection4] o.a.s.c.SolrCore Looking for old index directories to cleanup for core collection4 in C:\Users\JenkinsSlave\workspace\Lucene-Solr-trunk-Windows\solr\build\solr-core\test\J0\temp\solr.core.TestLazyCores_B4E8B3C1ADDDE1B-001\tempDir-001\collection4\data\
   [junit4]   2> 4862 INFO  (TEST-TestLazyCores.testLazySearch-seed#[B4E8B3C1ADDDE1B]) [    x:collection4] o.a.s.h.l.XMLLoader xsltCacheLifetimeSeconds=60
   [junit4]   2> 4863 INFO  (TEST-TestLazyCores.testLazySearch-seed#[B4E8B3C1ADDDE1B]) [    x:collection4] o.a.s.h.l.XMLLoader xsltCacheLifetimeSeconds=60
   [junit4]   2> 4866 WARN  (OldIndexDirectoryCleanupThreadForCore-collection4) [    x:collection4] o.a.s.c.DirectoryFactory C:\Users\JenkinsSlave\workspace\Lucene-Solr-trunk-Windows\solr\build\solr-core\test\J0\temp\solr.core.TestLazyCores_B4E8B3C1ADDDE1B-001\tempDir-001\collection4\data\ does not point to a valid data directory; skipping clean-up of old index directories.
   [junit4]   2> 4866 INFO  (TEST-TestLazyCores.testLazySearch-seed#[B4E8B3C1ADDDE1B]) [    x:collection4] o.a.s.h.l.XMLLoader xsltCacheLifetimeSeconds=60
   [junit4]   2> 4868 INFO  (TEST-TestLazyCores.testLazySearch-seed#[B4E8B3C1ADDDE1B]) [    x:collection4] o.a.s.h.l.XMLLoader xsltCacheLifetimeSeconds=60
   [junit4]   2> 4873 INFO  (TEST-TestLazyCores.testLazySearch-seed#[B4E8B3C1ADDDE1B]) [    x:collection4] o.a.s.c.RequestHandlers Registered paths: /admin/mbeans,/update/csv,/sql,/update/json/docs,/admin/luke,/export,/select,/admin/segments,/get,/admin/system,/replication,/admin/properties,/config,/stream,/schema,/admin/plugins,/admin/logging,/update/json,/admin/threads,/admin/ping,/update,/admin/file
   [junit4]   2> 4874 INFO  (TEST-TestLazyCores.testLazySearch-seed#[B4E8B3C1ADDDE1B]) [    x:collection4] o.a.s.c.SolrCore Using default statsCache cache: org.apache.solr.search.stats.LocalStatsCache
   [junit4]   2> 4874 INFO  (TEST-TestLazyCores.testLazySearch-seed#[B4E8B3C1ADDDE1B]) [    x:collection4] o.a.s.u.CommitTracker Hard AutoCommit: disabled
   [junit4]   2> 4875 INFO  (TEST-TestLazyCores.testLazySearch-seed#[B4E8B3C1ADDDE1B]) [    x:collection4] o.a.s.u.CommitTracker Soft AutoCommit: disabled
   [junit4]   2> 4875 INFO  (TEST-TestLazyCores.testLazySearch-seed#[B4E8B3C1ADDDE1B]) [    x:collection4] o.a.s.u.RandomMergePolicy RandomMergePolicy wrapping class org.apache.lucene.index.LogDocMergePolicy: [LogDocMergePolicy: minMergeSize=1000, mergeFactor=11, maxMergeSize=9223372036854775807, maxMergeSizeForForcedMerge=9223372036854775807, calibrateSizeByDeletes=true, maxMergeDocs=2147483647, maxCFSSegmentSizeMB=8.796093022207999E12, noCFSRatio=0.46827091794058096]
   [junit4]   2> 4875 INFO  (TEST-TestLazyCores.testLazySearch-seed#[B4E8B3C1ADDDE1B]) [    x:collection4] o.a.s.c.SolrDeletionPolicy SolrDeletionPolicy.onInit: commits: num=1
   [junit4]   2> 	commit{dir=MockDirectoryWrapper(RAMDirectory@3e2dd556 lockFactory=org.apache.lucene.store.SingleInstanceLockFactory@736b7f9d),segFN=segments_1,generation=1}
   [junit4]   2> 4875 INFO  (TEST-TestLazyCores.testLazySearch-seed#[B4E8B3C1ADDDE1B]) [    x:collection4] o.a.s.c.SolrDeletionPolicy newest commit generation = 1
   [junit4]   2> 4876 INFO  (TEST-TestLazyCores.testLazySearch-seed#[B4E8B3C1ADDDE1B]) [    x:collection4] o.a.s.s.SolrIndexSearcher Opening [Searcher@6844cb2d[collection4] main]
   [junit4]   2> 4876 INFO  (TEST-TestLazyCores.testLazySearch-seed#[B4E8B3C1ADDDE1B]) [    x:collection4] o.a.s.r.ManagedResourceStorage File-based storage initialized to use dir: C:\Users\JenkinsSlave\workspace\Lucene-Solr-trunk-Windows\solr\build\solr-core\test\J0\temp\solr.core.TestLazyCores_B4E8B3C1ADDDE1B-001\tempDir-001\collection4\conf
   [junit4]   2> 4876 INFO  (TEST-TestLazyCores.testLazySearch-seed#[B4E8B3C1ADDDE1B]) [    x:collection4] o.a.s.r.RestManager Initializing RestManager with initArgs: {storageDir=C:\Users\JenkinsSlave\workspace\Lucene-Solr-trunk-Windows\solr\build\solr-core\test\J0\temp\solr.core.TestLazyCores_B4E8B3C1ADDDE1B-001\tempDir-001\collection4\conf}
   [junit4]   2> 4877 INFO  (TEST-TestLazyCores.testLazySearch-seed#[B4E8B3C1ADDDE1B]) [    x:collection4] o.a.s.r.ManagedResourceStorage Reading _rest_managed.json using file:dir=C:\Users\JenkinsSlave\workspace\Lucene-Solr-trunk-Windows\solr\build\solr-core\test\J0\temp\solr.core.TestLazyCores_B4E8B3C1ADDDE1B-001\tempDir-001\collection4\conf
   [junit4]   2> 4877 INFO  (TEST-TestLazyCores.testLazySearch-seed#[B4E8B3C1ADDDE1B]) [    x:collection4] o.a.s.r.RestManager Initializing 0 registered ManagedResources
   [junit4]   2> 4877 INFO  (TEST-TestLazyCores.testLazySearch-seed#[B4E8B3C1ADDDE1B]) [    x:collection4] o.a.s.h.ReplicationHandler Commits will be reserved for  10000
   [junit4]   2> 4879 INFO  (TEST-TestLazyCores.testLazySearch-seed#[B4E8B3C1ADDDE1B]) [    x:collection4] o.a.s.c.CoreContainer registering core: collection4
   [junit4]   2> 4879 INFO  (searcherExecutor-19-thread-1-processing-x:collection4) [    x:collection4] o.a.s.c.SolrCore [collection4] Registered new searcher Searcher@6844cb2d[collection4] main{ExitableDirectoryReader(UninvertingDirectoryReader())}
   [junit4]   2> 5201 INFO  (TEST-TestLazyCores.testLazySearch-seed#[B4E8B3C1ADDDE1B]) [    x:collection4] o.a.s.u.DirectUpdateHandler2 start commit{,optimize=false,openSearcher=true,waitSearcher=true,expungeDeletes=false,softCommit=false,prepareCommit=false}
   [junit4]   2> 5636 INFO  (TEST-TestLazyCores.testLazySearch-seed#[B4E8B3C1ADDDE1B]) [    x:collection4] o.a.s.c.SolrDeletionPolicy SolrDeletionPolicy.onCommit: commits: num=2
   [junit4]   2> 	commit{dir=MockDirectoryWrapper(RAMDirectory@3e2dd556 lockFactory=org.apache.lucene.store.SingleInstanceLockFactory@736b7f9d),segFN=segments_1,generation=1}
   [junit4]   2> 	commit{dir=MockDirectoryWrapper(RAMDirectory@3e2dd556 lockFactory=org.apache.lucene.store.SingleInstanceLockFactory@736b7f9d),segFN=segments_2,generation=2}
   [junit4]   2> 5638 INFO  (TEST-TestLazyCores.testLazySearch-seed#[B4E8B3C1ADDDE1B]) [    x:collection4] o.a.s.c.SolrDeletionPolicy newest commit generation = 2
   [junit4]   2> 5780 INFO  (TEST-TestLazyCores.testLazySearch-seed#[B4E8B3C1ADDDE1B]) [    x:collection4] o.a.s.s.SolrIndexSearcher Opening [Searcher@6cf8edfc[collection4] main]
   [junit4]   2> 5787 INFO  (TEST-TestLazyCores.testLazySearch-seed#[B4E8B3C1ADDDE1B]) [    x:collection4] o.a.s.u.DirectUpdateHandler2 end_commit_flush
   [junit4]   2> 5795 INFO  (searcherExecutor-19-thread-1-processing-x:collection4) [    x:collection4] o.a.s.c.SolrCore [collection4] Registered new searcher Searcher@6cf8edfc[collection4] main{ExitableDirectoryReader(UninvertingDirectoryReader(Uninverting(_0(6.0.0):c7)))}
   [junit4]   2> 6026 INFO  (TEST-TestLazyCores.testLazySearch-seed#[B4E8B3C1ADDDE1B]) [    x:collection4] o.a.s.c.S.Request [collection4]  webapp=null path=null params={q={!prefix+f%3Dv_t}hel&wt=xml} hits=2 status=0 QTime=193
   [junit4]   2> 6141 INFO  (TEST-TestLazyCores.testLazySearch-seed#[B4E8B3C1ADDDE1B]) [    x:collection4] o.a.s.c.S.Request [collection4]  webapp=null path=null params={q={!raw+f%3Dv_t}hello&wt=xml} hits=2 status=0 QTime=20
   [junit4]   2> 6143 INFO  (TEST-TestLazyCores.testLazySearch-seed#[B4E8B3C1ADDDE1B]) [    x:collection4] o.a.s.c.S.Request [collection4]  webapp=null path=null params={q={!raw+f%3Dv_t}Hello&wt=xml} hits=0 status=0 QTime=0
   [junit4]   2> 6154 INFO  (TEST-TestLazyCores.testLazySearch-seed#[B4E8B3C1ADDDE1B]) [    x:collection4] o.a.s.c.S.Request [collection4]  webapp=null path=null params={q={!raw+f%3Dv_f}1.5&wt=xml} hits=0 status=0 QTime=8
   [junit4]   2> 6164 INFO  (TEST-TestLazyCores.testLazySearch-seed#[B4E8B3C1ADDDE1B]) [    x:collection4] o.a.s.c.S.Request [collection1]  webapp=null path=null params={q={!raw+f%3Dv_t}hello&wt=xml} hits=0 status=0 QTime=3
   [junit4]   2> 6166 INFO  (TEST-TestLazyCores.testLazySearch-seed#[B4E8B3C1ADDDE1B]) [    x:collection4] o.a.s.c.CoreContainer Shutting down CoreContainer instance=1857853639
   [junit4]   2> 6171 INFO  (TEST-TestLazyCores.testLazySearch-seed#[B4E8B3C1ADDDE1B]) [    x:collection1] o.a.s.c.SolrCore [collection1]  CLOSING SolrCore org.apache.solr.core.SolrCore@7207e5ef
   [junit4]   2> 6172 INFO  (TEST-TestLazyCores.testLazySearch-seed#[B4E8B3C1ADDDE1B]) [    x:collection1] o.a.s.u.DirectUpdateHandler2 closing DirectUpdateHandler2{commits=0,autocommits=0,soft autocommits=0,optimizes=0,rollbacks=0,expungeDeletes=0,docsPending=0,adds=0,deletesById=0,deletesByQuery=0,errors=0,cumulative_adds=0,cumulative_deletesById=0,cumulative_deletesByQuery=0,cumulative_errors=0}
   [junit4]   2> 6172 INFO  (TEST-TestLazyCores.testLazySearch-seed#[B4E8B3C1ADDDE1B]) [    x:collection1] o.a.s.u.SolrCoreState Closing SolrCoreState
   [junit4]   2> 6172 INFO  (TEST-TestLazyCores.testLazySearch-seed#[B4E8B3C1ADDDE1B]) [    x:collection1] o.a.s.u.DefaultSolrCoreState SolrCoreState ref count has reached 0 - closing IndexWriter
   [junit4]   2> 6172 INFO  (TEST-TestLazyCores.testLazySearch-seed#[B4E8B3C1ADDDE1B]) [    x:collection1] o.a.s.u.DefaultSolrCoreState closing IndexWriter with IndexWriterCloser
   [junit4]   2> 6186 INFO  (TEST-TestLazyCores.testLazySearch-seed#[B4E8B3C1ADDDE1B]) [    x:collection1] o.a.s.c.SolrCore [collection1] Closing main searcher on request.
   [junit4]   2> 6187 INFO  (TEST-TestLazyCores.testLazySearch-seed#[B4E8B3C1ADDDE1B]) [    x:collection1] o.a.s.c.CachingDirectoryFactory Closing MockDirectoryFactory - 2 directories currently being tracked
   [junit4]   2> 6188 INFO  (TEST-TestLazyCores.testLazySearch-seed#[B4E8B3C1ADDDE1B]) [    x:collection1] o.a.s.c.CachingDirectoryFactory looking to close C:\Users\JenkinsSlave\workspace\Lucene-Solr-trunk-Windows\solr\build\solr-core\test\J0\temp\solr.core.TestLazyCores_B4E8B3C1ADDDE1B-001\tempDir-001\collection1\data\index [CachedDir<<refCount=0;path=C:\Users\JenkinsSlave\workspace\Lucene-Solr-trunk-Windows\solr\build\solr-core\test\J0\temp\solr.core.TestLazyCores_B4E8B3C1ADDDE1B-001\tempDir-001\collection1\data\index;done=false>>]
   [junit4]   2> 6188 INFO  (TEST-TestLazyCores.testLazySearch-seed#[B4E8B3C1ADDDE1B]) [    x:collection1] o.a.s.c.CachingDirectoryFactory Closing directory: C:\Users\JenkinsSlave\workspace\Lucene-Solr-trunk-Windows\solr\build\solr-core\test\J0\temp\solr.core.TestLazyCores_B4E8B3C1ADDDE1B-001\tempDir-001\collection1\data\index
   [junit4]   2> 6188 INFO  (TEST-TestLazyCores.testLazySearch-seed#[B4E8B3C1ADDDE1B]) [    x:collection1] o.a.s.c.CachingDirectoryFactory looking to close C:\Users\JenkinsSlave\workspace\Lucene-Solr-trunk-Windows\solr\build\solr-core\test\J0\temp\solr.core.TestLazyCores_B4E8B3C1ADDDE1B-001\tempDir-001\collection1\data\ [CachedDir<<refCount=0;path=C:\Users\JenkinsSlave\workspace\Lucene-Solr-trunk-Windows\solr\build\solr-core\test\J0\temp\solr.core.TestLazyCores_B4E8B3C1ADDDE1B-001\tempDir-001\collection1\data\;done=false>>]
   [junit4]   2> 6188 INFO  (TEST-TestLazyCores.testLazySearch-seed#[B4E8B3C1ADDDE1B]) [    x:collection1] o.a.s.c.CachingDirectoryFactory Closing directory: C:\Users\JenkinsSlave\workspace\Lucene-Solr-trunk-Windows\solr\build\solr-core\test\J0\temp\solr.core.TestLazyCores_B4E8B3C1ADDDE1B-001\tempDir-001\collection1\data\
   [junit4]   2> 6189 INFO  (TEST-TestLazyCores.testLazySearch-seed#[B4E8B3C1ADDDE1B]) [    x:collection5] o.a.s.c.SolrCore [collection5]  CLOSING SolrCore org.apache.solr.core.SolrCore@38a1e9e7
   [junit4]   2> 6189 INFO  (TEST-TestLazyCores.testLazySearch-seed#[B4E8B3C1ADDDE1B]) [    x:collection5] o.a.s.u.DirectUpdateHandler2 closing DirectUpdateHandler2{commits=0,autocommits=0,soft autocommits=0,optimizes=0,rollbacks=0,expungeDeletes=0,docsPending=0,adds=0,deletesById=0,deletesByQuery=0,errors=0,cumulative_adds=0,cumulative_deletesById=0,cumulative_deletesByQuery=0,cumulative_errors=0}
   [junit4]   2> 6192 INFO  (TEST-TestLazyCores.testLazySearch-seed#[B4E8B3C1ADDDE1B]) [    x:collection5] o.a.s.u.SolrCoreState Closing SolrCoreState
   [junit4]   2> 6192 INFO  (TEST-TestLazyCores.testLazySearch-seed#[B4E8B3C1ADDDE1B]) [    x:collection5] o.a.s.u.DefaultSolrCoreState SolrCoreState ref count has reached 0 - closing IndexWriter
   [junit4]   2> 6192 INFO  (TEST-TestLazyCores.testLazySearch-seed#[B4E8B3C1ADDDE1B]) [    x:collection5] o.a.s.u.DefaultSolrCoreState closing IndexWriter with IndexWriterCloser
   [junit4]   2> 6197 INFO  (TEST-TestLazyCores.testLazySearch-seed#[B4E8B3C1ADDDE1B]) [    x:collection5] o.a.s.c.SolrCore [collection5] Closing main searcher on request.
   [junit4]   2> 6197 INFO  (TEST-TestLazyCores.testLazySearch-seed#[B4E8B3C1ADDDE1B]) [    x:collection5] o.a.s.c.CachingDirectoryFactory Closing MockDirectoryFactory - 2 directories currently being tracked
   [junit4]   2> 6197 INFO  (TEST-TestLazyCores.testLazySearch-seed#[B4E8B3C1ADDDE1B]) [    x:collection5] o.a.s.c.CachingDirectoryFactory looking to close C:\Users\JenkinsSlave\workspace\Lucene-Solr-trunk-Windows\solr\build\solr-core\test\J0\temp\solr.core.TestLazyCores_B4E8B3C1ADDDE1B-001\tempDir-001\collection5\data\index [CachedDir<<refCount=0;path=C:\Users\JenkinsSlave\workspace\Lucene-Solr-trunk-Windows\solr\build\solr-core\test\J0\temp\solr.core.TestLazyCores_B4E8B3C1ADDDE1B-001\tempDir-001\collection5\data\index;done=false>>]
   [junit4]   2> 6197 INFO  (TEST-TestLazyCores.testLazySearch-seed#[B4E8B3C1ADDDE1B]) [    x:collection5] o.a.s.c.CachingDirectoryFactory Closing directory: C:\Users\JenkinsSlave\workspace\Lucene-Solr-trunk-Windows\solr\build\solr-core\test\J0\temp\solr.core.TestLazyCores_B4E8B3C1ADDDE1B-001\tempDir-001\collection5\data\index
   [junit4]   2> 6197 INFO  (TEST-TestLazyCores.testLazySearch-seed#[B4E8B3C1ADDDE1B]) [    x:collection5] o.a.s.c.CachingDirectoryFactory looking to close C:\Users\JenkinsSlave\workspace\Lucene-Solr-trunk-Windows\solr\build\solr-core\test\J0\temp\solr.core.TestLazyCores_B4E8B3C1ADDDE1B-001\tempDir-001\collection5\data\ [CachedDir<<refCount=0;path=C:\Users\JenkinsSlave\workspace\Lucene-Solr-trunk-Windows\solr\build\solr-core\test\J0\temp\solr.core.TestLazyCores_B4E8B3C1ADDDE1B-001\tempDir-001\collection5\data\;done=false>>]
   [junit4]   2> 6197 INFO  (TEST-TestLazyCores.testLazySearch-seed#[B4E8B3C1ADDDE1B]) [    x:collection5] o.a.s.c.CachingDirectoryFactory Closing directory: C:\Users\JenkinsSlave\workspace\Lucene-Solr-trunk-Windows\solr\build\solr-core\test\J0\temp\solr.core.TestLazyCores_B4E8B3C1ADDDE1B-001\tempDir-001\collection5\data\
   [junit4]   2> 6197 INFO  (TEST-TestLazyCores.testLazySearch-seed#[B4E8B3C1ADDDE1B]) [    x:collection4] o.a.s.c.SolrCore [collection4]  CLOSING SolrCore org.apache.solr.core.SolrCore@b3f8132
   [junit4]   2> 6197 INFO  (TEST-TestLazyCores.testLazySearch-seed#[B4E8B3C1ADDDE1B]) [    x:collection4] o.a.s.u.DirectUpdateHandler2 closing DirectUpdateHandler2{commits=1,autocommits=0,soft autocommits=0,optimizes=0,rollbacks=0,expungeDeletes=0,docsPending=0,adds=0,deletesById=0,deletesByQuery=0,errors=0,cumulative_adds=7,cumulative_deletesById=0,cumulative_deletesByQuery=0,cumulative_errors=0}
   [junit4]   2> 6199 INFO  (TEST-TestLazyCores.testLazySearch-seed#[B4E8B3C1ADDDE1B]) [    x:collection4] o.a.s.u.SolrCoreState Closing SolrCoreState
   [junit4]   2> 6199 INFO  (TEST-TestLazyCores.testLazySearch-seed#[B4E8B3C1ADDDE1B]) [    x:collection4] o.a.s.u.DefaultSolrCoreState SolrCoreState ref count has reached 0 - closing IndexWriter
   [junit4]   2> 6199 INFO  (TEST-TestLazyCores.testLazySearch-seed#[B4E8B3C1ADDDE1B]) [    x:collection4] o.a.s.u.DefaultSolrCoreState closing IndexWriter with IndexWriterCloser
   [junit4]   2> 6200 INFO  (TEST-TestLazyCores.testLazySearch-seed#[B4E8B3C1ADDDE1B]) [    x:collection4] o.a.s.c.SolrCore [collection4] Closing main searcher on request.
   [junit4]   2> 6201 INFO  (TEST-TestLazyCores.testLazySearch-seed#[B4E8B3C1ADDDE1B]) [    x:collection4] o.a.s.c.CachingDirectoryFactory Closing MockDirectoryFactory - 2 directories currently being tracked
   [junit4]   2> 6201 INFO  (TEST-TestLazyCores.testLazySearch-seed#[B4E8B3C1ADDDE1B]) [    x:collection4] o.a.s.c.CachingDirectoryFactory looking to close C:\Users\JenkinsSlave\workspace\Lucene-Solr-trunk-Windows\solr\build\solr-core\test\J0\temp\solr.core.TestLazyCores_B4E8B3C1ADDDE1B-001\tempDir-001\collection4\data\index [CachedDir<<refCount=0;path=C:\Users\JenkinsSlave\workspace\Lucene-Solr-trunk-Windows\solr\build\solr-core\test\J0\temp\solr.core.TestLazyCores_B4E8B3C1ADDDE1B-001\tempDir-001\collection4\data\index;done=false>>]
   [junit4]   2> 6201 INFO  (TEST-TestLazyCores.testLazySearch-seed#[B4E8B3C1ADDDE1B]) [    x:collection4] o.a.s.c.CachingDirectoryFactory Closing directory: C:\Users\JenkinsSlave\workspace\Lucene-Solr-trunk-Windows\solr\build\solr-core\test\J0\temp\solr.core.TestLazyCores_B4E8B3C1ADDDE1B-001\tempDir-001\collection4\data\index
   [junit4]   2> 6201 INFO  (TEST-TestLazyCores.testLazySearch-seed#[B4E8B3C1ADDDE1B]) [    x:collection4] o.a.s.c.CachingDirectoryFactory looking to close C:\Users\JenkinsSlave\workspace\Lucene-Solr-trunk-Windows\solr\build\solr-core\test\J0\temp\solr.core.TestLazyCores_B4E8B3C1ADDDE1B-001\tempDir-001\collection4\data\ [CachedDir<<refCount=0;path=C:\Users\JenkinsSlave\workspace\Lucene-Solr-trunk-Windows\solr\build\solr-core\test\J0\temp\solr.core.TestLazyCores_B4E8B3C1ADDDE1B-001\tempDir-001\collection4\data\;done=false>>]
   [junit4]   2> 6201 INFO  (TEST-TestLazyCores.testLazySearch-seed#[B4E8B3C1ADDDE1B]) [    x:collection4] o.a.s.c.CachingDirectoryFactory Closing directory: C:\Users\JenkinsSlave\workspace\Lucene-Solr-trunk-Windows\solr\build\solr-core\test\J0\temp\solr.core.TestLazyCores_B4E8B3C1ADDDE1B-001\tempDir-001\collection4\data\
   [junit4]   2> 6202 INFO  (TEST-TestLazyCores.testLazySearch-seed#[B4E8B3C1ADDDE1B]) [    x:collection2] o.a.s.c.SolrCore [collection2]  CLOSING SolrCore org.apache.solr.core.SolrCore@6156437b
   [junit4]   2> 6202 INFO  (TEST-TestLazyCores.testLazySearch-seed#[B4E8B3C1ADDDE1B]) [    x:collection2] o.a.s.u.DirectUpdateHandler2 closing DirectUpdateHandler2{commits=0,autocommits=0,soft autocommits=0,optimizes=0,rollbacks=0,expungeDeletes=0,docsPending=0,adds=0,deletesById=0,deletesByQuery=0,errors=0,cumulative_adds=0,cumulative_deletesById=0,cumulative_deletesByQuery=0,cumulative_errors=0}
   [junit4]   2> 6204 INFO  (TEST-TestLazyCores.testLazySearch-seed#[B4E8B3C1ADDDE1B]) [    x:collection2] o.a.s.u.SolrCoreState Closing SolrCoreState
   [junit4]   2> 6204 INFO  (TEST-TestLazyCores.testLazySearch-seed#[B4E8B3C1ADDDE1B]) [    x:collection2] o.a.s.u.DefaultSolrCoreState SolrCoreState ref count has reached 0 - closing IndexWriter
   [junit4]   2> 6206 INFO  (TEST-TestLazyCores.testLazySearch-seed#[B4E8B3C1ADDDE1B]) [    x:collection2] o.a.s.u.DefaultSolrCoreState closing IndexWriter with IndexWriterCloser
   [junit4]   2> 6210 INFO  (TEST-TestLazyCores.testLazySearch-seed#[B4E8B3C1ADDDE1B]) [    x:collection2] o.a.s.c.SolrCore [collection2] Closing main searcher on request.
   [junit4]   2> 6211 INFO  (TEST-TestLazyCores.testLazySearch-seed#[B4E8B3C1ADDDE1B]) [    x:collection2] o.a.s.c.CachingDirectoryFactory Closing MockDirectoryFactory - 2 directories currently being tracked
   [junit4]   2> 6211 INFO  (TEST-TestLazyCores.testLazySearch-seed#[B4E8B3C1ADDDE1B]) [    x:collection2] o.a.s.c.CachingDirectoryFactory looking to close C:\Users\JenkinsSlave\workspace\Lucene-Solr-trunk-Windows\solr\build\solr-core\test\J0\temp\solr.core.TestLazyCores_B4E8B3C1ADDDE1B-001\tempDir-001\collection2\data\ [CachedDir<<refCount=0;path=C:\Users\JenkinsSlave\workspace\Lucene-Solr-trunk-Windows\solr\build\solr-core\test\J0\temp\solr.core.TestLazyCores_B4E8B3C1ADDDE1B-001\tempDir-001\collection2\data\;done=false>>]
   [junit4]   2> 6211 INFO  (TEST-TestLazyCores.testLazySearch-seed#[B4E8B3C1ADDDE1B]) [    x:collection2] o.a.s.c.CachingDirectoryFactory Closing directory: C:\Users\JenkinsSlave\workspace\Lucene-Solr-trunk-Windows\solr\build\solr-core\test\J0\temp\solr.core.TestLazyCores_B4E8B3C1ADDDE1B-001\tempDir-001\collection2\data\
   [junit4]   2> 6211 INFO  (TEST-TestLazyCores.testLazySearch-seed#[B4E8B3C1ADDDE1B]) [    x:collection2] o.a.s.c.CachingDirectoryFactory looking to close C:\Users\JenkinsSlave\workspace\Lucene-Solr-trunk-Windows\solr\build\solr-core\test\J0\temp\solr.core.TestLazyCores_B4E8B3C1ADDDE1B-001\tempDir-001\collection2\data\index [CachedDir<<refCount=0;path=C:\Users\JenkinsSlave\workspace\Lucene-Solr-trunk-Windows\solr\build\solr-core\test\J0\temp\solr.core.TestLazyCores_B4E8B3C1ADDDE1B-001\tempDir-001\collection2\data\index;done=false>>]
   [junit4]   2> 6211 INFO  (TEST-TestLazyCores.testLazySearch-seed#[B4E8B3C1ADDDE1B]) [    x:collection2] o.a.s.c.CachingDirectoryFactory Closing directory: C:\Users\JenkinsSlave\workspace\Lucene-Solr-trunk-Windows\solr\build\solr-core\test\J0\temp\solr.core.TestLazyCores_B4E8B3C1ADDDE1B-001\tempDir-001\collection2\data\index
   [junit4]   2> 6211 INFO  (TEST-TestLazyCores.testLazySearch-seed#[B4E8B3C1ADDDE1B]) [    x:collection2] o.a.s.SolrTestCaseJ4 ###Ending testLazySearch
   [junit4]   2> 6220 INFO  (TEST-TestLazyCores.testBadConfigsGenerateErrors-seed#[B4E8B3C1ADDDE1B]) [    x:collection2] o.a.s.SolrTestCaseJ4 ###Starting testBadConfigsGenerateErrors
   [junit4]   2> 6292 INFO  (TEST-TestLazyCores.testBadConfigsGenerateErrors-seed#[B4E8B3C1ADDDE1B]) [    x:collection2] o.a.s.c.SolrResourceLoader new SolrResourceLoader for directory: 'C:\Users\JenkinsSlave\workspace\Lucene-Solr-trunk-Windows\solr\build\solr-core\test\J0\temp\solr.core.TestLazyCores_B4E8B3C1ADDDE1B-001\tempDir-002'
   [junit4]   2> 6292 INFO  (TEST-TestLazyCores.testBadConfigsGenerateErrors-seed#[B4E8B3C1ADDDE1B]) [    x:collection2] o.a.s.c.SolrResourceLoader JNDI not configured for solr (NoInitialContextEx)
   [junit4]   2> 6293 INFO  (TEST-TestLazyCores.testBadConfigsGenerateErrors-seed#[B4E8B3C1ADDDE1B]) [    x:collection2] o.a.s.c.SolrResourceLoader solr home defaulted to 'solr/' (could not find system property or JNDI)
   [junit4]   2> 6317 INFO  (TEST-TestLazyCores.testBadConfigsGenerateErrors-seed#[B4E8B3C1ADDDE1B]) [    x:collection2] o.a.s.c.CorePropertiesLocator Config-defined core root directory: C:\Users\JenkinsSlave\workspace\Lucene-Solr-trunk-Windows\solr\build\solr-core\test\J0\temp\solr.core.TestLazyCores_B4E8B3C1ADDDE1B-001\tempDir-002
   [junit4]   2> 6317 INFO  (TEST-TestLazyCores.testBadConfigsGenerateErrors-seed#[B4E8B3C1ADDDE1B]) [    x:collection2] o.a.s.c.CoreContainer New CoreContainer 159510722
   [junit4]   2> 6318 INFO  (TEST-TestLazyCores.testBadConfigsGenerateErrors-seed#[B4E8B3C1ADDDE1B]) [    x:collection2] o.a.s.c.CoreContainer Loading cores into CoreContainer [instanceDir=C:\Users\JenkinsSlave\workspace\Lucene-Solr-trunk-Windows\solr\build\solr-core\test\J0\temp\solr.core.TestLazyCores_B4E8B3C1ADDDE1B-001\tempDir-002]
   [junit4]   2> 6318 WARN  (TEST-TestLazyCores.testBadConfigsGenerateErrors-seed#[B4E8B3C1ADDDE1B]) [    x:collection2] o.a.s.c.CoreContainer Couldn't add files from C:\Users\JenkinsSlave\workspace\Lucene-Solr-trunk-Windows\solr\build\solr-core\test\J0\temp\solr.core.TestLazyCores_B4E8B3C1ADDDE1B-001\tempDir-002\lib to classpath: C:\Users\JenkinsSlave\workspace\Lucene-Solr-trunk-Windows\solr\build\solr-core\test\J0\temp\solr.core.TestLazyCores_B4E8B3C1ADDDE1B-001\tempDir-002\lib
   [junit4]   2> 6318 INFO  (TEST-TestLazyCores.testBadConfigsGenerateErrors-seed#[B4E8B3C1ADDDE1B]) [    x:collection2] o.a.s.h.c.HttpShardHandlerFactory created with socketTimeout : 600000,connTimeout : 60000,maxConnectionsPerHost : 20,maxConnections : 10000,corePoolSize : 0,maximumPoolSize : 2147483647,maxThreadIdleTime : 5,sizeOfQueue : -1,fairnessPolicy : false,useRetries : false,
   [junit4]   2> 6322 INFO  (TEST-TestLazyCores.testBadConfigsGenerateErrors-seed#[B4E8B3C1ADDDE1B]) [    x:collection2] o.a.s.u.UpdateShardHandler Creating UpdateShardHandler HTTP client with params: socketTimeout=600000&connTimeout=60000&retry=true
   [junit4]   2> 6323 INFO  (TEST-TestLazyCores.testBadConfigsGenerateErrors-seed#[B4E8B3C1ADDDE1B]) [    x:collection2] o.a.s.l.LogWatcher SLF4J impl is org.slf4j.impl.Log4jLoggerFactory
   [junit4]   2> 6323 INFO  (TEST-TestLazyCores.testBadConfigsGenerateErrors-seed#[B4E8B3C1ADDDE1B]) [    x:collection2] o.a.s.l.LogWatcher Registering Log Listener [Log4j (org.slf4j.impl.Log4jLoggerFactory)]
   [junit4]   2> 6323 INFO  (TEST-TestLazyCores.testBadConfigsGenerateErrors-seed#[B4E8B3C1ADDDE1B]) [    x:collection2] o.a.s.c.CoreContainer Security conf doesn't exist. Skipping setup for authorization module.
   [junit4]   2> 6323 INFO  (TEST-TestLazyCores.testBadConfigsGenerateErrors-seed#[B4E8B3C1ADDDE1B]) [    x:collection2] o.a.s.c.CoreContainer No authentication plugin used.
   [junit4]   2> 6324 INFO  (TEST-TestLazyCores.testBadConfigsGenerateErrors-seed#[B4E8B3C1ADDDE1B]) [    x:collection2] o.a.s.c.CorePropertiesLocator Looking for core definitions underneath C:\Users\JenkinsSlave\workspace\Lucene-Solr-trunk-Windows\solr\build\solr-core\test\J0\temp\solr.core.TestLazyCores_B4E8B3C1ADDDE1B-001\tempDir-002
   [junit4]   2> 6331 INFO  (TEST-TestLazyCores.testBadConfigsGenerateErrors-seed#[B4E8B3C1ADDDE1B]) [    x:collection2] o.a.s.c.CoreDescriptor Created CoreDescriptor: {name=badConfig1, config=solrconfig.xml, loadOnStartup=true, schema=schema.xml, configSetProperties=configsetprops.json, transient=true, dataDir=data\}
   [junit4]   2> 6332 INFO  (TEST-TestLazyCores.testBadConfigsGenerateErrors-seed#[B4E8B3C1ADDDE1B]) [    x:collection2] o.a.s.c.CorePropertiesLocator Found core badConfig1 in C:\Users\JenkinsSlave\workspace\Lucene-Solr-trunk-Windows\solr\build\solr-core\test\J0\temp\solr.core.TestLazyCores_B4E8B3C1ADDDE1B-001\tempDir-002\badConfig1
   [junit4]   2> 6333 INFO  (TEST-TestLazyCores.testBadConfigsGenerateErrors-seed#[B4E8B3C1ADDDE1B]) [    x:collection2] o.a.s.c.CoreDescriptor Created CoreDescriptor: {name=badConfig2, config=solrconfig.xml, loadOnStartup=true, schema=schema.xml, configSetProperties=configsetprops.json, transient=true, dataDir=data\}
   [junit4]   2> 6333 INFO  (TEST-TestLazyCores.testBadConfigsGenerateErrors-seed#[B4E8B3C1ADDDE1B]) [    x:collection2] o.a.s.c.CorePropertiesLocator Found core badConfig2 in C:\Users\JenkinsSlave\workspace\Lucene-Solr-trunk-Windows\solr\build\solr-core\test\J0\temp\solr.core.TestLazyCores_B4E8B3C1ADDDE1B-001\tempDir-002\badConfig2
   [junit4]   2> 6336 INFO  (TEST-TestLazyCores.testBadConfigsGenerateErrors-seed#[B4E8B3C1ADDDE1B]) [    x:collection2] o.a.s.c.CoreDescriptor Created CoreDescriptor: {name=badSchema1, config=solrconfig.xml, loadOnStartup=true, schema=schema.xml, configSetProperties=configsetprops.json, transient=true, dataDir=data\}
   [junit4]   2> 6337 INFO  (TEST-TestLazyCores.testBadConfigsGenerateErrors-seed#[B4E8B3C1ADDDE1B]) [    x:collection2] o.a.s.c.CorePropertiesLocator Found core badSchema1 in C:\Users\JenkinsSlave\workspace\Lucene-Solr-trunk-Windows\solr\build\solr-core\test\J0\temp\solr.core.TestLazyCores_B4E8B3C1ADDDE1B-001\tempDir-002\badSchema1
   [junit4]   2> 6338 INFO  (TEST-TestLazyCores.testBadConfigsGenerateErrors-seed#[B4E8B3C1ADDDE1B]) [    x:collection2] o.a.s.c.CoreDescriptor Created CoreDescriptor: {name=badSchema2, config=solrconfig.xml, loadOnStartup=true, schema=schema.xml, configSetProperties=configsetprops.json, transient=true, dataDir=data\}
   [junit4]   2> 6338 INFO  (TEST-TestLazyCores.testBadConfigsGenerateErrors-seed#[B4E8B3C1ADDDE1B]) [    x:collection2] o.a.s.c.CorePropertiesLocator Found core badSchema2 in C:\Users\JenkinsSlave\workspace\Lucene-Solr-trunk-Windows\solr\build\solr-core\test\J0\temp\solr.core.TestLazyCores_B4E8B3C1ADDDE1B-001\tempDir-002\badSchema2
   [junit4]   2> 6341 INFO  (TEST-TestLazyCores.testBadConfigsGenerateErrors-seed#[B4E8B3C1ADDDE1B]) [    x:collection2] o.a.s.c.CoreDescriptor Created CoreDescriptor: {name=core1, config=solrconfig.xml, loadOnStartup=true, schema=schema.xml, configSetProperties=configsetprops.json, transient=false, dataDir=data\}
   [junit4]   2> 6341 INFO  (TEST-TestLazyCores.testBadConfigsGenerateErrors-seed#[B4E8B3C1ADDDE1B]) [    x:collection2] o.a.s.c.CorePropertiesLocator Found core core1 in C:\Users\JenkinsSlave\workspace\Lucene-Solr-trunk-Windows\solr\build\solr-core\test\J0\temp\solr.core.TestLazyCores_B4E8B3C1ADDDE1B-001\tempDir-002\core1
   [junit4]   2> 6344 INFO  (TEST-TestLazyCores.testBadConfigsGenerateErrors-seed#[B4E8B3C1ADDDE1B]) [    x:collection2] o.a.s.c.CoreDescriptor Created CoreDescriptor: {name=core2, config=solrconfig.xml, loadOnStartup=true, schema=schema.xml, configSetProperties=configsetprops.json, transient=false, dataDir=data\}
   [junit4]   2> 6344 INFO  (TEST-TestLazyCores.testBadConfigsGenerateErrors-seed#[B4E8B3C1ADDDE1B]) [    x:collection2] o.a.s.c.CorePropertiesLocator Found core core2 in C:\Users\JenkinsSlave\workspace\Lucene-Solr-trunk-Windows\solr\build\solr-core\test\J0\temp\solr.core.TestLazyCores_B4E8B3C1ADDDE1B-001\tempDir-002\core2
   [junit4]   2> 6344 INFO  (TEST-TestLazyCores.testBadConfigsGenerateErrors-seed#[B4E8B3C1ADDDE1B]) [    x:collection2] o.a.s.c.CorePropertiesLocator Found 6 core definitions
   [junit4]   2> 6347 INFO  (coreLoadExecutor-28-thread-1-processing-x:collection2) [    x:collection2] o.a.s.c.SolrResourceLoader new SolrResourceLoader for directory: 'C:\Users\JenkinsSlave\workspace\Lucene-Solr-trunk-Windows\solr\build\solr-core\test\J0\temp\solr.core.TestLazyCores_B4E8B3C1ADDDE1B-001\tempDir-002\badConfig1'
   [junit4]   2> 6348 INFO  (coreLoadExecutor-28-thread-1-processing-x:collection2) [    x:collection2] o.a.s.c.SolrResourceLoader JNDI not configured for solr (NoInitialContextEx)
   [junit4]   2> 6348 INFO  (coreLoadExecutor-28-thread-2-processing-x:collection2) [    x:collection2] o.a.s.c.SolrResourceLoader new SolrResourceLoader for directory: 'C:\Users\JenkinsSlave\workspace\Lucene-Solr-trunk-Windows\solr\build\solr-core\test\J0\temp\solr.core.TestLazyCores_B4E8B3C1ADDDE1B-001\tempDir-002\badConfig2'
   [junit4]   2> 6348 INFO  (coreLoadExecutor-28-thread-2-processing-x:collection2) [    x:collection2] o.a.s.c.SolrResourceLoader JNDI not configured for solr (NoInitialContextEx)
   [junit4]   2> 6348 INFO  (coreLoadExecutor-28-thread-1-processing-x:collection2) [    x:collection2] o.a.s.c.SolrResourceLoader solr home defaulted to 'solr/' (could not find system property or JNDI)
   [junit4]   2> 6348 INFO  (coreLoadExecutor-28-thread-3-processing-x:collection2) [    x:collection2] o.a.s.c.SolrResourceLoader new SolrResourceLoader for directory: 'C:\Users\JenkinsSlave\workspace\Lucene-Solr-trunk-Windows\solr\build\solr-core\test\J0\temp\solr.core.TestLazyCores_B4E8B3C1ADDDE1B-001\tempDir-002\badSchema1'
   [junit4]   2> 6350 INFO  (coreLoadExecutor-28-thread-3-processing-x:collection2) [    x:collection2] o.a.s.c.SolrResourceLoader JNDI not configured for solr (NoInitialContextEx)
   [junit4]   2> 6350 INFO  (coreLoadExecutor-28-thread-3-processing-x:collection2) [    x:collection2] o.a.s.c.SolrResourceLoader solr home defaulted to 'solr/' (could not find system property or JNDI)
   [junit4]   2> 6348 INFO  (coreLoadExecutor-28-thread-2-processing-x:collection2) [    x:collection2] o.a.s.c.SolrResourceLoader solr home defaulted to 'solr/' (could not find system property or JNDI)
   [junit4]   2> 6400 INFO  (coreLoadExecutor-28-thread-3-processing-x:collection2) [    x:collection2] o.a.s.c.SolrConfig current version of requestparams : -1
   [junit4]   2> 6405 INFO  (coreLoadExecutor-28-thread-1-processing-x:collection2) [    x:collection2] o.a.s.c.Config Ignoring exception matching \QSAXParseException\E
   [junit4]   2> 6408 ERROR (coreLoadExecutor-28-thread-1-processing-x:collection2) [    x:collection2] o.a.s.c.CoreContainer Error creating core [badConfig1]: Could not load conf for core badConfig1: Error loading solr config from C:\Users\JenkinsSlave\workspace\Lucene-Solr-trunk-Windows\solr\build\solr-core\test\J0\temp\solr.core.TestLazyCores_B4E8B3C1ADDDE1B-001\tempDir-002\badConfig1\conf\solrconfig.xml
   [junit4]   2> org.apache.solr.common.SolrException: Could not load conf for core badConfig1: Error loading solr config from C:\Users\JenkinsSlave\workspace\Lucene-Solr-trunk-Windows\solr\build\solr-core\test\J0\temp\solr.core.TestLazyCores_B4E8B3C1ADDDE1B-001\tempDir-002\badConfig1\conf\solrconfig.xml
   [junit4]   2> 	at org.apache.solr.core.ConfigSetService.getConfig(ConfigSetService.java:86)
   [junit4]   2> 	at org.apache.solr.core.CoreContainer.create(CoreContainer.java:812)
   [junit4]   2> 	at org.apache.solr.core.CoreContainer.access$000(CoreContainer.java:87)
   [junit4]   2> 	at org.apache.solr.core.CoreContainer$1.call(CoreContainer.java:467)
   [junit4]   2> 	at org.apache.solr.core.CoreContainer$1.call(CoreContainer.java:458)
   [junit4]   2> 	at java.util.concurrent.FutureTask.run(FutureTask.java:266)
   [junit4]   2> 	at org.apache.solr.common.util.ExecutorUtil$MDCAwareThreadPoolExecutor$1.run(ExecutorUtil.java:231)
   [junit4]   2> 	at java.util.concurrent.ThreadPoolExecutor.runWorker(ThreadPoolExecutor.java:1142)
   [junit4]   2> 	at java.util.concurrent.ThreadPoolExecutor$Worker.run(ThreadPoolExecutor.java:617)
   [junit4]   2> 	at java.lang.Thread.run(Thread.java:745)
   [junit4]   2> Caused by: org.apache.solr.common.SolrException: Error loading solr config from C:\Users\JenkinsSlave\workspace\Lucene-Solr-trunk-Windows\solr\build\solr-core\test\J0\temp\solr.core.TestLazyCores_B4E8B3C1ADDDE1B-001\tempDir-002\badConfig1\conf\solrconfig.xml
   [junit4]   2> 	at org.apache.solr.core.SolrConfig.readFromResourceLoader(SolrConfig.java:172)
   [junit4]   2> 	at org.apache.solr.core.ConfigSetService.createSolrConfig(ConfigSetService.java:98)
   [junit4]   2> 	at org.apache.solr.core.ConfigSetService.getConfig(ConfigSetService.java:78)
   [junit4]   2> 	... 9 more
   [junit4]   2> Caused by: org.apache.solr.common.SolrException: org.xml.sax.SAXParseException; systemId: solrres:/solrconfig.xml; lineNumber: 56; columnNumber: 5; The element type "reqsthalr" must be terminated by the matching end-tag "</reqsthalr>".
   [junit4]   2> 	at org.apache.solr.core.Config.<init>(Config.java:154)
   [junit4]   2> 	at org.apache.solr.core.Config.<init>(Config.java:90)
   [junit4]   2> 	at org.apache.solr.core.SolrConfig.<init>(SolrConfig.java:187)
   [junit4]   2> 	at org.apache.solr.core.SolrConfig.readFromResourceLoader(SolrConfig.java:164)
   [junit4]   2> 	... 11 more
   [junit4]   2> Caused by: org.xml.sax.SAXParseException; systemId: solrres:/solrconfig.xml; lineNumber: 56; columnNumber: 5; The element type "reqsthalr" must be terminated by the matching end-tag "</reqsthalr>".
   [junit4]   2> 	at com.sun.org.apache.xerces.internal.util.ErrorHandlerWrapper.createSAXParseException(ErrorHandlerWrapper.java:203)
   [junit4]   2> 	at com.sun.org.apache.xerces.internal.util.ErrorHandlerWrapper.fatalError(ErrorHandlerWrapper.java:177)
   [junit4]   2> 	at com.sun.org.apache.xerces.internal.impl.XMLErrorReporter.reportError(XMLErrorReporter.java:400)
   [junit4]   2> 	at com.sun.org.apache.xerces.internal.impl.XMLErrorReporter.reportError(XMLErrorReporter.java:327)
   [junit4]   2> 	at com.sun.org.apache.xerces.internal.impl.XMLScanner.reportFatalError(XMLScanner.java:1437)
   [junit4]   2> 	at com.sun.org.apache.xerces.internal.impl.XMLDocumentFragmentScannerImpl.scanEndElement(XMLDocumentFragmentScannerImpl.java:1750)
   [junit4]   2> 	at com.sun.org.apache.xerces.internal.impl.XMLDocumentFragmentScannerImpl$FragmentContentDriver.next(XMLDocumentFragmentScannerImpl.java:2970)
   [junit4]   2> 	at com.sun.org.apache.xerces.internal.impl.XMLDocumentScannerImpl.next(XMLDocumentScannerImpl.java:606)
   [junit4]   2> 	at com.sun.org.apache.xerces.internal.impl.XMLNSDocumentScannerImpl.next(XMLNSDocumentScannerImpl.java:118)
   [junit4]   2> 	at com.sun.org.apache.xerces.internal.impl.XMLDocumentFragmentScannerImpl.scanDocument(XMLDocumentFragmentScannerImpl.java:510)
   [junit4]   2> 	at com.sun.org.apache.xerces.internal.parsers.XML11Configuration.parse(XML11Configuration.java:848)
   [junit4]   2> 	at com.sun.org.apache.xerces.internal.parsers.XML11Configuration.parse(XML11Configuration.java:777)
   [junit4]   2> 	at com.sun.org.apache.xerces.internal.parsers.XMLParser.parse(XMLParser.java:141)
   [junit4]   2> 	at com.sun.org.apache.xerces.internal.parsers.DOMParser.parse(DOMParser.java:243)
   [junit4]   2> 	at com.sun.org.apache.xerces.internal.jaxp.DocumentBuilderImpl.parse(DocumentBuilderImpl.java:339)
   [junit4]   2> 	at org.apache.solr.core.Config.<init>(Config.java:143)
   [junit4]   2> 	... 14 more
   [junit4]   2> 6421 INFO  (coreLoadExecutor-28-thread-1-processing-x:collection2) [    x:collection2] o.a.s.c.SolrResourceLoader new SolrResourceLoader for directory: 'C:\Users\JenkinsSlave\workspace\Lucene-Solr-trunk-Windows\solr\build\solr-core\test\J0\temp\solr.core.TestLazyCores_B4E8B3C1ADDDE1B-001\tempDir-002\badSchema2'
   [junit4]   2> 6415 INFO  (coreLoadExecutor-28-thread-3-processing-x:collection2) [    x:collection2] o.a.s.c.SolrConfig Using Lucene MatchVersion: 6.0.0
   [junit4]   2> 6421 INFO  (coreLoadExecutor-28-thread-1-processing-x:collection2) [    x:collection2] o.a.s.c.SolrResourceLoader JNDI not configured for solr (NoInitialContextEx)
   [junit4]   2> 6421 INFO  (coreLoadExecutor-28-thread-1-processing-x:collection2) [    x:collection2] o.a.s.c.SolrResourceLoader solr home defaulted to 'solr/' (could not find system property or JNDI)
   [junit4]   2> 6415 INFO  (coreLoadExecutor-28-thread-2-processing-x:collection2) [    x:collection2] o.a.s.c.Config Ignoring exception matc

[...truncated too long message...]

 > 	at org.apache.solr.SolrTestCaseJ4.assertJQ(SolrTestCaseJ4.java:789)
   [junit4]    > 	at org.apache.solr.handler.component.SpellCheckComponentTest.testNumericQuery(SpellCheckComponentTest.java:154)
   [junit4]    > 	at java.lang.Thread.run(Thread.java:745)
   [junit4]   2> 1066346 INFO  (SUITE-SpellCheckComponentTest-seed#[B4E8B3C1ADDDE1B]-worker) [    ] o.a.s.SolrTestCaseJ4 ###deleteCore
   [junit4]   2> 1066346 INFO  (SUITE-SpellCheckComponentTest-seed#[B4E8B3C1ADDDE1B]-worker) [    ] o.a.s.c.CoreContainer Shutting down CoreContainer instance=310480470
   [junit4]   2> 1066347 INFO  (SUITE-SpellCheckComponentTest-seed#[B4E8B3C1ADDDE1B]-worker) [    x:collection1] o.a.s.c.SolrCore [collection1]  CLOSING SolrCore org.apache.solr.core.SolrCore@5037b38f
   [junit4]   2> 1066347 INFO  (SUITE-SpellCheckComponentTest-seed#[B4E8B3C1ADDDE1B]-worker) [    x:collection1] o.a.s.u.DirectUpdateHandler2 closing DirectUpdateHandler2{commits=24,autocommits=0,soft autocommits=0,optimizes=0,rollbacks=0,expungeDeletes=0,docsPending=0,adds=0,deletesById=0,deletesByQuery=0,errors=0,cumulative_adds=112,cumulative_deletesById=0,cumulative_deletesByQuery=11,cumulative_errors=0}
   [junit4]   2> 1066347 INFO  (SUITE-SpellCheckComponentTest-seed#[B4E8B3C1ADDDE1B]-worker) [    x:collection1] o.a.s.u.SolrCoreState Closing SolrCoreState
   [junit4]   2> 1066347 INFO  (SUITE-SpellCheckComponentTest-seed#[B4E8B3C1ADDDE1B]-worker) [    x:collection1] o.a.s.u.DefaultSolrCoreState SolrCoreState ref count has reached 0 - closing IndexWriter
   [junit4]   2> 1066347 INFO  (SUITE-SpellCheckComponentTest-seed#[B4E8B3C1ADDDE1B]-worker) [    x:collection1] o.a.s.u.DefaultSolrCoreState closing IndexWriter with IndexWriterCloser
   [junit4]   2> 1066347 INFO  (SUITE-SpellCheckComponentTest-seed#[B4E8B3C1ADDDE1B]-worker) [    x:collection1] o.a.s.c.SolrCore [collection1] Closing main searcher on request.
   [junit4]   2> 1066347 INFO  (SUITE-SpellCheckComponentTest-seed#[B4E8B3C1ADDDE1B]-worker) [    x:collection1] o.a.s.c.CachingDirectoryFactory Closing MockDirectoryFactory - 2 directories currently being tracked
   [junit4]   2> 1066347 INFO  (SUITE-SpellCheckComponentTest-seed#[B4E8B3C1ADDDE1B]-worker) [    x:collection1] o.a.s.c.CachingDirectoryFactory looking to close C:\Users\JenkinsSlave\workspace\Lucene-Solr-trunk-Windows\solr\build\solr-core\test\J1\temp\solr.handler.component.SpellCheckComponentTest_B4E8B3C1ADDDE1B-001\init-core-data-001\ [CachedDir<<refCount=0;path=C:\Users\JenkinsSlave\workspace\Lucene-Solr-trunk-Windows\solr\build\solr-core\test\J1\temp\solr.handler.component.SpellCheckComponentTest_B4E8B3C1ADDDE1B-001\init-core-data-001\;done=false>>]
   [junit4]   2> 1066347 INFO  (SUITE-SpellCheckComponentTest-seed#[B4E8B3C1ADDDE1B]-worker) [    x:collection1] o.a.s.c.CachingDirectoryFactory Closing directory: C:\Users\JenkinsSlave\workspace\Lucene-Solr-trunk-Windows\solr\build\solr-core\test\J1\temp\solr.handler.component.SpellCheckComponentTest_B4E8B3C1ADDDE1B-001\init-core-data-001\
   [junit4]   2> 1066347 INFO  (SUITE-SpellCheckComponentTest-seed#[B4E8B3C1ADDDE1B]-worker) [    x:collection1] o.a.s.c.CachingDirectoryFactory looking to close C:\Users\JenkinsSlave\workspace\Lucene-Solr-trunk-Windows\solr\build\solr-core\test\J1\temp\solr.handler.component.SpellCheckComponentTest_B4E8B3C1ADDDE1B-001\init-core-data-001\index [CachedDir<<refCount=0;path=C:\Users\JenkinsSlave\workspace\Lucene-Solr-trunk-Windows\solr\build\solr-core\test\J1\temp\solr.handler.component.SpellCheckComponentTest_B4E8B3C1ADDDE1B-001\init-core-data-001\index;done=false>>]
   [junit4]   2> 1066347 INFO  (SUITE-SpellCheckComponentTest-seed#[B4E8B3C1ADDDE1B]-worker) [    x:collection1] o.a.s.c.CachingDirectoryFactory Closing directory: C:\Users\JenkinsSlave\workspace\Lucene-Solr-trunk-Windows\solr\build\solr-core\test\J1\temp\solr.handler.component.SpellCheckComponentTest_B4E8B3C1ADDDE1B-001\init-core-data-001\index
   [junit4]   2> NOTE: leaving temporary files on disk at: C:\Users\JenkinsSlave\workspace\Lucene-Solr-trunk-Windows\solr\build\solr-core\test\J1\temp\solr.handler.component.SpellCheckComponentTest_B4E8B3C1ADDDE1B-001
   [junit4]   2> NOTE: test params are: codec=Asserting(Lucene60): {start1=TestBloomFilteredLucenePostings(BloomFilteringPostingsFormat(Lucene50(blocksize=128))), range_facet_l_dv=PostingsFormat(name=LuceneVarGapDocFreqInterval), multiDefault=PostingsFormat(name=Asserting), intDefault=PostingsFormat(name=Memory doPackFST= false), range_facet_l=PostingsFormat(name=Memory doPackFST= false), lowerfilt1and2=PostingsFormat(name=Asserting), end4=TestBloomFilteredLucenePostings(BloomFilteringPostingsFormat(Lucene50(blocksize=128))), end3=PostingsFormat(name=Asserting), end2=PostingsFormat(name=LuceneVarGapDocFreqInterval), end1=PostingsFormat(name=Memory doPackFST= false), lowerfilt=PostingsFormat(name=Asserting), gram1=PostingsFormat(name=Memory doPackFST= false), id=PostingsFormat(name=LuceneVarGapDocFreqInterval), range_facet_i_dv=PostingsFormat(name=Memory doPackFST= false), gram2=PostingsFormat(name=LuceneVarGapDocFreqInterval), gram3=PostingsFormat(name=Asserting), start3=PostingsFormat(name=LuceneVarGapDocFreqInterval), gram4=TestBloomFilteredLucenePostings(BloomFilteringPostingsFormat(Lucene50(blocksize=128))), start2=PostingsFormat(name=Asserting), word=PostingsFormat(name=Memory doPackFST= false), timestamp=PostingsFormat(name=Memory doPackFST= false), start4=PostingsFormat(name=Memory doPackFST= false)}, docValues:{range_facet_l_dv=DocValuesFormat(name=Direct), range_facet_i_dv=DocValuesFormat(name=Lucene54), timestamp=DocValuesFormat(name=Lucene54)}, sim=RandomSimilarity(queryNorm=true,coord=yes): {}, locale=fr-CA, timezone=America/Kentucky/Monticello
   [junit4]   2> NOTE: Windows 7 6.1 amd64/Oracle Corporation 1.8.0_72 (64-bit)/cpus=3,threads=1,free=416789120,total=484892672
   [junit4]   2> NOTE: All tests run in this JVM: [DebugComponentTest, SortSpecParsingTest, UniqFieldsUpdateProcessorFactoryTest, EchoParamsTest, CSVRequestHandlerTest, TestTrie, TestSolrCloudWithKerberosAlt, ConcurrentDeleteAndCreateCollectionTest, DocExpirationUpdateProcessorFactoryTest, BasicFunctionalityTest, TestSolrIndexConfig, BadIndexSchemaTest, HdfsRecoverLeaseTest, TestPerFieldSimilarityWithDefaultOverride, SolrPluginUtilsTest, TestBadConfig, ExplicitHLLTest, SpellCheckCollatorTest, LoggingHandlerTest, TestCSVResponseWriter, SearchHandlerTest, CollectionsAPIDistributedZkTest, TestSearcherReuse, FacetPivotSmallTest, BadCopyFieldTest, TestManagedResourceStorage, DistanceFunctionTest, TestSystemIdResolver, DistributedFacetPivotSmallAdvancedTest, TestRestoreCore, TestRecovery, SolrIndexSplitterTest, TestRTimerTree, CdcrVersionReplicationTest, SolrCmdDistributorTest, TestIndexSearcher, TestSimpleTrackingShardHandler, TestUseDocValuesAsStored2, NumericFieldsTest, MigrateRouteKeyTest, TestCrossCoreJoin, TestIndexingPerformance, SimpleCollectionCreateDeleteTest, TestSolr4Spatial, TestAtomicUpdateErrorCases, TestPHPSerializedResponseWriter, NoCacheHeaderTest, ResponseLogComponentTest, TestJettySolrRunner, CleanupOldIndexTest, TestDistributedGrouping, TestQueryWrapperFilter, HdfsRestartWhileUpdatingTest, CloudMLTQParserTest, AutoCommitTest, TestStandardQParsers, ZkStateReaderTest, SolrInfoMBeanTest, TestRawTransformer, CollectionReloadTest, TestCoreDiscovery, TestFiltering, TestRangeQuery, HdfsBasicDistributedZk2Test, MergeStrategyTest, ConnectionReuseTest, TestReversedWildcardFilterFactory, TestPivotHelperCode, SolrCoreCheckLockOnStartupTest, CopyFieldTest, TestSha256AuthenticationProvider, DateFieldTest, TestManagedStopFilterFactory, TestCollationFieldDocValues, TestQueryTypes, TestConfigSetImmutable, AliasIntegrationTest, OverseerStatusTest, TestImplicitCoreProperties, TestComplexPhraseQParserPlugin, HdfsChaosMonkeyNothingIsSafeTest, HdfsThreadLeakTest, TestCloudManagedSchemaConcurrent, ConjunctionSolrSpellCheckerTest, FieldAnalysisRequestHandlerTest, TestRTGBase, RAMDirectoryFactoryTest, FileUtilsTest, TestFastWriter, TestSchemaSimilarityResource, AnalysisErrorHandlingTest, TestBM25SimilarityFactory, FullSolrCloudDistribCmdsTest, ShardRoutingCustomTest, DistribCursorPagingTest, TestBulkSchemaAPI, DistributedVersionInfoTest, TestSchemaManager, TestBlendedInfixSuggestions, FileBasedSpellCheckerTest, DistributedFacetPivotLargeTest, SecurityConfHandlerTest, TestNamedUpdateProcessors, TestWriterPerf, TestConfigSets, SuggesterTest, TestLMJelinekMercerSimilarityFactory, TestOmitPositions, TestJoin, SpellCheckComponentTest]
   [junit4] Completed [545/577 (2!)] on J1 in 9.85s, 11 tests, 1 error <<< FAILURES!

[...truncated 113 lines...]
BUILD FAILED
C:\Users\JenkinsSlave\workspace\Lucene-Solr-trunk-Windows\build.xml:740: The following error occurred while executing this line:
C:\Users\JenkinsSlave\workspace\Lucene-Solr-trunk-Windows\build.xml:684: The following error occurred while executing this line:
C:\Users\JenkinsSlave\workspace\Lucene-Solr-trunk-Windows\build.xml:59: The following error occurred while executing this line:
C:\Users\JenkinsSlave\workspace\Lucene-Solr-trunk-Windows\solr\build.xml:233: The following error occurred while executing this line:
C:\Users\JenkinsSlave\workspace\Lucene-Solr-trunk-Windows\solr\common-build.xml:524: The following error occurred while executing this line:
C:\Users\JenkinsSlave\workspace\Lucene-Solr-trunk-Windows\lucene\common-build.xml:1457: The following error occurred while executing this line:
C:\Users\JenkinsSlave\workspace\Lucene-Solr-trunk-Windows\lucene\common-build.xml:1014: There were test failures: 577 suites (8 ignored), 2318 tests, 3 suite-level errors, 1 error, 1728 ignored (65 assumptions) [seed: B4E8B3C1ADDDE1B]

Total time: 44 minutes 6 seconds
Build step 'Invoke Ant' marked build as failure
Archiving artifacts
[WARNINGS] Skipping publisher since build result is FAILURE
Recording test results
Email was triggered for: Failure - Any
Sending email for trigger: Failure - Any



Mime
View raw message