lucene-dev mailing list archives

Site index · List index
Message view « Date » · « Thread »
Top « Date » · « Thread »
From Policeman Jenkins Server <jenk...@thetaphi.de>
Subject [JENKINS-EA] Lucene-Solr-trunk-Linux (64bit/jdk-9-ea+102) - Build # 15769 - Still Failing!
Date Thu, 04 Feb 2016 14:33:01 GMT
Build: http://jenkins.thetaphi.de/job/Lucene-Solr-trunk-Linux/15769/
Java: 64bit/jdk-9-ea+102 -XX:+UseCompressedOops -XX:+UseParallelGC -XX:-CompactStrings -XX:-UseSuperWord

3 tests failed.
FAILED:  junit.framework.TestSuite.org.apache.solr.cloud.CollectionsAPIDistributedZkTest

Error Message:
5 threads leaked from SUITE scope at org.apache.solr.cloud.CollectionsAPIDistributedZkTest:     1) Thread[id=6049, name=zkCallback-921-thread-2, state=TIMED_WAITING, group=TGRP-CollectionsAPIDistributedZkTest]         at jdk.internal.misc.Unsafe.park(Native Method)         at java.util.concurrent.locks.LockSupport.parkNanos(LockSupport.java:230)         at java.util.concurrent.SynchronousQueue$TransferStack.awaitFulfill(SynchronousQueue.java:461)         at java.util.concurrent.SynchronousQueue$TransferStack.transfer(SynchronousQueue.java:362)         at java.util.concurrent.SynchronousQueue.poll(SynchronousQueue.java:937)         at java.util.concurrent.ThreadPoolExecutor.getTask(ThreadPoolExecutor.java:1082)         at java.util.concurrent.ThreadPoolExecutor.runWorker(ThreadPoolExecutor.java:1143)         at java.util.concurrent.ThreadPoolExecutor$Worker.run(ThreadPoolExecutor.java:632)         at java.lang.Thread.run(Thread.java:804)    2) Thread[id=5758, name=zkCallback-921-thread-1, state=TIMED_WAITING, group=TGRP-CollectionsAPIDistributedZkTest]         at jdk.internal.misc.Unsafe.park(Native Method)         at java.util.concurrent.locks.LockSupport.parkNanos(LockSupport.java:230)         at java.util.concurrent.SynchronousQueue$TransferStack.awaitFulfill(SynchronousQueue.java:461)         at java.util.concurrent.SynchronousQueue$TransferStack.transfer(SynchronousQueue.java:362)         at java.util.concurrent.SynchronousQueue.poll(SynchronousQueue.java:937)         at java.util.concurrent.ThreadPoolExecutor.getTask(ThreadPoolExecutor.java:1082)         at java.util.concurrent.ThreadPoolExecutor.runWorker(ThreadPoolExecutor.java:1143)         at java.util.concurrent.ThreadPoolExecutor$Worker.run(ThreadPoolExecutor.java:632)         at java.lang.Thread.run(Thread.java:804)    3) Thread[id=6050, name=zkCallback-921-thread-3, state=TIMED_WAITING, group=TGRP-CollectionsAPIDistributedZkTest]         at jdk.internal.misc.Unsafe.park(Native Method)         at java.util.concurrent.locks.LockSupport.parkNanos(LockSupport.java:230)         at java.util.concurrent.SynchronousQueue$TransferStack.awaitFulfill(SynchronousQueue.java:461)         at java.util.concurrent.SynchronousQueue$TransferStack.transfer(SynchronousQueue.java:362)         at java.util.concurrent.SynchronousQueue.poll(SynchronousQueue.java:937)         at java.util.concurrent.ThreadPoolExecutor.getTask(ThreadPoolExecutor.java:1082)         at java.util.concurrent.ThreadPoolExecutor.runWorker(ThreadPoolExecutor.java:1143)         at java.util.concurrent.ThreadPoolExecutor$Worker.run(ThreadPoolExecutor.java:632)         at java.lang.Thread.run(Thread.java:804)    4) Thread[id=5757, name=TEST-CollectionsAPIDistributedZkTest.test-seed#[438A5D594E791FF]-EventThread, state=WAITING, group=TGRP-CollectionsAPIDistributedZkTest]         at jdk.internal.misc.Unsafe.park(Native Method)         at java.util.concurrent.locks.LockSupport.park(LockSupport.java:190)         at java.util.concurrent.locks.AbstractQueuedSynchronizer$ConditionObject.await(AbstractQueuedSynchronizer.java:2059)         at java.util.concurrent.LinkedBlockingQueue.take(LinkedBlockingQueue.java:442)         at org.apache.zookeeper.ClientCnxn$EventThread.run(ClientCnxn.java:494)    5) Thread[id=5756, name=TEST-CollectionsAPIDistributedZkTest.test-seed#[438A5D594E791FF]-SendThread(127.0.0.1:58237), state=TIMED_WAITING, group=TGRP-CollectionsAPIDistributedZkTest]         at java.lang.Thread.sleep(Native Method)         at org.apache.zookeeper.client.StaticHostProvider.next(StaticHostProvider.java:101)         at org.apache.zookeeper.ClientCnxn$SendThread.startConnect(ClientCnxn.java:940)         at org.apache.zookeeper.ClientCnxn$SendThread.run(ClientCnxn.java:1003)

Stack Trace:
com.carrotsearch.randomizedtesting.ThreadLeakError: 5 threads leaked from SUITE scope at org.apache.solr.cloud.CollectionsAPIDistributedZkTest: 
   1) Thread[id=6049, name=zkCallback-921-thread-2, state=TIMED_WAITING, group=TGRP-CollectionsAPIDistributedZkTest]
        at jdk.internal.misc.Unsafe.park(Native Method)
        at java.util.concurrent.locks.LockSupport.parkNanos(LockSupport.java:230)
        at java.util.concurrent.SynchronousQueue$TransferStack.awaitFulfill(SynchronousQueue.java:461)
        at java.util.concurrent.SynchronousQueue$TransferStack.transfer(SynchronousQueue.java:362)
        at java.util.concurrent.SynchronousQueue.poll(SynchronousQueue.java:937)
        at java.util.concurrent.ThreadPoolExecutor.getTask(ThreadPoolExecutor.java:1082)
        at java.util.concurrent.ThreadPoolExecutor.runWorker(ThreadPoolExecutor.java:1143)
        at java.util.concurrent.ThreadPoolExecutor$Worker.run(ThreadPoolExecutor.java:632)
        at java.lang.Thread.run(Thread.java:804)
   2) Thread[id=5758, name=zkCallback-921-thread-1, state=TIMED_WAITING, group=TGRP-CollectionsAPIDistributedZkTest]
        at jdk.internal.misc.Unsafe.park(Native Method)
        at java.util.concurrent.locks.LockSupport.parkNanos(LockSupport.java:230)
        at java.util.concurrent.SynchronousQueue$TransferStack.awaitFulfill(SynchronousQueue.java:461)
        at java.util.concurrent.SynchronousQueue$TransferStack.transfer(SynchronousQueue.java:362)
        at java.util.concurrent.SynchronousQueue.poll(SynchronousQueue.java:937)
        at java.util.concurrent.ThreadPoolExecutor.getTask(ThreadPoolExecutor.java:1082)
        at java.util.concurrent.ThreadPoolExecutor.runWorker(ThreadPoolExecutor.java:1143)
        at java.util.concurrent.ThreadPoolExecutor$Worker.run(ThreadPoolExecutor.java:632)
        at java.lang.Thread.run(Thread.java:804)
   3) Thread[id=6050, name=zkCallback-921-thread-3, state=TIMED_WAITING, group=TGRP-CollectionsAPIDistributedZkTest]
        at jdk.internal.misc.Unsafe.park(Native Method)
        at java.util.concurrent.locks.LockSupport.parkNanos(LockSupport.java:230)
        at java.util.concurrent.SynchronousQueue$TransferStack.awaitFulfill(SynchronousQueue.java:461)
        at java.util.concurrent.SynchronousQueue$TransferStack.transfer(SynchronousQueue.java:362)
        at java.util.concurrent.SynchronousQueue.poll(SynchronousQueue.java:937)
        at java.util.concurrent.ThreadPoolExecutor.getTask(ThreadPoolExecutor.java:1082)
        at java.util.concurrent.ThreadPoolExecutor.runWorker(ThreadPoolExecutor.java:1143)
        at java.util.concurrent.ThreadPoolExecutor$Worker.run(ThreadPoolExecutor.java:632)
        at java.lang.Thread.run(Thread.java:804)
   4) Thread[id=5757, name=TEST-CollectionsAPIDistributedZkTest.test-seed#[438A5D594E791FF]-EventThread, state=WAITING, group=TGRP-CollectionsAPIDistributedZkTest]
        at jdk.internal.misc.Unsafe.park(Native Method)
        at java.util.concurrent.locks.LockSupport.park(LockSupport.java:190)
        at java.util.concurrent.locks.AbstractQueuedSynchronizer$ConditionObject.await(AbstractQueuedSynchronizer.java:2059)
        at java.util.concurrent.LinkedBlockingQueue.take(LinkedBlockingQueue.java:442)
        at org.apache.zookeeper.ClientCnxn$EventThread.run(ClientCnxn.java:494)
   5) Thread[id=5756, name=TEST-CollectionsAPIDistributedZkTest.test-seed#[438A5D594E791FF]-SendThread(127.0.0.1:58237), state=TIMED_WAITING, group=TGRP-CollectionsAPIDistributedZkTest]
        at java.lang.Thread.sleep(Native Method)
        at org.apache.zookeeper.client.StaticHostProvider.next(StaticHostProvider.java:101)
        at org.apache.zookeeper.ClientCnxn$SendThread.startConnect(ClientCnxn.java:940)
        at org.apache.zookeeper.ClientCnxn$SendThread.run(ClientCnxn.java:1003)
	at __randomizedtesting.SeedInfo.seed([438A5D594E791FF]:0)


FAILED:  junit.framework.TestSuite.org.apache.solr.cloud.CollectionsAPIDistributedZkTest

Error Message:
There are still zombie threads that couldn't be terminated:    1) Thread[id=6049, name=zkCallback-921-thread-2, state=TIMED_WAITING, group=TGRP-CollectionsAPIDistributedZkTest]         at jdk.internal.misc.Unsafe.park(Native Method)         at java.util.concurrent.locks.LockSupport.parkNanos(LockSupport.java:230)         at java.util.concurrent.SynchronousQueue$TransferStack.awaitFulfill(SynchronousQueue.java:461)         at java.util.concurrent.SynchronousQueue$TransferStack.transfer(SynchronousQueue.java:362)         at java.util.concurrent.SynchronousQueue.poll(SynchronousQueue.java:937)         at java.util.concurrent.ThreadPoolExecutor.getTask(ThreadPoolExecutor.java:1082)         at java.util.concurrent.ThreadPoolExecutor.runWorker(ThreadPoolExecutor.java:1143)         at java.util.concurrent.ThreadPoolExecutor$Worker.run(ThreadPoolExecutor.java:632)         at java.lang.Thread.run(Thread.java:804)    2) Thread[id=5758, name=zkCallback-921-thread-1, state=TIMED_WAITING, group=TGRP-CollectionsAPIDistributedZkTest]         at jdk.internal.misc.Unsafe.park(Native Method)         at java.util.concurrent.locks.LockSupport.parkNanos(LockSupport.java:230)         at java.util.concurrent.SynchronousQueue$TransferStack.awaitFulfill(SynchronousQueue.java:461)         at java.util.concurrent.SynchronousQueue$TransferStack.transfer(SynchronousQueue.java:362)         at java.util.concurrent.SynchronousQueue.poll(SynchronousQueue.java:937)         at java.util.concurrent.ThreadPoolExecutor.getTask(ThreadPoolExecutor.java:1082)         at java.util.concurrent.ThreadPoolExecutor.runWorker(ThreadPoolExecutor.java:1143)         at java.util.concurrent.ThreadPoolExecutor$Worker.run(ThreadPoolExecutor.java:632)         at java.lang.Thread.run(Thread.java:804)    3) Thread[id=6050, name=zkCallback-921-thread-3, state=TIMED_WAITING, group=TGRP-CollectionsAPIDistributedZkTest]         at jdk.internal.misc.Unsafe.park(Native Method)         at java.util.concurrent.locks.LockSupport.parkNanos(LockSupport.java:230)         at java.util.concurrent.SynchronousQueue$TransferStack.awaitFulfill(SynchronousQueue.java:461)         at java.util.concurrent.SynchronousQueue$TransferStack.transfer(SynchronousQueue.java:362)         at java.util.concurrent.SynchronousQueue.poll(SynchronousQueue.java:937)         at java.util.concurrent.ThreadPoolExecutor.getTask(ThreadPoolExecutor.java:1082)         at java.util.concurrent.ThreadPoolExecutor.runWorker(ThreadPoolExecutor.java:1143)         at java.util.concurrent.ThreadPoolExecutor$Worker.run(ThreadPoolExecutor.java:632)         at java.lang.Thread.run(Thread.java:804)    4) Thread[id=5756, name=TEST-CollectionsAPIDistributedZkTest.test-seed#[438A5D594E791FF]-SendThread(127.0.0.1:58237), state=TIMED_WAITING, group=TGRP-CollectionsAPIDistributedZkTest]         at java.lang.Thread.sleep(Native Method)         at org.apache.zookeeper.client.StaticHostProvider.next(StaticHostProvider.java:101)         at org.apache.zookeeper.ClientCnxn$SendThread.startConnect(ClientCnxn.java:940)         at org.apache.zookeeper.ClientCnxn$SendThread.run(ClientCnxn.java:1003)

Stack Trace:
com.carrotsearch.randomizedtesting.ThreadLeakError: There are still zombie threads that couldn't be terminated:
   1) Thread[id=6049, name=zkCallback-921-thread-2, state=TIMED_WAITING, group=TGRP-CollectionsAPIDistributedZkTest]
        at jdk.internal.misc.Unsafe.park(Native Method)
        at java.util.concurrent.locks.LockSupport.parkNanos(LockSupport.java:230)
        at java.util.concurrent.SynchronousQueue$TransferStack.awaitFulfill(SynchronousQueue.java:461)
        at java.util.concurrent.SynchronousQueue$TransferStack.transfer(SynchronousQueue.java:362)
        at java.util.concurrent.SynchronousQueue.poll(SynchronousQueue.java:937)
        at java.util.concurrent.ThreadPoolExecutor.getTask(ThreadPoolExecutor.java:1082)
        at java.util.concurrent.ThreadPoolExecutor.runWorker(ThreadPoolExecutor.java:1143)
        at java.util.concurrent.ThreadPoolExecutor$Worker.run(ThreadPoolExecutor.java:632)
        at java.lang.Thread.run(Thread.java:804)
   2) Thread[id=5758, name=zkCallback-921-thread-1, state=TIMED_WAITING, group=TGRP-CollectionsAPIDistributedZkTest]
        at jdk.internal.misc.Unsafe.park(Native Method)
        at java.util.concurrent.locks.LockSupport.parkNanos(LockSupport.java:230)
        at java.util.concurrent.SynchronousQueue$TransferStack.awaitFulfill(SynchronousQueue.java:461)
        at java.util.concurrent.SynchronousQueue$TransferStack.transfer(SynchronousQueue.java:362)
        at java.util.concurrent.SynchronousQueue.poll(SynchronousQueue.java:937)
        at java.util.concurrent.ThreadPoolExecutor.getTask(ThreadPoolExecutor.java:1082)
        at java.util.concurrent.ThreadPoolExecutor.runWorker(ThreadPoolExecutor.java:1143)
        at java.util.concurrent.ThreadPoolExecutor$Worker.run(ThreadPoolExecutor.java:632)
        at java.lang.Thread.run(Thread.java:804)
   3) Thread[id=6050, name=zkCallback-921-thread-3, state=TIMED_WAITING, group=TGRP-CollectionsAPIDistributedZkTest]
        at jdk.internal.misc.Unsafe.park(Native Method)
        at java.util.concurrent.locks.LockSupport.parkNanos(LockSupport.java:230)
        at java.util.concurrent.SynchronousQueue$TransferStack.awaitFulfill(SynchronousQueue.java:461)
        at java.util.concurrent.SynchronousQueue$TransferStack.transfer(SynchronousQueue.java:362)
        at java.util.concurrent.SynchronousQueue.poll(SynchronousQueue.java:937)
        at java.util.concurrent.ThreadPoolExecutor.getTask(ThreadPoolExecutor.java:1082)
        at java.util.concurrent.ThreadPoolExecutor.runWorker(ThreadPoolExecutor.java:1143)
        at java.util.concurrent.ThreadPoolExecutor$Worker.run(ThreadPoolExecutor.java:632)
        at java.lang.Thread.run(Thread.java:804)
   4) Thread[id=5756, name=TEST-CollectionsAPIDistributedZkTest.test-seed#[438A5D594E791FF]-SendThread(127.0.0.1:58237), state=TIMED_WAITING, group=TGRP-CollectionsAPIDistributedZkTest]
        at java.lang.Thread.sleep(Native Method)
        at org.apache.zookeeper.client.StaticHostProvider.next(StaticHostProvider.java:101)
        at org.apache.zookeeper.ClientCnxn$SendThread.startConnect(ClientCnxn.java:940)
        at org.apache.zookeeper.ClientCnxn$SendThread.run(ClientCnxn.java:1003)
	at __randomizedtesting.SeedInfo.seed([438A5D594E791FF]:0)


FAILED:  org.apache.solr.cloud.CollectionsAPIDistributedZkTest.test

Error Message:
Error from server at http://127.0.0.1:54126/awholynewcollection_0: non ok status: 500, message:Server Error

Stack Trace:
org.apache.solr.client.solrj.impl.HttpSolrClient$RemoteSolrException: Error from server at http://127.0.0.1:54126/awholynewcollection_0: non ok status: 500, message:Server Error
	at __randomizedtesting.SeedInfo.seed([438A5D594E791FF:8C6C9A0F3A1BFC07]:0)
	at org.apache.solr.client.solrj.impl.HttpSolrClient.executeMethod(HttpSolrClient.java:511)
	at org.apache.solr.client.solrj.impl.HttpSolrClient.request(HttpSolrClient.java:240)
	at org.apache.solr.client.solrj.impl.HttpSolrClient.request(HttpSolrClient.java:229)
	at org.apache.solr.client.solrj.SolrRequest.process(SolrRequest.java:150)
	at org.apache.solr.client.solrj.SolrClient.query(SolrClient.java:943)
	at org.apache.solr.client.solrj.SolrClient.query(SolrClient.java:958)
	at org.apache.solr.cloud.AbstractFullDistribZkTestBase.waitForNon403or404or503(AbstractFullDistribZkTestBase.java:1773)
	at org.apache.solr.cloud.CollectionsAPIDistributedZkTest.testCollectionsAPI(CollectionsAPIDistributedZkTest.java:644)
	at org.apache.solr.cloud.CollectionsAPIDistributedZkTest.test(CollectionsAPIDistributedZkTest.java:160)
	at sun.reflect.NativeMethodAccessorImpl.invoke0(Native Method)
	at sun.reflect.NativeMethodAccessorImpl.invoke(NativeMethodAccessorImpl.java:62)
	at sun.reflect.DelegatingMethodAccessorImpl.invoke(DelegatingMethodAccessorImpl.java:43)
	at java.lang.reflect.Method.invoke(Method.java:520)
	at com.carrotsearch.randomizedtesting.RandomizedRunner.invoke(RandomizedRunner.java:1764)
	at com.carrotsearch.randomizedtesting.RandomizedRunner$8.evaluate(RandomizedRunner.java:871)
	at com.carrotsearch.randomizedtesting.RandomizedRunner$9.evaluate(RandomizedRunner.java:907)
	at com.carrotsearch.randomizedtesting.RandomizedRunner$10.evaluate(RandomizedRunner.java:921)
	at org.apache.solr.BaseDistributedSearchTestCase$ShardsRepeatRule$ShardsFixedStatement.callStatement(BaseDistributedSearchTestCase.java:965)
	at org.apache.solr.BaseDistributedSearchTestCase$ShardsRepeatRule$ShardsStatement.evaluate(BaseDistributedSearchTestCase.java:940)
	at com.carrotsearch.randomizedtesting.rules.SystemPropertiesRestoreRule$1.evaluate(SystemPropertiesRestoreRule.java:57)
	at org.apache.lucene.util.TestRuleSetupTeardownChained$1.evaluate(TestRuleSetupTeardownChained.java:50)
	at org.apache.lucene.util.AbstractBeforeAfterRule$1.evaluate(AbstractBeforeAfterRule.java:46)
	at org.apache.lucene.util.TestRuleThreadAndTestName$1.evaluate(TestRuleThreadAndTestName.java:49)
	at org.apache.lucene.util.TestRuleIgnoreAfterMaxFailures$1.evaluate(TestRuleIgnoreAfterMaxFailures.java:65)
	at org.apache.lucene.util.TestRuleMarkFailure$1.evaluate(TestRuleMarkFailure.java:48)
	at com.carrotsearch.randomizedtesting.rules.StatementAdapter.evaluate(StatementAdapter.java:36)
	at com.carrotsearch.randomizedtesting.ThreadLeakControl$StatementRunner.run(ThreadLeakControl.java:367)
	at com.carrotsearch.randomizedtesting.ThreadLeakControl.forkTimeoutingTask(ThreadLeakControl.java:809)
	at com.carrotsearch.randomizedtesting.ThreadLeakControl$3.evaluate(ThreadLeakControl.java:460)
	at com.carrotsearch.randomizedtesting.RandomizedRunner.runSingleTest(RandomizedRunner.java:880)
	at com.carrotsearch.randomizedtesting.RandomizedRunner$5.evaluate(RandomizedRunner.java:781)
	at com.carrotsearch.randomizedtesting.RandomizedRunner$6.evaluate(RandomizedRunner.java:816)
	at com.carrotsearch.randomizedtesting.RandomizedRunner$7.evaluate(RandomizedRunner.java:827)
	at com.carrotsearch.randomizedtesting.rules.StatementAdapter.evaluate(StatementAdapter.java:36)
	at com.carrotsearch.randomizedtesting.rules.SystemPropertiesRestoreRule$1.evaluate(SystemPropertiesRestoreRule.java:57)
	at org.apache.lucene.util.AbstractBeforeAfterRule$1.evaluate(AbstractBeforeAfterRule.java:46)
	at com.carrotsearch.randomizedtesting.rules.StatementAdapter.evaluate(StatementAdapter.java:36)
	at org.apache.lucene.util.TestRuleStoreClassName$1.evaluate(TestRuleStoreClassName.java:42)
	at com.carrotsearch.randomizedtesting.rules.NoShadowingOrOverridesOnMethodsRule$1.evaluate(NoShadowingOrOverridesOnMethodsRule.java:40)
	at com.carrotsearch.randomizedtesting.rules.NoShadowingOrOverridesOnMethodsRule$1.evaluate(NoShadowingOrOverridesOnMethodsRule.java:40)
	at com.carrotsearch.randomizedtesting.rules.StatementAdapter.evaluate(StatementAdapter.java:36)
	at com.carrotsearch.randomizedtesting.rules.StatementAdapter.evaluate(StatementAdapter.java:36)
	at com.carrotsearch.randomizedtesting.rules.StatementAdapter.evaluate(StatementAdapter.java:36)
	at org.apache.lucene.util.TestRuleAssertionsRequired$1.evaluate(TestRuleAssertionsRequired.java:54)
	at org.apache.lucene.util.TestRuleMarkFailure$1.evaluate(TestRuleMarkFailure.java:48)
	at org.apache.lucene.util.TestRuleIgnoreAfterMaxFailures$1.evaluate(TestRuleIgnoreAfterMaxFailures.java:65)
	at org.apache.lucene.util.TestRuleIgnoreTestSuites$1.evaluate(TestRuleIgnoreTestSuites.java:55)
	at com.carrotsearch.randomizedtesting.rules.StatementAdapter.evaluate(StatementAdapter.java:36)
	at com.carrotsearch.randomizedtesting.ThreadLeakControl$StatementRunner.run(ThreadLeakControl.java:367)
	at java.lang.Thread.run(Thread.java:804)




Build Log:
[...truncated 10925 lines...]
   [junit4] Suite: org.apache.solr.cloud.CollectionsAPIDistributedZkTest
   [junit4]   2> Creating dataDir: /home/jenkins/workspace/Lucene-Solr-trunk-Linux/solr/build/solr-core/test/J0/temp/solr.cloud.CollectionsAPIDistributedZkTest_438A5D594E791FF-001/init-core-data-001
   [junit4]   2> 595951 INFO  (SUITE-CollectionsAPIDistributedZkTest-seed#[438A5D594E791FF]-worker) [    ] o.a.s.SolrTestCaseJ4 Randomized ssl (false) and clientAuth (false)
   [junit4]   2> 595951 INFO  (SUITE-CollectionsAPIDistributedZkTest-seed#[438A5D594E791FF]-worker) [    ] o.a.s.BaseDistributedSearchTestCase Setting hostContext system property: /
   [junit4]   2> 595953 INFO  (TEST-CollectionsAPIDistributedZkTest.test-seed#[438A5D594E791FF]) [    ] o.a.s.c.ZkTestServer STARTING ZK TEST SERVER
   [junit4]   2> 595953 INFO  (Thread-2352) [    ] o.a.s.c.ZkTestServer client port:0.0.0.0/0.0.0.0:0
   [junit4]   2> 595953 INFO  (Thread-2352) [    ] o.a.s.c.ZkTestServer Starting server
   [junit4]   2> 596053 INFO  (TEST-CollectionsAPIDistributedZkTest.test-seed#[438A5D594E791FF]) [    ] o.a.s.c.ZkTestServer start zk server on port:58237
   [junit4]   2> 596053 INFO  (TEST-CollectionsAPIDistributedZkTest.test-seed#[438A5D594E791FF]) [    ] o.a.s.c.c.SolrZkClient Using default ZkCredentialsProvider
   [junit4]   2> 596053 INFO  (TEST-CollectionsAPIDistributedZkTest.test-seed#[438A5D594E791FF]) [    ] o.a.s.c.c.ConnectionManager Waiting for client to connect to ZooKeeper
   [junit4]   2> 596055 INFO  (zkCallback-885-thread-1) [    ] o.a.s.c.c.ConnectionManager Watcher org.apache.solr.common.cloud.ConnectionManager@39a66420 name:ZooKeeperConnection Watcher:127.0.0.1:58237 got event WatchedEvent state:SyncConnected type:None path:null path:null type:None
   [junit4]   2> 596055 INFO  (TEST-CollectionsAPIDistributedZkTest.test-seed#[438A5D594E791FF]) [    ] o.a.s.c.c.ConnectionManager Client is connected to ZooKeeper
   [junit4]   2> 596055 INFO  (TEST-CollectionsAPIDistributedZkTest.test-seed#[438A5D594E791FF]) [    ] o.a.s.c.c.SolrZkClient Using default ZkACLProvider
   [junit4]   2> 596055 INFO  (TEST-CollectionsAPIDistributedZkTest.test-seed#[438A5D594E791FF]) [    ] o.a.s.c.c.SolrZkClient makePath: /solr
   [junit4]   2> 596057 INFO  (TEST-CollectionsAPIDistributedZkTest.test-seed#[438A5D594E791FF]) [    ] o.a.s.c.c.SolrZkClient Using default ZkCredentialsProvider
   [junit4]   2> 596057 INFO  (TEST-CollectionsAPIDistributedZkTest.test-seed#[438A5D594E791FF]) [    ] o.a.s.c.c.ConnectionManager Waiting for client to connect to ZooKeeper
   [junit4]   2> 596058 INFO  (zkCallback-886-thread-1) [    ] o.a.s.c.c.ConnectionManager Watcher org.apache.solr.common.cloud.ConnectionManager@7c96ea34 name:ZooKeeperConnection Watcher:127.0.0.1:58237/solr got event WatchedEvent state:SyncConnected type:None path:null path:null type:None
   [junit4]   2> 596058 INFO  (TEST-CollectionsAPIDistributedZkTest.test-seed#[438A5D594E791FF]) [    ] o.a.s.c.c.ConnectionManager Client is connected to ZooKeeper
   [junit4]   2> 596058 INFO  (TEST-CollectionsAPIDistributedZkTest.test-seed#[438A5D594E791FF]) [    ] o.a.s.c.c.SolrZkClient Using default ZkACLProvider
   [junit4]   2> 596058 INFO  (TEST-CollectionsAPIDistributedZkTest.test-seed#[438A5D594E791FF]) [    ] o.a.s.c.c.SolrZkClient makePath: /collections/collection1
   [junit4]   2> 596059 INFO  (TEST-CollectionsAPIDistributedZkTest.test-seed#[438A5D594E791FF]) [    ] o.a.s.c.c.SolrZkClient makePath: /collections/collection1/shards
   [junit4]   2> 596059 INFO  (TEST-CollectionsAPIDistributedZkTest.test-seed#[438A5D594E791FF]) [    ] o.a.s.c.c.SolrZkClient makePath: /collections/control_collection
   [junit4]   2> 596060 INFO  (TEST-CollectionsAPIDistributedZkTest.test-seed#[438A5D594E791FF]) [    ] o.a.s.c.c.SolrZkClient makePath: /collections/control_collection/shards
   [junit4]   2> 596060 INFO  (TEST-CollectionsAPIDistributedZkTest.test-seed#[438A5D594E791FF]) [    ] o.a.s.c.AbstractZkTestCase put /home/jenkins/workspace/Lucene-Solr-trunk-Linux/solr/core/src/test-files/solr/collection1/conf/solrconfig-tlog.xml to /configs/conf1/solrconfig.xml
   [junit4]   2> 596060 INFO  (TEST-CollectionsAPIDistributedZkTest.test-seed#[438A5D594E791FF]) [    ] o.a.s.c.c.SolrZkClient makePath: /configs/conf1/solrconfig.xml
   [junit4]   2> 596061 INFO  (TEST-CollectionsAPIDistributedZkTest.test-seed#[438A5D594E791FF]) [    ] o.a.s.c.AbstractZkTestCase put /home/jenkins/workspace/Lucene-Solr-trunk-Linux/solr/core/src/test-files/solr/collection1/conf/schema.xml to /configs/conf1/schema.xml
   [junit4]   2> 596061 INFO  (TEST-CollectionsAPIDistributedZkTest.test-seed#[438A5D594E791FF]) [    ] o.a.s.c.c.SolrZkClient makePath: /configs/conf1/schema.xml
   [junit4]   2> 596061 INFO  (TEST-CollectionsAPIDistributedZkTest.test-seed#[438A5D594E791FF]) [    ] o.a.s.c.AbstractZkTestCase put /home/jenkins/workspace/Lucene-Solr-trunk-Linux/solr/core/src/test-files/solr/collection1/conf/solrconfig.snippet.randomindexconfig.xml to /configs/conf1/solrconfig.snippet.randomindexconfig.xml
   [junit4]   2> 596062 INFO  (TEST-CollectionsAPIDistributedZkTest.test-seed#[438A5D594E791FF]) [    ] o.a.s.c.c.SolrZkClient makePath: /configs/conf1/solrconfig.snippet.randomindexconfig.xml
   [junit4]   2> 596062 INFO  (TEST-CollectionsAPIDistributedZkTest.test-seed#[438A5D594E791FF]) [    ] o.a.s.c.AbstractZkTestCase put /home/jenkins/workspace/Lucene-Solr-trunk-Linux/solr/core/src/test-files/solr/collection1/conf/stopwords.txt to /configs/conf1/stopwords.txt
   [junit4]   2> 596062 INFO  (TEST-CollectionsAPIDistributedZkTest.test-seed#[438A5D594E791FF]) [    ] o.a.s.c.c.SolrZkClient makePath: /configs/conf1/stopwords.txt
   [junit4]   2> 596062 INFO  (TEST-CollectionsAPIDistributedZkTest.test-seed#[438A5D594E791FF]) [    ] o.a.s.c.AbstractZkTestCase put /home/jenkins/workspace/Lucene-Solr-trunk-Linux/solr/core/src/test-files/solr/collection1/conf/protwords.txt to /configs/conf1/protwords.txt
   [junit4]   2> 596063 INFO  (TEST-CollectionsAPIDistributedZkTest.test-seed#[438A5D594E791FF]) [    ] o.a.s.c.c.SolrZkClient makePath: /configs/conf1/protwords.txt
   [junit4]   2> 596063 INFO  (TEST-CollectionsAPIDistributedZkTest.test-seed#[438A5D594E791FF]) [    ] o.a.s.c.AbstractZkTestCase put /home/jenkins/workspace/Lucene-Solr-trunk-Linux/solr/core/src/test-files/solr/collection1/conf/currency.xml to /configs/conf1/currency.xml
   [junit4]   2> 596063 INFO  (TEST-CollectionsAPIDistributedZkTest.test-seed#[438A5D594E791FF]) [    ] o.a.s.c.c.SolrZkClient makePath: /configs/conf1/currency.xml
   [junit4]   2> 596063 INFO  (TEST-CollectionsAPIDistributedZkTest.test-seed#[438A5D594E791FF]) [    ] o.a.s.c.AbstractZkTestCase put /home/jenkins/workspace/Lucene-Solr-trunk-Linux/solr/core/src/test-files/solr/collection1/conf/enumsConfig.xml to /configs/conf1/enumsConfig.xml
   [junit4]   2> 596063 INFO  (TEST-CollectionsAPIDistributedZkTest.test-seed#[438A5D594E791FF]) [    ] o.a.s.c.c.SolrZkClient makePath: /configs/conf1/enumsConfig.xml
   [junit4]   2> 596064 INFO  (TEST-CollectionsAPIDistributedZkTest.test-seed#[438A5D594E791FF]) [    ] o.a.s.c.AbstractZkTestCase put /home/jenkins/workspace/Lucene-Solr-trunk-Linux/solr/core/src/test-files/solr/collection1/conf/open-exchange-rates.json to /configs/conf1/open-exchange-rates.json
   [junit4]   2> 596064 INFO  (TEST-CollectionsAPIDistributedZkTest.test-seed#[438A5D594E791FF]) [    ] o.a.s.c.c.SolrZkClient makePath: /configs/conf1/open-exchange-rates.json
   [junit4]   2> 596064 INFO  (TEST-CollectionsAPIDistributedZkTest.test-seed#[438A5D594E791FF]) [    ] o.a.s.c.AbstractZkTestCase put /home/jenkins/workspace/Lucene-Solr-trunk-Linux/solr/core/src/test-files/solr/collection1/conf/mapping-ISOLatin1Accent.txt to /configs/conf1/mapping-ISOLatin1Accent.txt
   [junit4]   2> 596064 INFO  (TEST-CollectionsAPIDistributedZkTest.test-seed#[438A5D594E791FF]) [    ] o.a.s.c.c.SolrZkClient makePath: /configs/conf1/mapping-ISOLatin1Accent.txt
   [junit4]   2> 596065 INFO  (TEST-CollectionsAPIDistributedZkTest.test-seed#[438A5D594E791FF]) [    ] o.a.s.c.AbstractZkTestCase put /home/jenkins/workspace/Lucene-Solr-trunk-Linux/solr/core/src/test-files/solr/collection1/conf/old_synonyms.txt to /configs/conf1/old_synonyms.txt
   [junit4]   2> 596065 INFO  (TEST-CollectionsAPIDistributedZkTest.test-seed#[438A5D594E791FF]) [    ] o.a.s.c.c.SolrZkClient makePath: /configs/conf1/old_synonyms.txt
   [junit4]   2> 596065 INFO  (TEST-CollectionsAPIDistributedZkTest.test-seed#[438A5D594E791FF]) [    ] o.a.s.c.AbstractZkTestCase put /home/jenkins/workspace/Lucene-Solr-trunk-Linux/solr/core/src/test-files/solr/collection1/conf/synonyms.txt to /configs/conf1/synonyms.txt
   [junit4]   2> 596065 INFO  (TEST-CollectionsAPIDistributedZkTest.test-seed#[438A5D594E791FF]) [    ] o.a.s.c.c.SolrZkClient makePath: /configs/conf1/synonyms.txt
   [junit4]   2> 596116 INFO  (TEST-CollectionsAPIDistributedZkTest.test-seed#[438A5D594E791FF]) [    ] o.a.s.SolrTestCaseJ4 Writing core.properties file to /home/jenkins/workspace/Lucene-Solr-trunk-Linux/solr/build/solr-core/test/J0/temp/solr.cloud.CollectionsAPIDistributedZkTest_438A5D594E791FF-001/control-001/cores/collection1
   [junit4]   2> 596117 INFO  (TEST-CollectionsAPIDistributedZkTest.test-seed#[438A5D594E791FF]) [    ] o.e.j.s.Server jetty-9.2.13.v20150730
   [junit4]   2> 596117 INFO  (TEST-CollectionsAPIDistributedZkTest.test-seed#[438A5D594E791FF]) [    ] o.e.j.s.h.ContextHandler Started o.e.j.s.ServletContextHandler@416700c9{/,null,AVAILABLE}
   [junit4]   2> 596122 INFO  (TEST-CollectionsAPIDistributedZkTest.test-seed#[438A5D594E791FF]) [    ] o.e.j.s.ServerConnector Started ServerConnector@2f675367{HTTP/1.1}{127.0.0.1:54126}
   [junit4]   2> 596122 INFO  (TEST-CollectionsAPIDistributedZkTest.test-seed#[438A5D594E791FF]) [    ] o.e.j.s.Server Started @597925ms
   [junit4]   2> 596122 INFO  (TEST-CollectionsAPIDistributedZkTest.test-seed#[438A5D594E791FF]) [    ] o.a.s.c.s.e.JettySolrRunner Jetty properties: {solr.data.dir=/home/jenkins/workspace/Lucene-Solr-trunk-Linux/solr/build/solr-core/test/J0/temp/solr.cloud.CollectionsAPIDistributedZkTest_438A5D594E791FF-001/tempDir-001/control/data, hostContext=/, hostPort=54126, coreRootDirectory=/home/jenkins/workspace/Lucene-Solr-trunk-Linux/solr/build/solr-core/test/J0/../../../../../../../../../home/jenkins/workspace/Lucene-Solr-trunk-Linux/solr/build/solr-core/test/J0/temp/solr.cloud.CollectionsAPIDistributedZkTest_438A5D594E791FF-001/control-001/cores}
   [junit4]   2> 596122 INFO  (TEST-CollectionsAPIDistributedZkTest.test-seed#[438A5D594E791FF]) [    ] o.a.s.s.SolrDispatchFilter SolrDispatchFilter.init(): sun.misc.Launcher$AppClassLoader@7fbe847c
   [junit4]   2> 596122 INFO  (TEST-CollectionsAPIDistributedZkTest.test-seed#[438A5D594E791FF]) [    ] o.a.s.c.SolrResourceLoader new SolrResourceLoader for directory: '/home/jenkins/workspace/Lucene-Solr-trunk-Linux/solr/build/solr-core/test/J0/temp/solr.cloud.CollectionsAPIDistributedZkTest_438A5D594E791FF-001/control-001'
   [junit4]   2> 596122 INFO  (TEST-CollectionsAPIDistributedZkTest.test-seed#[438A5D594E791FF]) [    ] o.a.s.c.SolrResourceLoader JNDI not configured for solr (NoInitialContextEx)
   [junit4]   2> 596122 INFO  (TEST-CollectionsAPIDistributedZkTest.test-seed#[438A5D594E791FF]) [    ] o.a.s.c.SolrResourceLoader solr home defaulted to 'solr/' (could not find system property or JNDI)
   [junit4]   2> 596122 INFO  (TEST-CollectionsAPIDistributedZkTest.test-seed#[438A5D594E791FF]) [    ] o.a.s.c.c.SolrZkClient Using default ZkCredentialsProvider
   [junit4]   2> 596123 INFO  (TEST-CollectionsAPIDistributedZkTest.test-seed#[438A5D594E791FF]) [    ] o.a.s.c.c.ConnectionManager Waiting for client to connect to ZooKeeper
   [junit4]   2> 596123 INFO  (zkCallback-887-thread-1) [    ] o.a.s.c.c.ConnectionManager Watcher org.apache.solr.common.cloud.ConnectionManager@6f09e34d name:ZooKeeperConnection Watcher:127.0.0.1:58237/solr got event WatchedEvent state:SyncConnected type:None path:null path:null type:None
   [junit4]   2> 596123 INFO  (TEST-CollectionsAPIDistributedZkTest.test-seed#[438A5D594E791FF]) [    ] o.a.s.c.c.ConnectionManager Client is connected to ZooKeeper
   [junit4]   2> 596124 INFO  (TEST-CollectionsAPIDistributedZkTest.test-seed#[438A5D594E791FF]) [    ] o.a.s.c.c.SolrZkClient Using default ZkACLProvider
   [junit4]   2> 596124 INFO  (TEST-CollectionsAPIDistributedZkTest.test-seed#[438A5D594E791FF]) [    ] o.a.s.s.SolrDispatchFilter Loading solr.xml from SolrHome (not found in ZooKeeper)
   [junit4]   2> 596124 INFO  (TEST-CollectionsAPIDistributedZkTest.test-seed#[438A5D594E791FF]) [    ] o.a.s.c.SolrXmlConfig Loading container configuration from /home/jenkins/workspace/Lucene-Solr-trunk-Linux/solr/build/solr-core/test/J0/temp/solr.cloud.CollectionsAPIDistributedZkTest_438A5D594E791FF-001/control-001/solr.xml
   [junit4]   2> 596127 INFO  (TEST-CollectionsAPIDistributedZkTest.test-seed#[438A5D594E791FF]) [    ] o.a.s.c.CorePropertiesLocator Config-defined core root directory: /home/jenkins/workspace/Lucene-Solr-trunk-Linux/solr/build/solr-core/test/J0/../../../../../../../../../home/jenkins/workspace/Lucene-Solr-trunk-Linux/solr/build/solr-core/test/J0/temp/solr.cloud.CollectionsAPIDistributedZkTest_438A5D594E791FF-001/control-001/cores
   [junit4]   2> 596127 INFO  (TEST-CollectionsAPIDistributedZkTest.test-seed#[438A5D594E791FF]) [    ] o.a.s.c.CoreContainer New CoreContainer 1943006154
   [junit4]   2> 596127 INFO  (TEST-CollectionsAPIDistributedZkTest.test-seed#[438A5D594E791FF]) [    ] o.a.s.c.CoreContainer Loading cores into CoreContainer [instanceDir=/home/jenkins/workspace/Lucene-Solr-trunk-Linux/solr/build/solr-core/test/J0/temp/solr.cloud.CollectionsAPIDistributedZkTest_438A5D594E791FF-001/control-001]
   [junit4]   2> 596127 WARN  (TEST-CollectionsAPIDistributedZkTest.test-seed#[438A5D594E791FF]) [    ] o.a.s.c.CoreContainer Couldn't add files from /home/jenkins/workspace/Lucene-Solr-trunk-Linux/solr/build/solr-core/test/J0/temp/solr.cloud.CollectionsAPIDistributedZkTest_438A5D594E791FF-001/control-001/lib to classpath: /home/jenkins/workspace/Lucene-Solr-trunk-Linux/solr/build/solr-core/test/J0/temp/solr.cloud.CollectionsAPIDistributedZkTest_438A5D594E791FF-001/control-001/lib
   [junit4]   2> 596127 INFO  (TEST-CollectionsAPIDistributedZkTest.test-seed#[438A5D594E791FF]) [    ] o.a.s.h.c.HttpShardHandlerFactory created with socketTimeout : 90000,urlScheme : ,connTimeout : 15000,maxConnectionsPerHost : 20,maxConnections : 10000,corePoolSize : 0,maximumPoolSize : 2147483647,maxThreadIdleTime : 5,sizeOfQueue : -1,fairnessPolicy : false,useRetries : false,
   [junit4]   2> 596128 INFO  (TEST-CollectionsAPIDistributedZkTest.test-seed#[438A5D594E791FF]) [    ] o.a.s.u.UpdateShardHandler Creating UpdateShardHandler HTTP client with params: socketTimeout=340000&connTimeout=45000&retry=true
   [junit4]   2> 596128 INFO  (TEST-CollectionsAPIDistributedZkTest.test-seed#[438A5D594E791FF]) [    ] o.a.s.l.LogWatcher SLF4J impl is org.slf4j.impl.Log4jLoggerFactory
   [junit4]   2> 596128 INFO  (TEST-CollectionsAPIDistributedZkTest.test-seed#[438A5D594E791FF]) [    ] o.a.s.l.LogWatcher Registering Log Listener [Log4j (org.slf4j.impl.Log4jLoggerFactory)]
   [junit4]   2> 596128 INFO  (TEST-CollectionsAPIDistributedZkTest.test-seed#[438A5D594E791FF]) [    ] o.a.s.c.ZkContainer Zookeeper client=127.0.0.1:58237/solr
   [junit4]   2> 596128 INFO  (TEST-CollectionsAPIDistributedZkTest.test-seed#[438A5D594E791FF]) [    ] o.a.s.c.ZkController zkHost includes chroot
   [junit4]   2> 596128 INFO  (TEST-CollectionsAPIDistributedZkTest.test-seed#[438A5D594E791FF]) [    ] o.a.s.c.c.SolrZkClient Using default ZkCredentialsProvider
   [junit4]   2> 596128 INFO  (TEST-CollectionsAPIDistributedZkTest.test-seed#[438A5D594E791FF]) [    ] o.a.s.c.c.ConnectionManager Waiting for client to connect to ZooKeeper
   [junit4]   2> 596129 INFO  (zkCallback-890-thread-1) [    ] o.a.s.c.c.ConnectionManager Watcher org.apache.solr.common.cloud.ConnectionManager@4da1130e name:ZooKeeperConnection Watcher:127.0.0.1:58237 got event WatchedEvent state:SyncConnected type:None path:null path:null type:None
   [junit4]   2> 596129 INFO  (TEST-CollectionsAPIDistributedZkTest.test-seed#[438A5D594E791FF]) [    ] o.a.s.c.c.ConnectionManager Client is connected to ZooKeeper
   [junit4]   2> 596129 INFO  (TEST-CollectionsAPIDistributedZkTest.test-seed#[438A5D594E791FF]) [    ] o.a.s.c.c.SolrZkClient Using default ZkACLProvider
   [junit4]   2> 596130 INFO  (TEST-CollectionsAPIDistributedZkTest.test-seed#[438A5D594E791FF]) [    ] o.a.s.c.c.ConnectionManager Waiting for client to connect to ZooKeeper
   [junit4]   2> 596131 INFO  (zkCallback-891-thread-1) [    ] o.a.s.c.c.ConnectionManager Watcher org.apache.solr.common.cloud.ConnectionManager@72aee605 name:ZooKeeperConnection Watcher:127.0.0.1:58237/solr got event WatchedEvent state:SyncConnected type:None path:null path:null type:None
   [junit4]   2> 596131 INFO  (TEST-CollectionsAPIDistributedZkTest.test-seed#[438A5D594E791FF]) [    ] o.a.s.c.c.ConnectionManager Client is connected to ZooKeeper
   [junit4]   2> 596131 INFO  (TEST-CollectionsAPIDistributedZkTest.test-seed#[438A5D594E791FF]) [    ] o.a.s.c.c.SolrZkClient makePath: /overseer/queue
   [junit4]   2> 596132 INFO  (TEST-CollectionsAPIDistributedZkTest.test-seed#[438A5D594E791FF]) [    ] o.a.s.c.c.SolrZkClient makePath: /overseer/collection-queue-work
   [junit4]   2> 596133 INFO  (TEST-CollectionsAPIDistributedZkTest.test-seed#[438A5D594E791FF]) [    ] o.a.s.c.c.SolrZkClient makePath: /overseer/collection-map-running
   [junit4]   2> 596133 INFO  (TEST-CollectionsAPIDistributedZkTest.test-seed#[438A5D594E791FF]) [    ] o.a.s.c.c.SolrZkClient makePath: /overseer/collection-map-completed
   [junit4]   2> 596134 INFO  (TEST-CollectionsAPIDistributedZkTest.test-seed#[438A5D594E791FF]) [    ] o.a.s.c.c.SolrZkClient makePath: /overseer/collection-map-failure
   [junit4]   2> 596135 INFO  (TEST-CollectionsAPIDistributedZkTest.test-seed#[438A5D594E791FF]) [    ] o.a.s.c.c.SolrZkClient makePath: /live_nodes
   [junit4]   2> 596135 INFO  (TEST-CollectionsAPIDistributedZkTest.test-seed#[438A5D594E791FF]) [    ] o.a.s.c.c.SolrZkClient makePath: /aliases.json
   [junit4]   2> 596136 INFO  (TEST-CollectionsAPIDistributedZkTest.test-seed#[438A5D594E791FF]) [    ] o.a.s.c.c.SolrZkClient makePath: /clusterstate.json
   [junit4]   2> 596136 INFO  (TEST-CollectionsAPIDistributedZkTest.test-seed#[438A5D594E791FF]) [    ] o.a.s.c.c.SolrZkClient makePath: /security.json
   [junit4]   2> 596136 INFO  (TEST-CollectionsAPIDistributedZkTest.test-seed#[438A5D594E791FF]) [    ] o.a.s.c.ZkController Register node as live in ZooKeeper:/live_nodes/127.0.0.1:54126_
   [junit4]   2> 596136 INFO  (TEST-CollectionsAPIDistributedZkTest.test-seed#[438A5D594E791FF]) [    ] o.a.s.c.c.SolrZkClient makePath: /live_nodes/127.0.0.1:54126_
   [junit4]   2> 596137 INFO  (TEST-CollectionsAPIDistributedZkTest.test-seed#[438A5D594E791FF]) [    ] o.a.s.c.c.SolrZkClient makePath: /overseer_elect
   [junit4]   2> 596137 INFO  (TEST-CollectionsAPIDistributedZkTest.test-seed#[438A5D594E791FF]) [    ] o.a.s.c.c.SolrZkClient makePath: /overseer_elect/election
   [junit4]   2> 596137 INFO  (TEST-CollectionsAPIDistributedZkTest.test-seed#[438A5D594E791FF]) [    ] o.a.s.c.Overseer Overseer (id=null) closing
   [junit4]   2> 596138 INFO  (TEST-CollectionsAPIDistributedZkTest.test-seed#[438A5D594E791FF]) [    ] o.a.s.c.LeaderElector Joined leadership election with path: /overseer_elect/election/95328387647078404-127.0.0.1:54126_-n_0000000000
   [junit4]   2> 596138 INFO  (TEST-CollectionsAPIDistributedZkTest.test-seed#[438A5D594E791FF]) [    ] o.a.s.c.OverseerElectionContext I am going to be the leader 127.0.0.1:54126_
   [junit4]   2> 596138 INFO  (TEST-CollectionsAPIDistributedZkTest.test-seed#[438A5D594E791FF]) [    ] o.a.s.c.c.SolrZkClient makePath: /overseer_elect/leader
   [junit4]   2> 596138 INFO  (TEST-CollectionsAPIDistributedZkTest.test-seed#[438A5D594E791FF]) [    ] o.a.s.c.Overseer Overseer (id=95328387647078404-127.0.0.1:54126_-n_0000000000) starting
   [junit4]   2> 596139 INFO  (TEST-CollectionsAPIDistributedZkTest.test-seed#[438A5D594E791FF]) [    ] o.a.s.c.c.SolrZkClient makePath: /overseer/queue-work
   [junit4]   2> 596140 INFO  (TEST-CollectionsAPIDistributedZkTest.test-seed#[438A5D594E791FF]) [    ] o.a.s.c.OverseerAutoReplicaFailoverThread Starting OverseerAutoReplicaFailoverThread autoReplicaFailoverWorkLoopDelay=10000 autoReplicaFailoverWaitAfterExpiration=10000 autoReplicaFailoverBadNodeExpiration=60000
   [junit4]   2> 596141 INFO  (TEST-CollectionsAPIDistributedZkTest.test-seed#[438A5D594E791FF]) [    ] o.a.s.c.c.ZkStateReader Updating cluster state from ZooKeeper... 
   [junit4]   2> 596141 INFO  (OverseerCollectionConfigSetProcessor-95328387647078404-127.0.0.1:54126_-n_0000000000) [    ] o.a.s.c.OverseerTaskProcessor Process current queue of overseer operations
   [junit4]   2> 596141 INFO  (OverseerStateUpdate-95328387647078404-127.0.0.1:54126_-n_0000000000) [    ] o.a.s.c.Overseer Starting to work on the main queue
   [junit4]   2> 596147 INFO  (TEST-CollectionsAPIDistributedZkTest.test-seed#[438A5D594E791FF]) [    ] o.a.s.c.CoreContainer Security conf doesn't exist. Skipping setup for authorization module.
   [junit4]   2> 596147 INFO  (TEST-CollectionsAPIDistributedZkTest.test-seed#[438A5D594E791FF]) [    ] o.a.s.c.CoreContainer No authentication plugin used.
   [junit4]   2> 596147 INFO  (TEST-CollectionsAPIDistributedZkTest.test-seed#[438A5D594E791FF]) [    ] o.a.s.c.CorePropertiesLocator Looking for core definitions underneath /home/jenkins/workspace/Lucene-Solr-trunk-Linux/solr/build/solr-core/test/J0/../../../../../../../../../home/jenkins/workspace/Lucene-Solr-trunk-Linux/solr/build/solr-core/test/J0/temp/solr.cloud.CollectionsAPIDistributedZkTest_438A5D594E791FF-001/control-001/cores
   [junit4]   2> 596148 INFO  (TEST-CollectionsAPIDistributedZkTest.test-seed#[438A5D594E791FF]) [    ] o.a.s.c.CoreDescriptor Created CoreDescriptor: {name=collection1, config=solrconfig.xml, transient=false, schema=schema.xml, loadOnStartup=true, configSetProperties=configsetprops.json, collection=control_collection, coreNodeName=, dataDir=data/, shard=}
   [junit4]   2> 596148 INFO  (TEST-CollectionsAPIDistributedZkTest.test-seed#[438A5D594E791FF]) [    ] o.a.s.c.CorePropertiesLocator Found core collection1 in /home/jenkins/workspace/Lucene-Solr-trunk-Linux/solr/build/solr-core/test/J0/../../../../../../../../../home/jenkins/workspace/Lucene-Solr-trunk-Linux/solr/build/solr-core/test/J0/temp/solr.cloud.CollectionsAPIDistributedZkTest_438A5D594E791FF-001/control-001/cores/collection1
   [junit4]   2> 596148 INFO  (TEST-CollectionsAPIDistributedZkTest.test-seed#[438A5D594E791FF]) [    ] o.a.s.c.CorePropertiesLocator Found 1 core definitions
   [junit4]   2> 596148 INFO  (TEST-CollectionsAPIDistributedZkTest.test-seed#[438A5D594E791FF]) [    ] o.a.s.s.SolrDispatchFilter user.dir=/home/jenkins/workspace/Lucene-Solr-trunk-Linux/solr/build/solr-core/test/J0
   [junit4]   2> 596148 INFO  (TEST-CollectionsAPIDistributedZkTest.test-seed#[438A5D594E791FF]) [    ] o.a.s.s.SolrDispatchFilter SolrDispatchFilter.init() done
   [junit4]   2> 596148 INFO  (coreLoadExecutor-2891-thread-1) [    ] o.a.s.c.ZkController publishing state=down
   [junit4]   2> 596148 INFO  (coreLoadExecutor-2891-thread-1) [    ] o.a.s.c.ZkController numShards not found on descriptor - reading it from system property
   [junit4]   2> 596149 INFO  (OverseerStateUpdate-95328387647078404-127.0.0.1:54126_-n_0000000000) [    ] o.a.s.c.Overseer processMessage: queueSize: 1, message = {
   [junit4]   2>   "core":"collection1",
   [junit4]   2>   "roles":null,
   [junit4]   2>   "base_url":"http://127.0.0.1:54126",
   [junit4]   2>   "node_name":"127.0.0.1:54126_",
   [junit4]   2>   "numShards":"1",
   [junit4]   2>   "state":"down",
   [junit4]   2>   "shard":null,
   [junit4]   2>   "collection":"control_collection",
   [junit4]   2>   "operation":"state"} current state version: 0
   [junit4]   2> 596149 INFO  (coreLoadExecutor-2891-thread-1) [    ] o.a.s.c.ZkController look for our core node name
   [junit4]   2> 596149 INFO  (OverseerStateUpdate-95328387647078404-127.0.0.1:54126_-n_0000000000) [    ] o.a.s.c.o.ReplicaMutator Update state numShards=1 message={
   [junit4]   2>   "core":"collection1",
   [junit4]   2>   "roles":null,
   [junit4]   2>   "base_url":"http://127.0.0.1:54126",
   [junit4]   2>   "node_name":"127.0.0.1:54126_",
   [junit4]   2>   "numShards":"1",
   [junit4]   2>   "state":"down",
   [junit4]   2>   "shard":null,
   [junit4]   2>   "collection":"control_collection",
   [junit4]   2>   "operation":"state"}
   [junit4]   2> 596149 INFO  (OverseerStateUpdate-95328387647078404-127.0.0.1:54126_-n_0000000000) [    ] o.a.s.c.o.ClusterStateMutator building a new cName: control_collection
   [junit4]   2> 596149 INFO  (OverseerStateUpdate-95328387647078404-127.0.0.1:54126_-n_0000000000) [    ] o.a.s.c.o.ReplicaMutator Assigning new node to shard shard=shard1
   [junit4]   2> 596150 INFO  (zkCallback-891-thread-1) [    ] o.a.s.c.c.ZkStateReader A cluster state change: [WatchedEvent state:SyncConnected type:NodeDataChanged path:/clusterstate.json], has occurred - updating... (live nodes size: [1])
   [junit4]   2> 597149 INFO  (coreLoadExecutor-2891-thread-1) [    ] o.a.s.c.ZkController waiting to find shard id in clusterstate for collection1
   [junit4]   2> 597149 INFO  (coreLoadExecutor-2891-thread-1) [    ] o.a.s.c.ZkController Check for collection zkNode:control_collection
   [junit4]   2> 597150 INFO  (coreLoadExecutor-2891-thread-1) [    ] o.a.s.c.ZkController Collection zkNode exists
   [junit4]   2> 597150 INFO  (coreLoadExecutor-2891-thread-1) [    ] o.a.s.c.c.ZkStateReader Load collection config from: [/collections/control_collection]
   [junit4]   2> 597150 INFO  (coreLoadExecutor-2891-thread-1) [    ] o.a.s.c.c.ZkStateReader path=[/collections/control_collection] [configName]=[conf1] specified config exists in ZooKeeper
   [junit4]   2> 597150 INFO  (coreLoadExecutor-2891-thread-1) [    ] o.a.s.c.SolrResourceLoader new SolrResourceLoader for directory: '/home/jenkins/workspace/Lucene-Solr-trunk-Linux/solr/build/solr-core/test/J0/temp/solr.cloud.CollectionsAPIDistributedZkTest_438A5D594E791FF-001/control-001/cores/collection1'
   [junit4]   2> 597150 INFO  (coreLoadExecutor-2891-thread-1) [    ] o.a.s.c.SolrResourceLoader JNDI not configured for solr (NoInitialContextEx)
   [junit4]   2> 597150 INFO  (coreLoadExecutor-2891-thread-1) [    ] o.a.s.c.SolrResourceLoader solr home defaulted to 'solr/' (could not find system property or JNDI)
   [junit4]   2> 597151 INFO  (coreLoadExecutor-2891-thread-1) [    ] o.a.s.c.Config loaded config solrconfig.xml with version 0 
   [junit4]   2> 597153 INFO  (coreLoadExecutor-2891-thread-1) [    ] o.a.s.c.SolrConfig current version of requestparams : -1
   [junit4]   2> 597156 INFO  (coreLoadExecutor-2891-thread-1) [    ] o.a.s.c.SolrConfig Using Lucene MatchVersion: 6.0.0
   [junit4]   2> 597160 INFO  (coreLoadExecutor-2891-thread-1) [    ] o.a.s.c.SolrConfig Loaded SolrConfig: solrconfig.xml
   [junit4]   2> 597164 INFO  (coreLoadExecutor-2891-thread-1) [    ] o.a.s.s.IndexSchema [collection1] Schema name=test
   [junit4]   2> 597216 INFO  (coreLoadExecutor-2891-thread-1) [    ] o.a.s.s.OpenExchangeRatesOrgProvider Initialized with rates=open-exchange-rates.json, refreshInterval=1440.
   [junit4]   2> 597219 INFO  (coreLoadExecutor-2891-thread-1) [    ] o.a.s.s.IndexSchema default search field in schema is text
   [junit4]   2> 597219 INFO  (coreLoadExecutor-2891-thread-1) [    ] o.a.s.s.IndexSchema unique key field: id
   [junit4]   2> 597223 INFO  (coreLoadExecutor-2891-thread-1) [    ] o.a.s.s.FileExchangeRateProvider Reloading exchange rates from file currency.xml
   [junit4]   2> 597224 INFO  (coreLoadExecutor-2891-thread-1) [    ] o.a.s.s.FileExchangeRateProvider Reloading exchange rates from file currency.xml
   [junit4]   2> 597225 INFO  (coreLoadExecutor-2891-thread-1) [    ] o.a.s.s.OpenExchangeRatesOrgProvider Reloading exchange rates from open-exchange-rates.json
   [junit4]   2> 597226 INFO  (coreLoadExecutor-2891-thread-1) [    ] o.a.s.s.OpenExchangeRatesOrgProvider Reloading exchange rates from open-exchange-rates.json
   [junit4]   2> 597227 INFO  (coreLoadExecutor-2891-thread-1) [    ] o.a.s.c.ConfigSetProperties Did not find ConfigSet properties, assuming default properties: Can't find resource 'configsetprops.json' in classpath or '/configs/conf1', cwd=/home/jenkins/workspace/Lucene-Solr-trunk-Linux/solr/build/solr-core/test/J0
   [junit4]   2> 597227 INFO  (coreLoadExecutor-2891-thread-1) [    ] o.a.s.c.CoreContainer Creating SolrCore 'collection1' using configuration from collection control_collection
   [junit4]   2> 597227 INFO  (coreLoadExecutor-2891-thread-1) [    ] o.a.s.c.SolrCore org.apache.solr.core.MockDirectoryFactory
   [junit4]   2> 597227 INFO  (coreLoadExecutor-2891-thread-1) [    ] o.a.s.c.SolrCore [[collection1] ] Opening new SolrCore at [/home/jenkins/workspace/Lucene-Solr-trunk-Linux/solr/build/solr-core/test/J0/temp/solr.cloud.CollectionsAPIDistributedZkTest_438A5D594E791FF-001/control-001/cores/collection1], dataDir=[/home/jenkins/workspace/Lucene-Solr-trunk-Linux/solr/build/solr-core/test/J0/../../../../../../../../../home/jenkins/workspace/Lucene-Solr-trunk-Linux/solr/build/solr-core/test/J0/temp/solr.cloud.CollectionsAPIDistributedZkTest_438A5D594E791FF-001/control-001/cores/collection1/data/]
   [junit4]   2> 597227 INFO  (coreLoadExecutor-2891-thread-1) [    ] o.a.s.c.JmxMonitoredMap JMX monitoring is enabled. Adding Solr mbeans to JMX Server: com.sun.jmx.mbeanserver.JmxMBeanServer@26939eca
   [junit4]   2> 597228 INFO  (coreLoadExecutor-2891-thread-1) [    ] o.a.s.c.CachingDirectoryFactory return new directory for /home/jenkins/workspace/Lucene-Solr-trunk-Linux/solr/build/solr-core/test/J0/../../../../../../../../../home/jenkins/workspace/Lucene-Solr-trunk-Linux/solr/build/solr-core/test/J0/temp/solr.cloud.CollectionsAPIDistributedZkTest_438A5D594E791FF-001/control-001/cores/collection1/data
   [junit4]   2> 597228 INFO  (coreLoadExecutor-2891-thread-1) [    ] o.a.s.c.SolrCore New index directory detected: old=null new=/home/jenkins/workspace/Lucene-Solr-trunk-Linux/solr/build/solr-core/test/J0/../../../../../../../../../home/jenkins/workspace/Lucene-Solr-trunk-Linux/solr/build/solr-core/test/J0/temp/solr.cloud.CollectionsAPIDistributedZkTest_438A5D594E791FF-001/control-001/cores/collection1/data/index/
   [junit4]   2> 597228 WARN  (coreLoadExecutor-2891-thread-1) [    ] o.a.s.c.SolrCore [collection1] Solr index directory '/home/jenkins/workspace/Lucene-Solr-trunk-Linux/solr/build/solr-core/test/J0/../../../../../../../../../home/jenkins/workspace/Lucene-Solr-trunk-Linux/solr/build/solr-core/test/J0/temp/solr.cloud.CollectionsAPIDistributedZkTest_438A5D594E791FF-001/control-001/cores/collection1/data/index' doesn't exist. Creating new index...
   [junit4]   2> 597228 INFO  (coreLoadExecutor-2891-thread-1) [    ] o.a.s.c.CachingDirectoryFactory return new directory for /home/jenkins/workspace/Lucene-Solr-trunk-Linux/solr/build/solr-core/test/J0/../../../../../../../../../home/jenkins/workspace/Lucene-Solr-trunk-Linux/solr/build/solr-core/test/J0/temp/solr.cloud.CollectionsAPIDistributedZkTest_438A5D594E791FF-001/control-001/cores/collection1/data/index
   [junit4]   2> 597228 INFO  (coreLoadExecutor-2891-thread-1) [    ] o.a.s.u.RandomMergePolicy RandomMergePolicy wrapping class org.apache.lucene.index.LogDocMergePolicy: [LogDocMergePolicy: minMergeSize=1000, mergeFactor=39, maxMergeSize=9223372036854775807, maxMergeSizeForForcedMerge=9223372036854775807, calibrateSizeByDeletes=false, maxMergeDocs=2147483647, maxCFSSegmentSizeMB=8.796093022207999E12, noCFSRatio=0.0]
   [junit4]   2> 597228 INFO  (coreLoadExecutor-2891-thread-1) [    ] o.a.s.c.SolrDeletionPolicy SolrDeletionPolicy.onCommit: commits: num=1
   [junit4]   2> 	commit{dir=MockDirectoryWrapper(RAMDirectory@62684a5e lockFactory=org.apache.lucene.store.SingleInstanceLockFactory@368cb4ec),segFN=segments_1,generation=1}
   [junit4]   2> 597228 INFO  (coreLoadExecutor-2891-thread-1) [    ] o.a.s.c.SolrDeletionPolicy newest commit generation = 1
   [junit4]   2> 597229 INFO  (OldIndexDirectoryCleanupThreadForCore-collection1) [    ] o.a.s.c.SolrCore Looking for old index directories to cleanup for core collection1 in /home/jenkins/workspace/Lucene-Solr-trunk-Linux/solr/build/solr-core/test/J0/../../../../../../../../../home/jenkins/workspace/Lucene-Solr-trunk-Linux/solr/build/solr-core/test/J0/temp/solr.cloud.CollectionsAPIDistributedZkTest_438A5D594E791FF-001/control-001/cores/collection1/data/
   [junit4]   2> 597229 WARN  (OldIndexDirectoryCleanupThreadForCore-collection1) [    ] o.a.s.c.DirectoryFactory /home/jenkins/workspace/Lucene-Solr-trunk-Linux/solr/build/solr-core/test/J0/../../../../../../../../../home/jenkins/workspace/Lucene-Solr-trunk-Linux/solr/build/solr-core/test/J0/temp/solr.cloud.CollectionsAPIDistributedZkTest_438A5D594E791FF-001/control-001/cores/collection1/data/ does not point to a valid data directory; skipping clean-up of old index directories.
   [junit4]   2> 597231 INFO  (coreLoadExecutor-2891-thread-1) [    ] o.a.s.u.p.UpdateRequestProcessorChain creating updateRequestProcessorChain "nodistrib"
   [junit4]   2> 597231 INFO  (coreLoadExecutor-2891-thread-1) [    ] o.a.s.u.p.UpdateRequestProcessorChain creating updateRequestProcessorChain "dedupe"
   [junit4]   2> 597231 INFO  (coreLoadExecutor-2891-thread-1) [    ] o.a.s.u.p.UpdateRequestProcessorChain inserting DistributedUpdateProcessorFactory into updateRequestProcessorChain "dedupe"
   [junit4]   2> 597231 INFO  (coreLoadExecutor-2891-thread-1) [    ] o.a.s.u.p.UpdateRequestProcessorChain creating updateRequestProcessorChain "stored_sig"
   [junit4]   2> 597231 INFO  (coreLoadExecutor-2891-thread-1) [    ] o.a.s.u.p.UpdateRequestProcessorChain inserting DistributedUpdateProcessorFactory into updateRequestProcessorChain "stored_sig"
   [junit4]   2> 597231 INFO  (coreLoadExecutor-2891-thread-1) [    ] o.a.s.u.p.UpdateRequestProcessorChain creating updateRequestProcessorChain "distrib-dup-test-chain-explicit"
   [junit4]   2> 597232 INFO  (coreLoadExecutor-2891-thread-1) [    ] o.a.s.u.p.UpdateRequestProcessorChain creating updateRequestProcessorChain "distrib-dup-test-chain-implicit"
   [junit4]   2> 597232 INFO  (coreLoadExecutor-2891-thread-1) [    ] o.a.s.u.p.UpdateRequestProcessorChain inserting DistributedUpdateProcessorFactory into updateRequestProcessorChain "distrib-dup-test-chain-implicit"
   [junit4]   2> 597232 INFO  (coreLoadExecutor-2891-thread-1) [    ] o.a.s.c.SolrCore no updateRequestProcessorChain defined as default, creating implicit default
   [junit4]   2> 597232 WARN  (coreLoadExecutor-2891-thread-1) [    ] o.a.s.c.RequestHandlers INVALID paramSet a in requestHandler {type = requestHandler,name = /dump,class = DumpRequestHandler,args = {defaults={a=A,b=B}}}
   [junit4]   2> 597233 INFO  (coreLoadExecutor-2891-thread-1) [    ] o.a.s.h.l.XMLLoader xsltCacheLifetimeSeconds=60
   [junit4]   2> 597234 INFO  (coreLoadExecutor-2891-thread-1) [    ] o.a.s.h.l.XMLLoader xsltCacheLifetimeSeconds=60
   [junit4]   2> 597235 INFO  (coreLoadExecutor-2891-thread-1) [    ] o.a.s.h.l.XMLLoader xsltCacheLifetimeSeconds=60
   [junit4]   2> 597235 INFO  (coreLoadExecutor-2891-thread-1) [    ] o.a.s.h.l.XMLLoader xsltCacheLifetimeSeconds=60
   [junit4]   2> 597238 INFO  (coreLoadExecutor-2891-thread-1) [    ] o.a.s.c.RequestHandlers Registered paths: /admin/mbeans,standard,/dump,/update/csv,/sql,/update/json/docs,/admin/luke,/export,/admin/segments,/get,/admin/system,/replication,/admin/properties,/config,/stream,/schema,/admin/plugins,/admin/logging,/update/json,/admin/threads,/admin/ping,/update,/admin/file
   [junit4]   2> 597238 INFO  (coreLoadExecutor-2891-thread-1) [    ] o.a.s.c.SolrCore Using default statsCache cache: org.apache.solr.search.stats.LocalStatsCache
   [junit4]   2> 597238 INFO  (coreLoadExecutor-2891-thread-1) [    ] o.a.s.u.UpdateHandler Using UpdateLog implementation: org.apache.solr.update.UpdateLog
   [junit4]   2> 597239 INFO  (coreLoadExecutor-2891-thread-1) [    ] o.a.s.u.UpdateLog Initializing UpdateLog: dataDir= defaultSyncLevel=FLUSH numRecordsToKeep=100 maxNumLogsToKeep=10 numVersionBuckets=65536
   [junit4]   2> 597239 INFO  (coreLoadExecutor-2891-thread-1) [    ] o.a.s.u.CommitTracker Hard AutoCommit: disabled
   [junit4]   2> 597239 INFO  (coreLoadExecutor-2891-thread-1) [    ] o.a.s.u.CommitTracker Soft AutoCommit: disabled
   [junit4]   2> 597240 INFO  (coreLoadExecutor-2891-thread-1) [    ] o.a.s.u.RandomMergePolicy RandomMergePolicy wrapping class org.apache.lucene.index.TieredMergePolicy: [TieredMergePolicy: maxMergeAtOnce=25, maxMergeAtOnceExplicit=23, maxMergedSegmentMB=55.474609375, floorSegmentMB=1.302734375, forceMergeDeletesPctAllowed=19.25197114788114, segmentsPerTier=37.0, maxCFSSegmentSizeMB=8.796093022207999E12, noCFSRatio=0.0
   [junit4]   2> 597240 INFO  (coreLoadExecutor-2891-thread-1) [    ] o.a.s.c.SolrDeletionPolicy SolrDeletionPolicy.onInit: commits: num=1
   [junit4]   2> 	commit{dir=MockDirectoryWrapper(RAMDirectory@62684a5e lockFactory=org.apache.lucene.store.SingleInstanceLockFactory@368cb4ec),segFN=segments_1,generation=1}
   [junit4]   2> 597240 INFO  (coreLoadExecutor-2891-thread-1) [    ] o.a.s.c.SolrDeletionPolicy newest commit generation = 1
   [junit4]   2> 597240 INFO  (coreLoadExecutor-2891-thread-1) [    ] o.a.s.s.SolrIndexSearcher Opening [Searcher@354b462[collection1] main]
   [junit4]   2> 597240 INFO  (coreLoadExecutor-2891-thread-1) [    ] o.a.s.c.c.ZkStateReader Load collection config from: [/collections/control_collection]
   [junit4]   2> 597240 INFO  (coreLoadExecutor-2891-thread-1) [    ] o.a.s.c.c.ZkStateReader path=[/collections/control_collection] [configName]=[conf1] specified config exists in ZooKeeper
   [junit4]   2> 597240 INFO  (coreLoadExecutor-2891-thread-1) [    ] o.a.s.r.ManagedResourceStorage Setting up ZooKeeper-based storage for the RestManager with znodeBase: /configs/conf1
   [junit4]   2> 597240 INFO  (coreLoadExecutor-2891-thread-1) [    ] o.a.s.r.ManagedResourceStorage Configured ZooKeeperStorageIO with znodeBase: /configs/conf1
   [junit4]   2> 597241 INFO  (coreLoadExecutor-2891-thread-1) [    ] o.a.s.r.RestManager Initializing RestManager with initArgs: {}
   [junit4]   2> 597241 INFO  (coreLoadExecutor-2891-thread-1) [    ] o.a.s.r.ManagedResourceStorage Reading _rest_managed.json using ZooKeeperStorageIO:path=/configs/conf1
   [junit4]   2> 597241 INFO  (coreLoadExecutor-2891-thread-1) [    ] o.a.s.r.ManagedResourceStorage No data found for znode /configs/conf1/_rest_managed.json
   [junit4]   2> 597241 INFO  (coreLoadExecutor-2891-thread-1) [    ] o.a.s.r.ManagedResourceStorage Loaded null at path _rest_managed.json using ZooKeeperStorageIO:path=/configs/conf1
   [junit4]   2> 597241 INFO  (coreLoadExecutor-2891-thread-1) [    ] o.a.s.r.RestManager Initializing 0 registered ManagedResources
   [junit4]   2> 597241 INFO  (coreLoadExecutor-2891-thread-1) [    ] o.a.s.h.ReplicationHandler Commits will be reserved for  10000
   [junit4]   2> 597241 INFO  (searcherExecutor-2892-thread-1) [    ] o.a.s.c.SolrCore [collection1] Registered new searcher Searcher@354b462[collection1] main{ExitableDirectoryReader(UninvertingDirectoryReader())}
   [junit4]   2> 597241 INFO  (coreLoadExecutor-2891-thread-1) [    ] o.a.s.u.UpdateLog Looking up max value of version field to seed version buckets
   [junit4]   2> 597241 INFO  (coreLoadExecutor-2891-thread-1) [    ] o.a.s.u.VersionInfo Refreshing highest value of _version_ for 65536 version buckets from index
   [junit4]   2> 597241 INFO  (coreLoadExecutor-2891-thread-1) [    ] o.a.s.u.VersionInfo No terms found for _version_, cannot seed version bucket highest value from index
   [junit4]   2> 597241 INFO  (coreLoadExecutor-2891-thread-1) [    ] o.a.s.u.UpdateLog Could not find max version in index or recent updates, using new clock 1525254203702771712
   [junit4]   2> 597243 INFO  (coreLoadExecutor-2891-thread-1) [    ] o.a.s.u.UpdateLog Took 1.0ms to seed version buckets with highest version 1525254203702771712
   [junit4]   2> 597243 INFO  (coreLoadExecutor-2891-thread-1) [    ] o.a.s.c.ZkController watch zkdir /configs/conf1
   [junit4]   2> 597244 INFO  (coreLoadExecutor-2891-thread-1) [    ] o.a.s.c.CoreContainer registering core: collection1
   [junit4]   2> 597244 INFO  (coreZkRegister-2885-thread-1) [    ] o.a.s.c.ZkController Register replica - core:collection1 address:http://127.0.0.1:54126 collection:control_collection shard:shard1
   [junit4]   2> 597244 INFO  (coreZkRegister-2885-thread-1) [    ] o.a.s.c.c.SolrZkClient makePath: /collections/control_collection/leader_elect/shard1/election
   [junit4]   2> 597245 INFO  (coreZkRegister-2885-thread-1) [    ] o.a.s.c.LeaderElector Joined leadership election with path: /collections/control_collection/leader_elect/shard1/election/95328387647078404-core_node1-n_0000000000
   [junit4]   2> 597246 INFO  (coreZkRegister-2885-thread-1) [    ] o.a.s.c.ShardLeaderElectionContext Running the leader process for shard=shard1 and weAreReplacement=false and leaderVoteWait=180000
   [junit4]   2> 597246 INFO  (coreZkRegister-2885-thread-1) [    ] o.a.s.c.ShardLeaderElectionContext Enough replicas found to continue.
   [junit4]   2> 597246 INFO  (coreZkRegister-2885-thread-1) [    ] o.a.s.c.ShardLeaderElectionContext I may be the new leader - try and sync
   [junit4]   2> 597246 INFO  (coreZkRegister-2885-thread-1) [    ] o.a.s.c.SyncStrategy Sync replicas to http://127.0.0.1:54126/collection1/
   [junit4]   2> 597247 INFO  (coreZkRegister-2885-thread-1) [    ] o.a.s.c.SyncStrategy Sync Success - now sync replicas to me
   [junit4]   2> 597247 INFO  (OverseerStateUpdate-95328387647078404-127.0.0.1:54126_-n_0000000000) [    ] o.a.s.c.Overseer processMessage: queueSize: 1, message = {
   [junit4]   2>   "operation":"leader",
   [junit4]   2>   "shard":"shard1",
   [junit4]   2>   "collection":"control_collection"} current state version: 1
   [junit4]   2> 597247 INFO  (coreZkRegister-2885-thread-1) [    ] o.a.s.c.SyncStrategy http://127.0.0.1:54126/collection1/ has no replicas
   [junit4]   2> 597247 INFO  (coreZkRegister-2885-thread-1) [    ] o.a.s.c.c.SolrZkClient makePath: /collections/control_collection/leaders/shard1
   [junit4]   2> 597248 INFO  (coreZkRegister-2885-thread-1) [    ] o.a.s.c.ShardLeaderElectionContextBase Creating leader registration node
   [junit4]   2> 597248 INFO  (coreZkRegister-2885-thread-1) [    ] o.a.s.c.ShardLeaderElectionContext I am the new leader: http://127.0.0.1:54126/collection1/ shard1
   [junit4]   2> 597249 INFO  (OverseerStateUpdate-95328387647078404-127.0.0.1:54126_-n_0000000000) [    ] o.a.s.c.Overseer processMessage: queueSize: 1, message = {
   [junit4]   2>   "operation":"leader",
   [junit4]   2>   "shard":"shard1",
   [junit4]   2>   "collection":"control_collection",
   [junit4]   2>   "base_url":"http://127.0.0.1:54126",
   [junit4]   2>   "core":"collection1",
   [junit4]   2>   "state":"active"} current state version: 1
   [junit4]   2> 597350 INFO  (zkCallback-891-thread-1) [    ] o.a.s.c.c.ZkStateReader A cluster state change: [WatchedEvent state:SyncConnected type:NodeDataChanged path:/clusterstate.json], has occurred - updating... (live nodes size: [1])
   [junit4]   2> 597399 INFO  (coreZkRegister-2885-thread-1) [    ] o.a.s.c.ZkController We are http://127.0.0.1:54126/collection1/ and leader is http://127.0.0.1:54126/collection1/
   [junit4]   2> 597399 INFO  (coreZkRegister-2885-thread-1) [    ] o.a.s.c.ZkController No LogReplay needed for core=collection1 baseURL=http://127.0.0.1:54126
   [junit4]   2> 597399 INFO  (coreZkRegister-2885-thread-1) [    ] o.a.s.c.ZkController I am the leader, no recovery necessary
   [junit4]   2> 597399 INFO  (coreZkRegister-2885-thread-1) [    ] o.a.s.c.ZkController publishing state=active
   [junit4]   2> 597399 INFO  (coreZkRegister-2885-thread-1) [    ] o.a.s.c.ZkController numShards not found on descriptor - reading it from system property
   [junit4]   2> 597400 INFO  (OverseerStateUpdate-95328387647078404-127.0.0.1:54126_-n_0000000000) [    ] o.a.s.c.Overseer processMessage: queueSize: 1, message = {
   [junit4]   2>   "core":"collection1",
   [junit4]   2>   "core_node_name":"core_node1",
   [junit4]   2>   "roles":null,
   [junit4]   2>   "base_url":"http://127.0.0.1:54126",
   [junit4]   2>   "node_name":"127.0.0.1:54126_",
   [junit4]   2>   "numShards":"1",
   [junit4]   2>   "state":"active",
   [junit4]   2>   "shard":"shard1",
   [junit4]   2>   "collection":"control_collection",
   [junit4]   2>   "operation":"state"} current state version: 2
   [junit4]   2> 597400 INFO  (OverseerStateUpdate-95328387647078404-127.0.0.1:54126_-n_0000000000) [    ] o.a.s.c.o.ReplicaMutator Update state numShards=1 message={
   [junit4]   2>   "core":"collection1",
   [junit4]   2>   "core_node_name":"core_node1",
   [junit4]   2>   "roles":null,
   [junit4]   2>   "base_url":"http://127.0.0.1:54126",
   [junit4]   2>   "node_name":"127.0.0.1:54126_",
   [junit4]   2>   "numShards":"1",
   [junit4]   2>   "state":"active",
   [junit4]   2>   "shard":"shard1",
   [junit4]   2>   "collection":"control_collection",
   [junit4]   2>   "operation":"state"}
   [junit4]   2> 597501 INFO  (zkCallback-891-thread-1) [    ] o.a.s.c.c.ZkStateReader A cluster state change: [WatchedEvent state:SyncConnected type:NodeDataChanged path:/clusterstate.json], has occurred - updating... (live nodes size: [1])
   [junit4]   2> 597649 INFO  (TEST-CollectionsAPIDistributedZkTest.test-seed#[438A5D594E791FF]) [    ] o.a.s.c.c.SolrZkClient Using default ZkCredentialsProvider
   [junit4]   2> 597650 INFO  (TEST-CollectionsAPIDistributedZkTest.test-seed#[438A5D594E791FF]) [    ] o.a.s.c.c.ConnectionManager Waiting for client to connect to ZooKeeper
   [junit4]   2> 597651 INFO  (zkCallback-893-thread-1) [    ] o.a.s.c.c.ConnectionManager Watcher org.apache.solr.common.cloud.ConnectionManager@7908f5dc name:ZooKeeperConnection Watcher:127.0.0.1:58237/solr got event WatchedEvent state:SyncConnected type:None path:null path:null type:None
   [junit4]   2> 597651 INFO  (TEST-CollectionsAPIDistributedZkTest.test-seed#[438A5D594E791FF]) [    ] o.a.s.c.c.ConnectionManager Client is connected to ZooKeeper
   [junit4]   2> 597651 INFO  (TEST-CollectionsAPIDistributedZkTest.test-seed#[438A5D594E791FF]) [    ] o.a.s.c.c.SolrZkClient Using default ZkACLProvider
   [junit4]   2> 597651 INFO  (TEST-CollectionsAPIDistributedZkTest.test-seed#[438A5D594E791FF]) [    ] o.a.s.c.c.ZkStateReader Updating cluster state from ZooKeeper... 
   [junit4]   2> 597652 INFO  (TEST-CollectionsAPIDistributedZkTest.test-seed#[438A5D594E791FF]) [    ] o.a.s.c.ChaosMonkey monkey: init - expire sessions:false cause connection loss:false
   [junit4]   2> 597698 INFO  (TEST-CollectionsAPIDistributedZkTest.test-seed#[438A5D594E791FF]) [    ] o.a.s.SolrTestCaseJ4 Writing core.properties file to /home/jenkins/workspace/Lucene-Solr-trunk-Linux/solr/build/solr-core/test/J0/temp/solr.cloud.CollectionsAPIDistributedZkTest_438A5D594E791FF-001/shard-1-001/cores/collection1
   [junit4]   2> 597698 INFO  (TEST-CollectionsAPIDistributedZkTest.test-seed#[438A5D594E791FF]) [    ] o.a.s.c.AbstractFullDistribZkTestBase create jetty 1 in directory /home/jenkins/workspace/Lucene-Solr-trunk-Linux/solr/build/solr-core/test/J0/temp/solr.cloud.CollectionsAPIDistributedZkTest_438A5D594E791FF-001/shard-1-001
   [junit4]   2> 597699 INFO  (TEST-CollectionsAPIDistributedZkTest.test-seed#[438A5D594E791FF]) [    ] o.e.j.s.Server jetty-9.2.13.v20150730
   [junit4]   2> 597699 INFO  (TEST-CollectionsAPIDistributedZkTest.test-seed#[438A5D594E791FF]) [    ] o.e.j.s.h.ContextHandler Started o.e.j.s.ServletContextHandler@4903c334{/,null,AVAILABLE}
   [junit4]   2> 597700 INFO  (TEST-CollectionsAPIDistributedZkTest.test-seed#[438A5D594E791FF]) [    ] o.e.j.s.ServerConnector Started ServerConnector@19ebb59e{HTTP/1.1}{127.0.0.1:51506}
   [junit4]   2> 597700 INFO  (TEST-CollectionsAPIDistributedZkTest.test-seed#[438A5D594E791FF]) [    ] o.e.j.s.Server Started @599503ms
   [junit4]   2> 597700 INFO  (TEST-CollectionsAPIDistributedZkTest.test-seed#[438A5D594E791FF]) [    ] o.a.s.c.s.e.JettySolrRunner Jetty properties: {solr.data.dir=/home/jenkins/workspace/Lucene-Solr-trunk-Linux/solr/build/solr-core/test/J0/temp/solr.cloud.CollectionsAPIDistributedZkTest_438A5D594E791FF-001/tempDir-001/jetty1, solrconfig=solrconfig.xml, hostContext=/, hostPort=51506, coreRootDirectory=/home/jenkins/workspace/Lucene-Solr-trunk-Linux/solr/build/solr-core/test/J0/temp/solr.cloud.CollectionsAPIDistributedZkTest_438A5D594E791FF-001/shard-1-001/cores}
   [junit4]   2> 597700 INFO  (TEST-CollectionsAPIDistributedZkTest.test-seed#[438A5D594E791FF]) [    ] o.a.s.s.SolrDispatchFilter SolrDispatchFilter.init(): sun.misc.Launcher$AppClassLoader@7fbe847c
   [junit4]   2> 597700 INFO  (TEST-CollectionsAPIDistributedZkTest.test-seed#[438A5D594E791FF]) [    ] o.a.s.c.SolrResourceLoader new SolrResourceLoader for directory: '/home/jenkins/workspace/Lucene-Solr-trunk-Linux/solr/build/solr-core/test/J0/temp/solr.cloud.CollectionsAPIDistributedZkTest_438A5D594E791FF-001/shard-1-001'
   [junit4]   2> 597700 INFO  (TEST-CollectionsAPIDistributedZkTest.test-seed#[438A5D594E791FF]) [    ] o.a.s.c.SolrResourceLoader JNDI not configured for solr (NoInitialContextEx)
   [junit4]   2> 597700 INFO  (TEST-CollectionsAPIDistributedZkTest.test-seed#[438A5D594E791FF]) [    ] o.a.s.c.SolrResourceLoader solr home defaulted to 'solr/' (could not find system property or JNDI)
   [junit4]   2> 597700 INFO  (TEST-CollectionsAPIDistributedZkTest.test-seed#[438A5D594E791FF]) [    ] o.a.s.c.c.SolrZkClient Using default ZkCredentialsProvider
   [junit4]   2> 597700 INFO  (TEST-CollectionsAPIDistributedZkTest.test-seed#[438A5D594E791FF]) [    ] o.a.s.c.c.ConnectionManager Waiting for client to connect to ZooKeeper
   [junit4]   2> 597701 INFO  (zkCallback-894-thread-1) [    ] o.a.s.c.c.ConnectionManager Watcher org.apache.solr.common.cloud.ConnectionManager@6c9a22d9 name:ZooKeeperConnection Watcher:127.0.0.1:58237/solr got event WatchedEvent state:SyncConnected type:None path:null path:null type:None
   [junit4]   2> 597701 INFO  (TEST-CollectionsAPIDistributedZkTest.test-seed#[438A5D594E791FF]) [    ] o.a.s.c.c.ConnectionManager Client is connected to ZooKeeper
   [junit4]   2> 597701 INFO  (TEST-CollectionsAPIDistributedZkTest.test-seed#[438A5D594E791FF]) [    ] o.a.s.c.c.SolrZkClient Using default ZkACLProvider
   [junit4]   2> 597702 INFO  (TEST-CollectionsAPIDistributedZkTest.test-seed#[438A5D594E791FF]) [    ] o.a.s.s.SolrDispatchFilter Loading solr.xml from SolrHome (not found in ZooKeeper)
   [junit4]   2> 597703 INFO  (TEST-CollectionsAPIDistributedZkTest.test-seed#[438A5D594E791FF]) [    ] o.a.s.c.SolrXmlConfig Loading container configuration from /home/jenkins/workspace/Lucene-Solr-trunk-Linux/solr/build/solr-core/test/J0/temp/solr.cloud.CollectionsAPIDistributedZkTest_438A5D594E791FF-001/shard-1-001/solr.xml
   [junit4]   2> 597705 INFO  (TEST-CollectionsAPIDistributedZkTest.test-seed#[438A5D594E791FF]) [    ] o.a.s.c.CorePropertiesLocator Config-defined core root directory: /home/jenkins/workspace/Lucene-Solr-trunk-Linux/solr/build/solr-core/test/J0/temp/solr.cloud.CollectionsAPIDistributedZkTest_438A5D594E791FF-001/shard-1-001/cores
   [junit4]   2> 597705 INFO  (TEST-CollectionsAPIDistributedZkTest.test-seed#[438A5D594E791FF]) [    ] o.a.s.c.CoreContainer New CoreContainer 1084177724
   [junit4]   2> 597705 INFO  (TEST-CollectionsAPIDistributedZkTest.test-seed#[438A5D594E791FF]) [    ] o.a.s.c.CoreContainer Loading cores into CoreContainer [instanceDir=/home/jenkins/workspace/Lucene-Solr-trunk-Linux/solr/build/solr-core/test/J0/temp/solr.cloud.CollectionsAPIDistributedZkTest_438A5D594E791FF-001/shard-1-001]
   [junit4]   2> 597705 WARN  (TEST-CollectionsAPIDistributedZkTest.test-seed#[438A5D594E791FF]) [    ] o.a.s.c.CoreContainer Couldn't add files from /home/jenkins/workspace/Lucene-Solr-trunk-Linux/solr/build/solr-core/test/J0/temp/solr.cloud.CollectionsAPIDistributedZkTest_438A5D594E791FF-001/shard-1-001/lib to classpath: /home/jenkins/workspace/Lucene-Solr-trunk-Linux/solr/build/solr-core/test/J0/temp/solr.cloud.CollectionsAPIDistributedZkTest_438A5D594E791FF-001/shard-1-001/lib
   [junit4]   2> 597705 INFO  (TEST-CollectionsAPIDistributedZkTest.test-seed#[438A5D594E791FF]) [    ] o.a.s.h.c.HttpShardHandlerFactory created with socketTimeout : 90000,urlScheme : ,connTimeout : 15000,maxConnectionsPerHost : 20,maxConnections : 10000,corePoolSize : 0,maximumPoolSize : 2147483647,maxThreadIdleTime : 5,sizeOfQueue : -1,fairnessPolicy : false,useRetries : false,
   [junit4]   2> 597706 INFO  (TEST-CollectionsAPIDistributedZkTest.test-seed#[438A5D594E791FF]) [    ] o.a.s.u.UpdateShardHandler Creating UpdateShardHandler HTTP client with params: socketTimeout=340000&connTimeout=45000&retry=true
   [junit4]   2> 597707 INFO  (TEST-CollectionsAPIDistributedZkTest.test-seed#[438A5D594E791FF]) [    ] o.a.s.l.LogWatcher SLF4J impl is org.slf4j.impl.Log4jLoggerFactory
   [junit4]   2> 597707 INFO  (TEST-CollectionsAPIDistributedZkTest.test-seed#[438A5D594E791FF]) [    ] o.a.s.l.LogWatcher Registering Log Listener [Log4j (org.slf4j.impl.Log4jLoggerFactory)]
   [junit4]   2> 597707 INFO  (TEST-CollectionsAPIDistributedZkTest.test-seed#[438A5D594E791FF]) [    ] o.a.s.c.ZkContainer Zookeeper client=127.0.0.1:58237/solr
   [junit4]   2> 597707 INFO  (TEST-CollectionsAPIDistributedZkTest.test-seed#[438A5D594E791FF]) [    ] o.a.s.c.ZkController zkHost includes chroot
   [junit4]   2> 597707 INFO  (TEST-CollectionsAPIDistributedZkTest.test-seed#[438A5D594E791FF]) [    ] o.a.s.c.c.SolrZkClient Using default ZkCredentialsProvider
   [junit4]   2> 597707 INFO  (TEST-CollectionsAPIDistributedZkTest.test-seed#[438A5D594E791FF]) [    ] o.a.s.c.c.ConnectionManager Waiting for client to connect to ZooKeeper
   [junit4]   2> 597708 INFO  (zkCallback-897-thread-1) [    ] o.a.s.c.c.ConnectionManager Watcher org.apache.solr.common.cloud.ConnectionManager@7dad6194 name:ZooKeeperConnection Watcher:127.0.0.1:58237 got event WatchedEvent state:SyncConnected type:None path:null path:null type:None
   [junit4]   2> 597708 INFO  (TEST-CollectionsAPIDistributedZkTest.test-seed#[438A5D594E791FF]) [    ] o.a.s.c.c.ConnectionManager Client is connected to ZooKeeper
   [junit4]   2> 597708 INFO  (TEST-CollectionsAPIDistributedZkTest.test-seed#[438A5D594E791FF]) [    ] o.a.s.c.c.SolrZkClient Using default ZkACLProvider
   [junit4]   2> 597709 INFO  (TEST-CollectionsAPIDistributedZkTest.test-seed#[438A5D594E791FF]) [    ] o.a.s.c.c.ConnectionManager Waiting for client to connect to ZooKeeper
   [junit4]   2> 597709 INFO  (zkCallback-898-thread-1) [    ] o.a.s.c.c.ConnectionManager Watcher org.apache.solr.common.cloud.ConnectionManager@5757e00 name:ZooKeeperConnection Watcher:127.0.0.1:58237/solr got event WatchedEvent state:SyncConnected type:None path:null path:null type:None
   [junit4]   2> 597709 INFO  (TEST-CollectionsAPIDistributedZkTest.test-seed#[438A5D594E791FF]) [    ] o.a.s.c.c.ConnectionManager Client is connected to ZooKeeper
   [junit4]   2> 597711 INFO  (TEST-CollectionsAPIDistributedZkTest.test-seed#[438A5D594E791FF]) [    ] o.a.s.c.c.ZkStateReader Updating cluster state from ZooKeeper... 
   [junit4]   2> 598712 INFO  (TEST-CollectionsAPIDistributedZkTest.test-seed#[438A5D594E791FF]) [    ] o.a.s.c.ZkController Register node as live in ZooKeeper:/live_nodes/127.0.0.1:51506_
   [junit4]   2> 598713 INFO  (TEST-CollectionsAPIDistributedZkTest.test-seed#[438A5D594E791FF]) [    ] o.a.s.c.c.SolrZkClient makePath: /live_nodes/127.0.0.1:51506_
   [junit4]   2> 598713 INFO  (zkCallback-898-thread-1) [    ] o.a.s.c.c.ZkStateReader A live node change: [WatchedEvent state:SyncConnected type:NodeChildrenChanged path:/live_nodes], has occurred - updating... (live nodes size: [1])
   [junit4]   2> 598713 INFO  (zkCallback-893-thread-1) [    ] o.a.s.c.c.ZkStateReader A live node change: [WatchedEvent state:SyncConnected type:NodeChildrenChanged path:/live_nodes], has occurred - updating... (live nodes size: [1])
   [junit4]   2> 598713 INFO  (zkCallback-891-thread-1) [    ] o.a.s.c.c.ZkStateReader A live node change: [WatchedEvent state:SyncConnected type:NodeChildrenChanged path:/live_nodes], has occurred - updating... (live nodes size: [1])
   [junit4]   2> 598714 INFO  (TEST-CollectionsAPIDistributedZkTest.test-seed#[438A5D594E791FF]) [    ] o.a.s.c.Overseer Overseer (id=null) closing
   [junit4]   2> 598714 INFO  (TEST-CollectionsAPIDistributedZkTest.test-seed#[438A5D594E791FF]) [    ] o.a.s.c.LeaderElector Joined leadership election with path: /overseer_elect/election/95328387647078408-127.0.0.1:51506_-n_0000000001
   [junit4]   2> 598715 INFO  (TEST-CollectionsAPIDistributedZkTest.test-seed#[438A5D594E791FF]) [    ] o.a.s.c.LeaderElector Watching path /overseer_elect/election/95328387647078404-127.0.0.1:54126_-n_0000000000 to know if I could be the leader
   [junit4]   2> 598721 INFO  (TEST-CollectionsAPIDistributedZkTest.test-seed#[438A5D594E791FF]) [    ] o.a.s.c.CoreContainer Security conf doesn't exist. Skipping setup for authorization module.
   [junit4]   2> 598721 INFO  (TEST-CollectionsAPIDistributedZkTest.test-seed#[438A5D594E791FF]) [    ] o.a.s.c.CoreContainer No authentication plugin used.
   [junit4]   2> 598721 INFO  (TEST-CollectionsAPIDistributedZkTest.test-seed#[438A5D594E791FF]) [    ] o.a.s.c.CorePropertiesLocator Looking for core definitions underneath /home/jenkins/workspace/Lucene-Solr-trunk-Linux/solr/build/solr-core/test/J0/temp/solr.cloud.CollectionsAPIDistributedZkTest_438A5D594E791FF-001/shard-1-001/cores
   [junit4]   2> 598721 INFO  (TEST-CollectionsAPIDistributedZkTest.test-seed#[438A5D594E791FF]) [    ] o.a.s.c.CoreDescriptor Created CoreDescriptor: {name=collection1, config=solrconfig.xml, transient=false, schema=schema.xml, loadOnStartup=true, configSetProperties=configsetprops.json, collection=collection1, coreNodeName=, dataDir=data/, shard=}
   [junit4]   2> 598721 INFO  (TEST-CollectionsAPIDistributedZkTest.test-seed#[438A5D594E791FF]) [    ] o.a.s.c.CorePropertiesLocator Found core collection1 in /home/jenkins/workspace/Lucene-Solr-trunk-Linux/solr/build/solr-core/test/J0/temp/solr.cloud.CollectionsAPIDistributedZkTest_438A5D594E791FF-001/shard-1-001/cores/collection1
   [junit4]   2> 598722 INFO  (TEST-CollectionsAPIDistributedZkTest.test-seed#[438A5D594E791FF]) [    ] o.a.s.c.CorePropertiesLocator Found 1 core definitions
   [junit4]   2> 598722 INFO  (TEST-CollectionsAPIDistributedZkTest.test-seed#[438A5D594E791FF]) [    ] o.a.s.s.SolrDispatchFilter user.dir=/home/jenkins/workspace/Lucene-Solr-trunk-Linux/solr/build/solr-core/test/J0
   [junit4]   2> 598722 INFO  (TEST-CollectionsAPIDistributedZkTest.test-seed#[438A5D594E791FF]) [    ] o.a.s.s.SolrDispatchFilter SolrDispatchFilter.init() done
   [junit4]   2> 598722 INFO  (coreLoadExecutor-2902-thread-1) [    ] o.a.s.c.ZkController publishing state=down
   [junit4]   2> 598722 INFO  (coreLoadExecutor-2902-thread-1) [    ] o.a.s.c.ZkController numShards not found on descriptor - reading it from system property
   [junit4]   2> 598723 INFO  (coreLoadExecutor-2902-thread-1) [    ] o.a.s.c.ZkController look for our core node name
   [junit4]   2> 598723 INFO  (OverseerStateUpdate-95328387647078404-127.0.0.1:54126_-n_0000000000) [    ] o.a.s.c.Overseer processMessage: queueSize: 1, message = {
   [junit4]   2>   "core":"collection1",
   [junit4]   2>   "roles":null,
   [junit4]   2>   "base_url":"http://127.0.0.1:51506",
   [junit4]   2>   "node_name":"127.0.0.1:51506_",
   [junit4]   2>   "numShards":"2",
   [junit4]   2>   "state":"down",
   [junit4]   2>   "shard":null,
   [junit4]   2>   "collection":"collection1",
   [junit4]   2>   "operation":"state"} current state version: 3
   [junit4]   2> 598723 INFO  (OverseerStateUpdate-95328387647078404-127.0.0.1:54126_-n_0000000000) [    ] o.a.s.c.o.ReplicaMutator Update state numShards=2 message={
   [junit4]   2>   "core":"collection1",
   [junit4]   2>   "roles":null,
   [junit4]   2>   "base_url":"http://127.0.0.1:51506",
   [junit4]   2>   "node_name":"127.0.0.1:51506_",
   [junit4]   2>   "numShards":"2",
   [junit4]   2>   "state":"down",
   [junit4]   2>   "shard":null,
   [junit4]   2>   "collection":"collection1",
   [junit4]   2>   "operation":"state"}
   [junit4]   2> 598723 INFO  (OverseerStateUpdate-95328387647078404-127.0.0.1:54126_-n_0000000000) [    ] o.a.s.c.o.ClusterStateMutator building a new cName: collection1
   [junit4]   2> 598723 INFO  (OverseerStateUpdate-95328387647078404-127.0.0.1:54126_-n_0000000000) [    ] o.a.s.c.o.ReplicaMutator Assigning new node to shard shard=shard2
   [junit4]   2> 598824 INFO  (zkCallback-891-thread-1) [    ] o.a.s.c.c.ZkStateReader A cluster state change: [WatchedEvent state:SyncConnected type:NodeDataChanged path:/clusterstate.json], has occurred - updating... (live nodes size: [2])
   [junit4]   2> 598824 INFO  (zkCallback-893-thread-1) [    ] o.a.s.c.c.ZkStateReader A cluster state change: [WatchedEvent state:SyncConnected type:NodeDataChanged path:/clusterstate.json], has occurred - updating... (live nodes size: [2])
   [junit4]   2> 598824 INFO  (zkCallback-898-thread-1) [    ] o.a.s.c.c.ZkStateReader A cluster state change: [WatchedEvent state:SyncConnected type:NodeDataChanged path:/clusterstate.json], has occurred - updating... (live nodes size: [2])
   [junit4]   2> 599723 INFO  (coreLoadExecutor-2902-thread-1) [    ] o.a.s.c.ZkController waiting to find shard id in clusterstate for collection1
   [junit4]   2> 599723 INFO  (coreLoadExecutor-2902-thread-1) [    ] o.a.s.c.ZkController Check for collection zkNode:collection1
   [junit4]   2> 599724 INFO  (coreLoadExecutor-2902-thread-1) [    ] o.a.s.c.ZkController Collection zkNode exists
   [junit4]   2> 599724 INFO  (coreLoadExecutor-2902-thread-1) [    ] o.a.s.c.c.ZkStateReader Load collection config from: [/collections/collection1]
   [junit4]   2> 599724 INFO  (coreLoadExecutor-2902-thread-1) [    ] o.a.s.c.c.ZkStateReader path=[/collections/collection1] [configName]=[conf1] specified config exists in ZooKeeper
   [junit4]   2> 599724 INFO  (coreLoadExecutor-2902-thread-1) [    ] o.a.s.c.SolrResourceLoader new SolrResourceLoader for directory: '/home/jenkins/workspace/Lucene-Solr-trunk-Linux/solr/build/solr-core/test/J0/temp/solr.cloud.CollectionsAPIDistributedZkTest_438A5D594E791FF-001/shard-1-001/cores/collection1'
   [junit4]   2> 599724 INFO  (coreLoadExecutor-2902-thread-1) [    ] o.a.s.c.SolrResourceLoader JNDI not configured for solr (NoInitialContextEx)
   [junit4]   2> 599724 INFO  (coreLoadExecutor-2902-thread-1) [    ] o.a.s.c.SolrResourceLoader solr home defaulted to 'solr/' (could not find system property or JNDI)
   [junit4]   2> 599725 INFO  (coreLoadExecutor-2902-thread-1) [    ] o.a.s.c.Config loaded config solrconfig.xml with version 0 
   [junit4]   2> 599727 INFO  (coreLoadExecutor-2902-thread-1) [    ] o.a.s.c.SolrConfig current version of requestparams : -1
   [junit4]   2> 599729 INFO  (coreLoadExecutor-2902-thread-1) [    ] o.a.s.c.SolrConfig Using Lucene MatchVersion: 6.0.0
   [junit4]   2> 599734 INFO  (coreLoadExecutor-2902-thread-1) [    ] o.a.s.c.SolrConfig Loaded SolrConfig: solrconfig.xml
   [junit4]   2> 599737 INFO  (coreLoadExecutor-2902-thread-1) [    ] o.a.s.s.IndexSchema [collection1] Schema name=test
   [junit4]   2> 599785 INFO  (coreLoadExecutor-2902-thread-1) [    ] o.a.s.s.OpenExchangeRatesOrgProvider Initialized with rates=open-exchange-rates.json, refreshInterval=1440.
   [junit4]   2> 599788 INFO  (coreLoadExecutor-2902-thread-1) [    ] o.a.s.s.IndexSchema default search field in schema is text
   [junit4]   2> 599788 INFO  (coreLoadExecutor-2902-thread-1) [    ] o.a.s.s.IndexSchema unique key field: id
   [junit4]   2> 599791 INFO  (coreLoadExecutor-2902-thread-1) [    ] o.a.s.s.FileExchangeRateProvider Reloading exchange rates from file currency.xml
   [junit4]   2> 599792 INFO  (coreLoadExecutor-2902-thread-1) [    ] o.a.s.s.FileExchangeRateProvider Reloading exchange rates from file currency.xml
   [junit4]   2> 599793 INFO  (coreLoadExecutor-2902-thread-1) [    ] o.a.s.s.OpenExchangeRatesOrgProvider Reloading exchange rates from open-exchange-rates.json
   [junit4]   2> 599793 INFO  (coreLoadExecutor-2902-thread-1) [    ] o.a.s.s.OpenExchangeRatesOrgProvider Reloading exchange rates from open-exchange-rates.json
   [junit4]   2> 599794 INFO  (coreLoadExecutor-2902-thread-1) [    ] o.a.s.c.ConfigSetProperties Did not find ConfigSet properties, assuming default properties: Can't find resource 'configsetprops.json' in classpath or '/configs/conf1', cwd=/home/jenkins/workspace/Lucene-Solr-trunk-Linux/solr/build/solr-core/test/J0
   [junit4]   2> 599794 INFO  (coreLoadExecutor-2902-thread-1) [    ] o.a.s.c.CoreContainer Creating SolrCore 'collection1' using configuration from collection collection1
   [junit4]   2> 599794 INFO  (coreLoadExecutor-2902-thread-1) [    ] o.a.s.c.SolrCore org.apache.solr.core.MockDirectoryFactory
   [junit4]   2> 599794 INFO  (coreLoadExecutor-2902-thread-1) [    ] o.a.s.c.SolrCore [[collection1] ] Opening new SolrCore at [/home/jenkins/workspace/Lucene-Solr-trunk-Linux/solr/build/solr-core/test/J0/temp/solr.cloud.CollectionsAPIDistributedZkTest_438A5D594E791FF-001/shard-1-001/cores/collection1], dataDir=[/home/jenkins/workspace/Lucene-Solr-trunk-Linux/solr/build/solr-core/test/J0/temp/solr.cloud.CollectionsAPIDistributedZkTest_438A5D594E791FF-001/shard-1-001/cores/collection1/data/]
   [junit4]   2> 599794 INFO  (coreLoadExecutor-2902-thread-1) [    ] o.a.s.c.JmxMonitoredMap JMX monitoring is enabled. Adding Solr mbeans to JMX Server: com.sun.jmx.mbeanserver.JmxMBeanServer@26939eca
   [junit4]   2> 599795 INFO  (coreLoadExecutor-2902-thread-1) [    ] o.a.s.c.CachingDirectoryFactory return new directory for /home/jenkins/workspace/Lucene-Solr-trunk-Linux/solr/build/solr-core/test/J0/temp/solr.cloud.CollectionsAPIDistributedZkTest_438A5D594E791FF-001/shard-1-001/cores/collection1/data
   [junit4]   2> 599795 INFO  (coreLoadExecutor-2902-thread-1) [    ] o.a.s.c.SolrCore New index directory detected: old=null new=/home/jenkins/workspace/Lucene-Solr-trunk-Linux/solr/build/solr-core/test/J0/temp/solr.cloud.CollectionsAPIDistributedZkTest_438A5D594E791FF-001/shard-1-001/cores/collection1/data/index/
   [junit4]   2> 599795 WARN  (coreLoadExecutor-2902-thread-1) [    ] o.a.s.c.SolrCore [collection1] Solr index directory '/home/jenkins/workspace/Lucene-Solr-trunk-Linux/solr/build/solr-core/test/J0/temp/solr.cloud.CollectionsAPIDistributedZkTest_438A5D594E791FF-001/shard-1-001/cores/collection1/data/index' doesn't exist. Creating new index...
   [junit4]   2> 599795 INFO  (coreLoadExecutor-2902-thread-1) [    ] o.a.s.c.CachingDirectoryFactory return new directory for /home/jenkins/workspace/Lucene-Solr-trunk-Linux/solr/build/solr-core/test/J0/temp/solr.cloud.CollectionsAPIDistributedZkTest_438A5D594E791FF-001/shard-1-001/cores/collection1/data/index
   [junit4]   2> 599795 INFO  (coreLoadExecutor-2902-thread-1) [    ] o.a.s.u.RandomMergePolicy RandomMergePolicy wrapping class org.apache.lucene.index.LogDocMergePolicy: [LogDocMergePolicy: minMergeSize=1000, mergeFactor=39, maxMergeSize=9223372036854775807, maxMergeSizeForForcedMerge=9223372036854775807, calibrateSizeByDeletes=false, maxMergeDocs=2147483647, maxCFSSegmentSizeMB=8.796093022207999E12, noCFSRatio=0.0]
   [junit4]   2> 599795 INFO  (coreLoadExecutor-2902-thread-1) [    ] o.a.s.c.SolrDeletionPolicy SolrDeletionPolicy.onCommit: commits: num=1
   [junit4]   2> 	commit{dir=MockDirectoryWrapper(RAMDirectory@26ddaa10 lockFactory=org.apache.lucene.store.SingleInstanceLockFactory@3a97c565),segFN=segments_1,generation=1}
   [junit4]   2> 599795 INFO  (coreLoadExecutor-2902-thread-1) [    ] o.a.s.c.SolrDeletionPolicy newest commit generation = 1
   [junit4]   2> 599796 INFO  (OldIndexDirectoryCleanupThreadForCore-collection1) [    ] o.a.s.c.SolrCore Looking for old index directories to cleanup for core collection1 in /home/jenkins/workspace/Lucene-Solr-trunk-Linux/solr/build/solr-core/test/J0/temp/solr.cloud.CollectionsAPIDistributedZkTest_438A5D594E791FF-001/shard-1-001/cores/collection1/data/
   [junit4]   2> 599796 WARN  (OldIndexDirectoryCleanupThreadForCore-collection1) [    ] o.a.s.c.DirectoryFactory /home/jenkins/workspace/Lucene-Solr-trunk-Linux/solr/build/solr-core/test/J0/temp/solr.cloud.CollectionsAPIDistributedZkTest_438A5D594E791FF-001/shard-1-001/cores/collection1/data/ does not point to a valid data directory; skipping clean-up of old index directories.
   [junit4]   2> 599797 INFO  (coreLoadExecutor-2902-thread-1) [    ] o.a.s.u.p.UpdateRequestProcessorChain creating updateRequestProcessorChain "nodistrib"
   [junit4]   2> 599797 INFO  (coreLoadExecutor-2902-thread-1) [    ] o.a.s.u.p.UpdateRequestProcessorChain creating updateRequestProcessorChain "dedupe"
   [junit4]   2> 599797 INFO  (coreLoadExecutor-2902-thread-1) [    ] o.a.s.u.p.UpdateRequestProcessorChain inserting DistributedUpdateProcessorFactory into updateRequestProcessorChain "dedupe"
   [junit4]   2> 599797 INFO  (coreLoadExecutor-2902-thread-1) [    ] o.a.s.u.p.UpdateRequestProcessorChain creating updateRequestProcessorChain "stored_sig"
   [junit4]   2> 599798 INFO  (coreLoadExecutor-2902-thread-1) [    ] o.a.s.u.p.UpdateRequestProcessorChain inserting DistributedUpdateProcessorFactory into updateRequestProcessorChain "stored_sig"
   [junit4]   2> 599798 INFO  (coreLoadExecutor-2902-thread-1) [    ] o.a.s.u.p.UpdateRequestProcessorChain creating u

[...truncated too long message...]

Dtests.timezone=Antarctica/Mawson -Dtests.asserts=true -Dtests.file.encoding=ISO-8859-1
   [junit4] ERROR   0.00s J0 | CollectionsAPIDistributedZkTest (suite) <<<
   [junit4]    > Throwable #1: com.carrotsearch.randomizedtesting.ThreadLeakError: 5 threads leaked from SUITE scope at org.apache.solr.cloud.CollectionsAPIDistributedZkTest: 
   [junit4]    >    1) Thread[id=6049, name=zkCallback-921-thread-2, state=TIMED_WAITING, group=TGRP-CollectionsAPIDistributedZkTest]
   [junit4]    >         at jdk.internal.misc.Unsafe.park(Native Method)
   [junit4]    >         at java.util.concurrent.locks.LockSupport.parkNanos(LockSupport.java:230)
   [junit4]    >         at java.util.concurrent.SynchronousQueue$TransferStack.awaitFulfill(SynchronousQueue.java:461)
   [junit4]    >         at java.util.concurrent.SynchronousQueue$TransferStack.transfer(SynchronousQueue.java:362)
   [junit4]    >         at java.util.concurrent.SynchronousQueue.poll(SynchronousQueue.java:937)
   [junit4]    >         at java.util.concurrent.ThreadPoolExecutor.getTask(ThreadPoolExecutor.java:1082)
   [junit4]    >         at java.util.concurrent.ThreadPoolExecutor.runWorker(ThreadPoolExecutor.java:1143)
   [junit4]    >         at java.util.concurrent.ThreadPoolExecutor$Worker.run(ThreadPoolExecutor.java:632)
   [junit4]    >         at java.lang.Thread.run(Thread.java:804)
   [junit4]    >    2) Thread[id=5758, name=zkCallback-921-thread-1, state=TIMED_WAITING, group=TGRP-CollectionsAPIDistributedZkTest]
   [junit4]    >         at jdk.internal.misc.Unsafe.park(Native Method)
   [junit4]    >         at java.util.concurrent.locks.LockSupport.parkNanos(LockSupport.java:230)
   [junit4]    >         at java.util.concurrent.SynchronousQueue$TransferStack.awaitFulfill(SynchronousQueue.java:461)
   [junit4]    >         at java.util.concurrent.SynchronousQueue$TransferStack.transfer(SynchronousQueue.java:362)
   [junit4]    >         at java.util.concurrent.SynchronousQueue.poll(SynchronousQueue.java:937)
   [junit4]    >         at java.util.concurrent.ThreadPoolExecutor.getTask(ThreadPoolExecutor.java:1082)
   [junit4]    >         at java.util.concurrent.ThreadPoolExecutor.runWorker(ThreadPoolExecutor.java:1143)
   [junit4]    >         at java.util.concurrent.ThreadPoolExecutor$Worker.run(ThreadPoolExecutor.java:632)
   [junit4]    >         at java.lang.Thread.run(Thread.java:804)
   [junit4]    >    3) Thread[id=6050, name=zkCallback-921-thread-3, state=TIMED_WAITING, group=TGRP-CollectionsAPIDistributedZkTest]
   [junit4]    >         at jdk.internal.misc.Unsafe.park(Native Method)
   [junit4]    >         at java.util.concurrent.locks.LockSupport.parkNanos(LockSupport.java:230)
   [junit4]    >         at java.util.concurrent.SynchronousQueue$TransferStack.awaitFulfill(SynchronousQueue.java:461)
   [junit4]    >         at java.util.concurrent.SynchronousQueue$TransferStack.transfer(SynchronousQueue.java:362)
   [junit4]    >         at java.util.concurrent.SynchronousQueue.poll(SynchronousQueue.java:937)
   [junit4]    >         at java.util.concurrent.ThreadPoolExecutor.getTask(ThreadPoolExecutor.java:1082)
   [junit4]    >         at java.util.concurrent.ThreadPoolExecutor.runWorker(ThreadPoolExecutor.java:1143)
   [junit4]    >         at java.util.concurrent.ThreadPoolExecutor$Worker.run(ThreadPoolExecutor.java:632)
   [junit4]    >         at java.lang.Thread.run(Thread.java:804)
   [junit4]    >    4) Thread[id=5757, name=TEST-CollectionsAPIDistributedZkTest.test-seed#[438A5D594E791FF]-EventThread, state=WAITING, group=TGRP-CollectionsAPIDistributedZkTest]
   [junit4]    >         at jdk.internal.misc.Unsafe.park(Native Method)
   [junit4]    >         at java.util.concurrent.locks.LockSupport.park(LockSupport.java:190)
   [junit4]    >         at java.util.concurrent.locks.AbstractQueuedSynchronizer$ConditionObject.await(AbstractQueuedSynchronizer.java:2059)
   [junit4]    >         at java.util.concurrent.LinkedBlockingQueue.take(LinkedBlockingQueue.java:442)
   [junit4]    >         at org.apache.zookeeper.ClientCnxn$EventThread.run(ClientCnxn.java:494)
   [junit4]    >    5) Thread[id=5756, name=TEST-CollectionsAPIDistributedZkTest.test-seed#[438A5D594E791FF]-SendThread(127.0.0.1:58237), state=TIMED_WAITING, group=TGRP-CollectionsAPIDistributedZkTest]
   [junit4]    >         at java.lang.Thread.sleep(Native Method)
   [junit4]    >         at org.apache.zookeeper.client.StaticHostProvider.next(StaticHostProvider.java:101)
   [junit4]    >         at org.apache.zookeeper.ClientCnxn$SendThread.startConnect(ClientCnxn.java:940)
   [junit4]    >         at org.apache.zookeeper.ClientCnxn$SendThread.run(ClientCnxn.java:1003)
   [junit4]    > 	at __randomizedtesting.SeedInfo.seed([438A5D594E791FF]:0)Throwable #2: com.carrotsearch.randomizedtesting.ThreadLeakError: There are still zombie threads that couldn't be terminated:
   [junit4]    >    1) Thread[id=6049, name=zkCallback-921-thread-2, state=TIMED_WAITING, group=TGRP-CollectionsAPIDistributedZkTest]
   [junit4]    >         at jdk.internal.misc.Unsafe.park(Native Method)
   [junit4]    >         at java.util.concurrent.locks.LockSupport.parkNanos(LockSupport.java:230)
   [junit4]    >         at java.util.concurrent.SynchronousQueue$TransferStack.awaitFulfill(SynchronousQueue.java:461)
   [junit4]    >         at java.util.concurrent.SynchronousQueue$TransferStack.transfer(SynchronousQueue.java:362)
   [junit4]    >         at java.util.concurrent.SynchronousQueue.poll(SynchronousQueue.java:937)
   [junit4]    >         at java.util.concurrent.ThreadPoolExecutor.getTask(ThreadPoolExecutor.java:1082)
   [junit4]    >         at java.util.concurrent.ThreadPoolExecutor.runWorker(ThreadPoolExecutor.java:1143)
   [junit4]    >         at java.util.concurrent.ThreadPoolExecutor$Worker.run(ThreadPoolExecutor.java:632)
   [junit4]    >         at java.lang.Thread.run(Thread.java:804)
   [junit4]    >    2) Thread[id=5758, name=zkCallback-921-thread-1, state=TIMED_WAITING, group=TGRP-CollectionsAPIDistributedZkTest]
   [junit4]    >         at jdk.internal.misc.Unsafe.park(Native Method)
   [junit4]    >         at java.util.concurrent.locks.LockSupport.parkNanos(LockSupport.java:230)
   [junit4]    >         at java.util.concurrent.SynchronousQueue$TransferStack.awaitFulfill(SynchronousQueue.java:461)
   [junit4]    >         at java.util.concurrent.SynchronousQueue$TransferStack.transfer(SynchronousQueue.java:362)
   [junit4]    >         at java.util.concurrent.SynchronousQueue.poll(SynchronousQueue.java:937)
   [junit4]    >         at java.util.concurrent.ThreadPoolExecutor.getTask(ThreadPoolExecutor.java:1082)
   [junit4]    >         at java.util.concurrent.ThreadPoolExecutor.runWorker(ThreadPoolExecutor.java:1143)
   [junit4]    >         at java.util.concurrent.ThreadPoolExecutor$Worker.run(ThreadPoolExecutor.java:632)
   [junit4]    >         at java.lang.Thread.run(Thread.java:804)
   [junit4]    >    3) Thread[id=6050, name=zkCallback-921-thread-3, state=TIMED_WAITING, group=TGRP-CollectionsAPIDistributedZkTest]
   [junit4]    >         at jdk.internal.misc.Unsafe.park(Native Method)
   [junit4]    >         at java.util.concurrent.locks.LockSupport.parkNanos(LockSupport.java:230)
   [junit4]    >         at java.util.concurrent.SynchronousQueue$TransferStack.awaitFulfill(SynchronousQueue.java:461)
   [junit4]    >         at java.util.concurrent.SynchronousQueue$TransferStack.transfer(SynchronousQueue.java:362)
   [junit4]    >         at java.util.concurrent.SynchronousQueue.poll(SynchronousQueue.java:937)
   [junit4]    >         at java.util.concurrent.ThreadPoolExecutor.getTask(ThreadPoolExecutor.java:1082)
   [junit4]    >         at java.util.concurrent.ThreadPoolExecutor.runWorker(ThreadPoolExecutor.java:1143)
   [junit4]    >         at java.util.concurrent.ThreadPoolExecutor$Worker.run(ThreadPoolExecutor.java:632)
   [junit4]    >         at java.lang.Thread.run(Thread.java:804)
   [junit4]    >    4) Thread[id=5756, name=TEST-CollectionsAPIDistributedZkTest.test-seed#[438A5D594E791FF]-SendThread(127.0.0.1:58237), state=TIMED_WAITING, group=TGRP-CollectionsAPIDistributedZkTest]
   [junit4]    >         at java.lang.Thread.sleep(Native Method)
   [junit4]    >         at org.apache.zookeeper.client.StaticHostProvider.next(StaticHostProvider.java:101)
   [junit4]    >         at org.apache.zookeeper.ClientCnxn$SendThread.startConnect(ClientCnxn.java:940)
   [junit4]    >         at org.apache.zookeeper.ClientCnxn$SendThread.run(ClientCnxn.java:1003)
   [junit4]    > 	at __randomizedtesting.SeedInfo.seed([438A5D594E791FF]:0)
   [junit4] Completed [220/575 (1!)] on J0 in 50.75s, 1 test, 3 errors <<< FAILURES!

[...truncated 1141 lines...]
BUILD FAILED
/home/jenkins/workspace/Lucene-Solr-trunk-Linux/build.xml:740: The following error occurred while executing this line:
/home/jenkins/workspace/Lucene-Solr-trunk-Linux/build.xml:684: The following error occurred while executing this line:
/home/jenkins/workspace/Lucene-Solr-trunk-Linux/build.xml:59: The following error occurred while executing this line:
/home/jenkins/workspace/Lucene-Solr-trunk-Linux/solr/build.xml:233: The following error occurred while executing this line:
/home/jenkins/workspace/Lucene-Solr-trunk-Linux/solr/common-build.xml:524: The following error occurred while executing this line:
/home/jenkins/workspace/Lucene-Solr-trunk-Linux/lucene/common-build.xml:1457: The following error occurred while executing this line:
/home/jenkins/workspace/Lucene-Solr-trunk-Linux/lucene/common-build.xml:1014: There were test failures: 575 suites (8 ignored), 2316 tests, 2 suite-level errors, 1 error, 1023 ignored (67 assumptions) [seed: 438A5D594E791FF]

Total time: 45 minutes 54 seconds
Build step 'Invoke Ant' marked build as failure
Archiving artifacts
[WARNINGS] Skipping publisher since build result is FAILURE
Recording test results
Email was triggered for: Failure - Any
Sending email for trigger: Failure - Any



Mime
View raw message