lucene-dev mailing list archives

Site index · List index
Message view « Date » · « Thread »
Top « Date » · « Thread »
From Policeman Jenkins Server <jenk...@thetaphi.de>
Subject [JENKINS] Lucene-Solr-trunk-Windows (64bit/jdk1.8.0_72) - Build # 5636 - Still Failing!
Date Mon, 22 Feb 2016 10:55:47 GMT
Build: http://jenkins.thetaphi.de/job/Lucene-Solr-trunk-Windows/5636/
Java: 64bit/jdk1.8.0_72 -XX:+UseCompressedOops -XX:+UseG1GC

1 tests failed.
FAILED:  org.apache.solr.handler.TestReplicationHandler.doTestStressReplication

Error Message:
timed out waiting for collection1 startAt time to exceed: Mon Feb 22 10:28:37 GMT 2016

Stack Trace:
java.lang.AssertionError: timed out waiting for collection1 startAt time to exceed: Mon Feb 22 10:28:37 GMT 2016
	at __randomizedtesting.SeedInfo.seed([7F7F594C1BECDEE9:A4D4598A1EC4B75A]:0)
	at org.junit.Assert.fail(Assert.java:93)
	at org.apache.solr.handler.TestReplicationHandler.watchCoreStartAt(TestReplicationHandler.java:1419)
	at org.apache.solr.handler.TestReplicationHandler.doTestStressReplication(TestReplicationHandler.java:771)
	at sun.reflect.NativeMethodAccessorImpl.invoke0(Native Method)
	at sun.reflect.NativeMethodAccessorImpl.invoke(NativeMethodAccessorImpl.java:62)
	at sun.reflect.DelegatingMethodAccessorImpl.invoke(DelegatingMethodAccessorImpl.java:43)
	at java.lang.reflect.Method.invoke(Method.java:498)
	at com.carrotsearch.randomizedtesting.RandomizedRunner.invoke(RandomizedRunner.java:1764)
	at com.carrotsearch.randomizedtesting.RandomizedRunner$8.evaluate(RandomizedRunner.java:871)
	at com.carrotsearch.randomizedtesting.RandomizedRunner$9.evaluate(RandomizedRunner.java:907)
	at com.carrotsearch.randomizedtesting.RandomizedRunner$10.evaluate(RandomizedRunner.java:921)
	at com.carrotsearch.randomizedtesting.rules.SystemPropertiesRestoreRule$1.evaluate(SystemPropertiesRestoreRule.java:57)
	at org.apache.lucene.util.TestRuleSetupTeardownChained$1.evaluate(TestRuleSetupTeardownChained.java:49)
	at org.apache.lucene.util.AbstractBeforeAfterRule$1.evaluate(AbstractBeforeAfterRule.java:45)
	at org.apache.lucene.util.TestRuleThreadAndTestName$1.evaluate(TestRuleThreadAndTestName.java:48)
	at org.apache.lucene.util.TestRuleIgnoreAfterMaxFailures$1.evaluate(TestRuleIgnoreAfterMaxFailures.java:64)
	at org.apache.lucene.util.TestRuleMarkFailure$1.evaluate(TestRuleMarkFailure.java:47)
	at com.carrotsearch.randomizedtesting.rules.StatementAdapter.evaluate(StatementAdapter.java:36)
	at com.carrotsearch.randomizedtesting.ThreadLeakControl$StatementRunner.run(ThreadLeakControl.java:367)
	at com.carrotsearch.randomizedtesting.ThreadLeakControl.forkTimeoutingTask(ThreadLeakControl.java:809)
	at com.carrotsearch.randomizedtesting.ThreadLeakControl$3.evaluate(ThreadLeakControl.java:460)
	at com.carrotsearch.randomizedtesting.RandomizedRunner.runSingleTest(RandomizedRunner.java:880)
	at com.carrotsearch.randomizedtesting.RandomizedRunner$5.evaluate(RandomizedRunner.java:781)
	at com.carrotsearch.randomizedtesting.RandomizedRunner$6.evaluate(RandomizedRunner.java:816)
	at com.carrotsearch.randomizedtesting.RandomizedRunner$7.evaluate(RandomizedRunner.java:827)
	at com.carrotsearch.randomizedtesting.rules.StatementAdapter.evaluate(StatementAdapter.java:36)
	at com.carrotsearch.randomizedtesting.rules.SystemPropertiesRestoreRule$1.evaluate(SystemPropertiesRestoreRule.java:57)
	at org.apache.lucene.util.AbstractBeforeAfterRule$1.evaluate(AbstractBeforeAfterRule.java:45)
	at com.carrotsearch.randomizedtesting.rules.StatementAdapter.evaluate(StatementAdapter.java:36)
	at org.apache.lucene.util.TestRuleStoreClassName$1.evaluate(TestRuleStoreClassName.java:41)
	at com.carrotsearch.randomizedtesting.rules.NoShadowingOrOverridesOnMethodsRule$1.evaluate(NoShadowingOrOverridesOnMethodsRule.java:40)
	at com.carrotsearch.randomizedtesting.rules.NoShadowingOrOverridesOnMethodsRule$1.evaluate(NoShadowingOrOverridesOnMethodsRule.java:40)
	at com.carrotsearch.randomizedtesting.rules.StatementAdapter.evaluate(StatementAdapter.java:36)
	at com.carrotsearch.randomizedtesting.rules.StatementAdapter.evaluate(StatementAdapter.java:36)
	at com.carrotsearch.randomizedtesting.rules.StatementAdapter.evaluate(StatementAdapter.java:36)
	at org.apache.lucene.util.TestRuleAssertionsRequired$1.evaluate(TestRuleAssertionsRequired.java:53)
	at org.apache.lucene.util.TestRuleMarkFailure$1.evaluate(TestRuleMarkFailure.java:47)
	at org.apache.lucene.util.TestRuleIgnoreAfterMaxFailures$1.evaluate(TestRuleIgnoreAfterMaxFailures.java:64)
	at org.apache.lucene.util.TestRuleIgnoreTestSuites$1.evaluate(TestRuleIgnoreTestSuites.java:54)
	at com.carrotsearch.randomizedtesting.rules.StatementAdapter.evaluate(StatementAdapter.java:36)
	at com.carrotsearch.randomizedtesting.ThreadLeakControl$StatementRunner.run(ThreadLeakControl.java:367)
	at java.lang.Thread.run(Thread.java:745)




Build Log:
[...truncated 11333 lines...]
   [junit4] Suite: org.apache.solr.handler.TestReplicationHandler
   [junit4]   2> Creating dataDir: C:\Users\JenkinsSlave\workspace\Lucene-Solr-trunk-Windows\solr\build\solr-core\test\J0\temp\solr.handler.TestReplicationHandler_7F7F594C1BECDEE9-001\init-core-data-001
   [junit4]   2> 1688648 INFO  (TEST-TestReplicationHandler.doTestReplicateAfterStartupWithNoActivity-seed#[7F7F594C1BECDEE9]) [    ] o.a.s.SolrTestCaseJ4 ###Starting doTestReplicateAfterStartupWithNoActivity
   [junit4]   2> 1688649 INFO  (TEST-TestReplicationHandler.doTestReplicateAfterStartupWithNoActivity-seed#[7F7F594C1BECDEE9]) [    ] o.a.s.SolrTestCaseJ4 Writing core.properties file to C:\Users\JenkinsSlave\workspace\Lucene-Solr-trunk-Windows\solr\build\solr-core\test\J0\temp\solr.handler.TestReplicationHandler_7F7F594C1BECDEE9-001\solr-instance-001\collection1
   [junit4]   2> 1688676 INFO  (TEST-TestReplicationHandler.doTestReplicateAfterStartupWithNoActivity-seed#[7F7F594C1BECDEE9]) [    ] o.e.j.s.Server jetty-9.3.6.v20151106
   [junit4]   2> 1688678 INFO  (TEST-TestReplicationHandler.doTestReplicateAfterStartupWithNoActivity-seed#[7F7F594C1BECDEE9]) [    ] o.e.j.s.h.ContextHandler Started o.e.j.s.ServletContextHandler@57a50871{/solr,null,AVAILABLE}
   [junit4]   2> 1688679 INFO  (TEST-TestReplicationHandler.doTestReplicateAfterStartupWithNoActivity-seed#[7F7F594C1BECDEE9]) [    ] o.e.j.s.ServerConnector Started ServerConnector@72f04bd3{HTTP/1.1,[http/1.1]}{127.0.0.1:61752}
   [junit4]   2> 1688680 INFO  (TEST-TestReplicationHandler.doTestReplicateAfterStartupWithNoActivity-seed#[7F7F594C1BECDEE9]) [    ] o.e.j.s.Server Started @1695461ms
   [junit4]   2> 1688680 INFO  (TEST-TestReplicationHandler.doTestReplicateAfterStartupWithNoActivity-seed#[7F7F594C1BECDEE9]) [    ] o.a.s.c.s.e.JettySolrRunner Jetty properties: {solr.data.dir=C:\Users\JenkinsSlave\workspace\Lucene-Solr-trunk-Windows\solr\build\solr-core\test\J0\temp\solr.handler.TestReplicationHandler_7F7F594C1BECDEE9-001\solr-instance-001\collection1\data, hostContext=/solr, hostPort=61752}
   [junit4]   2> 1688681 INFO  (TEST-TestReplicationHandler.doTestReplicateAfterStartupWithNoActivity-seed#[7F7F594C1BECDEE9]) [    ] o.a.s.s.SolrDispatchFilter SolrDispatchFilter.init(): sun.misc.Launcher$AppClassLoader@73d16e93
   [junit4]   2> 1688681 INFO  (TEST-TestReplicationHandler.doTestReplicateAfterStartupWithNoActivity-seed#[7F7F594C1BECDEE9]) [    ] o.a.s.c.SolrResourceLoader new SolrResourceLoader for directory: 'C:\Users\JenkinsSlave\workspace\Lucene-Solr-trunk-Windows\solr\build\solr-core\test\J0\temp\solr.handler.TestReplicationHandler_7F7F594C1BECDEE9-001\solr-instance-001'
   [junit4]   2> 1688681 INFO  (TEST-TestReplicationHandler.doTestReplicateAfterStartupWithNoActivity-seed#[7F7F594C1BECDEE9]) [    ] o.a.s.c.SolrResourceLoader JNDI not configured for solr (NoInitialContextEx)
   [junit4]   2> 1688681 INFO  (TEST-TestReplicationHandler.doTestReplicateAfterStartupWithNoActivity-seed#[7F7F594C1BECDEE9]) [    ] o.a.s.c.SolrResourceLoader solr home defaulted to 'solr/' (could not find system property or JNDI)
   [junit4]   2> 1688681 INFO  (TEST-TestReplicationHandler.doTestReplicateAfterStartupWithNoActivity-seed#[7F7F594C1BECDEE9]) [    ] o.a.s.c.SolrXmlConfig Loading container configuration from C:\Users\JenkinsSlave\workspace\Lucene-Solr-trunk-Windows\solr\build\solr-core\test\J0\temp\solr.handler.TestReplicationHandler_7F7F594C1BECDEE9-001\solr-instance-001\solr.xml
   [junit4]   2> 1688694 INFO  (TEST-TestReplicationHandler.doTestReplicateAfterStartupWithNoActivity-seed#[7F7F594C1BECDEE9]) [    ] o.a.s.c.CorePropertiesLocator Config-defined core root directory: C:\Users\JenkinsSlave\workspace\Lucene-Solr-trunk-Windows\solr\build\solr-core\test\J0\temp\solr.handler.TestReplicationHandler_7F7F594C1BECDEE9-001\solr-instance-001\.
   [junit4]   2> 1688694 INFO  (TEST-TestReplicationHandler.doTestReplicateAfterStartupWithNoActivity-seed#[7F7F594C1BECDEE9]) [    ] o.a.s.c.CoreContainer New CoreContainer 1299814494
   [junit4]   2> 1688694 INFO  (TEST-TestReplicationHandler.doTestReplicateAfterStartupWithNoActivity-seed#[7F7F594C1BECDEE9]) [    ] o.a.s.c.CoreContainer Loading cores into CoreContainer [instanceDir=C:\Users\JenkinsSlave\workspace\Lucene-Solr-trunk-Windows\solr\build\solr-core\test\J0\temp\solr.handler.TestReplicationHandler_7F7F594C1BECDEE9-001\solr-instance-001]
   [junit4]   2> 1688695 WARN  (TEST-TestReplicationHandler.doTestReplicateAfterStartupWithNoActivity-seed#[7F7F594C1BECDEE9]) [    ] o.a.s.c.CoreContainer Couldn't add files from C:\Users\JenkinsSlave\workspace\Lucene-Solr-trunk-Windows\solr\build\solr-core\test\J0\temp\solr.handler.TestReplicationHandler_7F7F594C1BECDEE9-001\solr-instance-001\lib to classpath: C:\Users\JenkinsSlave\workspace\Lucene-Solr-trunk-Windows\solr\build\solr-core\test\J0\temp\solr.handler.TestReplicationHandler_7F7F594C1BECDEE9-001\solr-instance-001\lib
   [junit4]   2> 1688695 INFO  (TEST-TestReplicationHandler.doTestReplicateAfterStartupWithNoActivity-seed#[7F7F594C1BECDEE9]) [    ] o.a.s.h.c.HttpShardHandlerFactory created with socketTimeout : 90000,urlScheme : ,connTimeout : 15000,maxConnectionsPerHost : 20,maxConnections : 10000,corePoolSize : 0,maximumPoolSize : 2147483647,maxThreadIdleTime : 5,sizeOfQueue : -1,fairnessPolicy : false,useRetries : false,
   [junit4]   2> 1688698 INFO  (TEST-TestReplicationHandler.doTestReplicateAfterStartupWithNoActivity-seed#[7F7F594C1BECDEE9]) [    ] o.a.s.u.UpdateShardHandler Creating UpdateShardHandler HTTP client with params: socketTimeout=340000&connTimeout=45000&retry=true
   [junit4]   2> 1688698 INFO  (TEST-TestReplicationHandler.doTestReplicateAfterStartupWithNoActivity-seed#[7F7F594C1BECDEE9]) [    ] o.a.s.l.LogWatcher SLF4J impl is org.slf4j.impl.Log4jLoggerFactory
   [junit4]   2> 1688698 INFO  (TEST-TestReplicationHandler.doTestReplicateAfterStartupWithNoActivity-seed#[7F7F594C1BECDEE9]) [    ] o.a.s.l.LogWatcher Registering Log Listener [Log4j (org.slf4j.impl.Log4jLoggerFactory)]
   [junit4]   2> 1688698 INFO  (TEST-TestReplicationHandler.doTestReplicateAfterStartupWithNoActivity-seed#[7F7F594C1BECDEE9]) [    ] o.a.s.c.CoreContainer Security conf doesn't exist. Skipping setup for authorization module.
   [junit4]   2> 1688698 INFO  (TEST-TestReplicationHandler.doTestReplicateAfterStartupWithNoActivity-seed#[7F7F594C1BECDEE9]) [    ] o.a.s.c.CoreContainer No authentication plugin used.
   [junit4]   2> 1688700 INFO  (TEST-TestReplicationHandler.doTestReplicateAfterStartupWithNoActivity-seed#[7F7F594C1BECDEE9]) [    ] o.a.s.c.CorePropertiesLocator Looking for core definitions underneath C:\Users\JenkinsSlave\workspace\Lucene-Solr-trunk-Windows\solr\build\solr-core\test\J0\temp\solr.handler.TestReplicationHandler_7F7F594C1BECDEE9-001\solr-instance-001\.
   [junit4]   2> 1688702 INFO  (TEST-TestReplicationHandler.doTestReplicateAfterStartupWithNoActivity-seed#[7F7F594C1BECDEE9]) [    ] o.a.s.c.CoreDescriptor Created CoreDescriptor: {name=collection1, config=solrconfig.xml, loadOnStartup=true, schema=schema.xml, configSetProperties=configsetprops.json, transient=false, dataDir=data\}
   [junit4]   2> 1688702 INFO  (TEST-TestReplicationHandler.doTestReplicateAfterStartupWithNoActivity-seed#[7F7F594C1BECDEE9]) [    ] o.a.s.c.CorePropertiesLocator Found core collection1 in C:\Users\JenkinsSlave\workspace\Lucene-Solr-trunk-Windows\solr\build\solr-core\test\J0\temp\solr.handler.TestReplicationHandler_7F7F594C1BECDEE9-001\solr-instance-001\.\collection1
   [junit4]   2> 1688702 INFO  (TEST-TestReplicationHandler.doTestReplicateAfterStartupWithNoActivity-seed#[7F7F594C1BECDEE9]) [    ] o.a.s.c.CorePropertiesLocator Found 1 core definitions
   [junit4]   2> 1688703 INFO  (coreLoadExecutor-4401-thread-1) [    ] o.a.s.c.SolrResourceLoader new SolrResourceLoader for directory: 'C:\Users\JenkinsSlave\workspace\Lucene-Solr-trunk-Windows\solr\build\solr-core\test\J0\temp\solr.handler.TestReplicationHandler_7F7F594C1BECDEE9-001\solr-instance-001\collection1'
   [junit4]   2> 1688703 INFO  (TEST-TestReplicationHandler.doTestReplicateAfterStartupWithNoActivity-seed#[7F7F594C1BECDEE9]) [    ] o.a.s.s.SolrDispatchFilter user.dir=C:\Users\JenkinsSlave\workspace\Lucene-Solr-trunk-Windows\solr\build\solr-core\test\J0
   [junit4]   2> 1688705 INFO  (TEST-TestReplicationHandler.doTestReplicateAfterStartupWithNoActivity-seed#[7F7F594C1BECDEE9]) [    ] o.a.s.s.SolrDispatchFilter SolrDispatchFilter.init() done
   [junit4]   2> 1688705 INFO  (coreLoadExecutor-4401-thread-1) [    ] o.a.s.c.SolrResourceLoader JNDI not configured for solr (NoInitialContextEx)
   [junit4]   2> 1688705 INFO  (coreLoadExecutor-4401-thread-1) [    ] o.a.s.c.SolrResourceLoader solr home defaulted to 'solr/' (could not find system property or JNDI)
   [junit4]   2> 1688725 INFO  (coreLoadExecutor-4401-thread-1) [    ] o.a.s.c.SolrConfig current version of requestparams : -1
   [junit4]   2> 1688727 INFO  (coreLoadExecutor-4401-thread-1) [    ] o.a.s.c.SolrConfig Using Lucene MatchVersion: 6.0.0
   [junit4]   2> 1688730 INFO  (coreLoadExecutor-4401-thread-1) [    ] o.a.s.c.SolrConfig Loaded SolrConfig: solrconfig.xml
   [junit4]   2> 1688733 INFO  (coreLoadExecutor-4401-thread-1) [    ] o.a.s.s.IndexSchema [collection1] Schema name=test
   [junit4]   2> 1688737 INFO  (coreLoadExecutor-4401-thread-1) [    ] o.a.s.s.IndexSchema unique key field: id
   [junit4]   2> 1688741 INFO  (coreLoadExecutor-4401-thread-1) [    ] o.a.s.c.ConfigSetProperties Did not find ConfigSet properties, assuming default properties: Can't find resource 'configsetprops.json' in classpath or 'C:\Users\JenkinsSlave\workspace\Lucene-Solr-trunk-Windows\solr\build\solr-core\test\J0\temp\solr.handler.TestReplicationHandler_7F7F594C1BECDEE9-001\solr-instance-001\collection1'
   [junit4]   2> 1688742 INFO  (coreLoadExecutor-4401-thread-1) [    ] o.a.s.c.CoreContainer Creating SolrCore 'collection1' using configuration from instancedir C:\Users\JenkinsSlave\workspace\Lucene-Solr-trunk-Windows\solr\build\solr-core\test\J0\temp\solr.handler.TestReplicationHandler_7F7F594C1BECDEE9-001\solr-instance-001\.\collection1
   [junit4]   2> 1688742 INFO  (coreLoadExecutor-4401-thread-1) [    x:collection1] o.a.s.c.SolrCore org.apache.solr.core.MockDirectoryFactory
   [junit4]   2> 1688742 INFO  (coreLoadExecutor-4401-thread-1) [    x:collection1] o.a.s.c.SolrCore [[collection1] ] Opening new SolrCore at [C:\Users\JenkinsSlave\workspace\Lucene-Solr-trunk-Windows\solr\build\solr-core\test\J0\temp\solr.handler.TestReplicationHandler_7F7F594C1BECDEE9-001\solr-instance-001\collection1], dataDir=[C:\Users\JenkinsSlave\workspace\Lucene-Solr-trunk-Windows\solr\build\solr-core\test\J0\temp\solr.handler.TestReplicationHandler_7F7F594C1BECDEE9-001\solr-instance-001\.\collection1\data\]
   [junit4]   2> 1688742 INFO  (coreLoadExecutor-4401-thread-1) [    x:collection1] o.a.s.c.SolrCore JMX monitoring not detected for core: collection1
   [junit4]   2> 1688742 INFO  (coreLoadExecutor-4401-thread-1) [    x:collection1] o.a.s.c.CachingDirectoryFactory return new directory for C:\Users\JenkinsSlave\workspace\Lucene-Solr-trunk-Windows\solr\build\solr-core\test\J0\temp\solr.handler.TestReplicationHandler_7F7F594C1BECDEE9-001\solr-instance-001\.\collection1\data\
   [junit4]   2> 1688742 INFO  (coreLoadExecutor-4401-thread-1) [    x:collection1] o.a.s.c.SolrCore New index directory detected: old=null new=C:\Users\JenkinsSlave\workspace\Lucene-Solr-trunk-Windows\solr\build\solr-core\test\J0\temp\solr.handler.TestReplicationHandler_7F7F594C1BECDEE9-001\solr-instance-001\.\collection1\data\index/
   [junit4]   2> 1688742 WARN  (coreLoadExecutor-4401-thread-1) [    x:collection1] o.a.s.c.SolrCore [collection1] Solr index directory 'C:\Users\JenkinsSlave\workspace\Lucene-Solr-trunk-Windows\solr\build\solr-core\test\J0\temp\solr.handler.TestReplicationHandler_7F7F594C1BECDEE9-001\solr-instance-001\.\collection1\data\index' doesn't exist. Creating new index...
   [junit4]   2> 1688743 INFO  (coreLoadExecutor-4401-thread-1) [    x:collection1] o.a.s.c.CachingDirectoryFactory return new directory for C:\Users\JenkinsSlave\workspace\Lucene-Solr-trunk-Windows\solr\build\solr-core\test\J0\temp\solr.handler.TestReplicationHandler_7F7F594C1BECDEE9-001\solr-instance-001\.\collection1\data\index
   [junit4]   2> 1688743 INFO  (coreLoadExecutor-4401-thread-1) [    x:collection1] o.a.s.u.RandomMergePolicy RandomMergePolicy wrapping class org.apache.lucene.index.TieredMergePolicy: [TieredMergePolicy: maxMergeAtOnce=25, maxMergeAtOnceExplicit=34, maxMergedSegmentMB=84.453125, floorSegmentMB=1.7421875, forceMergeDeletesPctAllowed=11.57452043984938, segmentsPerTier=16.0, maxCFSSegmentSizeMB=8.796093022207999E12, noCFSRatio=0.5374165236502632
   [junit4]   2> 1688744 INFO  (coreLoadExecutor-4401-thread-1) [    x:collection1] o.a.s.c.SolrDeletionPolicy SolrDeletionPolicy.onCommit: commits: num=1
   [junit4]   2> 	commit{dir=MockDirectoryWrapper(NRTCachingDirectory(RAMDirectory@4826dddf lockFactory=org.apache.lucene.store.SingleInstanceLockFactory@1c81b050; maxCacheMB=0.75 maxMergeSizeMB=0.96484375)),segFN=segments_1,generation=1}
   [junit4]   2> 1688744 INFO  (coreLoadExecutor-4401-thread-1) [    x:collection1] o.a.s.c.SolrDeletionPolicy newest commit generation = 1
   [junit4]   2> 1688745 INFO  (OldIndexDirectoryCleanupThreadForCore-collection1) [    x:collection1] o.a.s.c.SolrCore Looking for old index directories to cleanup for core collection1 in C:\Users\JenkinsSlave\workspace\Lucene-Solr-trunk-Windows\solr\build\solr-core\test\J0\temp\solr.handler.TestReplicationHandler_7F7F594C1BECDEE9-001\solr-instance-001\.\collection1\data\
   [junit4]   2> 1688745 INFO  (coreLoadExecutor-4401-thread-1) [    x:collection1] o.a.s.c.SolrCore no updateRequestProcessorChain defined as default, creating implicit default
   [junit4]   2> 1688750 INFO  (coreLoadExecutor-4401-thread-1) [    x:collection1] o.a.s.h.l.XMLLoader xsltCacheLifetimeSeconds=60
   [junit4]   2> 1688751 INFO  (coreLoadExecutor-4401-thread-1) [    x:collection1] o.a.s.h.l.XMLLoader xsltCacheLifetimeSeconds=60
   [junit4]   2> 1688752 INFO  (coreLoadExecutor-4401-thread-1) [    x:collection1] o.a.s.h.l.XMLLoader xsltCacheLifetimeSeconds=60
   [junit4]   2> 1688752 INFO  (coreLoadExecutor-4401-thread-1) [    x:collection1] o.a.s.h.l.XMLLoader xsltCacheLifetimeSeconds=60
   [junit4]   2> 1688753 INFO  (coreLoadExecutor-4401-thread-1) [    x:collection1] o.a.s.c.PluginBag requestHandler : 'lazy' created with startup=lazy 
   [junit4]   2> 1688753 INFO  (coreLoadExecutor-4401-thread-1) [    x:collection1] o.a.s.c.RequestHandlers Registered paths: /admin/mbeans,standard,lazy,/update/json/docs,/admin/luke,/export,/get,/admin/properties,/update/json,/admin/threads,/update/csv,/sql,/admin/segments,/admin/system,/replication,defaults,/config,/stream,/schema,/admin/plugins,/admin/logging,/admin/ping,/update,/admin/file
   [junit4]   2> 1688754 INFO  (coreLoadExecutor-4401-thread-1) [    x:collection1] o.a.s.c.SolrCore Using default statsCache cache: org.apache.solr.search.stats.LocalStatsCache
   [junit4]   2> 1688754 INFO  (coreLoadExecutor-4401-thread-1) [    x:collection1] o.a.s.u.CommitTracker Hard AutoCommit: disabled
   [junit4]   2> 1688754 INFO  (coreLoadExecutor-4401-thread-1) [    x:collection1] o.a.s.u.CommitTracker Soft AutoCommit: disabled
   [junit4]   2> 1688754 INFO  (coreLoadExecutor-4401-thread-1) [    x:collection1] o.a.s.u.RandomMergePolicy RandomMergePolicy wrapping class org.apache.lucene.index.LogDocMergePolicy: [LogDocMergePolicy: minMergeSize=1000, mergeFactor=22, maxMergeSize=9223372036854775807, maxMergeSizeForForcedMerge=9223372036854775807, calibrateSizeByDeletes=true, maxMergeDocs=2147483647, maxCFSSegmentSizeMB=8.796093022207999E12, noCFSRatio=0.7248008133238881]
   [junit4]   2> 1688754 INFO  (coreLoadExecutor-4401-thread-1) [    x:collection1] o.a.s.c.SolrDeletionPolicy SolrDeletionPolicy.onInit: commits: num=1
   [junit4]   2> 	commit{dir=MockDirectoryWrapper(NRTCachingDirectory(RAMDirectory@4826dddf lockFactory=org.apache.lucene.store.SingleInstanceLockFactory@1c81b050; maxCacheMB=0.75 maxMergeSizeMB=0.96484375)),segFN=segments_1,generation=1}
   [junit4]   2> 1688755 INFO  (coreLoadExecutor-4401-thread-1) [    x:collection1] o.a.s.c.SolrDeletionPolicy newest commit generation = 1
   [junit4]   2> 1688755 INFO  (coreLoadExecutor-4401-thread-1) [    x:collection1] o.a.s.s.SolrIndexSearcher Opening [Searcher@741b6664[collection1] main]
   [junit4]   2> 1688755 INFO  (coreLoadExecutor-4401-thread-1) [    x:collection1] o.a.s.r.ManagedResourceStorage File-based storage initialized to use dir: C:\Users\JenkinsSlave\workspace\Lucene-Solr-trunk-Windows\solr\build\solr-core\test\J0\temp\solr.handler.TestReplicationHandler_7F7F594C1BECDEE9-001\solr-instance-001\collection1\conf
   [junit4]   2> 1688755 INFO  (coreLoadExecutor-4401-thread-1) [    x:collection1] o.a.s.r.RestManager Initializing RestManager with initArgs: {storageDir=C:\Users\JenkinsSlave\workspace\Lucene-Solr-trunk-Windows\solr\build\solr-core\test\J0\temp\solr.handler.TestReplicationHandler_7F7F594C1BECDEE9-001\solr-instance-001\collection1\conf}
   [junit4]   2> 1688755 INFO  (coreLoadExecutor-4401-thread-1) [    x:collection1] o.a.s.r.ManagedResourceStorage Reading _rest_managed.json using file:dir=C:\Users\JenkinsSlave\workspace\Lucene-Solr-trunk-Windows\solr\build\solr-core\test\J0\temp\solr.handler.TestReplicationHandler_7F7F594C1BECDEE9-001\solr-instance-001\collection1\conf
   [junit4]   2> 1688756 INFO  (coreLoadExecutor-4401-thread-1) [    x:collection1] o.a.s.r.RestManager Initializing 0 registered ManagedResources
   [junit4]   2> 1688756 INFO  (coreLoadExecutor-4401-thread-1) [    x:collection1] o.a.s.h.ReplicationHandler Replication enabled for following config files: schema.xml,xslt/dummy.xsl
   [junit4]   2> 1688756 INFO  (coreLoadExecutor-4401-thread-1) [    x:collection1] o.a.s.h.ReplicationHandler Commits will be reserved for  10000
   [junit4]   2> 1688756 INFO  (searcherExecutor-4402-thread-1-processing-x:collection1) [    x:collection1] o.a.s.c.SolrCore [collection1] Registered new searcher Searcher@741b6664[collection1] main{ExitableDirectoryReader(UninvertingDirectoryReader())}
   [junit4]   2> 1688756 INFO  (coreLoadExecutor-4401-thread-1) [    x:collection1] o.a.s.c.CoreContainer registering core: collection1
   [junit4]   2> 1689171 INFO  (TEST-TestReplicationHandler.doTestReplicateAfterStartupWithNoActivity-seed#[7F7F594C1BECDEE9]) [    ] o.a.s.SolrTestCaseJ4 Writing core.properties file to C:\Users\JenkinsSlave\workspace\Lucene-Solr-trunk-Windows\solr\build\solr-core\test\J0\temp\solr.handler.TestReplicationHandler_7F7F594C1BECDEE9-001\solr-instance-002\collection1
   [junit4]   2> 1689182 INFO  (TEST-TestReplicationHandler.doTestReplicateAfterStartupWithNoActivity-seed#[7F7F594C1BECDEE9]) [    ] o.e.j.s.Server jetty-9.3.6.v20151106
   [junit4]   2> 1689184 INFO  (TEST-TestReplicationHandler.doTestReplicateAfterStartupWithNoActivity-seed#[7F7F594C1BECDEE9]) [    ] o.e.j.s.h.ContextHandler Started o.e.j.s.ServletContextHandler@506e1856{/solr,null,AVAILABLE}
   [junit4]   2> 1689185 INFO  (TEST-TestReplicationHandler.doTestReplicateAfterStartupWithNoActivity-seed#[7F7F594C1BECDEE9]) [    ] o.e.j.s.ServerConnector Started ServerConnector@399c2982{HTTP/1.1,[http/1.1]}{127.0.0.1:61755}
   [junit4]   2> 1689186 INFO  (TEST-TestReplicationHandler.doTestReplicateAfterStartupWithNoActivity-seed#[7F7F594C1BECDEE9]) [    ] o.e.j.s.Server Started @1696007ms
   [junit4]   2> 1689186 INFO  (TEST-TestReplicationHandler.doTestReplicateAfterStartupWithNoActivity-seed#[7F7F594C1BECDEE9]) [    ] o.a.s.c.s.e.JettySolrRunner Jetty properties: {solr.data.dir=C:\Users\JenkinsSlave\workspace\Lucene-Solr-trunk-Windows\solr\build\solr-core\test\J0\temp\solr.handler.TestReplicationHandler_7F7F594C1BECDEE9-001\solr-instance-002\collection1\data, hostContext=/solr, hostPort=61755}
   [junit4]   2> 1689186 INFO  (TEST-TestReplicationHandler.doTestReplicateAfterStartupWithNoActivity-seed#[7F7F594C1BECDEE9]) [    ] o.a.s.s.SolrDispatchFilter SolrDispatchFilter.init(): sun.misc.Launcher$AppClassLoader@73d16e93
   [junit4]   2> 1689186 INFO  (TEST-TestReplicationHandler.doTestReplicateAfterStartupWithNoActivity-seed#[7F7F594C1BECDEE9]) [    ] o.a.s.c.SolrResourceLoader new SolrResourceLoader for directory: 'C:\Users\JenkinsSlave\workspace\Lucene-Solr-trunk-Windows\solr\build\solr-core\test\J0\temp\solr.handler.TestReplicationHandler_7F7F594C1BECDEE9-001\solr-instance-002'
   [junit4]   2> 1689187 INFO  (TEST-TestReplicationHandler.doTestReplicateAfterStartupWithNoActivity-seed#[7F7F594C1BECDEE9]) [    ] o.a.s.c.SolrResourceLoader JNDI not configured for solr (NoInitialContextEx)
   [junit4]   2> 1689187 INFO  (TEST-TestReplicationHandler.doTestReplicateAfterStartupWithNoActivity-seed#[7F7F594C1BECDEE9]) [    ] o.a.s.c.SolrResourceLoader solr home defaulted to 'solr/' (could not find system property or JNDI)
   [junit4]   2> 1689188 INFO  (TEST-TestReplicationHandler.doTestReplicateAfterStartupWithNoActivity-seed#[7F7F594C1BECDEE9]) [    ] o.a.s.c.SolrXmlConfig Loading container configuration from C:\Users\JenkinsSlave\workspace\Lucene-Solr-trunk-Windows\solr\build\solr-core\test\J0\temp\solr.handler.TestReplicationHandler_7F7F594C1BECDEE9-001\solr-instance-002\solr.xml
   [junit4]   2> 1689190 INFO  (TEST-TestReplicationHandler.doTestReplicateAfterStartupWithNoActivity-seed#[7F7F594C1BECDEE9]) [    ] o.a.s.c.CorePropertiesLocator Config-defined core root directory: C:\Users\JenkinsSlave\workspace\Lucene-Solr-trunk-Windows\solr\build\solr-core\test\J0\temp\solr.handler.TestReplicationHandler_7F7F594C1BECDEE9-001\solr-instance-002\.
   [junit4]   2> 1689190 INFO  (TEST-TestReplicationHandler.doTestReplicateAfterStartupWithNoActivity-seed#[7F7F594C1BECDEE9]) [    ] o.a.s.c.CoreContainer New CoreContainer 680703353
   [junit4]   2> 1689190 INFO  (TEST-TestReplicationHandler.doTestReplicateAfterStartupWithNoActivity-seed#[7F7F594C1BECDEE9]) [    ] o.a.s.c.CoreContainer Loading cores into CoreContainer [instanceDir=C:\Users\JenkinsSlave\workspace\Lucene-Solr-trunk-Windows\solr\build\solr-core\test\J0\temp\solr.handler.TestReplicationHandler_7F7F594C1BECDEE9-001\solr-instance-002]
   [junit4]   2> 1689191 WARN  (TEST-TestReplicationHandler.doTestReplicateAfterStartupWithNoActivity-seed#[7F7F594C1BECDEE9]) [    ] o.a.s.c.CoreContainer Couldn't add files from C:\Users\JenkinsSlave\workspace\Lucene-Solr-trunk-Windows\solr\build\solr-core\test\J0\temp\solr.handler.TestReplicationHandler_7F7F594C1BECDEE9-001\solr-instance-002\lib to classpath: C:\Users\JenkinsSlave\workspace\Lucene-Solr-trunk-Windows\solr\build\solr-core\test\J0\temp\solr.handler.TestReplicationHandler_7F7F594C1BECDEE9-001\solr-instance-002\lib
   [junit4]   2> 1689192 INFO  (TEST-TestReplicationHandler.doTestReplicateAfterStartupWithNoActivity-seed#[7F7F594C1BECDEE9]) [    ] o.a.s.h.c.HttpShardHandlerFactory created with socketTimeout : 90000,urlScheme : ,connTimeout : 15000,maxConnectionsPerHost : 20,maxConnections : 10000,corePoolSize : 0,maximumPoolSize : 2147483647,maxThreadIdleTime : 5,sizeOfQueue : -1,fairnessPolicy : false,useRetries : false,
   [junit4]   2> 1689193 INFO  (TEST-TestReplicationHandler.doTestReplicateAfterStartupWithNoActivity-seed#[7F7F594C1BECDEE9]) [    ] o.a.s.u.UpdateShardHandler Creating UpdateShardHandler HTTP client with params: socketTimeout=340000&connTimeout=45000&retry=true
   [junit4]   2> 1689193 INFO  (TEST-TestReplicationHandler.doTestReplicateAfterStartupWithNoActivity-seed#[7F7F594C1BECDEE9]) [    ] o.a.s.l.LogWatcher SLF4J impl is org.slf4j.impl.Log4jLoggerFactory
   [junit4]   2> 1689193 INFO  (TEST-TestReplicationHandler.doTestReplicateAfterStartupWithNoActivity-seed#[7F7F594C1BECDEE9]) [    ] o.a.s.l.LogWatcher Registering Log Listener [Log4j (org.slf4j.impl.Log4jLoggerFactory)]
   [junit4]   2> 1689194 INFO  (TEST-TestReplicationHandler.doTestReplicateAfterStartupWithNoActivity-seed#[7F7F594C1BECDEE9]) [    ] o.a.s.c.CoreContainer Security conf doesn't exist. Skipping setup for authorization module.
   [junit4]   2> 1689194 INFO  (TEST-TestReplicationHandler.doTestReplicateAfterStartupWithNoActivity-seed#[7F7F594C1BECDEE9]) [    ] o.a.s.c.CoreContainer No authentication plugin used.
   [junit4]   2> 1689194 INFO  (TEST-TestReplicationHandler.doTestReplicateAfterStartupWithNoActivity-seed#[7F7F594C1BECDEE9]) [    ] o.a.s.c.CorePropertiesLocator Looking for core definitions underneath C:\Users\JenkinsSlave\workspace\Lucene-Solr-trunk-Windows\solr\build\solr-core\test\J0\temp\solr.handler.TestReplicationHandler_7F7F594C1BECDEE9-001\solr-instance-002\.
   [junit4]   2> 1689197 INFO  (TEST-TestReplicationHandler.doTestReplicateAfterStartupWithNoActivity-seed#[7F7F594C1BECDEE9]) [    ] o.a.s.c.CoreDescriptor Created CoreDescriptor: {name=collection1, config=solrconfig.xml, loadOnStartup=true, schema=schema.xml, configSetProperties=configsetprops.json, transient=false, dataDir=data\}
   [junit4]   2> 1689197 INFO  (TEST-TestReplicationHandler.doTestReplicateAfterStartupWithNoActivity-seed#[7F7F594C1BECDEE9]) [    ] o.a.s.c.CorePropertiesLocator Found core collection1 in C:\Users\JenkinsSlave\workspace\Lucene-Solr-trunk-Windows\solr\build\solr-core\test\J0\temp\solr.handler.TestReplicationHandler_7F7F594C1BECDEE9-001\solr-instance-002\.\collection1
   [junit4]   2> 1689198 INFO  (TEST-TestReplicationHandler.doTestReplicateAfterStartupWithNoActivity-seed#[7F7F594C1BECDEE9]) [    ] o.a.s.c.CorePropertiesLocator Found 1 core definitions
   [junit4]   2> 1689198 INFO  (coreLoadExecutor-4411-thread-1) [    ] o.a.s.c.SolrResourceLoader new SolrResourceLoader for directory: 'C:\Users\JenkinsSlave\workspace\Lucene-Solr-trunk-Windows\solr\build\solr-core\test\J0\temp\solr.handler.TestReplicationHandler_7F7F594C1BECDEE9-001\solr-instance-002\collection1'
   [junit4]   2> 1689199 INFO  (TEST-TestReplicationHandler.doTestReplicateAfterStartupWithNoActivity-seed#[7F7F594C1BECDEE9]) [    ] o.a.s.s.SolrDispatchFilter user.dir=C:\Users\JenkinsSlave\workspace\Lucene-Solr-trunk-Windows\solr\build\solr-core\test\J0
   [junit4]   2> 1689199 INFO  (TEST-TestReplicationHandler.doTestReplicateAfterStartupWithNoActivity-seed#[7F7F594C1BECDEE9]) [    ] o.a.s.s.SolrDispatchFilter SolrDispatchFilter.init() done
   [junit4]   2> 1689199 INFO  (coreLoadExecutor-4411-thread-1) [    ] o.a.s.c.SolrResourceLoader JNDI not configured for solr (NoInitialContextEx)
   [junit4]   2> 1689199 INFO  (coreLoadExecutor-4411-thread-1) [    ] o.a.s.c.SolrResourceLoader solr home defaulted to 'solr/' (could not find system property or JNDI)
   [junit4]   2> 1689209 INFO  (coreLoadExecutor-4411-thread-1) [    ] o.a.s.c.SolrConfig current version of requestparams : -1
   [junit4]   2> 1689212 INFO  (coreLoadExecutor-4411-thread-1) [    ] o.a.s.c.SolrConfig Using Lucene MatchVersion: 6.0.0
   [junit4]   2> 1689218 INFO  (coreLoadExecutor-4411-thread-1) [    ] o.a.s.c.SolrConfig Loaded SolrConfig: solrconfig.xml
   [junit4]   2> 1689221 INFO  (coreLoadExecutor-4411-thread-1) [    ] o.a.s.s.IndexSchema [collection1] Schema name=test
   [junit4]   2> 1689224 INFO  (coreLoadExecutor-4411-thread-1) [    ] o.a.s.s.IndexSchema unique key field: id
   [junit4]   2> 1689227 INFO  (coreLoadExecutor-4411-thread-1) [    ] o.a.s.c.ConfigSetProperties Did not find ConfigSet properties, assuming default properties: Can't find resource 'configsetprops.json' in classpath or 'C:\Users\JenkinsSlave\workspace\Lucene-Solr-trunk-Windows\solr\build\solr-core\test\J0\temp\solr.handler.TestReplicationHandler_7F7F594C1BECDEE9-001\solr-instance-002\collection1'
   [junit4]   2> 1689227 INFO  (coreLoadExecutor-4411-thread-1) [    ] o.a.s.c.CoreContainer Creating SolrCore 'collection1' using configuration from instancedir C:\Users\JenkinsSlave\workspace\Lucene-Solr-trunk-Windows\solr\build\solr-core\test\J0\temp\solr.handler.TestReplicationHandler_7F7F594C1BECDEE9-001\solr-instance-002\.\collection1
   [junit4]   2> 1689227 INFO  (coreLoadExecutor-4411-thread-1) [    x:collection1] o.a.s.c.SolrCore org.apache.solr.core.MockDirectoryFactory
   [junit4]   2> 1689227 INFO  (coreLoadExecutor-4411-thread-1) [    x:collection1] o.a.s.c.SolrCore [[collection1] ] Opening new SolrCore at [C:\Users\JenkinsSlave\workspace\Lucene-Solr-trunk-Windows\solr\build\solr-core\test\J0\temp\solr.handler.TestReplicationHandler_7F7F594C1BECDEE9-001\solr-instance-002\collection1], dataDir=[C:\Users\JenkinsSlave\workspace\Lucene-Solr-trunk-Windows\solr\build\solr-core\test\J0\temp\solr.handler.TestReplicationHandler_7F7F594C1BECDEE9-001\solr-instance-002\.\collection1\data\]
   [junit4]   2> 1689227 INFO  (coreLoadExecutor-4411-thread-1) [    x:collection1] o.a.s.c.SolrCore JMX monitoring not detected for core: collection1
   [junit4]   2> 1689227 INFO  (coreLoadExecutor-4411-thread-1) [    x:collection1] o.a.s.c.CachingDirectoryFactory return new directory for C:\Users\JenkinsSlave\workspace\Lucene-Solr-trunk-Windows\solr\build\solr-core\test\J0\temp\solr.handler.TestReplicationHandler_7F7F594C1BECDEE9-001\solr-instance-002\.\collection1\data\
   [junit4]   2> 1689227 INFO  (coreLoadExecutor-4411-thread-1) [    x:collection1] o.a.s.c.SolrCore New index directory detected: old=null new=C:\Users\JenkinsSlave\workspace\Lucene-Solr-trunk-Windows\solr\build\solr-core\test\J0\temp\solr.handler.TestReplicationHandler_7F7F594C1BECDEE9-001\solr-instance-002\.\collection1\data\index/
   [junit4]   2> 1689227 WARN  (coreLoadExecutor-4411-thread-1) [    x:collection1] o.a.s.c.SolrCore [collection1] Solr index directory 'C:\Users\JenkinsSlave\workspace\Lucene-Solr-trunk-Windows\solr\build\solr-core\test\J0\temp\solr.handler.TestReplicationHandler_7F7F594C1BECDEE9-001\solr-instance-002\.\collection1\data\index' doesn't exist. Creating new index...
   [junit4]   2> 1689227 INFO  (coreLoadExecutor-4411-thread-1) [    x:collection1] o.a.s.c.CachingDirectoryFactory return new directory for C:\Users\JenkinsSlave\workspace\Lucene-Solr-trunk-Windows\solr\build\solr-core\test\J0\temp\solr.handler.TestReplicationHandler_7F7F594C1BECDEE9-001\solr-instance-002\.\collection1\data\index
   [junit4]   2> 1689227 INFO  (coreLoadExecutor-4411-thread-1) [    x:collection1] o.a.s.u.RandomMergePolicy RandomMergePolicy wrapping class org.apache.lucene.index.TieredMergePolicy: [TieredMergePolicy: maxMergeAtOnce=25, maxMergeAtOnceExplicit=34, maxMergedSegmentMB=84.453125, floorSegmentMB=1.7421875, forceMergeDeletesPctAllowed=11.57452043984938, segmentsPerTier=16.0, maxCFSSegmentSizeMB=8.796093022207999E12, noCFSRatio=0.5374165236502632
   [junit4]   2> 1689228 INFO  (coreLoadExecutor-4411-thread-1) [    x:collection1] o.a.s.c.SolrDeletionPolicy SolrDeletionPolicy.onCommit: commits: num=1
   [junit4]   2> 	commit{dir=MockDirectoryWrapper(NRTCachingDirectory(RAMDirectory@242d2184 lockFactory=org.apache.lucene.store.SingleInstanceLockFactory@529624cb; maxCacheMB=0.75 maxMergeSizeMB=0.96484375)),segFN=segments_1,generation=1}
   [junit4]   2> 1689228 INFO  (coreLoadExecutor-4411-thread-1) [    x:collection1] o.a.s.c.SolrDeletionPolicy newest commit generation = 1
   [junit4]   2> 1689229 INFO  (OldIndexDirectoryCleanupThreadForCore-collection1) [    x:collection1] o.a.s.c.SolrCore Looking for old index directories to cleanup for core collection1 in C:\Users\JenkinsSlave\workspace\Lucene-Solr-trunk-Windows\solr\build\solr-core\test\J0\temp\solr.handler.TestReplicationHandler_7F7F594C1BECDEE9-001\solr-instance-002\.\collection1\data\
   [junit4]   2> 1689230 INFO  (coreLoadExecutor-4411-thread-1) [    x:collection1] o.a.s.c.SolrCore no updateRequestProcessorChain defined as default, creating implicit default
   [junit4]   2> 1689232 INFO  (coreLoadExecutor-4411-thread-1) [    x:collection1] o.a.s.h.l.XMLLoader xsltCacheLifetimeSeconds=60
   [junit4]   2> 1689234 INFO  (coreLoadExecutor-4411-thread-1) [    x:collection1] o.a.s.h.l.XMLLoader xsltCacheLifetimeSeconds=60
   [junit4]   2> 1689235 INFO  (coreLoadExecutor-4411-thread-1) [    x:collection1] o.a.s.h.l.XMLLoader xsltCacheLifetimeSeconds=60
   [junit4]   2> 1689236 INFO  (coreLoadExecutor-4411-thread-1) [    x:collection1] o.a.s.h.l.XMLLoader xsltCacheLifetimeSeconds=60
   [junit4]   2> 1689237 INFO  (coreLoadExecutor-4411-thread-1) [    x:collection1] o.a.s.c.PluginBag requestHandler : 'lazy' created with startup=lazy 
   [junit4]   2> 1689237 INFO  (coreLoadExecutor-4411-thread-1) [    x:collection1] o.a.s.c.RequestHandlers Registered paths: /admin/mbeans,standard,lazy,/update/json/docs,/admin/luke,/export,/get,/admin/properties,/update/json,/admin/threads,/update/csv,/sql,/admin/segments,/admin/system,/replication,defaults,/config,/stream,/schema,/admin/plugins,/admin/logging,/admin/ping,/update,/admin/file
   [junit4]   2> 1689237 INFO  (coreLoadExecutor-4411-thread-1) [    x:collection1] o.a.s.c.SolrCore Using default statsCache cache: org.apache.solr.search.stats.LocalStatsCache
   [junit4]   2> 1689237 INFO  (coreLoadExecutor-4411-thread-1) [    x:collection1] o.a.s.u.CommitTracker Hard AutoCommit: disabled
   [junit4]   2> 1689237 INFO  (coreLoadExecutor-4411-thread-1) [    x:collection1] o.a.s.u.CommitTracker Soft AutoCommit: disabled
   [junit4]   2> 1689237 INFO  (coreLoadExecutor-4411-thread-1) [    x:collection1] o.a.s.u.RandomMergePolicy RandomMergePolicy wrapping class org.apache.lucene.index.LogDocMergePolicy: [LogDocMergePolicy: minMergeSize=1000, mergeFactor=22, maxMergeSize=9223372036854775807, maxMergeSizeForForcedMerge=9223372036854775807, calibrateSizeByDeletes=true, maxMergeDocs=2147483647, maxCFSSegmentSizeMB=8.796093022207999E12, noCFSRatio=0.7248008133238881]
   [junit4]   2> 1689238 INFO  (coreLoadExecutor-4411-thread-1) [    x:collection1] o.a.s.c.SolrDeletionPolicy SolrDeletionPolicy.onInit: commits: num=1
   [junit4]   2> 	commit{dir=MockDirectoryWrapper(NRTCachingDirectory(RAMDirectory@242d2184 lockFactory=org.apache.lucene.store.SingleInstanceLockFactory@529624cb; maxCacheMB=0.75 maxMergeSizeMB=0.96484375)),segFN=segments_1,generation=1}
   [junit4]   2> 1689238 INFO  (coreLoadExecutor-4411-thread-1) [    x:collection1] o.a.s.c.SolrDeletionPolicy newest commit generation = 1
   [junit4]   2> 1689238 INFO  (coreLoadExecutor-4411-thread-1) [    x:collection1] o.a.s.s.SolrIndexSearcher Opening [Searcher@57236abf[collection1] main]
   [junit4]   2> 1689238 INFO  (coreLoadExecutor-4411-thread-1) [    x:collection1] o.a.s.r.ManagedResourceStorage File-based storage initialized to use dir: C:\Users\JenkinsSlave\workspace\Lucene-Solr-trunk-Windows\solr\build\solr-core\test\J0\temp\solr.handler.TestReplicationHandler_7F7F594C1BECDEE9-001\solr-instance-002\collection1\conf
   [junit4]   2> 1689238 INFO  (coreLoadExecutor-4411-thread-1) [    x:collection1] o.a.s.r.RestManager Initializing RestManager with initArgs: {storageDir=C:\Users\JenkinsSlave\workspace\Lucene-Solr-trunk-Windows\solr\build\solr-core\test\J0\temp\solr.handler.TestReplicationHandler_7F7F594C1BECDEE9-001\solr-instance-002\collection1\conf}
   [junit4]   2> 1689238 INFO  (coreLoadExecutor-4411-thread-1) [    x:collection1] o.a.s.r.ManagedResourceStorage Reading _rest_managed.json using file:dir=C:\Users\JenkinsSlave\workspace\Lucene-Solr-trunk-Windows\solr\build\solr-core\test\J0\temp\solr.handler.TestReplicationHandler_7F7F594C1BECDEE9-001\solr-instance-002\collection1\conf
   [junit4]   2> 1689239 INFO  (coreLoadExecutor-4411-thread-1) [    x:collection1] o.a.s.r.RestManager Initializing 0 registered ManagedResources
   [junit4]   2> 1689245 INFO  (coreLoadExecutor-4411-thread-1) [    x:collection1] o.a.s.h.ReplicationHandler Poll scheduled at an interval of 1000ms
   [junit4]   2> 1689245 INFO  (searcherExecutor-4412-thread-1-processing-x:collection1) [    x:collection1] o.a.s.c.SolrCore [collection1] Registered new searcher Searcher@57236abf[collection1] main{ExitableDirectoryReader(UninvertingDirectoryReader())}
   [junit4]   2> 1689245 INFO  (coreLoadExecutor-4411-thread-1) [    x:collection1] o.a.s.c.CoreContainer registering core: collection1
   [junit4]   2> 1689664 INFO  (TEST-TestReplicationHandler.doTestReplicateAfterStartupWithNoActivity-seed#[7F7F594C1BECDEE9]) [    ] o.e.j.s.ServerConnector Stopped ServerConnector@399c2982{HTTP/1.1,[http/1.1]}{127.0.0.1:0}
   [junit4]   2> 1689664 INFO  (TEST-TestReplicationHandler.doTestReplicateAfterStartupWithNoActivity-seed#[7F7F594C1BECDEE9]) [    ] o.a.s.c.CoreContainer Shutting down CoreContainer instance=680703353
   [junit4]   2> 1689665 INFO  (coreCloseExecutor-4417-thread-1) [    x:collection1] o.a.s.c.SolrCore [collection1]  CLOSING SolrCore org.apache.solr.core.SolrCore@20f63750
   [junit4]   2> 1689666 INFO  (coreCloseExecutor-4417-thread-1) [    x:collection1] o.a.s.u.DirectUpdateHandler2 closing DirectUpdateHandler2{commits=0,autocommits=0,soft autocommits=0,optimizes=0,rollbacks=0,expungeDeletes=0,docsPending=0,adds=0,deletesById=0,deletesByQuery=0,errors=0,cumulative_adds=0,cumulative_deletesById=0,cumulative_deletesByQuery=0,cumulative_errors=0}
   [junit4]   2> 1689666 INFO  (coreCloseExecutor-4417-thread-1) [    x:collection1] o.a.s.u.SolrCoreState Closing SolrCoreState
   [junit4]   2> 1689666 INFO  (coreCloseExecutor-4417-thread-1) [    x:collection1] o.a.s.u.DefaultSolrCoreState SolrCoreState ref count has reached 0 - closing IndexWriter
   [junit4]   2> 1689666 INFO  (coreCloseExecutor-4417-thread-1) [    x:collection1] o.a.s.u.DefaultSolrCoreState closing IndexWriter with IndexWriterCloser
   [junit4]   2> 1689667 INFO  (coreCloseExecutor-4417-thread-1) [    x:collection1] o.a.s.c.SolrCore [collection1] Closing main searcher on request.
   [junit4]   2> 1689667 INFO  (coreCloseExecutor-4417-thread-1) [    x:collection1] o.a.s.c.CachingDirectoryFactory Closing MockDirectoryFactory - 2 directories currently being tracked
   [junit4]   2> 1689667 INFO  (coreCloseExecutor-4417-thread-1) [    x:collection1] o.a.s.c.CachingDirectoryFactory looking to close C:\Users\JenkinsSlave\workspace\Lucene-Solr-trunk-Windows\solr\build\solr-core\test\J0\temp\solr.handler.TestReplicationHandler_7F7F594C1BECDEE9-001\solr-instance-002\.\collection1\data\index [CachedDir<<refCount=0;path=C:\Users\JenkinsSlave\workspace\Lucene-Solr-trunk-Windows\solr\build\solr-core\test\J0\temp\solr.handler.TestReplicationHandler_7F7F594C1BECDEE9-001\solr-instance-002\.\collection1\data\index;done=false>>]
   [junit4]   2> 1689667 INFO  (coreCloseExecutor-4417-thread-1) [    x:collection1] o.a.s.c.CachingDirectoryFactory Closing directory: C:\Users\JenkinsSlave\workspace\Lucene-Solr-trunk-Windows\solr\build\solr-core\test\J0\temp\solr.handler.TestReplicationHandler_7F7F594C1BECDEE9-001\solr-instance-002\.\collection1\data\index
   [junit4]   2> 1689667 INFO  (coreCloseExecutor-4417-thread-1) [    x:collection1] o.a.s.c.CachingDirectoryFactory looking to close C:\Users\JenkinsSlave\workspace\Lucene-Solr-trunk-Windows\solr\build\solr-core\test\J0\temp\solr.handler.TestReplicationHandler_7F7F594C1BECDEE9-001\solr-instance-002\.\collection1\data\ [CachedDir<<refCount=0;path=C:\Users\JenkinsSlave\workspace\Lucene-Solr-trunk-Windows\solr\build\solr-core\test\J0\temp\solr.handler.TestReplicationHandler_7F7F594C1BECDEE9-001\solr-instance-002\.\collection1\data\;done=false>>]
   [junit4]   2> 1689667 INFO  (coreCloseExecutor-4417-thread-1) [    x:collection1] o.a.s.c.CachingDirectoryFactory Closing directory: C:\Users\JenkinsSlave\workspace\Lucene-Solr-trunk-Windows\solr\build\solr-core\test\J0\temp\solr.handler.TestReplicationHandler_7F7F594C1BECDEE9-001\solr-instance-002\.\collection1\data\
   [junit4]   2> 1689668 INFO  (TEST-TestReplicationHandler.doTestReplicateAfterStartupWithNoActivity-seed#[7F7F594C1BECDEE9]) [    ] o.e.j.s.h.ContextHandler Stopped o.e.j.s.ServletContextHandler@506e1856{/solr,null,UNAVAILABLE}
   [junit4]   2> 1689670 INFO  (qtp497314445-9044) [    x:collection1] o.a.s.u.DirectUpdateHandler2 [collection1] REMOVING ALL DOCUMENTS FROM INDEX
   [junit4]   2> 1689670 INFO  (qtp497314445-9044) [    x:collection1] o.a.s.u.p.LogUpdateProcessorFactory [collection1]  webapp=/solr path=/update params={wt=javabin&version=2}{deleteByQuery=*:*} 0 0
   [junit4]   2> 1689673 INFO  (qtp497314445-9045) [    x:collection1] o.a.s.u.DirectUpdateHandler2 start commit{,optimize=false,openSearcher=true,waitSearcher=true,expungeDeletes=false,softCommit=false,prepareCommit=false}
   [junit4]   2> 1689674 INFO  (qtp497314445-9045) [    x:collection1] o.a.s.c.SolrDeletionPolicy SolrDeletionPolicy.onCommit: commits: num=2
   [junit4]   2> 	commit{dir=MockDirectoryWrapper(NRTCachingDirectory(RAMDirectory@4826dddf lockFactory=org.apache.lucene.store.SingleInstanceLockFactory@1c81b050; maxCacheMB=0.75 maxMergeSizeMB=0.96484375)),segFN=segments_1,generation=1}
   [junit4]   2> 	commit{dir=MockDirectoryWrapper(NRTCachingDirectory(RAMDirectory@4826dddf lockFactory=org.apache.lucene.store.SingleInstanceLockFactory@1c81b050; maxCacheMB=0.75 maxMergeSizeMB=0.96484375)),segFN=segments_2,generation=2}
   [junit4]   2> 1689675 INFO  (qtp497314445-9045) [    x:collection1] o.a.s.c.SolrDeletionPolicy newest commit generation = 2
   [junit4]   2> 1689675 INFO  (qtp497314445-9045) [    x:collection1] o.a.s.s.SolrIndexSearcher Opening [Searcher@1993c353[collection1] main]
   [junit4]   2> 1689675 INFO  (qtp497314445-9045) [    x:collection1] o.a.s.u.DirectUpdateHandler2 end_commit_flush
   [junit4]   2> 1689675 INFO  (searcherExecutor-4402-thread-1-processing-x:collection1) [    x:collection1] o.a.s.c.SolrCore [collection1] Registered new searcher Searcher@1993c353[collection1] main{ExitableDirectoryReader(UninvertingDirectoryReader())}
   [junit4]   2> 1689676 INFO  (qtp497314445-9045) [    x:collection1] o.a.s.u.p.LogUpdateProcessorFactory [collection1]  webapp=/solr path=/update params={waitSearcher=true&commit=true&softCommit=false&wt=javabin&version=2}{commit=} 0 2
   [junit4]   2> 1689677 INFO  (TEST-TestReplicationHandler.doTestReplicateAfterStartupWithNoActivity-seed#[7F7F594C1BECDEE9]) [    ] o.e.j.s.ServerConnector Stopped ServerConnector@72f04bd3{HTTP/1.1,[http/1.1]}{127.0.0.1:0}
   [junit4]   2> 1689678 INFO  (TEST-TestReplicationHandler.doTestReplicateAfterStartupWithNoActivity-seed#[7F7F594C1BECDEE9]) [    ] o.a.s.c.CoreContainer Shutting down CoreContainer instance=1299814494
   [junit4]   2> 1689678 INFO  (coreCloseExecutor-4418-thread-1) [    x:collection1] o.a.s.c.SolrCore [collection1]  CLOSING SolrCore org.apache.solr.core.SolrCore@32544546
   [junit4]   2> 1689678 INFO  (coreCloseExecutor-4418-thread-1) [    x:collection1] o.a.s.u.DirectUpdateHandler2 closing DirectUpdateHandler2{commits=1,autocommits=0,soft autocommits=0,optimizes=0,rollbacks=0,expungeDeletes=0,docsPending=0,adds=0,deletesById=0,deletesByQuery=0,errors=0,cumulative_adds=0,cumulative_deletesById=0,cumulative_deletesByQuery=1,cumulative_errors=0}
   [junit4]   2> 1689678 INFO  (coreCloseExecutor-4418-thread-1) [    x:collection1] o.a.s.u.SolrCoreState Closing SolrCoreState
   [junit4]   2> 1689678 INFO  (coreCloseExecutor-4418-thread-1) [    x:collection1] o.a.s.u.DefaultSolrCoreState SolrCoreState ref count has reached 0 - closing IndexWriter
   [junit4]   2> 1689678 INFO  (coreCloseExecutor-4418-thread-1) [    x:collection1] o.a.s.u.DefaultSolrCoreState closing IndexWriter with IndexWriterCloser
   [junit4]   2> 1689678 INFO  (coreCloseExecutor-4418-thread-1) [    x:collection1] o.a.s.c.SolrCore [collection1] Closing main searcher on request.
   [junit4]   2> 1689678 INFO  (coreCloseExecutor-4418-thread-1) [    x:collection1] o.a.s.c.CachingDirectoryFactory Closing MockDirectoryFactory - 2 directories currently being tracked
   [junit4]   2> 1689678 INFO  (coreCloseExecutor-4418-thread-1) [    x:collection1] o.a.s.c.CachingDirectoryFactory looking to close C:\Users\JenkinsSlave\workspace\Lucene-Solr-trunk-Windows\solr\build\solr-core\test\J0\temp\solr.handler.TestReplicationHandler_7F7F594C1BECDEE9-001\solr-instance-001\.\collection1\data\index [CachedDir<<refCount=0;path=C:\Users\JenkinsSlave\workspace\Lucene-Solr-trunk-Windows\solr\build\solr-core\test\J0\temp\solr.handler.TestReplicationHandler_7F7F594C1BECDEE9-001\solr-instance-001\.\collection1\data\index;done=false>>]
   [junit4]   2> 1689678 INFO  (coreCloseExecutor-4418-thread-1) [    x:collection1] o.a.s.c.CachingDirectoryFactory Closing directory: C:\Users\JenkinsSlave\workspace\Lucene-Solr-trunk-Windows\solr\build\solr-core\test\J0\temp\solr.handler.TestReplicationHandler_7F7F594C1BECDEE9-001\solr-instance-001\.\collection1\data\index
   [junit4]   2> 1689678 INFO  (coreCloseExecutor-4418-thread-1) [    x:collection1] o.a.s.c.CachingDirectoryFactory looking to close C:\Users\JenkinsSlave\workspace\Lucene-Solr-trunk-Windows\solr\build\solr-core\test\J0\temp\solr.handler.TestReplicationHandler_7F7F594C1BECDEE9-001\solr-instance-001\.\collection1\data\ [CachedDir<<refCount=0;path=C:\Users\JenkinsSlave\workspace\Lucene-Solr-trunk-Windows\solr\build\solr-core\test\J0\temp\solr.handler.TestReplicationHandler_7F7F594C1BECDEE9-001\solr-instance-001\.\collection1\data\;done=false>>]
   [junit4]   2> 1689678 INFO  (coreCloseExecutor-4418-thread-1) [    x:collection1] o.a.s.c.CachingDirectoryFactory Closing directory: C:\Users\JenkinsSlave\workspace\Lucene-Solr-trunk-Windows\solr\build\solr-core\test\J0\temp\solr.handler.TestReplicationHandler_7F7F594C1BECDEE9-001\solr-instance-001\.\collection1\data\
   [junit4]   2> 1689680 INFO  (TEST-TestReplicationHandler.doTestReplicateAfterStartupWithNoActivity-seed#[7F7F594C1BECDEE9]) [    ] o.e.j.s.h.ContextHandler Stopped o.e.j.s.ServletContextHandler@57a50871{/solr,null,UNAVAILABLE}
   [junit4]   2> 1689682 INFO  (TEST-TestReplicationHandler.doTestReplicateAfterStartupWithNoActivity-seed#[7F7F594C1BECDEE9]) [    ] o.e.j.s.Server jetty-9.3.6.v20151106
   [junit4]   2> 1689683 INFO  (TEST-TestReplicationHandler.doTestReplicateAfterStartupWithNoActivity-seed#[7F7F594C1BECDEE9]) [    ] o.e.j.s.h.ContextHandler Started o.e.j.s.ServletContextHandler@245bf66b{/solr,null,AVAILABLE}
   [junit4]   2> 1689684 INFO  (TEST-TestReplicationHandler.doTestReplicateAfterStartupWithNoActivity-seed#[7F7F594C1BECDEE9]) [    ] o.e.j.s.ServerConnector Started ServerConnector@7f3267a7{HTTP/1.1,[http/1.1]}{127.0.0.1:61759}
   [junit4]   2> 1689684 INFO  (TEST-TestReplicationHandler.doTestReplicateAfterStartupWithNoActivity-seed#[7F7F594C1BECDEE9]) [    ] o.e.j.s.Server Started @1696544ms
   [junit4]   2> 1689685 INFO  (TEST-TestReplicationHandler.doTestReplicateAfterStartupWithNoActivity-seed#[7F7F594C1BECDEE9]) [    ] o.a.s.c.s.e.JettySolrRunner Jetty properties: {solr.data.dir=C:\Users\JenkinsSlave\workspace\Lucene-Solr-trunk-Windows\solr\build\solr-core\test\J0\temp\solr.handler.TestReplicationHandler_7F7F594C1BECDEE9-001\solr-instance-001\collection1\data, hostContext=/solr, hostPort=61759}
   [junit4]   2> 1689685 INFO  (TEST-TestReplicationHandler.doTestReplicateAfterStartupWithNoActivity-seed#[7F7F594C1BECDEE9]) [    ] o.a.s.s.SolrDispatchFilter SolrDispatchFilter.init(): sun.misc.Launcher$AppClassLoader@73d16e93
   [junit4]   2> 1689685 INFO  (TEST-TestReplicationHandler.doTestReplicateAfterStartupWithNoActivity-seed#[7F7F594C1BECDEE9]) [    ] o.a.s.c.SolrResourceLoader new SolrResourceLoader for directory: 'C:\Users\JenkinsSlave\workspace\Lucene-Solr-trunk-Windows\solr\build\solr-core\test\J0\temp\solr.handler.TestReplicationHandler_7F7F594C1BECDEE9-001\solr-instance-001'
   [junit4]   2> 1689685 INFO  (TEST-TestReplicationHandler.doTestReplicateAfterStartupWithNoActivity-seed#[7F7F594C1BECDEE9]) [    ] o.a.s.c.SolrResourceLoader JNDI not configured for solr (NoInitialContextEx)
   [junit4]   2> 1689685 INFO  (TEST-TestReplicationHandler.doTestReplicateAfterStartupWithNoActivity-seed#[7F7F594C1BECDEE9]) [    ] o.a.s.c.SolrResourceLoader solr home defaulted to 'solr/' (could not find system property or JNDI)
   [junit4]   2> 1689685 INFO  (TEST-TestReplicationHandler.doTestReplicateAfterStartupWithNoActivity-seed#[7F7F594C1BECDEE9]) [    ] o.a.s.c.SolrXmlConfig Loading container configuration from C:\Users\JenkinsSlave\workspace\Lucene-Solr-trunk-Windows\solr\build\solr-core\test\J0\temp\solr.handler.TestReplicationHandler_7F7F594C1BECDEE9-001\solr-instance-001\solr.xml
   [junit4]   2> 1689687 INFO  (TEST-TestReplicationHandler.doTestReplicateAfterStartupWithNoActivity-seed#[7F7F594C1BECDEE9]) [    ] o.a.s.c.CorePropertiesLocator Config-defined core root directory: C:\Users\JenkinsSlave\workspace\Lucene-Solr-trunk-Windows\solr\build\solr-core\test\J0\temp\solr.handler.TestReplicationHandler_7F7F594C1BECDEE9-001\solr-instance-001\.
   [junit4]   2> 1689688 INFO  (TEST-TestReplicationHandler.doTestReplicateAfterStartupWithNoActivity-seed#[7F7F594C1BECDEE9]) [    ] o.a.s.c.CoreContainer New CoreContainer 1087316174
   [junit4]   2> 1689688 INFO  (TEST-TestReplicationHandler.doTestReplicateAfterStartupWithNoActivity-seed#[7F7F594C1BECDEE9]) [    ] o.a.s.c.CoreContainer Loading cores into CoreContainer [instanceDir=C:\Users\JenkinsSlave\workspace\Lucene-Solr-trunk-Windows\solr\build\solr-core\test\J0\temp\solr.handler.TestReplicationHandler_7F7F594C1BECDEE9-001\solr-instance-001]
   [junit4]   2> 1689688 WARN  (TEST-TestReplicationHandler.doTestReplicateAfterStartupWithNoActivity-seed#[7F7F594C1BECDEE9]) [    ] o.a.s.c.CoreContainer Couldn't add files from C:\Users\JenkinsSlave\workspace\Lucene-Solr-trunk-Windows\solr\build\solr-core\test\J0\temp\solr.handler.TestReplicationHandler_7F7F594C1BECDEE9-001\solr-instance-001\lib to classpath: C:\Users\JenkinsSlave\workspace\Lucene-Solr-trunk-Windows\solr\build\solr-core\test\J0\temp\solr.handler.TestReplicationHandler_7F7F594C1BECDEE9-001\solr-instance-001\lib
   [junit4]   2> 1689688 INFO  (TEST-TestReplicationHandler.doTestReplicateAfterStartupWithNoActivity-seed#[7F7F594C1BECDEE9]) [    ] o.a.s.h.c.HttpShardHandlerFactory created with socketTimeout : 90000,urlScheme : ,connTimeout : 15000,maxConnectionsPerHost : 20,maxConnections : 10000,corePoolSize : 0,maximumPoolSize : 2147483647,maxThreadIdleTime : 5,sizeOfQueue : -1,fairnessPolicy : false,useRetries : false,
   [junit4]   2> 1689689 INFO  (TEST-TestReplicationHandler.doTestReplicateAfterStartupWithNoActivity-seed#[7F7F594C1BECDEE9]) [    ] o.a.s.u.UpdateShardHandler Creating UpdateShardHandler HTTP client with params: socketTimeout=340000&connTimeout=45000&retry=true
   [junit4]   2> 1689689 INFO  (TEST-TestReplicationHandler.doTestReplicateAfterStartupWithNoActivity-seed#[7F7F594C1BECDEE9]) [    ] o.a.s.l.LogWatcher SLF4J impl is org.slf4j.impl.Log4jLoggerFactory
   [junit4]   2> 1689690 INFO  (TEST-TestReplicationHandler.doTestReplicateAfterStartupWithNoActivity-seed#[7F7F594C1BECDEE9]) [    ] o.a.s.l.LogWatcher Registering Log Listener [Log4j (org.slf4j.impl.Log4jLoggerFactory)]
   [junit4]   2> 1689690 INFO  (TEST-TestReplicationHandler.doTestReplicateAfterStartupWithNoActivity-seed#[7F7F594C1BECDEE9]) [    ] o.a.s.c.CoreContainer Security conf doesn't exist. Skipping setup for authorization module.
   [junit4]   2> 1689690 INFO  (TEST-TestReplicationHandler.doTestReplicateAfterStartupWithNoActivity-seed#[7F7F594C1BECDEE9]) [    ] o.a.s.c.CoreContainer No authentication plugin used.
   [junit4]   2> 1689690 INFO  (TEST-TestReplicationHandler.doTestReplicateAfterStartupWithNoActivity-seed#[7F7F594C1BECDEE9]) [    ] o.a.s.c.CorePropertiesLocator Looking for core definitions underneath C:\Users\JenkinsSlave\workspace\Lucene-Solr-trunk-Windows\solr\build\solr-core\test\J0\temp\solr.handler.TestReplicationHandler_7F7F594C1BECDEE9-001\solr-instance-001\.
   [junit4]   2> 1689691 INFO  (TEST-TestReplicationHandler.doTestReplicateAfterStartupWithNoActivity-seed#[7F7F594C1BECDEE9]) [    ] o.a.s.c.CoreDescriptor Created CoreDescriptor: {name=collection1, config=solrconfig.xml, loadOnStartup=true, schema=schema.xml, configSetProperties=configsetprops.json, transient=false, dataDir=data\}
   [junit4]   2> 1689691 INFO  (TEST-TestReplicationHandler.doTestReplicateAfterStartupWithNoActivity-seed#[7F7F594C1BECDEE9]) [    ] o.a.s.c.CorePropertiesLocator Found core collection1 in C:\Users\JenkinsSlave\workspace\Lucene-Solr-trunk-Windows\solr\build\solr-core\test\J0\temp\solr.handler.TestReplicationHandler_7F7F594C1BECDEE9-001\solr-instance-001\.\collection1
   [junit4]   2> 1689691 INFO  (TEST-TestReplicationHandler.doTestReplicateAfterStartupWithNoActivity-seed#[7F7F594C1BECDEE9]) [    ] o.a.s.c.CorePropertiesLocator Found 1 core definitions
   [junit4]   2> 1689692 INFO  (coreLoadExecutor-4424-thread-1) [    ] o.a.s.c.SolrResourceLoader new SolrResourceLoader for directory: 'C:\Users\JenkinsSlave\workspace\Lucene-Solr-trunk-Windows\solr\build\solr-core\test\J0\temp\solr.handler.TestReplicationHandler_7F7F594C1BECDEE9-001\solr-instance-001\collection1'
   [junit4]   2> 1689692 INFO  (TEST-TestReplicationHandler.doTestReplicateAfterStartupWithNoActivity-seed#[7F7F594C1BECDEE9]) [    ] o.a.s.s.SolrDispatchFilter user.dir=C:\Users\JenkinsSlave\workspace\Lucene-Solr-trunk-Windows\solr\build\solr-core\test\J0
   [junit4]   2> 1689693 INFO  (TEST-TestReplicationHandler.doTestReplicateAfterStartupWithNoActivity-seed#[7F7F594C1BECDEE9]) [    ] o.a.s.s.SolrDispatchFilter SolrDispatchFilter.init() done
   [junit4]   2> 1689693 INFO  (coreLoadExecutor-4424-thread-1) [    ] o.a.s.c.SolrResourceLoader JNDI not configured for solr (NoInitialContextEx)
   [junit4]   2> 1689693 INFO  (coreLoadExecutor-4424-thread-1) [    ] o.a.s.c.SolrResourceLoader solr home defaulted to 'solr/' (could not find system property or JNDI)
   [junit4]   2> 1689697 INFO  (coreLoadExecutor-4424-thread-1) [    ] o.a.s.c.SolrConfig current version of requestparams : -1
   [junit4]   2> 1689698 INFO  (coreLoadExecutor-4424-thread-1) [    ] o.a.s.c.SolrConfig Using Lucene MatchVersion: 6.0.0
   [junit4]   2> 1689702 INFO  (coreLoadExecutor-4424-thread-1) [    ] o.a.s.c.SolrConfig Loaded SolrConfig: solrconfig.xml
   [junit4]   2> 1689705 INFO  (coreLoadExecutor-4424-thread-1) [    ] o.a.s.s.IndexSchema [collection1] Schema name=test
   [junit4]   2> 1689706 INFO  (coreLoadExecutor-4424-thread-1) [    ] o.a.s.s.IndexSchema unique key field: id
   [junit4]   2> 1689707 INFO  (coreLoadExecutor-4424-thread-1) [    ] o.a.s.c.ConfigSetProperties Did not find ConfigSet properties, assuming default properties: Can't find resource 'configsetprops.json' in classpath or 'C:\Users\JenkinsSlave\workspace\Lucene-Solr-trunk-Windows\solr\build\solr-core\test\J0\temp\solr.handler.TestReplicationHandler_7F7F594C1BECDEE9-001\solr-instance-001\collection1'
   [junit4]   2> 1689707 INFO  (coreLoadExecutor-4424-thread-1) [    ] o.a.s.c.CoreContainer Creating SolrCore 'collection1' using configuration from instancedir C:\Users\JenkinsSlave\workspace\Lucene-Solr-trunk-Windows\solr\build\solr-core\test\J0\temp\solr.handler.TestReplicationHandler_7F7F594C1BECDEE9-001\solr-instance-001\.\collection1
   [junit4]   2> 1689707 INFO  (coreLoadExecutor-4424-thread-1) [    x:collection1] o.a.s.c.SolrCore solr.NRTCachingDirectoryFactory
   [junit4]   2> 1689725 INFO  (coreLoadExecutor-4424-thread-1) [    x:collection1] o.a.s.c.SolrCore [[collection1] ] Opening new SolrCore at [C:\Users\JenkinsSlave\workspace\Lucene-Solr-trunk-Windows\solr\build\solr-core\test\J0\temp\solr.handler.TestReplicationHandler_7F7F594C1BECDEE9-001\solr-instance-001\collection1], dataDir=[C:\Users\JenkinsSlave\workspace\Lucene-Solr-trunk-Windows\solr\build\solr-core\test\J0\temp\solr.handler.TestReplicationHandler_7F7F594C1BECDEE9-001\solr-instance-001\.\collection1\data\]
   [junit4]   2> 1689725 INFO  (coreLoadExecutor-4424-thread-1) [    x:collection1] o.a.s.c.SolrCore JMX monitoring not detected for core: collection1
   [junit4]   2> 1689726 INFO  (coreLoadExecutor-4424-thread-1) [    x:collection1] o.a.s.c.CachingDirectoryFactory return new directory for C:\Users\JenkinsSlave\workspace\Lucene-Solr-trunk-Windows\solr\build\solr-core\test\J0\temp\solr.handler.TestReplicationHandler_7F7F594C1BECDEE9-001\solr-instance-001\collection1\data
   [junit4]   2> 1689726 INFO  (coreLoadExecutor-4424-thread-1) [    x:collection1] o.a.s.c.SolrCore New index directory detected: old=null new=C:\Users\JenkinsSlave\workspace\Lucene-Solr-trunk-Windows\solr\build\solr-core\test\J0\temp\solr.handler.TestReplicationHandler_7F7F594C1BECDEE9-001\solr-instance-001\.\collection1\data\index/
   [junit4]   2> 1689726 WARN  (coreLoadExecutor-4424-thread-1) [    x:collection1] o.a.s.c.SolrCore [collection1] Solr index directory 'C:\Users\JenkinsSlave\workspace\Lucene-Solr-trunk-Windows\solr\build\solr-core\test\J0\temp\solr.handler.TestReplicationHandler_7F7F594C1BECDEE9-001\solr-instance-001\.\collection1\data\index' doesn't exist. Creating new index...
   [junit4]   2> 1689727 INFO  (coreLoadExecutor-4424-thread-1) [    x:collection1] o.a.s.c.CachingDirectoryFactory return new directory for C:\Users\JenkinsSlave\workspace\Lucene-Solr-trunk-Windows\solr\build\solr-core\test\J0\temp\solr.handler.TestReplicationHandler_7F7F594C1BECDEE9-001\solr-instance-001\collection1\data\index
   [junit4]   2> 1689727 INFO  (coreLoadExecutor-4424-thread-1) [    x:collection1] o.a.s.u.RandomMergePolicy RandomMergePolicy wrapping class org.apache.lucene.index.TieredMergePolicy: [TieredMergePolicy: maxMergeAtOnce=3, maxMergeAtOnceExplicit=6, maxMergedSegmentMB=85.919921875, floorSegmentMB=1.291015625, forceMergeDeletesPctAllowed=21.59595964808713, segmentsPerTier=41.0, maxCFSSegmentSizeMB=8.796093022207999E12, noCFSRatio=0.29349574069489803
   [junit4]   2> 1689748 INFO  (coreLoadExecutor-4424-thread-1) [    x:collection1] o.a.s.c.SolrDeletionPolicy SolrDeletionPolicy.onCommit: commits: num=1
   [junit4]   2> 	commit{dir=NRTCachingDirectory(MMapDirectory@C:\Users\JenkinsSlave\workspace\Lucene-Solr-trunk-Windows\solr\build\solr-core\test\J0\temp\solr.handler.TestReplicationHandler_7F7F594C1BECDEE9-001\solr-instance-001\collection1\data\index lockFactory=org.apache.lucene.store.SingleInstanceLockFactory@7823b5e1; maxCacheMB=48.0 maxMergeSizeMB=4.0),segFN=segments_1,generation=1}
   [junit4]   2> 1689748 INFO  (coreLoadExecutor-4424-thread-1) [    x:collection1] o.a.s.c.SolrDeletionPolicy newest commit generation = 1
   [junit4]   2> 1689749 INFO  (OldIndexDirectoryCleanupThreadForCore-collection1) [    x:collection1] o.a.s.c.SolrCore Looking for old index directories to cleanup for core collection1 in C:\Users\JenkinsSlave\workspace\Lucene-Solr-trunk-Windows\solr\build\solr-core\test\J0\temp\solr.handler.TestReplicationHandler_7F7F594C1BECDEE9-001\solr-instance-001\.\collection1\data\
   [junit4]   2> 1689749 INFO  (coreLoadExecutor-4424-thread-1) [    x:collection1] o.a.s.c.SolrCore no updateRequestProcessorChain defined as default, creating implicit default
   [junit4]   2> 1689751 INFO  (coreLoadExecutor-4424-thread-1) [    x:collection1] o.a.s.h.l.XMLLoader xsltCacheLifetimeSeconds=60
   [junit4]   2> 1689751 INFO  (coreLoadExecutor-4424-thread-1) [    x:collection1] o.a.s.h.l.XMLLoader xsltCacheLifetimeSeconds=60
   [junit4]   2> 1689752 INFO  (coreLoadExecutor-4424-thread-1) [    x:collection1] o.a.s.h.l.XMLLoader xsltCacheLifetimeSeconds=60
   [junit4]   2> 1689753 INFO  (coreLoadExecutor-4424-thread-1) [    x:collection1] o.a.s.h.l.XMLLoader xsltCacheLifetimeSeconds=60
   [junit4]   2> 1689754 INFO  (coreLoadExecutor-4424-thread-1) [    x:collection1] o.a.s.c.PluginBag requestHandler : 'lazy' created with startup=lazy 
   [junit4]   2> 1689754 INFO  (coreLoadExecutor-4424-thread-1) [    x:collection1] o.a.s.c.RequestHandlers Registered paths: /admin/mbeans,standard,lazy,/update/json/docs,/admin/luke,/export,/get,/admin/properties,/update/json,/admin/threads,/update/csv,/sql,/admin/segments,/admin/system,/replication,defaults,/config,/stream,/schema,/admin/plugins,/admin/logging,/admin/ping,/update,/admin/file
   [junit4]   2> 1689754 INFO  (coreLoadExecutor-4424-thread-1) [    x:collection1] o.a.s.c.SolrCore Using default statsCache cache: org.apache.solr.search.stats.LocalStatsCache
   [junit4]   2> 1689754 INFO  (coreLoadExecutor-4424-thread-1) [    x:collection1] o.a.s.u.CommitTracker Hard AutoCommit: disabled
   [junit4]   2> 1689754 INFO  (coreLoadExecutor-4424-thread-1) [    x:collection1] o.a.s.u.CommitTracker Soft AutoCommit: disabled
   [junit4]   2> 1689754 INFO  (coreLoadExecutor-4424-thread-1) [    x:collection1] o.a.s.u.RandomMergePolicy RandomMergePolicy wrapping class org.apache.lucene.index.AlcoholicMergePolicy: [AlcoholicMergePolicy: minMergeSize=0, mergeFactor=10, maxMergeSize=1313371672, maxMergeSizeForForcedMerge=9223372036854775807, calibrateSizeByDeletes=true, maxMergeDocs=2147483647, maxCFSSegmentSizeMB=8.796093022207999E12, noCFSRatio=0.1]
   [junit4]   2> 1689754 INFO  (coreLoadExecutor-4424-thread-1) [    x:collection1] o.a.s.c.SolrDeletionPolicy SolrDeletionPolicy.onInit: commits: num=1
   [junit4]   2> 	commit{dir=NRTCachingDirectory(MMapDirectory@C:\Users\JenkinsSlave\workspace\Lucene-Solr-trunk-Windows\solr\build\solr-core\test\J0\temp\solr.handler.TestReplicationHandler_7F7F594C1BECDEE9-001\solr-instance-001\collection1\data\index lockFactory=org.apache.lucene.store.SingleInstanceLockFactory@7823b5e1; maxCacheMB=48.0 maxMergeSizeMB=4.0),segFN=segments_1,generation=1}
   [junit4]   2> 1689755 INFO  (coreLoadExecutor-4424-thread-1) [    x:collection1] o.a.s.c.SolrDeletionPolicy newest commit generation = 1
   [junit4]   2> 1689755 INFO  (coreLoadExecutor-4424-thread-1) [    x:collection1] o.a.s.s.SolrIndexSearcher Opening [Searcher@357e5fc9[collection1] main]
   [junit4]   2> 1689755 INFO  (coreLoadExecutor-4424-thread-1) [    x:collection1] o.a.s.r.ManagedResourceStorage File-based storage initialized to use dir: C:\Users\JenkinsSlave\workspace\Lucene-Solr-trunk-Windows\solr\build\solr-core\test\J0\temp\solr.handler.TestReplicationHandler_7F7F594C1BECDEE9-001\solr-instance-001\collection1\conf
   [junit4]   2> 1689755 INFO  (coreLoadExecutor-4424-thread-1) [    x:collection1] o.a.s.r.RestManager Initializing RestManager with initArgs: {storageDir=C:\Users\JenkinsSlave\workspace\Lucene-Solr-trunk-Windows\solr\build\solr-core\test\J0\temp\solr.handler.TestReplicationHandler_7F7F594C1BECDEE9-001\solr-instance-001\collection1\conf}
   [junit4]   2> 1689755 INFO  (coreLoadExecutor-4424-thread-1) [    x:collection1] o.a.s.r.ManagedResourceStorage Reading _rest_managed.json using file:dir=C:\Users\JenkinsSlave\workspace\Lucene-Solr-trunk-Windows\solr\build\solr-core\test\J0\temp\solr.handler.TestReplicationHandler_7F7F594C1BECDEE9-001\solr-instance-001\collection1\conf
   [junit4]   2> 1689755 INFO  (coreLoadExecutor-4424-thread-1) [    x:collection1] o.a.s.r.RestManager Initializing 0 registered ManagedResources
   [junit4]   2> 1689755 INFO  (coreLoadExecutor-4424-thread-1) [    x:collection1] o.a.s.h.ReplicationHandler Replication enabled for following config files: schema.xml
   [junit4]   2> 1689756 INFO  (coreLoadExecutor-4424-thread-1) [    x:collection1] o.a.s.h.ReplicationHandler Commits will be reserved for  10000
   [junit4]   2> 1689756 INFO  (searcherExecutor-4425-thread-1-processing-x:collection1) [    x:collection1] o.a.s.c.SolrCore [collection1] Registered new searcher Searcher@357e5fc9[collection1] main{ExitableDirectoryReader(UninvertingDirectoryReader())}
   [junit4]   2> 1689756 INFO  (coreLoadExecutor-4424-thread-1) [    x:collection1] o.a.s.c.CoreContainer registering core: collection1
   [junit4]   2> 1690162 INFO  (qtp929986213-9088) [    x:collection1] o.a.s.u.p.LogUpdateProcessorFactory [collection1]  webapp=/solr path=/update params={wt=javabin&version=2}{add=[0]} 0 1
   [junit4]   2> 1690164 INFO  (qtp929986213-9087) [    x:collection1] o.a.s.u.p.LogUpdateProcessorFactory [collection1]  webapp=/solr path=/update params={wt=javabin&version=2}{add=[1]} 0 0
   [junit4]   2> 1690166 INFO  (qtp929986213-9089) [    x:collection1] o.a.s.u.p.LogUpdateProcessorFactory [collection1]  webapp=/solr path=/update params={wt=javabin&version=2}{add=[2]} 0 0
   [junit4]   2> 1690167 INFO  (qtp929986213-9086) [    x:collection1] o.a.s.u.p.LogUpdateProcessorFactory [collection1]  webapp=/solr path=/update params={wt=javabin&version=2}{add=[3]} 0 0
   [junit4]   2> 1690169 INFO  (qtp929986213-9090) [    x:collection1] o.a.s.u.p.LogUpdateProcessorFactory [collection1]  webapp=/solr path=/update params={wt=javabin&version=2}{add=[4]} 0 0
   [junit4]   2> 1690171 INFO  (qtp929986213-9091) [    x:collection1] o.a.s.u.p.LogUpdateProcessorFactory [collection1]  webapp=/solr path=/update params={wt=javabin&version=2}{add=[5]} 0 0
   [junit4]   2> 1690173 INFO  (qtp929986213-9084) [    x:collection1] o.a.s.u.p.LogUpdateProcessorFactory [collection1]  webapp=/solr path=/update params={wt=javabin&version=2}{add=[6]} 0 0
   [junit4]   2> 1690175 INFO  (qtp929986213-9088) [    x:collection1] o.a.s.u.p.LogUpdateProcessorFactory [collection1]  webapp=/solr path=/update params={wt=javabin&version=2}{add=[7]} 0 0
   [junit4]   2> 1690176 INFO  (qtp929986213-9087) [    x:collection1] o.a.s.u.p.LogUpdateProcessorFactory [collection1]  webapp=/solr path=/update params={wt=javabin&version=2}{add=[8]} 0 0
   [junit4]   2> 1690178 INFO  (qtp929986213-9089) [    x:collection1] o.a.s.u.p.LogUpdateProcessorFactory [collection1]  webapp=/solr path=/update params={wt=javabin&version=2}{add=[9]} 0 0
   [junit4]   2> 1690180 INFO  (qtp929986213-9086) [    x:collection1] o.a.s.u.p.LogUpdateProcessorFactory [collection1]  webapp=/solr path=/update params={wt=javabin&version=2}{add=[10]} 0 0
   [junit4]   2> 1690182 INFO  (qtp929986213-9090) [    x:collection1] o.a.s.u.p.LogUpdateProcessorFactory [collection1]  webapp=/solr path=/update params={wt=javabin&version=2}{add=[11]} 0 0
   [junit4]   2> 1690184 INFO  (qtp929986213-9091) [    x:collection1] o.a.s.u.p.LogUpdateProcessorFactory [collection1]  webapp=/solr path=/update params={wt=javabin&version=2}{add=[12]} 0 0
   [junit4]   2> 1690186 INFO  (qtp929986213-9084) [    x:collection1] o.a.s.u.p.LogUpdateProcessorFactory [collection1]  webapp=/solr path=/update params={wt=javabin&version=2}{add=[13]} 0 0
   [junit4]   2> 1690188 INFO  (qtp929986213-9088) [    x:collection1] o.a.s.u.p.LogUpdateProcessorFactory [collection1]  webapp=/solr path=/update params={wt=javabin&version=2}{add=[14]} 0 0
   [junit4]   2> 1690190 INFO  (qtp929986213-9087) [    x:collection1] o.a.s.u.p.LogUpdateProcessorFactory [collection1]  webapp=/solr path=/update params={wt=javabin&version=2}{add=[15]} 0 0
   [junit4]   2> 1690192 INFO  (qtp929986213-9089) [    x:collection1] o.a.s.u.p.LogUpdateProcessorFactory [collection1]  webapp=/solr path=/update params={wt=javabin&version=2}{add=[16]} 0 0
   [junit4]   2> 1690194 INFO  (qtp929986213-9086) [    x:collection1] o.a.s.u.p.LogUpdateProcessorFactory [collection1]  webapp=/solr path=/update params={wt=javabin&version=2}{add=[17]} 0 0
   [junit4]   2> 1690195 INFO  (qtp929986213-9090) [    x:collection1] o.a.s.u.p.LogUpdateProcessorFactory [collection1]  webapp=/solr path=/update params={wt=javabin&version=2}{add=[18]} 0 0
   [junit4]   2> 1690197 INFO  (qtp929986213-9091) [    x:collection1] o.a.s.u.p.LogUpdateProcessorFactory [collection1]  webapp=/solr path=/update params={wt=javabin&version=2}{add=[19]} 0 0
   [junit4]   2> 1690199 INFO  (qtp929986213-9084) [    x:collection1] o.a.s.u.p.LogUpdateProcessorFactory [collection1]  webapp=/solr path=/update params={wt=javabin&version=2}{add=[20]} 0 0
   [junit4]   2> 1690201 INFO  (qtp929986213-9088) [    x:collection1] o.a.s.u.p.LogUpdateProcessorFactory [collection1]  webapp=/solr path=/update params={wt=javabin&version=2}{add=[21]} 0 0
   [junit4]   2> 1690203 INFO  (qtp929986213-9087) [    x:collection1] o.a.s.u.p.LogUpdateProcessorFactory [collection1]  webapp=/solr path=/update params={wt=javabin&version=2}{add=[22]} 0 0
   [junit4]   2> 1690205 INFO  (qtp929986213-9089) [    x:collection1] o.a.s.u.p.LogUpdateProcessorFactory [collection1]  webapp=/solr path=/update params={wt=javabin&version=2}{add=[23]} 0 0
   [junit4]   2> 1690206 INFO  (qtp929986213-9086) [    x:collection1] o.a.s.u.p.LogUpdateProcessorFactory [collection1]  webapp=/solr path=/update params={wt=javabin&version=2}{add=[24]} 0 0
   [junit4]   2> 1690208 INFO  (qtp929986213-9090) [    x:collection1] o.a.s.u.p.LogUpdateProcessorFactory [collection1]  webapp=/solr path=/update params={wt=javabin&version=2}{add=[25]} 0 0
   [junit4]   2> 1690210 INFO  (qtp929986213-9091) [    x:collection1] o.a.s.u.p.LogUpdateProcessorFactory [collection1]  webapp=/solr path=/update params={wt=javabin&version=2}{add=[26]} 0 0
   [junit4]   2> 1690212 INFO  (qtp929986213-9084) [    x:collection1] o.a.s.u.p.LogUpdateProcessorFactory [collection1]  webapp=/solr path=/update params={wt=javabin&version=2}{add=[27]} 0 0
   [junit4]   2> 1690214 INFO  (qtp929986213-9088) [    x:collection1] o.a.s.u.p.LogUpdateProcessorFactory [collection1]  webapp=/solr path=/update params={wt=javabin&version=2}{add=[28]} 0 0
   [junit4]   2> 1690215 INFO  (qtp929986213-9087) [    x:collection1] o.a.s.u.p.LogUpdateProcessorFactory [collection1]  webapp=/solr path=/update params={wt=javabin&version=2}{add=[29]} 0 0
   [junit4]   2> 1690217 INFO  (qtp929986213-9089) [    x:collection1] o.a.s.u.p.LogUpdateProcessorFactory [collection1]  webapp=/solr path=/update params={wt=javabin&version=2}{add=[30]} 0 0
   [junit4]   2> 1690219 INFO  (qtp929986213-9086) [    x:collection1] o.a.s.u.p.LogUpdateProcessorFactory [collection1]  webapp=/solr path=/update params={wt=javabin&version=2}{add=[31]} 0 0
   [junit4]   2> 1690221 INFO  (qtp929986213-9090) [    x:collection1] o.a.s.u.p.LogUpdateProcessorFactory [collection1]  webapp=/solr path=/update params={wt=javabin&version=2}{add=[32]} 0 0
   [junit4]   2> 1690223 INFO  (qtp929986213-9091) [    x:collection1] o.a.s.u.p.LogUpdateProcessorFactory [collection1]  webapp=/solr path=/update params={wt=javabin&version=2}{add=[33]} 0 0
   [junit4]   2> 1690225 INFO  (qtp929986213-9084) [    x:collection1] o.a.s.u.p.LogUpdateProcessorFactory [collection1]  webapp=/solr path=/update params={wt=javabin&version=2}{add=[34]} 0 0
   [junit4]   2> 1690227 INFO  (qtp929986213-9088) [    x:collection1] o.a.s.u.p.LogUpdateProcessorFactory [collection1]  webapp=/solr path=/update params={wt=javabin&version=2}{add=[35]} 0 0
   [junit4]   2> 1690229 INFO  (qtp929986213-9087) [    x:collection1] o.a.s.u.p.LogUpdateProcessorFactory [collection1]  webapp=/solr path=/update params={wt=javabin&version=2}{add=[36]} 0 0
   [junit4]   2> 1690231 INFO  (qtp929986213-9089) [    x:collection1] o.a.s.u.p.LogUpdateProcessorFactory [collection1]  webapp=/solr path=/update params={wt=javabin&version=2}{add=[37]} 0 0
   [junit4]   2> 1690233 INFO  (qtp929986213-9086) [    x:collection1] o.a.s.u.p.LogUpdateProcessorFactory [collection1]  webapp=/solr path=/update params={wt=javabin&version=2}{add=[38]} 0 0
   [junit4]   2> 1690234 INFO  (qtp929986213-9090) [    x:collection1] o.a.s.u.p.LogUpdateProcessorFactory [collection1]  webapp=/solr path=/update params={wt=javabin&version=2}{add=[39]} 0 0
   [junit4]   2> 1690236 INFO  (qtp929986213-9091) [    x:collection1] o.a.s.u.p.LogUpdateProcessorFactory [collection1]  webapp=/solr path=/update params={wt=javabin&version=2}{add=[40]} 0 0
   [junit4]   2> 1690368 INFO  (qtp929986213-9084) [    x:collection1] o.a.s.u.p.LogUpdateProcessorFactory [collection1]  webapp=/solr path=/update params={wt=javabin&version=2}{add=[41]} 0 0
   [junit4]   2> 1690370 INFO  (qtp929986213-9088) [    x:collection1] o.a.s.u.p.LogUpdateProcessorFactory [collection1]  webapp=/solr path=/update params={wt=javabin&version=2}{add=[42]} 0 0
   [junit4]   2> 1690372 INFO  (qtp929986213-9087) [    x:collection1] o.a.s.u.p.LogUpdateProcessorFactory [collection1]  webapp=/solr path=/update params={wt=javabin&version=2}{add=[43]} 0 0
   [junit4]   2> 1690374 INFO  (qtp929986213-9089) [    x:collection1] o.a.s.u.p.LogUpdateProcessorFactory [collection1]  webapp=/solr path=/update params={wt=javabin&version=2}{add=[44]} 0 0
   [junit4]   2> 1690376 INFO  (qtp929986213-9086) [    x:collection1] o.a.s.u.p.LogUpdateProcessorFactory [collection1]  webapp=/solr path=/update params={wt=javabin&version=2}{add=[45]} 0 0
   [junit4]   2> 1690378 INFO  (qtp929986213-9090) [    x:collection1] o.a.s.u.p.LogUpdateProcessorFactory [collection1]  webapp=/solr path=/update params={wt=javabin&version=2}{add=[46]} 0 0
   [junit4]   2> 1690380 INFO  (qtp929986213-9091) [    x:collection1] o.a.s.u.p.LogUpdateProcessorFactory [collection1]  webapp=/solr path=/update params={wt=javabin&version=2}{add=[47]} 0 0
   [junit4]   2> 1690382 INFO  (qtp929986213-9084) [    x:collection1] o.a.s.u.p.LogUpdateProcessorFactory [collection1]  webapp=/solr path=/update params={wt=javabin&version=2}{add=[48]} 0 0
   [junit4]   2> 1690384 INFO  (qtp929986213-9088) [    x:collection1] o.a.s.u.p.LogUpdateProcessorFactory [collection1]  webapp=/solr path=/update params={wt=javabin&version=2}{add=[49]} 0 0
   [junit4]   2> 1690386 INFO  (qtp929986213-9087) [    x:collection1] o.a.s.u.p.LogUpdateProcessorFactory [collection1]  webapp=/solr path=/update params={wt=javabin&version=2}{add=[50]} 0 0
   [junit4]   2> 1690387 INFO  (qtp929986213-9089) [    x:collection1] o.a.s.u.p.LogUpdateProcessorFactory [collection1]  webapp=/solr path=/update params={wt=javabin&version=2}{add=[51]} 0 0
   [junit4]   2> 1690389 INFO  (qtp929986213-9086) [    x:collection1] o.a.s.u.p.LogUpdateProcessorFactory [collection1]  webapp=/solr path=/update params={wt=javabin&version=2}{add=[52]} 0 0
   [junit4]   2> 1690391 INFO  (qtp929986213-9090) [    x:collection1] o.a.s.u.p.LogUpdateProcessorFactory [collection1]  webapp=/solr path=/update params={wt=javabin&version=2}{add=[53]} 0 0
   [junit4]   2> 1690393 INFO  (qtp929986213-9091) [    x:collection1] o.a.s.u.p.LogUpdateProcessorFactory [collection1]  webapp=/solr path=/update params={wt=javabin&version=2}{add=[54]} 0 0
   [junit4]   2> 1690395 INFO  (qtp929986213-9084) [    x:collection1] o.a.s.u.p.LogUpdateProcessorFactory [collection1]  webapp=/solr path=/update params={wt=javabin&version=2}{add=[55]} 0 0
   [junit4]   2> 1690397 INFO  (qtp929986213-9088) [    x:collection1] o.a.s.u.p.LogUpdateProcessorFactory [collection1]  webapp=/solr path=/update params={wt=javabin&version=2}{add=[56]} 0 0
   [junit4]   2> 1690399 INFO  (qtp929986213-9087) [    x:collection1] o.a.s.u.p.LogUpdateProcessorFactory [collection1]  webapp=/solr path=/update params={wt=javabin&version=2}{add=[57]} 0 0
   [junit4]   2> 1690401 INFO  (qtp929986213-9089) [    x:collection1] o.a.s.u.p.LogUpdateProcessorFactory [collection1]  webapp=/solr path=/update params={wt=javabin&version=2}{add=[58]} 0 0
   [junit4]   2> 1690403 INFO  (qtp929986213-9086) [    x:collection1] o.a.s.u.p.LogUpdateProcessorFactory [collection1]  webapp=/solr path=/update params={wt=javabin&version=2}{add=[59]} 0 0
   [junit4]   2> 1690405 INFO  (qtp929986213-9090) [    x:collection1] o.a.s.u.p.LogUpdateProcessorFactory [collection1]  webapp=/solr path=/update params={wt=javabin&version=2}{add=[60]} 0 0
   [junit4]   2> 1690406 INFO  (qtp929986213-9091) [    x:collection1] o.a.s.u.p.LogUpdateProcessorFactory [collection1]  webapp=/solr path=/update params={wt=javabin&version=2}{add=[61]} 0 0
   [junit4]   2> 1690408 INFO  (qtp929986213-9084) [    x:collection1] o.a.s.u.p.LogUpdateProcessorFactory [collection1]  webapp=/solr path=/update params={wt=javabin&version=2}{add=[62]} 0 0
   [junit4]   2> 1690410 INFO  (qtp929986213-9088) [    x:collection1] o.a.s.u.p.LogUpdateProcessorFactory [collection1]  webapp=/solr path=/update params={wt=javabin&version=2}{add=[63]} 0 0
   [junit4]   2> 1690412 INFO  (qtp929986213-9087) [    x:collection1] o.a.s.u.p.LogUpdateProcessorFactory [collection1]  webapp=/solr path=/update params={wt=javabin&version=2}{add=[64]} 0 0
   [junit4]   2> 1690414 INFO  (qtp929986213-9089) [    x:collection1] o.a.s.u.p.LogUpdateProcessorFactory [collection1]  webapp=/solr path=/update params={wt=javabin&version=2}{add=[65]} 0 0
   [junit4]   2> 1690416 INFO  (qtp929986213-9086) [    x:collection1] o.a.s.u.p.LogUpdateProcessorFactory [collection1]  webapp=/solr path=/update params={wt=javabin&version=2}{add=[66]} 0 0
   [junit4]   2> 1690417 INFO  (qtp929986213-9090) [    x:collection1] o.a.s.u.p.LogUpdateProcessorFactory [collection1]  webapp=/solr path=/update params={wt=javabin&version=2}{add=[67]} 0 0
   [junit4]   2> 1690419 INFO  (qtp929986213-9091) [    x:collection1] o.a.s.u.p.LogUpdateProcessorFactory [collection1]  webapp=/solr path=/update params={wt=javabin&version=2}{add=[68]} 0 0
   [junit4]   2> 1690421 INFO  (qtp929986213-9084) [    x:collection1] o.a.s.u.p.LogUpdateProcessorFactory [collection1]  webapp=/solr path=/update params={wt=javabin&version=2}{add=[69]} 0 0
   [junit4]   2> 1690423 INFO  (qtp929986213-9088) [    x:collection1] o.a.s.u.p.LogUpdateProcessorFactory [collection1]  webapp=/solr path=/update params={wt=javabin&version=2}{add=[70]} 0 0
   [junit4]   2> 1690425 INFO  (qtp929986213-9087) [    x:collection1] o.a.s.u.p.LogUpdateProcessorFactory [collection1]  webapp=/solr path=/update params={wt=javabin&version=2}{add=[71]} 0 0
   [junit4]   2> 1690426 INFO  (qtp929986213-9089) [    x:collection1] o.a.s.u.p.LogUpdateProcessorFactory [collection1]  webapp=/solr path=/update params={wt=javabin&version=2}{add=[72]} 0 0
   [junit4]   2> 1690428 INFO  (qtp929986213-9086) [    x:collection1] o.a.s.u.p.LogUpdateProcessorFactory [collection1]  webapp=/solr path=/update params={wt=javabin&version=2}{add=[73]} 0 0
   [junit4]   2> 1690430 INFO  (qtp929986213-9090) [    x:collection1] o.a.s.u.p.LogUpdateProcessorFactory [collection1]  webapp=/solr path=/update params={wt=javabin&version=2}{add=[74]} 0 0
   [junit4]   2> 1690432 INFO  (qtp929986213-9091) [    x:collection1] o.a.s.u.p.LogUpdateProcessorFactory [collection1]  webapp=/solr path=/update params={wt=javabin&version=2}{add=[75]} 0 0
   [junit4]   2> 1690434 INFO  (qtp929986213-9084) [    x:collection1] o.a.s.u.p.LogUpdateProcessorFactory [collection1]  webapp=/solr path=/update params={wt=javabin&version=2}{add=[76]} 0 0
   [junit4]   2> 1690435 INFO  (qtp929986213-9088) [    x:collection1] o.a.s.u.p.LogUpdateProcessorFactory [collection1]  webapp=/solr path=/update params={wt=javabin&version=2}{add=[77]} 0 0
   [junit4]   2> 1690437 INFO  (qtp929986213-9087) [    x:collection1] o.a.s.u.p.LogUpdateProcessorFactory [collection1]  webapp=/solr path=/update params={wt=javabin&version=2}{add=[78]} 0 0
   [junit4]   2> 1690439 INFO  (qtp929986213-9089) [    x:collection1] o.a.s.u.p.LogUpdateProcessorFactory [collection1]  webapp=/solr path=/update params={wt=javabin&version=2}{add=[79]} 0 0
   [junit4]   2> 1690441 INFO  (qtp929986213-9086) [    x:collection1] o.a.s.u.p.LogUpdateProcessorFactory [collection1]  webapp=/solr path=/update params={wt=javabin&version=2}{add=[80]} 0 0
   [junit4]   2> 1690443 INFO  (qtp929986213-9090) [    x:collection1] o.a.s.u.p.LogUpdateProcessorFactory [collection1]  webapp=/solr path=/update params={wt=javabin&version=2}{add=[81]} 0 0
   [junit4]   2> 1690444 INFO  (qtp929986213-9091) [    x:collection1] o.a.s.u.p.LogUpdateProcessorFactory [collection1]  webapp=/solr path=/update params={wt=javabin&version=2}{add=[82]} 0 0
   [junit4]   2> 1690446 INFO  (qtp929986213-9084) [    x:collection1] o.a.s.u.p.LogUpdateProcessorFactory [collection1]  webapp=/solr path=/update params={wt=javabin&version=2}{add=[83]} 0 0
   [junit4]   2> 1690448 INFO  (qtp929986213-9088) [    x:collection1] o.a.s.u.p.LogUpdateProcessorFactory [collection1]  webapp=/solr path=/update params={wt=javabin&version=2}{add=[84]} 0 0
   [junit4]   2> 1690450 INFO  (qtp929986213-9087) [    x:collection1] o.a.s.u.p.LogUpdateProcessorFactory [collection1]  webapp=/solr path=/update params={wt=javabin&version=2}{add=[85]} 0 0
   [junit4]   2> 1690452 INFO  (qtp929986213-9089) [    x:collection1] o.a.s.u.p.LogUpdateProcessorFactory [collection1]  webapp=/solr path=/update params={wt=javabin&version=2}{add=[86]} 0 0
   [junit4]   2> 1690454 INFO  (qtp929986213-9086) [    x:collection1] o.a.s.u.p.LogUpdateProcessorFactory [collection1]  webapp=/solr path=/update params={wt=javabin&version=2}{add=[87]} 0 0
   [junit4]   2> 1690455 INFO  (qtp929986213-9090) [    x:collection1] o.a.s.u.p.LogUpdateProcessorFactory [collection1]  webapp=/solr path=/update params={wt=javabin&version=2}{add=[88]} 0 0
   [junit4]   2> 1690457 INFO  (qtp929986213-9091) [    x:collection1] o.a.s.u.p.LogUpdateProcessorFactory [collection1]  webapp=/solr path=/update params={wt=javabin&version=2}{add=[89]} 0 0
   [junit4]   2> 1690459 INFO  (qtp929986213-9084) [    x:collection1] o.a.s.u.p.LogUpdateProcessorFactory [collection1]  webapp=/solr path=/update params={wt=javabin&version=2}{add=[90]} 0 0
   [junit4]   2> 1690461 INFO  (qtp929986213-9088) [    x:collection1] o.a.s.u.p.LogUpdateProcessorFactory [collection1]  webapp=/solr path=/update params={wt=javabin&version=2}{add=[91]} 0 0
   [junit4]   2> 1690463 INFO  (qtp929986213-9087) [    x:collection1] o.a.s.u.p.LogUpdateProcessorFactory [collection1]  webapp=/solr path=/update params={wt=javabin&version=2}{add=[92]} 0 0
   [junit4]   2> 1690464 INFO  (qtp929986213-9089) [    x:collection1] o.a.s.u.p.LogUpdateProcessorFactory [collection1]  webapp=/solr path=/update params={wt=javabin&version=2}{add=[93]} 0 0
   [junit4]   2> 1690466 INFO  (qtp929986213-9086) [    x:collection1] o.a.s.u.p.LogUpdateProcessorFactory [collection1]  webapp=/solr path=/update params={wt=javabin&version=2}{add=[94]} 0 0
   [junit4]   2> 1690468 INFO  (qtp929986213-9090) [    x:collection1] o.a.s.u.p.LogUpdateProcessorFactory [collection1]  webapp=/solr path=/update params={wt=javabin&version=2}{add=[95]} 0 0
   [junit4]   2> 1690470 INFO  (qtp929986213-9090) [    x:collection1] o.a.s.u.p.LogUpdateProcessorFactory [collection1]  webapp=/solr path=/update params={wt=javabin&version=2}{add=[96]} 0 0
   [junit4]   2> 1690472 INFO  (qtp929986213-9084) [    x:collection1] o.a.s.u.p.LogUpdateProcessorFactory [collection1]  webapp=/solr path=/update params={wt=javabin&version=2}{add=[97]} 0 0
   [junit4]   2> 1690474 INFO  (qtp929986213-9088) [    x:collection1] o.a.s.u.p.LogUpdateProcessorFactory [collection1]  webapp=/solr path=/update params={wt=javabin&version=2}{add=[98]} 0 0
   [junit4]   2> 1690476 INFO  (qtp929986213-9087) [    x:collection1] o.a.s.u.p.LogUpdateProcessorFactory [collection1]  webapp=/solr path=/update params={wt=javabin&version=2}{add=[99]} 0 0
   [junit4]   2> 1690478 INFO  (qtp929986213-9089) [    x:collection1] o.a.s.u.p.LogUpdateProcessorFactory [collection1]  webapp=/solr path=/update params={wt=javabin&version=2}{add=[100]} 0 0
   [junit4]   2> 1690480 INFO  (qtp929986213-9086) [    x:collection1] o.a.s.u.p.LogUpdateProcessorFactory [collection1]  webapp=/solr path=/update params={wt=javabin&version=2}{add=[101]} 0 0
   [junit4]   2> 1690482 INFO  (qtp929986213-9091) [    x:collection1] o.a.s.u.p.LogUpdateProcessorFactory [collection1]  webapp=/solr path=/update params={wt=javabin&version=2}{add=[102]} 0 0
   [junit4]   2> 1690483 INFO  (qtp929986213-9091) [    x:collection1] o.a.s.u.p.LogUpdateProcessorFactory [collection1]  webapp=/solr path=/update params={wt=javabin&version=2}{add=[103]} 0 0
   [junit4]   2> 1690485 INFO  (qtp929986213-9084) [    x:collection1] o.a.s.u.p.LogUpdateProcessorFactory [collection1]  webapp=/solr path=/update params={wt=javabin&version=2}{add=[104]} 0 0
   [junit4]   2> 1690487 INFO  (qtp929986213-9088) [    x:collection1] o.a.s.u.p.LogUpdateProcessorFactory [collection1]  webapp=/solr path=/update params={wt=javabin&version=2}{add=[105]} 0 0
   [junit4]   2> 1690489 INFO  (qtp929986213-9087) [    x:collection1] o.a.s.u.p.LogUpdateProcessorFactory [collection1]  webapp=/solr path=/update params={wt=javabin&version=2}{add=[106]} 0 0
   [junit4]   2> 1690491 INFO  (qtp929986213-9089) [    x:collection1] o.a.s.u.p.LogUpdateProcessorFactory [collection1]  webapp=/solr path=/update params={wt=javabin&version=2}{add=[107]} 0 0
   [junit4]   2> 1690493 INFO  (qtp929986213-9086) [    x:collection1] o.a.s.u.p.LogUpdateProcessorFactory [collection1]  webapp=/solr path=/update params={wt=javabin&version=2}{add=[108]} 0 0
   [junit4]   2> 1690495 INFO  (qtp929986213-9090) [    x:collection1] o.a.s.u.p.LogUpdateProcessorFactory [collection1]  webapp=/solr path=/update params={wt=javabin&version=2}{add=[109]} 0 0
   [junit4]   2> 1690497 INFO  (qtp929986213-9090) [    x:collection1] o.a.s.u.p.LogUpdateProcessorFactory [collection1]  webapp=/solr path=/update params={wt=javabin&version=2}{add=[110]} 0 0
   [junit4]   2> 1690499 INFO  (qtp929986213-9090) [    x:collection1] o.a.s.u.p.LogUpdateProcessorFacto

[...truncated too long message...]

O  (coreCloseExecutor-4975-thread-1) [    x:collection1] o.a.s.c.CachingDirectoryFactory Closing directory: C:\Users\JenkinsSlave\workspace\Lucene-Solr-trunk-Windows\solr\build\solr-core\test\J0\temp\solr.handler.TestReplicationHandler_7F7F594C1BECDEE9-001\solr-instance-027\.\collection1\data\index
   [junit4]   2> 1791125 INFO  (TEST-TestReplicationHandler.doTestStopPoll-seed#[7F7F594C1BECDEE9]) [    ] o.e.j.s.h.ContextHandler Stopped o.e.j.s.ServletContextHandler@1a0fa3f8{/solr,null,UNAVAILABLE}
   [junit4]   2> 1791127 INFO  (TEST-TestReplicationHandler.doTestStopPoll-seed#[7F7F594C1BECDEE9]) [    ] o.e.j.s.ServerConnector Stopped ServerConnector@3df4f1e9{HTTP/1.1,[http/1.1]}{127.0.0.1:0}
   [junit4]   2> 1791127 INFO  (TEST-TestReplicationHandler.doTestStopPoll-seed#[7F7F594C1BECDEE9]) [    ] o.a.s.c.CoreContainer Shutting down CoreContainer instance=1260208553
   [junit4]   2> 1791130 INFO  (coreCloseExecutor-4976-thread-1) [    x:collection1] o.a.s.c.SolrCore [collection1]  CLOSING SolrCore org.apache.solr.core.SolrCore@51f8f518
   [junit4]   2> 1791130 INFO  (coreCloseExecutor-4976-thread-1) [    x:collection1] o.a.s.u.DirectUpdateHandler2 closing DirectUpdateHandler2{commits=0,autocommits=0,soft autocommits=0,optimizes=0,rollbacks=0,expungeDeletes=0,docsPending=0,adds=0,deletesById=0,deletesByQuery=0,errors=0,cumulative_adds=0,cumulative_deletesById=0,cumulative_deletesByQuery=0,cumulative_errors=0}
   [junit4]   2> 1791130 INFO  (coreCloseExecutor-4976-thread-1) [    x:collection1] o.a.s.u.SolrCoreState Closing SolrCoreState
   [junit4]   2> 1791130 INFO  (coreCloseExecutor-4976-thread-1) [    x:collection1] o.a.s.u.DefaultSolrCoreState SolrCoreState ref count has reached 0 - closing IndexWriter
   [junit4]   2> 1791130 INFO  (coreCloseExecutor-4976-thread-1) [    x:collection1] o.a.s.u.DefaultSolrCoreState closing IndexWriter with IndexWriterCloser
   [junit4]   2> 1791131 INFO  (coreCloseExecutor-4976-thread-1) [    x:collection1] o.a.s.c.SolrCore [collection1] Closing main searcher on request.
   [junit4]   2> 1791136 INFO  (coreCloseExecutor-4976-thread-1) [    x:collection1] o.a.s.c.CachingDirectoryFactory Closing MockDirectoryFactory - 2 directories currently being tracked
   [junit4]   2> 1791136 INFO  (coreCloseExecutor-4976-thread-1) [    x:collection1] o.a.s.c.CachingDirectoryFactory looking to close C:\Users\JenkinsSlave\workspace\Lucene-Solr-trunk-Windows\solr\build\solr-core\test\J0\temp\solr.handler.TestReplicationHandler_7F7F594C1BECDEE9-001\solr-instance-028\.\collection1\data\ [CachedDir<<refCount=0;path=C:\Users\JenkinsSlave\workspace\Lucene-Solr-trunk-Windows\solr\build\solr-core\test\J0\temp\solr.handler.TestReplicationHandler_7F7F594C1BECDEE9-001\solr-instance-028\.\collection1\data\;done=false>>]
   [junit4]   2> 1791137 INFO  (coreCloseExecutor-4976-thread-1) [    x:collection1] o.a.s.c.CachingDirectoryFactory Closing directory: C:\Users\JenkinsSlave\workspace\Lucene-Solr-trunk-Windows\solr\build\solr-core\test\J0\temp\solr.handler.TestReplicationHandler_7F7F594C1BECDEE9-001\solr-instance-028\.\collection1\data\
   [junit4]   2> 1791137 INFO  (coreCloseExecutor-4976-thread-1) [    x:collection1] o.a.s.c.CachingDirectoryFactory looking to close C:\Users\JenkinsSlave\workspace\Lucene-Solr-trunk-Windows\solr\build\solr-core\test\J0\temp\solr.handler.TestReplicationHandler_7F7F594C1BECDEE9-001\solr-instance-028\.\collection1\data\index.20160222102954334 [CachedDir<<refCount=0;path=C:\Users\JenkinsSlave\workspace\Lucene-Solr-trunk-Windows\solr\build\solr-core\test\J0\temp\solr.handler.TestReplicationHandler_7F7F594C1BECDEE9-001\solr-instance-028\.\collection1\data\index.20160222102954334;done=false>>]
   [junit4]   2> 1791137 INFO  (coreCloseExecutor-4976-thread-1) [    x:collection1] o.a.s.c.CachingDirectoryFactory Closing directory: C:\Users\JenkinsSlave\workspace\Lucene-Solr-trunk-Windows\solr\build\solr-core\test\J0\temp\solr.handler.TestReplicationHandler_7F7F594C1BECDEE9-001\solr-instance-028\.\collection1\data\index.20160222102954334
   [junit4]   2> 1791138 INFO  (TEST-TestReplicationHandler.doTestStopPoll-seed#[7F7F594C1BECDEE9]) [    ] o.e.j.s.h.ContextHandler Stopped o.e.j.s.ServletContextHandler@1dd72a2e{/solr,null,UNAVAILABLE}
   [junit4]   2> 1791139 INFO  (SUITE-TestReplicationHandler-seed#[7F7F594C1BECDEE9]-worker) [    ] o.a.s.SolrTestCaseJ4 ###deleteCore
   [junit4]   2> NOTE: leaving temporary files on disk at: C:\Users\JenkinsSlave\workspace\Lucene-Solr-trunk-Windows\solr\build\solr-core\test\J0\temp\solr.handler.TestReplicationHandler_7F7F594C1BECDEE9-001
   [junit4]   2> NOTE: test params are: codec=Asserting(Lucene60): {name=PostingsFormat(name=MockRandom), id=PostingsFormat(name=MockRandom), newname=PostingsFormat(name=MockRandom)}, docValues:{}, sim=RandomSimilarity(queryNorm=false,coord=yes): {}, locale=en-GB, timezone=Etc/GMT0
   [junit4]   2> NOTE: Windows 7 6.1 amd64/Oracle Corporation 1.8.0_72 (64-bit)/cpus=3,threads=1,free=277818912,total=536870912
   [junit4]   2> NOTE: All tests run in this JVM: [SpatialFilterTest, TestLRUCache, MBeansHandlerTest, TestUpdate, PrimitiveFieldTypeTest, TestSolrQueryResponse, TestMissingGroups, ActionThrottleTest, SolrTestCaseJ4Test, SharedFSAutoReplicaFailoverTest, TestUniqueKeyFieldResource, TestScoreJoinQPNoScore, TestSearchPerf, TestSchemaResource, TestClassNameShortening, TestStressReorder, AnalysisAfterCoreReloadTest, TestSort, DocValuesTest, TestAnalyzeInfixSuggestions, IndexBasedSpellCheckerTest, TestCloudManagedSchema, ReturnFieldsTest, TestExactStatsCache, ScriptEngineTest, TestIBSimilarityFactory, DistribJoinFromCollectionTest, TestSolrConfigHandler, HdfsThreadLeakTest, TestCustomSort, SecurityConfHandlerTest, DistributedQueryElevationComponentTest, UnloadDistributedZkTest, SystemInfoHandlerTest, TestSolr4Spatial2, TestSortByMinMaxFunction, SimpleMLTQParserTest, PeerSyncTest, TestGroupingSearch, TestCryptoKeys, TestUseDocValuesAsStored, TestStressLucene, XsltUpdateRequestHandlerTest, DeleteLastCustomShardedReplicaTest, URLClassifyProcessorTest, TestConfigSetImmutable, DistributedVersionInfoTest, DistributedQueryComponentOptimizationTest, TestEmbeddedSolrServerConstructors, TestDefaultSearchFieldResource, TestMergePolicyConfig, OutOfBoxZkACLAndCredentialsProvidersTest, TestReplicationHandlerBackup, TestLuceneMatchVersion, AlternateDirectoryTest, TermsComponentTest, TestXIncludeConfig, DistributedFacetPivotSmallAdvancedTest, TestRawResponseWriter, TestSweetSpotSimilarityFactory, TestDocBasedVersionConstraints, TestCollapseQParserPlugin, JSONWriterTest, DirectSolrSpellCheckerTest, ChangedSchemaMergeTest, HdfsChaosMonkeyNothingIsSafeTest, TestJmxMonitoredMap, LeaderInitiatedRecoveryOnCommitTest, TestChildDocTransformer, TestCursorMarkWithoutUniqueKey, DistributedFacetPivotWhiteBoxTest, ZkCLITest, TestAddFieldRealTimeGet, SolrCoreTest, TestFaceting, TestCollectionAPI, TestSolrQueryParserDefaultOperatorResource, HdfsBasicDistributedZk2Test, ZkControllerTest, SolrRequestParserTest, JsonLoaderTest, TestRandomDVFaceting, CdcrUpdateLogTest, TestDistributedSearch, RecoveryAfterSoftCommitTest, SchemaVersionSpecificBehaviorTest, TestDFISimilarityFactory, BigEndianAscendingWordDeserializerTest, TestRandomCollapseQParserPlugin, FullHLLTest, TestPseudoReturnFields, CdcrReplicationDistributedZkTest, TimeZoneUtilsTest, ChaosMonkeyNothingIsSafeTest, TestWordDelimiterFilterFactory, XmlUpdateRequestHandlerTest, TestBlobHandler, SolrIndexConfigTest, PolyFieldTest, TestOverriddenPrefixQueryForCustomFieldType, QueryElevationComponentTest, TestDocSet, TestLFUCache, SampleTest, TestSolrCLIRunExample, DistributedFacetPivotLargeTest, TestSolrXml, ClusterStateTest, TestPostingsSolrHighlighter, DistribCursorPagingTest, CursorMarkTest, StressHdfsTest, TestSolrDeletionPolicy1, CoreAdminCreateDiscoverTest, HdfsDirectoryTest, TestAuthorizationFramework, RequiredFieldsTest, TestDownShardTolerantSearch, TestLazyCores, JavabinLoaderTest, TestFileDictionaryLookup, TestTolerantSearch, SimpleCollectionCreateDeleteTest, PathHierarchyTokenizerFactoryTest, TestDFRSimilarityFactory, BlockJoinFacetDistribTest, TestJsonRequest, TestFastLRUCache, TestRestoreCore, TestDistributedStatsComponentCardinality, TestInitParams, LeaderElectionTest, TestFieldResource, TestSimpleQParserPlugin, TestPivotHelperCode, ExternalFileFieldSortTest, IndexSchemaTest, SolrXmlInZkTest, TriLevelCompositeIdRoutingTest, SimpleFacetsTest, ClusterStateUpdateTest, ChaosMonkeySafeLeaderTest, CollectionsAPIDistributedZkTest, RecoveryZkTest, TestReplicationHandler]
   [junit4] Completed [301/579 (1!)] on J0 in 102.52s, 13 tests, 1 failure <<< FAILURES!

[...truncated 892 lines...]
BUILD FAILED
C:\Users\JenkinsSlave\workspace\Lucene-Solr-trunk-Windows\build.xml:740: The following error occurred while executing this line:
C:\Users\JenkinsSlave\workspace\Lucene-Solr-trunk-Windows\build.xml:684: The following error occurred while executing this line:
C:\Users\JenkinsSlave\workspace\Lucene-Solr-trunk-Windows\build.xml:59: The following error occurred while executing this line:
C:\Users\JenkinsSlave\workspace\Lucene-Solr-trunk-Windows\solr\build.xml:233: The following error occurred while executing this line:
C:\Users\JenkinsSlave\workspace\Lucene-Solr-trunk-Windows\solr\common-build.xml:524: The following error occurred while executing this line:
C:\Users\JenkinsSlave\workspace\Lucene-Solr-trunk-Windows\lucene\common-build.xml:1457: The following error occurred while executing this line:
C:\Users\JenkinsSlave\workspace\Lucene-Solr-trunk-Windows\lucene\common-build.xml:1014: There were test failures: 579 suites (8 ignored), 2331 tests, 1 failure, 127 ignored (82 assumptions) [seed: 7F7F594C1BECDEE9]

Total time: 74 minutes 55 seconds
Build step 'Invoke Ant' marked build as failure
Archiving artifacts
[WARNINGS] Skipping publisher since build result is FAILURE
Recording test results
Email was triggered for: Failure - Any
Sending email for trigger: Failure - Any



Mime
View raw message