lucene-dev mailing list archives

Site index · List index
Message view « Date » · « Thread »
Top « Date » · « Thread »
From Steve Rowe <sar...@gmail.com>
Subject Re: [JENKINS] Lucene-Solr-NightlyTests-5.x - Build # 1098 - Still Failing
Date Mon, 15 Feb 2016 14:26:14 GMT
:) yeah, no coffee yet, thanks Mike.

--
Steve
www.lucidworks.com

> On Feb 15, 2016, at 9:04 AM, Michael McCandless <lucene@mikemccandless.com> wrote:
> 
> I committed a fix for this a few hours ago...
> 
> Mike McCandless
> 
> http://blog.mikemccandless.com
> 
> 
> On Mon, Feb 15, 2016 at 9:01 AM, Steve Rowe <sarowe@gmail.com> wrote:
>> I’ve seen this same failure on my Jenkins, but neither seed reproduces for me.
>> 
>> --
>> Steve
>> www.lucidworks.com
>> 
>>> On Feb 15, 2016, at 4:36 AM, Apache Jenkins Server <jenkins@builds.apache.org>
wrote:
>>> 
>>> Build: https://builds.apache.org/job/Lucene-Solr-NightlyTests-5.x/1098/
>>> 
>>> 1 tests failed.
>>> FAILED:  org.apache.lucene.index.TestSortingMergePolicy.testForceMergeNotNeeded
>>> 
>>> Error Message:
>>> 
>>> 
>>> Stack Trace:
>>> java.lang.AssertionError
>>>      at __randomizedtesting.SeedInfo.seed([A5F3779EADC97CBE:B9D00F84369697AB]:0)
>>>      at org.apache.lucene.index.BaseMergePolicyTestCase$1.merge(BaseMergePolicyTestCase.java:43)
>>>      at org.apache.lucene.index.IndexWriter.maybeMerge(IndexWriter.java:1931)
>>>      at org.apache.lucene.index.IndexWriter.forceMerge(IndexWriter.java:1764)
>>>      at org.apache.lucene.index.IndexWriter.forceMerge(IndexWriter.java:1721)
>>>      at org.apache.lucene.index.BaseMergePolicyTestCase.testForceMergeNotNeeded(BaseMergePolicyTestCase.java:62)
>>>      at sun.reflect.NativeMethodAccessorImpl.invoke0(Native Method)
>>>      at sun.reflect.NativeMethodAccessorImpl.invoke(NativeMethodAccessorImpl.java:57)
>>>      at sun.reflect.DelegatingMethodAccessorImpl.invoke(DelegatingMethodAccessorImpl.java:43)
>>>      at java.lang.reflect.Method.invoke(Method.java:606)
>>>      at com.carrotsearch.randomizedtesting.RandomizedRunner.invoke(RandomizedRunner.java:1764)
>>>      at com.carrotsearch.randomizedtesting.RandomizedRunner$8.evaluate(RandomizedRunner.java:871)
>>>      at com.carrotsearch.randomizedtesting.RandomizedRunner$9.evaluate(RandomizedRunner.java:907)
>>>      at com.carrotsearch.randomizedtesting.RandomizedRunner$10.evaluate(RandomizedRunner.java:921)
>>>      at org.apache.lucene.util.TestRuleSetupTeardownChained$1.evaluate(TestRuleSetupTeardownChained.java:49)
>>>      at org.apache.lucene.util.AbstractBeforeAfterRule$1.evaluate(AbstractBeforeAfterRule.java:45)
>>>      at org.apache.lucene.util.TestRuleThreadAndTestName$1.evaluate(TestRuleThreadAndTestName.java:48)
>>>      at org.apache.lucene.util.TestRuleIgnoreAfterMaxFailures$1.evaluate(TestRuleIgnoreAfterMaxFailures.java:64)
>>>      at org.apache.lucene.util.TestRuleMarkFailure$1.evaluate(TestRuleMarkFailure.java:47)
>>>      at com.carrotsearch.randomizedtesting.rules.StatementAdapter.evaluate(StatementAdapter.java:36)
>>>      at com.carrotsearch.randomizedtesting.ThreadLeakControl$StatementRunner.run(ThreadLeakControl.java:367)
>>>      at com.carrotsearch.randomizedtesting.ThreadLeakControl.forkTimeoutingTask(ThreadLeakControl.java:809)
>>>      at com.carrotsearch.randomizedtesting.ThreadLeakControl$3.evaluate(ThreadLeakControl.java:460)
>>>      at com.carrotsearch.randomizedtesting.RandomizedRunner.runSingleTest(RandomizedRunner.java:880)
>>>      at com.carrotsearch.randomizedtesting.RandomizedRunner$5.evaluate(RandomizedRunner.java:781)
>>>      at com.carrotsearch.randomizedtesting.RandomizedRunner$6.evaluate(RandomizedRunner.java:816)
>>>      at com.carrotsearch.randomizedtesting.RandomizedRunner$7.evaluate(RandomizedRunner.java:827)
>>>      at org.apache.lucene.util.AbstractBeforeAfterRule$1.evaluate(AbstractBeforeAfterRule.java:45)
>>>      at com.carrotsearch.randomizedtesting.rules.StatementAdapter.evaluate(StatementAdapter.java:36)
>>>      at org.apache.lucene.util.TestRuleStoreClassName$1.evaluate(TestRuleStoreClassName.java:41)
>>>      at com.carrotsearch.randomizedtesting.rules.NoShadowingOrOverridesOnMethodsRule$1.evaluate(NoShadowingOrOverridesOnMethodsRule.java:40)
>>>      at com.carrotsearch.randomizedtesting.rules.NoShadowingOrOverridesOnMethodsRule$1.evaluate(NoShadowingOrOverridesOnMethodsRule.java:40)
>>>      at com.carrotsearch.randomizedtesting.rules.StatementAdapter.evaluate(StatementAdapter.java:36)
>>>      at com.carrotsearch.randomizedtesting.rules.StatementAdapter.evaluate(StatementAdapter.java:36)
>>>      at com.carrotsearch.randomizedtesting.rules.StatementAdapter.evaluate(StatementAdapter.java:36)
>>>      at org.apache.lucene.util.TestRuleAssertionsRequired$1.evaluate(TestRuleAssertionsRequired.java:53)
>>>      at org.apache.lucene.util.TestRuleMarkFailure$1.evaluate(TestRuleMarkFailure.java:47)
>>>      at org.apache.lucene.util.TestRuleIgnoreAfterMaxFailures$1.evaluate(TestRuleIgnoreAfterMaxFailures.java:64)
>>>      at org.apache.lucene.util.TestRuleIgnoreTestSuites$1.evaluate(TestRuleIgnoreTestSuites.java:54)
>>>      at com.carrotsearch.randomizedtesting.rules.StatementAdapter.evaluate(StatementAdapter.java:36)
>>>      at com.carrotsearch.randomizedtesting.ThreadLeakControl$StatementRunner.run(ThreadLeakControl.java:367)
>>>      at java.lang.Thread.run(Thread.java:745)
>>> 
>>> 
>>> 
>>> 
>>> Build Log:
>>> [...truncated 8191 lines...]
>>>  [junit4] Suite: org.apache.lucene.index.TestSortingMergePolicy
>>>  [junit4]   2> NOTE: download the large Jenkins line-docs file by running
'ant get-jenkins-line-docs' in the lucene directory.
>>>  [junit4]   2> NOTE: reproduce with: ant test  -Dtestcase=TestSortingMergePolicy
-Dtests.method=testForceMergeNotNeeded -Dtests.seed=A5F3779EADC97CBE -Dtests.multiplier=2
-Dtests.nightly=true -Dtests.slow=true -Dtests.linedocsfile=/x1/jenkins/lucene-data/enwiki.random.lines.txt
-Dtests.locale=ar-DZ -Dtests.timezone=MST7MDT -Dtests.asserts=true -Dtests.file.encoding=UTF-8
>>>  [junit4] FAILURE 3.18s J1 | TestSortingMergePolicy.testForceMergeNotNeeded <<<
>>>  [junit4]    > Throwable #1: java.lang.AssertionError
>>>  [junit4]    >       at __randomizedtesting.SeedInfo.seed([A5F3779EADC97CBE:B9D00F84369697AB]:0)
>>>  [junit4]    >       at org.apache.lucene.index.BaseMergePolicyTestCase$1.merge(BaseMergePolicyTestCase.java:43)
>>>  [junit4]    >       at org.apache.lucene.index.IndexWriter.maybeMerge(IndexWriter.java:1931)
>>>  [junit4]    >       at org.apache.lucene.index.IndexWriter.forceMerge(IndexWriter.java:1764)
>>>  [junit4]    >       at org.apache.lucene.index.IndexWriter.forceMerge(IndexWriter.java:1721)
>>>  [junit4]    >       at org.apache.lucene.index.BaseMergePolicyTestCase.testForceMergeNotNeeded(BaseMergePolicyTestCase.java:62)
>>>  [junit4]    >       at java.lang.Thread.run(Thread.java:745)
>>>  [junit4]   2> NOTE: test params are: codec=Asserting(Lucene54): {s=FST50},
docValues:{ndv=DocValuesFormat(name=Asserting)}, sim=RandomSimilarity(queryNorm=true,coord=crazy):
{}, locale=ar-DZ, timezone=MST7MDT
>>>  [junit4]   2> NOTE: Linux 3.13.0-52-generic amd64/Oracle Corporation 1.7.0_80
(64-bit)/cpus=4,threads=1,free=191109240,total=294125568
>>>  [junit4]   2> NOTE: All tests run in this JVM: [TestIndexSplitter, TestFieldCacheReopen,
TestHighFreqTerms, IndexSortingTest, TestPKIndexSplitter, TestLazyDocument, TestSortingMergePolicy]
>>>  [junit4] Completed [14/25 (1!)] on J1 in 9.34s, 3 tests, 1 failure <<<
FAILURES!
>>> 
>>> [...truncated 48 lines...]
>>> BUILD FAILED
>>> /x1/jenkins/jenkins-slave/workspace/Lucene-Solr-NightlyTests-5.x/build.xml:757:
The following error occurred while executing this line:
>>> /x1/jenkins/jenkins-slave/workspace/Lucene-Solr-NightlyTests-5.x/build.xml:694:
The following error occurred while executing this line:
>>> /x1/jenkins/jenkins-slave/workspace/Lucene-Solr-NightlyTests-5.x/build.xml:59:
The following error occurred while executing this line:
>>> /x1/jenkins/jenkins-slave/workspace/Lucene-Solr-NightlyTests-5.x/lucene/build.xml:475:
The following error occurred while executing this line:
>>> /x1/jenkins/jenkins-slave/workspace/Lucene-Solr-NightlyTests-5.x/lucene/common-build.xml:2273:
The following error occurred while executing this line:
>>> /x1/jenkins/jenkins-slave/workspace/Lucene-Solr-NightlyTests-5.x/lucene/module-build.xml:58:
The following error occurred while executing this line:
>>> /x1/jenkins/jenkins-slave/workspace/Lucene-Solr-NightlyTests-5.x/lucene/common-build.xml:1477:
The following error occurred while executing this line:
>>> /x1/jenkins/jenkins-slave/workspace/Lucene-Solr-NightlyTests-5.x/lucene/common-build.xml:1033:
There were test failures: 25 suites, 187 tests, 1 failure, 1 ignored (1 assumption) [seed:
A5F3779EADC97CBE]
>>> 
>>> Total time: 105 minutes 12 seconds
>>> Build step 'Invoke Ant' marked build as failure
>>> Archiving artifacts
>>> Recording test results
>>> Email was triggered for: Failure - Any
>>> Sending email for trigger: Failure - Any
>>> 
>>> 
>>> 
>>> ---------------------------------------------------------------------
>>> To unsubscribe, e-mail: dev-unsubscribe@lucene.apache.org
>>> For additional commands, e-mail: dev-help@lucene.apache.org
>> 
>> 
>> ---------------------------------------------------------------------
>> To unsubscribe, e-mail: dev-unsubscribe@lucene.apache.org
>> For additional commands, e-mail: dev-help@lucene.apache.org
>> 
> 
> ---------------------------------------------------------------------
> To unsubscribe, e-mail: dev-unsubscribe@lucene.apache.org
> For additional commands, e-mail: dev-help@lucene.apache.org
> 


---------------------------------------------------------------------
To unsubscribe, e-mail: dev-unsubscribe@lucene.apache.org
For additional commands, e-mail: dev-help@lucene.apache.org


Mime
View raw message