lucene-dev mailing list archives

Site index · List index
Message view « Date » · « Thread »
Top « Date » · « Thread »
From "Uwe Schindler" <...@thetaphi.de>
Subject RE: [JENKINS-EA] Lucene-Solr-6.x-Linux (64bit/jdk-9-ea+110) - Build # 251 - Failure!
Date Sat, 26 Mar 2016 09:56:46 GMT
Sorry, false alarm. All fine. It was running build 110. KRRRRR.

Uwe

-----
Uwe Schindler
H.-H.-Meier-Allee 63, D-28213 Bremen
http://www.thetaphi.de
eMail: uwe@thetaphi.de


> -----Original Message-----
> From: Uwe Schindler [mailto:uwe@thetaphi.de]
> Sent: Saturday, March 26, 2016 10:25 AM
> To: dev@lucene.apache.org
> Subject: RE: [JENKINS-EA] Lucene-Solr-6.x-Linux (64bit/jdk-9-ea+110) - Build
> # 251 - Failure!
> 
> Oh,
> 
> on my local machine this did not happen (Windows), but on Linux this seems
> to be still an issue. I'll report to Alan Bateman.
> 
> Uwe
> 
> -----
> Uwe Schindler
> H.-H.-Meier-Allee 63, D-28213 Bremen
> http://www.thetaphi.de
> eMail: uwe@thetaphi.de
> 
> 
> > -----Original Message-----
> > From: Policeman Jenkins Server [mailto:jenkins@thetaphi.de]
> > Sent: Saturday, March 26, 2016 10:22 AM
> > To: dev@lucene.apache.org
> > Subject: [JENKINS-EA] Lucene-Solr-6.x-Linux (64bit/jdk-9-ea+110) - Build #
> > 251 - Failure!
> > Importance: Low
> >
> > Build: http://jenkins.thetaphi.de/job/Lucene-Solr-6.x-Linux/251/
> > Java: 64bit/jdk-9-ea+110 -XX:+UseCompressedOops -XX:+UseParallelGC -
> > XX:-CompactStrings
> >
> > 2 tests failed.
> > FAILED:  org.apache.lucene.util.TestRamUsageEstimator.testHotspotBean
> >
> > Error Message:
> > We should have been able to detect Hotspot's internal settings from the
> > management bean.
> >
> > Stack Trace:
> > java.lang.AssertionError: We should have been able to detect Hotspot's
> > internal settings from the management bean.
> > 	at
> >
> __randomizedtesting.SeedInfo.seed([343A1F0CDA50D388:8E123CF4B23EB8B
> > 7]:0)
> > 	at org.junit.Assert.fail(Assert.java:93)
> > 	at org.junit.Assert.assertTrue(Assert.java:43)
> > 	at
> >
> org.apache.lucene.util.TestRamUsageEstimator.testHotspotBean(TestRamU
> > sageEstimator.java:114)
> > 	at sun.reflect.NativeMethodAccessorImpl.invoke0(Native Method)
> > 	at
> >
> sun.reflect.NativeMethodAccessorImpl.invoke(NativeMethodAccessorImpl.j
> > ava:62)
> > 	at
> >
> sun.reflect.DelegatingMethodAccessorImpl.invoke(DelegatingMethodAcces
> > sorImpl.java:43)
> > 	at java.lang.reflect.Method.invoke(Method.java:520)
> > 	at
> >
> com.carrotsearch.randomizedtesting.RandomizedRunner.invoke(Randomize
> > dRunner.java:1764)
> > 	at
> >
> com.carrotsearch.randomizedtesting.RandomizedRunner$8.evaluate(Rando
> > mizedRunner.java:871)
> > 	at
> >
> com.carrotsearch.randomizedtesting.RandomizedRunner$9.evaluate(Rando
> > mizedRunner.java:907)
> > 	at
> >
> com.carrotsearch.randomizedtesting.RandomizedRunner$10.evaluate(Rand
> > omizedRunner.java:921)
> > 	at
> >
> org.apache.lucene.util.TestRuleSetupTeardownChained$1.evaluate(TestRule
> > SetupTeardownChained.java:49)
> > 	at
> >
> org.apache.lucene.util.AbstractBeforeAfterRule$1.evaluate(AbstractBeforeA
> > fterRule.java:45)
> > 	at
> >
> org.apache.lucene.util.TestRuleThreadAndTestName$1.evaluate(TestRuleTh
> > readAndTestName.java:48)
> > 	at
> >
> org.apache.lucene.util.TestRuleIgnoreAfterMaxFailures$1.evaluate(TestRule
> > IgnoreAfterMaxFailures.java:64)
> > 	at
> >
> org.apache.lucene.util.TestRuleMarkFailure$1.evaluate(TestRuleMarkFailure
> > .java:47)
> > 	at
> >
> com.carrotsearch.randomizedtesting.rules.StatementAdapter.evaluate(Stat
> > ementAdapter.java:36)
> > 	at
> >
> com.carrotsearch.randomizedtesting.ThreadLeakControl$StatementRunner.
> > run(ThreadLeakControl.java:367)
> > 	at
> >
> com.carrotsearch.randomizedtesting.ThreadLeakControl.forkTimeoutingTask
> > (ThreadLeakControl.java:809)
> > 	at
> >
> com.carrotsearch.randomizedtesting.ThreadLeakControl$3.evaluate(ThreadL
> > eakControl.java:460)
> > 	at
> >
> com.carrotsearch.randomizedtesting.RandomizedRunner.runSingleTest(Ran
> > domizedRunner.java:880)
> > 	at
> >
> com.carrotsearch.randomizedtesting.RandomizedRunner$5.evaluate(Rando
> > mizedRunner.java:781)
> > 	at
> >
> com.carrotsearch.randomizedtesting.RandomizedRunner$6.evaluate(Rando
> > mizedRunner.java:816)
> > 	at
> >
> com.carrotsearch.randomizedtesting.RandomizedRunner$7.evaluate(Rando
> > mizedRunner.java:827)
> > 	at
> >
> org.apache.lucene.util.AbstractBeforeAfterRule$1.evaluate(AbstractBeforeA
> > fterRule.java:45)
> > 	at
> >
> com.carrotsearch.randomizedtesting.rules.StatementAdapter.evaluate(Stat
> > ementAdapter.java:36)
> > 	at
> >
> org.apache.lucene.util.TestRuleStoreClassName$1.evaluate(TestRuleStoreCl
> > assName.java:41)
> > 	at
> >
> com.carrotsearch.randomizedtesting.rules.NoShadowingOrOverridesOnMet
> > hodsRule$1.evaluate(NoShadowingOrOverridesOnMethodsRule.java:40)
> > 	at
> >
> com.carrotsearch.randomizedtesting.rules.NoShadowingOrOverridesOnMet
> > hodsRule$1.evaluate(NoShadowingOrOverridesOnMethodsRule.java:40)
> > 	at
> >
> com.carrotsearch.randomizedtesting.rules.StatementAdapter.evaluate(Stat
> > ementAdapter.java:36)
> > 	at
> >
> com.carrotsearch.randomizedtesting.rules.StatementAdapter.evaluate(Stat
> > ementAdapter.java:36)
> > 	at
> >
> com.carrotsearch.randomizedtesting.rules.StatementAdapter.evaluate(Stat
> > ementAdapter.java:36)
> > 	at
> >
> org.apache.lucene.util.TestRuleAssertionsRequired$1.evaluate(TestRuleAss
> > ertionsRequired.java:53)
> > 	at
> >
> org.apache.lucene.util.TestRuleMarkFailure$1.evaluate(TestRuleMarkFailure
> > .java:47)
> > 	at
> >
> org.apache.lucene.util.TestRuleIgnoreAfterMaxFailures$1.evaluate(TestRule
> > IgnoreAfterMaxFailures.java:64)
> > 	at
> >
> org.apache.lucene.util.TestRuleIgnoreTestSuites$1.evaluate(TestRuleIgnore
> > TestSuites.java:54)
> > 	at
> >
> com.carrotsearch.randomizedtesting.rules.StatementAdapter.evaluate(Stat
> > ementAdapter.java:36)
> > 	at
> >
> com.carrotsearch.randomizedtesting.ThreadLeakControl$StatementRunner.
> > run(ThreadLeakControl.java:367)
> > 	at java.lang.Thread.run(Thread.java:804)
> >
> >
> > FAILED:  org.apache.lucene.util.bkd.TestBKD.testBitFlippedOnPartition2
> >
> > Error Message:
> > Unexpected exception type, expected CorruptIndexException
> >
> > Stack Trace:
> > junit.framework.AssertionFailedError: Unexpected exception type,
> > expected CorruptIndexException
> > 	at
> >
> __randomizedtesting.SeedInfo.seed([343A1F0CDA50D388:1DE9EB1CF51A1A
> > D9]:0)
> > 	at
> >
> org.apache.lucene.util.LuceneTestCase.expectThrows(LuceneTestCase.java:
> > 2682)
> > 	at
> >
> org.apache.lucene.util.bkd.TestBKD.testBitFlippedOnPartition2(TestBKD.java
> > :867)
> > 	at sun.reflect.NativeMethodAccessorImpl.invoke0(Native Method)
> > 	at
> >
> sun.reflect.NativeMethodAccessorImpl.invoke(NativeMethodAccessorImpl.j
> > ava:62)
> > 	at
> >
> sun.reflect.DelegatingMethodAccessorImpl.invoke(DelegatingMethodAcces
> > sorImpl.java:43)
> > 	at java.lang.reflect.Method.invoke(Method.java:520)
> > 	at
> >
> com.carrotsearch.randomizedtesting.RandomizedRunner.invoke(Randomize
> > dRunner.java:1764)
> > 	at
> >
> com.carrotsearch.randomizedtesting.RandomizedRunner$8.evaluate(Rando
> > mizedRunner.java:871)
> > 	at
> >
> com.carrotsearch.randomizedtesting.RandomizedRunner$9.evaluate(Rando
> > mizedRunner.java:907)
> > 	at
> >
> com.carrotsearch.randomizedtesting.RandomizedRunner$10.evaluate(Rand
> > omizedRunner.java:921)
> > 	at
> >
> org.apache.lucene.util.TestRuleSetupTeardownChained$1.evaluate(TestRule
> > SetupTeardownChained.java:49)
> > 	at
> >
> org.apache.lucene.util.AbstractBeforeAfterRule$1.evaluate(AbstractBeforeA
> > fterRule.java:45)
> > 	at
> >
> org.apache.lucene.util.TestRuleThreadAndTestName$1.evaluate(TestRuleTh
> > readAndTestName.java:48)
> > 	at
> >
> org.apache.lucene.util.TestRuleIgnoreAfterMaxFailures$1.evaluate(TestRule
> > IgnoreAfterMaxFailures.java:64)
> > 	at
> >
> org.apache.lucene.util.TestRuleMarkFailure$1.evaluate(TestRuleMarkFailure
> > .java:47)
> > 	at
> >
> com.carrotsearch.randomizedtesting.rules.StatementAdapter.evaluate(Stat
> > ementAdapter.java:36)
> > 	at
> >
> com.carrotsearch.randomizedtesting.ThreadLeakControl$StatementRunner.
> > run(ThreadLeakControl.java:367)
> > 	at
> >
> com.carrotsearch.randomizedtesting.ThreadLeakControl.forkTimeoutingTask
> > (ThreadLeakControl.java:809)
> > 	at
> >
> com.carrotsearch.randomizedtesting.ThreadLeakControl$3.evaluate(ThreadL
> > eakControl.java:460)
> > 	at
> >
> com.carrotsearch.randomizedtesting.RandomizedRunner.runSingleTest(Ran
> > domizedRunner.java:880)
> > 	at
> >
> com.carrotsearch.randomizedtesting.RandomizedRunner$5.evaluate(Rando
> > mizedRunner.java:781)
> > 	at
> >
> com.carrotsearch.randomizedtesting.RandomizedRunner$6.evaluate(Rando
> > mizedRunner.java:816)
> > 	at
> >
> com.carrotsearch.randomizedtesting.RandomizedRunner$7.evaluate(Rando
> > mizedRunner.java:827)
> > 	at
> >
> org.apache.lucene.util.AbstractBeforeAfterRule$1.evaluate(AbstractBeforeA
> > fterRule.java:45)
> > 	at
> >
> com.carrotsearch.randomizedtesting.rules.StatementAdapter.evaluate(Stat
> > ementAdapter.java:36)
> > 	at
> >
> org.apache.lucene.util.TestRuleStoreClassName$1.evaluate(TestRuleStoreCl
> > assName.java:41)
> > 	at
> >
> com.carrotsearch.randomizedtesting.rules.NoShadowingOrOverridesOnMet
> > hodsRule$1.evaluate(NoShadowingOrOverridesOnMethodsRule.java:40)
> > 	at
> >
> com.carrotsearch.randomizedtesting.rules.NoShadowingOrOverridesOnMet
> > hodsRule$1.evaluate(NoShadowingOrOverridesOnMethodsRule.java:40)
> > 	at
> >
> com.carrotsearch.randomizedtesting.rules.StatementAdapter.evaluate(Stat
> > ementAdapter.java:36)
> > 	at
> >
> com.carrotsearch.randomizedtesting.rules.StatementAdapter.evaluate(Stat
> > ementAdapter.java:36)
> > 	at
> >
> com.carrotsearch.randomizedtesting.rules.StatementAdapter.evaluate(Stat
> > ementAdapter.java:36)
> > 	at
> >
> org.apache.lucene.util.TestRuleAssertionsRequired$1.evaluate(TestRuleAss
> > ertionsRequired.java:53)
> > 	at
> >
> org.apache.lucene.util.TestRuleMarkFailure$1.evaluate(TestRuleMarkFailure
> > .java:47)
> > 	at
> >
> org.apache.lucene.util.TestRuleIgnoreAfterMaxFailures$1.evaluate(TestRule
> > IgnoreAfterMaxFailures.java:64)
> > 	at
> >
> org.apache.lucene.util.TestRuleIgnoreTestSuites$1.evaluate(TestRuleIgnore
> > TestSuites.java:54)
> > 	at
> >
> com.carrotsearch.randomizedtesting.rules.StatementAdapter.evaluate(Stat
> > ementAdapter.java:36)
> > 	at
> >
> com.carrotsearch.randomizedtesting.ThreadLeakControl$StatementRunner.
> > run(ThreadLeakControl.java:367)
> > 	at java.lang.Thread.run(Thread.java:804)
> > Caused by: java.lang.AssertionError: ord=42581 i=20610 was seen twice
> from
> > org.apache.lucene.util.bkd.OfflinePointReader@746f9574
> > 	at
> >
> org.apache.lucene.util.bkd.OfflinePointReader.markOrds(OfflinePointReade
> > r.java:156)
> > 	at
> >
> org.apache.lucene.util.bkd.BKDWriter.markRightTree(BKDWriter.java:1011)
> > 	at org.apache.lucene.util.bkd.BKDWriter.build(BKDWriter.java:1167)
> > 	at org.apache.lucene.util.bkd.BKDWriter.finish(BKDWriter.java:861)
> > 	at org.apache.lucene.util.bkd.TestBKD.verify(TestBKD.java:641)
> > 	at
> >
> org.apache.lucene.util.bkd.TestBKD.lambda$testBitFlippedOnPartition2$2(Te
> > stBKD.java:868)
> > 	at
> >
> org.apache.lucene.util.LuceneTestCase.expectThrows(LuceneTestCase.java:
> > 2677)
> > 	... 37 more
> > 	Suppressed: org.apache.lucene.index.CorruptIndexException:
> > checksum passed (713b8515). possibly transient resource issue, or a Lucene
> > or JVM bug
> >
> (resource=BufferedChecksumIndexInput(MockIndexInputWrapper(RAMInp
> > utStream(name=_0_bkd0_sort_3.tmp))))
> > 		at
> > org.apache.lucene.codecs.CodecUtil.checkFooter(CodecUtil.java:409)
> > 		at
> >
> org.apache.lucene.util.bkd.BKDWriter.verifyChecksum(BKDWriter.java:987)
> > 		at
> >
> org.apache.lucene.util.bkd.BKDWriter.markRightTree(BKDWriter.java:1014)
> > 		... 42 more
> >
> >
> >
> >
> > Build Log:
> > [...truncated 1167 lines...]
> >    [junit4] Suite: org.apache.lucene.util.TestRamUsageEstimator
> >    [junit4] IGNOR/A 0.00s J0 | TestRamUsageEstimator.testPrintValues
> >    [junit4]    > Assumption #1: Specify -Dtests.verbose=true to print
> constants
> > of RamUsageEstimator.
> >    [junit4]   2> NOTE: reproduce with: ant test  -
> > Dtestcase=TestRamUsageEstimator -Dtests.method=testHotspotBean -
> > Dtests.seed=343A1F0CDA50D388 -Dtests.multiplier=3 -Dtests.slow=true -
> > Dtests.locale=ja-JP -Dtests.timezone=Europe/Amsterdam -
> > Dtests.asserts=true -Dtests.file.encoding=US-ASCII
> >    [junit4] FAILURE 0.00s J0 | TestRamUsageEstimator.testHotspotBean <<<
> >    [junit4]    > Throwable #1: java.lang.AssertionError: We should have been
> > able to detect Hotspot's internal settings from the management bean.
> >    [junit4]    > 	at
> >
> __randomizedtesting.SeedInfo.seed([343A1F0CDA50D388:8E123CF4B23EB8B
> > 7]:0)
> >    [junit4]    > 	at
> >
> org.apache.lucene.util.TestRamUsageEstimator.testHotspotBean(TestRamU
> > sageEstimator.java:114)
> >    [junit4]    > 	at java.lang.Thread.run(Thread.java:804)
> >    [junit4]   2> NOTE: test params are: codec=Lucene60,
> > sim=RandomSimilarity(queryNorm=false,coord=crazy): {}, locale=ja-JP,
> > timezone=Europe/Amsterdam
> >    [junit4]   2> NOTE: Linux 4.2.0-34-generic amd64/Oracle Corporation 9-ea
> > (64-bit)/cpus=12,threads=1,free=163436624,total=417857536
> >    [junit4]   2> NOTE: All tests run in this JVM: [TestOperations,
> > TestDeterminism, Test4GBStoredFields, TestIndexWriterMergePolicy,
> > TestFixedBitSet, TestIntArrayDocIdSet, TestWeakIdentityMap,
> > TestPriorityQueue, TestSubScorerFreqs, TestMultiDocValues,
> > TestFilterLeafReader, TestRecyclingByteBlockAllocator, TestDateSort,
> > TestManyFields, TestNotDocIdSet, TestAutomatonQuery,
> > TestParallelCompositeReader, TestSimpleAttributeImpl, TestUTF32ToUTF8,
> > TestSloppyPhraseQuery2, Test2BTerms, TestMultiTermConstantScore,
> > TestSegmentReader, TestReusableStringReader, FiniteStringsIteratorTest,
> > TestPhraseQuery, TestBlockPostingsFormat2, TestIsCurrent,
> > TestCustomNorms, TestDirectPacked, TestIndexWriterLockRelease,
> > TestTermRangeQuery, TestNoDeletionPolicy,
> > TestLucene50StoredFieldsFormat, TestShardSearching, TestDoc,
> > TestNumericRangeQuery64, TestHighCompressionMode,
> > TestRegexpRandom, TestNoMergePolicy, TestMultiFields,
> > TestSwappedIndexFiles, TestTransactionRollback,
> > TestIndexWriterWithThreads, TestTragicIndexWriterDeadlock,
> > TestPerSegmentDeletes, TestDeletionPolicy, TestVirtualMethod,
> > TestMmapDirectory, TestRateLimiter, TestThreadedForceMerge,
> > TestBinaryTerms, TestTermVectorsWriter, TestPagedBytes,
> TestTermScorer,
> > TestDisjunctionMaxQuery, TestSimilarity2, TestBooleanMinShouldMatch,
> > TestIndexWriterForceMerge, TestQueryBuilder, TestLongBitSet,
> > TestPointValues, TestStringHelper, TestQueryRescorer,
> > TestMultiValuedNumericRangeQuery, TestCrash,
> TestCloseableThreadLocal,
> > TestSpanNotQuery, TestIndexWriter, TestFSTs,
> TestNumericRangeQuery32,
> > TestAddIndexes, TestSearcherManager, TestBasics,
> > TestFlushByRamOrCountsPolicy, TestIndexWriterDelete, TestNorms,
> > TestDirectoryReaderReopen, TestSearchAfter, TestTopDocsMerge,
> > TestMinimize, TestIndexWriterUnicode, TestPerFieldPostingsFormat,
> > TestDirectoryReader, TestLockFactory, TestSegmentMerger,
> > TestRegexpRandom2, TestNRTCachingDirectory,
> > TestFastDecompressionMode, TestSegmentTermDocs,
> > TestPerFieldPostingsFormat2, TestSort, TestToken,
> TestCustomSearcherSort,
> > TestDocValuesIndexing, TestSimilarityBase, TestHugeRamFile,
> > TestLegacyNumericUtils, TestDeterminizeLexicon,
> > TestIndexWriterOnDiskFull, TestSpans, TestMixedCodecs, TestFlex,
> > TestSpanExplanations, TestFastCompressionMode, TestRAMDirectory,
> > TestMultiPhraseQuery, TestDocsAndPositions, TestCodecs,
> > TestOmitPositions, TestBytesRefHash, TestForceMergeForever,
> > TestDocumentsWriterDeleteQueue, TestDocumentWriter,
> > TestCrashCausesCorruptIndex, TestScorerPerf, TestForTooMuchCloning,
> > TestPayloads, TestWildcard, TestFieldMaskingSpanQuery,
> > TestSimpleExplanationsOfNonMatches, TestTermVectorsReader,
> > TestIntBlockPool, TestSegmentTermEnum, TestUniqueTermCount,
> > TestBooleanQuery, TestComplexExplanationsOfNonMatches,
> > TestUnicodeUtil, TestSortRandom, TestPrefixCodedTerms,
> > TestAllFilesHaveCodecHeader, TestDocument, TestSumDocFreq,
> > TestIndexableField, TestDocValuesScoring, TestSentinelIntSet,
> > TestPrefixRandom, TestMultiLevelSkipList, TestCheckIndex,
> > TestPayloadsOnVectors, TestBooleanQueryVisitSubscorers,
> > TestSearchForDuplicates, TestSizeBoundedForceMerge,
> > TestIndexFileDeleter, TestCompiledAutomaton, TestConstantScoreQuery,
> > TestParallelTermEnum, TestIndexWriterConfig,
> > TestMultiTermQueryRewrites, TestPositionIncrement, TestField,
> > TestSimilarity, TestSpanExplanationsOfNonMatches, TestSimilarityProvider,
> > TestNumericTokenStream, TestSetOnce, TestSearch, TestFilterIterator,
> > TestCharsRef, TestSameTokenSamePosition, TestDocCount,
> > TestBinaryDocument, TestTotalHitCountCollector,
> TestRamUsageEstimator]
> >    [junit4] Completed [301/415 (1!)] on J0 in 0.01s, 5 tests, 1 failure, 1
> skipped
> > <<< FAILURES!
> >
> > [...truncated 373 lines...]
> >    [junit4] Suite: org.apache.lucene.util.bkd.TestBKD
> >    [junit4] IGNOR/A 0.00s J2 | TestBKD.testRandomBinaryBig
> >    [junit4]    > Assumption #1: 'nightly' test group is disabled (@Nightly())
> >    [junit4]   2> NOTE: reproduce with: ant test  -Dtestcase=TestBKD -
> > Dtests.method=testBitFlippedOnPartition2 -
> > Dtests.seed=343A1F0CDA50D388 -Dtests.multiplier=3 -Dtests.slow=true -
> > Dtests.locale=kl-GL -Dtests.timezone=Atlantic/Reykjavik -
> > Dtests.asserts=true -Dtests.file.encoding=US-ASCII
> >    [junit4] FAILURE 0.26s J2 | TestBKD.testBitFlippedOnPartition2 <<<
> >    [junit4]    > Throwable #1: junit.framework.AssertionFailedError:
> > Unexpected exception type, expected CorruptIndexException
> >    [junit4]    > 	at
> >
> __randomizedtesting.SeedInfo.seed([343A1F0CDA50D388:1DE9EB1CF51A1A
> > D9]:0)
> >    [junit4]    > 	at
> >
> org.apache.lucene.util.LuceneTestCase.expectThrows(LuceneTestCase.java:
> > 2682)
> >    [junit4]    > 	at
> >
> org.apache.lucene.util.bkd.TestBKD.testBitFlippedOnPartition2(TestBKD.java
> > :867)
> >    [junit4]    > 	at java.lang.Thread.run(Thread.java:804)
> >    [junit4]    > Caused by: java.lang.AssertionError: ord=42581 i=20610 was
> > seen twice from org.apache.lucene.util.bkd.OfflinePointReader@746f9574
> >    [junit4]    > 	at
> >
> org.apache.lucene.util.bkd.OfflinePointReader.markOrds(OfflinePointReade
> > r.java:156)
> >    [junit4]    > 	at
> >
> org.apache.lucene.util.bkd.BKDWriter.markRightTree(BKDWriter.java:1011)
> >    [junit4]    > 	at
> > org.apache.lucene.util.bkd.BKDWriter.build(BKDWriter.java:1167)
> >    [junit4]    > 	at
> > org.apache.lucene.util.bkd.BKDWriter.finish(BKDWriter.java:861)
> >    [junit4]    > 	at
> > org.apache.lucene.util.bkd.TestBKD.verify(TestBKD.java:641)
> >    [junit4]    > 	at
> >
> org.apache.lucene.util.bkd.TestBKD.lambda$testBitFlippedOnPartition2$2(Te
> > stBKD.java:868)
> >    [junit4]    > 	at
> >
> org.apache.lucene.util.LuceneTestCase.expectThrows(LuceneTestCase.java:
> > 2677)
> >    [junit4]    > 	... 37 more
> >    [junit4]    > 	Suppressed:
> > org.apache.lucene.index.CorruptIndexException: checksum passed
> > (713b8515). possibly transient resource issue, or a Lucene or JVM bug
> >
> (resource=BufferedChecksumIndexInput(MockIndexInputWrapper(RAMInp
> > utStream(name=_0_bkd0_sort_3.tmp))))
> >    [junit4]    > 		at
> > org.apache.lucene.codecs.CodecUtil.checkFooter(CodecUtil.java:409)
> >    [junit4]    > 		at
> >
> org.apache.lucene.util.bkd.BKDWriter.verifyChecksum(BKDWriter.java:987)
> >    [junit4]    > 		at
> >
> org.apache.lucene.util.bkd.BKDWriter.markRightTree(BKDWriter.java:1014)
> >    [junit4]    > 		... 42 more
> >    [junit4]   2> NOTE: leaving temporary files on disk at:
> > /home/jenkins/workspace/Lucene-Solr-6.x-
> >
> Linux/lucene/build/core/test/J2/temp/lucene.util.bkd.TestBKD_343A1F0CD
> > A50D388-001
> >    [junit4]   2> NOTE: test params are:
> >
> codec=DummyCompressingStoredFields(storedFieldsFormat=CompressingSt
> > oredFieldsFormat(compressionMode=DUMMY, chunkSize=32603,
> > maxDocsPerChunk=739, blockSize=5),
> >
> termVectorsFormat=CompressingTermVectorsFormat(compressionMode=D
> > UMMY, chunkSize=32603, blockSize=5)), sim=ClassicSimilarity, locale=kl-GL,
> > timezone=Atlantic/Reykjavik
> >    [junit4]   2> NOTE: Linux 4.2.0-34-generic amd64/Oracle Corporation 9-ea
> > (64-bit)/cpus=12,threads=1,free=223826472,total=486539264
> >    [junit4]   2> NOTE: All tests run in this JVM:
> > [TestConcurrentMergeScheduler, TestCodecUtil, TestSortedSetSortField,
> > TestLazyProxSkipping, Test2BBKDPoints, TestComplexExplanations,
> > TestMergeSchedulerExternal, TestExternalCodecs, TestAttributeSource,
> > TestCodecHoldsOpenFiles, TestUpgradeIndexMergePolicy,
> > TestBagOfPositions, TestSimpleSearchEquivalence, TestOrdinalMap,
> > TestIOUtils, TestPrefixQuery, TestFuzzyQuery, Test2BPositions,
> > TestNativeFSLockFactory, TestFilterDirectory, TestTermsEnum2,
> > TestConjunctions, TestLucene60PointsFormat, TestIndexSearcher,
> > TestDocBoost, TestOfflineSorter, TestIndexInput,
> > TestLucene50SegmentInfoFormat, TestLiveFieldValues,
> TestStressIndexing2,
> > TestMultiMMap, TestCachingCollector, TestNearSpansOrdered,
> > TestSpanBoostQuery, TestSearchWithThreads, TestElevationComparator,
> > TestTransactions, TestMultiThreadTermVectors,
> > TestIndexWriterOutOfFileDescriptors, TestTerms,
> TestIndexWriterMerging,
> > TestDirectory, TestTopDocsCollector, TestConsistentFieldNumbers,
> > TestCharTermAttributeImpl, TestNRTThreads, TestTimSorterWorstCase,
> > TestSparseFixedBitSet, TestBlendedTermQuery, TestBlockPostingsFormat,
> > Test2BBinaryDocValues, TestNoMergeScheduler, TestDocValues,
> > TestSortRescorer, TestIndexWriterReader, TestMaxTermFrequency,
> > TestNot, TestSPIClassIterator, TestDateTools, TestMergedIterator,
> > TestLogMergePolicy, TestBM25Similarity, TestSpanFirstQuery,
> > TestBytesStore, TestQueryCachingPolicy, TestMinShouldMatch2,
> > TestLongPostings, Test2BNumericDocValues,
> TestParallelReaderEmptyIndex,
> > TestBufferedIndexInput, TestBooleanOr, TestSloppyPhraseQuery,
> > TestPersistentSnapshotDeletionPolicy, TestAtomicUpdate,
> > TestIndexWriterCommit, TestTimeLimitingCollector, TestNeverDelete,
> > TestRollingUpdates, TestNRTReaderWithThreads, TestTieredMergePolicy,
> > TestArrayUtil, TestByteSlices, TestTermsEnum,
> TestIndexWriterFromReader,
> > TestIndexWriterMaxDocs, TestIndexWriterOnVMError,
> > TestIndexWriterThreadsToSegments, TestInfoStream, TestMaxPosition,
> > TestMergePolicyWrapper, TestMergeRateLimiter,
> > TestMixedDocValuesUpdates, TestReadOnlyIndex,
> > TestReaderWrapperDVTypeCheck, TestSegmentInfos, TestStressDeletes,
> > FuzzyTermOnShortTermsTest, TestBooleanRewrites,
> > TestDocValuesRewriteMethod, TestEarlyTermination,
> TestFieldValueQuery,
> > TestLRUQueryCache, TestMatchNoDocsQuery, TestMultiCollector,
> > TestNeedsScores, TestSortedNumericSortField, TestSortedSetSelector,
> > TestSynonymQuery, TestClassicSimilarity, TestSpanCollection,
> > TestSpanNearQuery, TestSpanOrQuery, TestSpanTermQuery,
> > TestSpansEnum, TestBufferedChecksum, TestNIOFSDirectory,
> > TestSimpleFSDirectory, TestSimpleFSLockFactory,
> > TestTrackingDirectoryWrapper, TestBytesRefArray, TestDocIdSetBuilder,
> > TestFixedBitDocIdSet, TestInPlaceMergeSorter, TestIntroSorter,
> > TestLSBRadixSorter, TestMathUtil, TestRoaringDocIdSet, TestSloppyMath,
> > TestRegExp, TestBKD]
> >    [junit4] Completed [412/415 (2!)] on J2 in 3.36s, 14 tests, 1 failure, 1
> skipped
> > <<< FAILURES!
> >
> > [...truncated 29 lines...]
> > BUILD FAILED
> > /home/jenkins/workspace/Lucene-Solr-6.x-Linux/build.xml:740: The
> > following error occurred while executing this line:
> > /home/jenkins/workspace/Lucene-Solr-6.x-Linux/build.xml:684: The
> > following error occurred while executing this line:
> > /home/jenkins/workspace/Lucene-Solr-6.x-Linux/build.xml:59: The
> > following error occurred while executing this line:
> > /home/jenkins/workspace/Lucene-Solr-6.x-Linux/lucene/build.xml:50: The
> > following error occurred while executing this line:
> > /home/jenkins/workspace/Lucene-Solr-6.x-Linux/lucene/common-
> > build.xml:1457: The following error occurred while executing this line:
> > /home/jenkins/workspace/Lucene-Solr-6.x-Linux/lucene/common-
> > build.xml:1014: There were test failures: 415 suites (1 ignored), 3468 tests,
> 2
> > failures, 65 ignored (61 assumptions) [seed: 343A1F0CDA50D388]
> >
> > Total time: 6 minutes 56 seconds
> > Build step 'Invoke Ant' marked build as failure
> > Archiving artifacts
> > [WARNINGS] Skipping publisher since build result is FAILURE
> > Recording test results
> > Email was triggered for: Failure - Any
> > Sending email for trigger: Failure - Any
> >
> 
> 
> 
> ---------------------------------------------------------------------
> To unsubscribe, e-mail: dev-unsubscribe@lucene.apache.org
> For additional commands, e-mail: dev-help@lucene.apache.org


---------------------------------------------------------------------
To unsubscribe, e-mail: dev-unsubscribe@lucene.apache.org
For additional commands, e-mail: dev-help@lucene.apache.org


Mime
View raw message